{"text_format":"1","workbook":"xlsx","n_sheets":8,"sheets":["1. INFORMACION ACUMULADA","BOGDATA VS FORMATO ","BOGDATA VS FORMATO R3","BOGDATA","BOGDATA VS FORMATO R2","WP REVISIÓN ","Proposito_programa","Tipo"],"not_rendered":{"charts":0,"images":1,"macros":1,"external_links":0,"defined_names":15,"comments":0,"pivot_tables":0},"unopened":[],"bounds":{"document_bytes":16777216,"sheet_cells":100000,"rows_first":2000,"rows_last":500,"rows_between":2000,"halvings":0,"cell_chars":16384,"cell_head_chars":4096},"cells_cut":0,"cells_raw":0,"read":"whole","date_system":"1900"}

{"sheet":"1. INFORMACION ACUMULADA","index":0,"n_rows":348,"n_cols":40,"rows_kept":348,"cut":false,"hidden":false,"merged":[[6,36,6,39],[7,36,7,39],[8,36,8,39],[9,36,9,39],[1,0,1,38],[2,0,2,38],[4,0,4,3],[4,8,4,10],[5,0,5,3],[5,8,5,10],[5,34,5,35],[5,36,5,39],[6,0,6,3],[6,8,6,10],[6,34,6,35],[7,34,7,35],[11,2,11,3],[11,8,11,12],[11,15,11,20],[10,0,10,20],[8,34,8,35],[9,34,9,35],[10,28,10,33],[10,34,10,37],[10,21,10,27]]}
[]
["VEEDURIA DISTRITAL - INFORMACIÓN GESTION CONTRACTUAL"]
["DEL 1 DE ENERO AL 31 DE DICIEMBRE DE 2022"]
[]
["1. Entidad",null,null,null,"FONDO DE DESARROLLO LOCAL ANTONIO NARIÑO - FDLAN",null,null,"2. Sector","Gobierno"]
["3. Presupuesto Disponible Inversión Directa PREDIS (BOGDATA)",null,null,null,23723024146,null,null,"5. Presupuesto Disponible Funcionamiento PREDIS (BOGDATA)",1798172000,null,null,null,null,null,null,null,null,null,null,null,null,null,null,null,null,null,null,null,null,null,null,null,null,null,"7. Nombre de quien diligencia el formato",null,"Edwin Johan Chocontá Quintero"]
["4. Presupuesto Comprometido de Inversión Directa según PREDIS (BOGDATA)",null,null,null,21045484881,null,null,"6. Presupuesto Comprometido Funcionamiento según PREDIS (BOGDATA)",1708189172,null,null,null,null,null,null,null,null,null,null,null,null,null,null,null,null,null,null,null,null,null,null,null,null,null,"Cargo",null,"Profesional Universitario Código 219 Grado 18"]
[null,null,null,null,null,null,null,null,null,null,null,null,null,null,null,null,null,null,null,null,null,null,null,null,null,null,null,null,null,null,null,null,null,null,"Dependencia",null,"Contratación"]
[null,null,null,null,null,null,null,null,null,null,null,null,null,null,null,null,null,null,null,null,null,null,null,null,null,null,null,null,null,null,null,null,null,null,"Teléfono",null,"3229103809"]
[null,null,null,null,null,null,null,null,null,null,null,null,null,null,null,null,null,null,null,null,null,null,null,null,null,null,null,null,null,null,null,null,null,null,"Correo Electrónico",null,"edwin.choconta@gobiernobogota.gov.co"]
["1- INFORMACION GENERAL",null,null,null,null,null,null,null,null,null,null,null,null,null,null,null,null,null,null,null,null,"2- INFORMACION FINANCIERA",null,null,null,null,null,null,"3 - PLAZOS ",null,null,null,null,null,"4. CESION",null,null,null,"5. ESTADO","6. %  Avance y/o cumplimiento"]
[1,2,3,null,4,5,6,7,8,null,null,null,null,9,10,11,null,null,null,null,null,12,13,14,15,16,17,18,19,20,21,22,23,24,25,26,27,28,29,30]
["Número Contrato","Año","Número de proceso contractual \nSECOP","Link proceso SECOP","Tipo de contrato ","Modalidad de Selección","Procedimiento o causal","Objeto","Afectación","Plan de Desarrollo Distrital","Número Programa","Equivalencia número de programa","Propósito","Número Proyecto","Número de proponentes","Número  de Identificación del contratista\n(Cédula o NIT sin puntos, comas ni caracteres especiales y sin digito de verificación)","Nombre del contratista\n  (según el caso: nombres y apellidos o Razón social y Tipo societario)","Naturaleza Jurídica","Número  de Identificación del integrante del Consorcio o U.T.\n(Cédula o NIT sin puntos, comas ni caracteres especiales y sin digito de verificación)","Nombre del Integrante del Consorcio o U.T. y Tipo societario\n (Según el caso: nombres y apellidos o razón social y tipo societario)","% Participación (indicar solo el numero del porcentaje, sin caracteres especiales)","Vigencias futuras","Valor Inicial del contrato","Valor total reducciones \n(En valor negativo)","Número de adiciones","Valor total de adiciones ","Valor Final ","Giros (Valor en pesos)","Fecha de suscripción (DD/MM/AAAA)","Fecha de inicio (DD/MM/AAAA)","Fecha de terminación (DD/MM/AAAA)","Plazo en días","Número de prórrogas","Prorroga en días","Número  de Identificación del cesionario\n(NIT sin digito de verificación)","Nombre cesionario","Fecha cesión\n(DD/MM/AAAA)","Valor cesión","Estado","% Avance y/o Cumplimiento"]
[1,2022,"FDLANCD-001-2022(66790)","https://community.secop.gov.co/Public/Tendering/OpportunityDetail/Index?noticeUID=CO1.NTC.2525139&isFromPublicArea=True&isModal=False","Contratos de prestación de servicios profesionales y de apoyo a la gestión","Contratación directa","Prestación de servicios profesionales y de apoyo a la gestión, o para la ejecución de trabajos artísticos que sólo puedan encomendarse a determinadas personas naturales","Prestación de servicios profesionales como abogado para apoyar la estructuración, seguimiento y control de procesos contractuales que deriven del proyecto de inversión 2201 conforme a las Acciones de fomento y promoción de actividades artísticas, interculturales, culturales y/o patrimoniales de la localidad de Antonio Nariño","Inversión","Un nuevo contrato social y ambiental para la Bogotá del Siglo XXI",21,{"$f":"IF(ISERROR(VLOOKUP(K14,Proposito_programa!$C$2:$E$59,2,FALSE)),\" \",VLOOKUP(K14,Proposito_programa!$C$2:$E$59,2,FALSE))","v":"Creación y vida cotidiana: Apropiación ciudadana del arte, la cultura y el patrimonio, para la democracia cultural"},{"$f":"IF(ISERROR(VLOOKUP(K14,Proposito_programa!$C$2:$E$59,3,FALSE)),\" \",VLOOKUP(K14,Proposito_programa!$C$2:$E$59,3,FALSE))","v":"Propósito 1: Hacer un nuevo contrato social para incrementar la inclusión social, productiva y política"},2201,1,79696837,"EDWIN GUILLERMO MOLINA CARDONA","Persona Natural",null,null,null,null,32400000,null,null,null,{"$f":"+W14+X14+Z14","v":32400000},32400000,"2022-01-11","2022-01-14","2022-07-12",180,null,null,null,null,null,null,"En ejecución",{"$f":"IF(ISERROR(AB14/AA14),\"-\",(AB14/AA14))","v":1}]
[2,2022,"FDLANCD-002-2022(66605)","https://community.secop.gov.co/Public/Tendering/OpportunityDetail/Index?noticeUID=CO1.NTC.2524922&isFromPublicArea=True&isModal=False","Contratos de prestación de servicios profesionales y de apoyo a la gestión","Contratación directa","Prestación de servicios profesionales y de apoyo a la gestión, o para la ejecución de trabajos artísticos que sólo puedan encomendarse a determinadas personas naturales","Prestar servicios profesionales de apoyo en los procesos administrativos, contables y financieros en el fondo de desarrollo local de Antonio Nariño en el marco de las normas de derecho contable, de seguridad social y los procedimientos vigentes.","Inversión","Un nuevo contrato social y ambiental para la Bogotá del Siglo XXI",57,{"$f":"IF(ISERROR(VLOOKUP(K15,Proposito_programa!$C$2:$E$59,2,FALSE)),\" \",VLOOKUP(K15,Proposito_programa!$C$2:$E$59,2,FALSE))","v":"Gestión pública local"},{"$f":"IF(ISERROR(VLOOKUP(K15,Proposito_programa!$C$2:$E$59,3,FALSE)),\" \",VLOOKUP(K15,Proposito_programa!$C$2:$E$59,3,FALSE))","v":"Propósito 5: Construir Bogotá - Región con gobierno abierto, transparente y ciudadanía consciente"},2198,1,1022342284,"YULY ANDREA SOLANO GUERRERO","Persona Natural",null,null,null,null,32400000,null,null,null,{"$f":"+W15+X15+Z15","v":32400000},32400000,"2022-01-11","2022-01-12","2022-07-10",180,null,null,null,null,null,null,"En ejecución",{"$f":"IF(ISERROR(AB15/AA15),\"-\",(AB15/AA15))","v":1}]
[3,2022,"FDLANCD-003-2022(66682)","https://community.secop.gov.co/Public/Tendering/OpportunityDetail/Index?noticeUID=CO1.NTC.2524742&isFromPublicArea=True&isModal=False","Contratos de prestación de servicios profesionales y de apoyo a la gestión","Contratación directa","Prestación de servicios profesionales y de apoyo a la gestión, o para la ejecución de trabajos artísticos que sólo puedan encomendarse a determinadas personas naturales","Apoyar la formulación, ejecución, seguimiento y mejora continua de las herramientas que conforman la Gestión Ambiental Institucional de la Alcaldía Local.","Inversión","Un nuevo contrato social y ambiental para la Bogotá del Siglo XXI",57,{"$f":"IF(ISERROR(VLOOKUP(K16,Proposito_programa!$C$2:$E$59,2,FALSE)),\" \",VLOOKUP(K16,Proposito_programa!$C$2:$E$59,2,FALSE))","v":"Gestión pública local"},{"$f":"IF(ISERROR(VLOOKUP(K16,Proposito_programa!$C$2:$E$59,3,FALSE)),\" \",VLOOKUP(K16,Proposito_programa!$C$2:$E$59,3,FALSE))","v":"Propósito 5: Construir Bogotá - Región con gobierno abierto, transparente y ciudadanía consciente"},2198,1,1013671508,"JONATHAN CALDERON PEÑA","Persona Natural",null,null,null,null,27720000,null,null,null,27720000,27720000,"2022-01-11","2022-01-12","2022-07-10",180,null,null,null,null,null,null,"En ejecución",1]
[4,2022,"FDLAN-CD-004-2022 (67164)","https://community.secop.gov.co/Public/Tendering/OpportunityDetail/Index?noticeUID=CO1.NTC.2524400&isFromPublicArea=True&isModal=False","Contratos de prestación de servicios profesionales y de apoyo a la gestión","Contratación directa","Prestación de servicios profesionales y de apoyo a la gestión, o para la ejecución de trabajos artísticos que sólo puedan encomendarse a determinadas personas naturales","Prestación de servicios profesionales como abogado para apoyar la estructuración, seguimiento y control de procesos contractuales que deriven del proyecto de inversión 2191 conforme a las Acciones integrales para la productividad y emprendimiento del Fondo de Desarrollo Local de Antonio Nariño","Inversión","Un nuevo contrato social y ambiental para la Bogotá del Siglo XXI",6,{"$f":"IF(ISERROR(VLOOKUP(K17,Proposito_programa!$C$2:$E$59,2,FALSE)),\" \",VLOOKUP(K17,Proposito_programa!$C$2:$E$59,2,FALSE))","v":"Sistema Distrital de Cuidado"},{"$f":"IF(ISERROR(VLOOKUP(K17,Proposito_programa!$C$2:$E$59,3,FALSE)),\" \",VLOOKUP(K17,Proposito_programa!$C$2:$E$59,3,FALSE))","v":"Propósito 1: Hacer un nuevo contrato social para incrementar la inclusión social, productiva y política"},2191,1,1094906434,"SANTIAGO DUQUE TABARES","Persona Natural",null,null,null,null,32400000,null,null,null,32400000,32400000,"2022-01-11","2022-01-19","2022-07-17",180,null,null,null,null,null,null,"En ejecución",1]
[5,2022,"FDLANCD-005-2022(66609)","https://community.secop.gov.co/Public/Tendering/OpportunityDetail/Index?noticeUID=CO1.NTC.2528138&isFromPublicArea=True&isModal=False","Contratos de prestación de servicios profesionales y de apoyo a la gestión","Contratación directa","Prestación de servicios profesionales y de apoyo a la gestión, o para la ejecución de trabajos artísticos que sólo puedan encomendarse a determinadas personas naturales","PRESTAR LOS SERVICIOS PROFESIONALES ESPECIALIZADOS AL DESPACHO DE LA ALCALDÍA LOCAL DE ANTONIO NARIÑO PARA LA REVISIÓN Y DESIGNACIÓN DE LOS PROCESOS RELACIONADOS CON LA FORMULACIÓN, SEGUIMIENTO, EVALUACIÓN Y ACOMPAÑAMIENTO A LOS PROYECTOS DE INFRAESTRUCTURA DE LA LOCALIDAD DE ANTONIO NARIÑO","Inversión","Un nuevo contrato social y ambiental para la Bogotá del Siglo XXI",49,{"$f":"IF(ISERROR(VLOOKUP(K18,Proposito_programa!$C$2:$E$59,2,FALSE)),\" \",VLOOKUP(K18,Proposito_programa!$C$2:$E$59,2,FALSE))","v":"Movilidad segura, sostenible y accesible"},{"$f":"IF(ISERROR(VLOOKUP(K18,Proposito_programa!$C$2:$E$59,3,FALSE)),\" \",VLOOKUP(K18,Proposito_programa!$C$2:$E$59,3,FALSE))","v":"Propósito 4: Hacer de Bogotá Región un modelo de movilidad multimodal, incluyente y sostenible"},2186,1,5820742,"HECTOR JULIAN ORJUELA PARRA","Persona Natural",null,null,null,null,105600000,null,1,6080000,111680000,102080000,"2022-01-12","2022-01-13","2022-12-30",349,null,null,null,null,null,null,"En ejecución",0.91404011461318047]
[6,2022,"FDLANCD-006-2022(67158)","https://community.secop.gov.co/Public/Tendering/OpportunityDetail/Index?noticeUID=CO1.NTC.2528925&isFromPublicArea=True&isModal=False","Contratos de prestación de servicios profesionales y de apoyo a la gestión","Contratación directa","Prestación de servicios profesionales y de apoyo a la gestión, o para la ejecución de trabajos artísticos que sólo puedan encomendarse a determinadas personas naturales","Prestar los servicios de apoyo como técnico administrativo en el área de gestión de desarrollo del Fondo de Desarrollo Local de Antonio Nariño para los diferentes asuntos contractuales que adelanta la entidad.","Inversión","Un nuevo contrato social y ambiental para la Bogotá del Siglo XXI",57,{"$f":"IF(ISERROR(VLOOKUP(K19,Proposito_programa!$C$2:$E$59,2,FALSE)),\" \",VLOOKUP(K19,Proposito_programa!$C$2:$E$59,2,FALSE))","v":"Gestión pública local"},{"$f":"IF(ISERROR(VLOOKUP(K19,Proposito_programa!$C$2:$E$59,3,FALSE)),\" \",VLOOKUP(K19,Proposito_programa!$C$2:$E$59,3,FALSE))","v":"Propósito 5: Construir Bogotá - Región con gobierno abierto, transparente y ciudadanía consciente"},2198,1,1019113136,"LUZ ADRIANA SANCHEZ VELANDIA","Persona Natural",null,null,null,null,16740000,null,null,null,16740000,16740000,"2022-01-12","2022-01-13","2022-07-11",180,null,null,null,null,null,null,"En ejecución",1]
[7,2022,"FDLANCD-007-2022(66818)","https://community.secop.gov.co/Public/Tendering/OpportunityDetail/Index?noticeUID=CO1.NTC.2529948&isFromPublicArea=True&isModal=False","Contratos de prestación de servicios profesionales y de apoyo a la gestión","Contratación directa","Prestación de servicios profesionales y de apoyo a la gestión, o para la ejecución de trabajos artísticos que sólo puedan encomendarse a determinadas personas naturales","Prestar servicios de apoyo a la gestión del fondo de desarrollo local de Antonio Nariño en los asuntos operativos relacionados con la seguridad, la convivencia y el desarrollo de actividad económica en la localidad, con conformidad con el marco normativo aplicable en la materia.","Inversión","Un nuevo contrato social y ambiental para la Bogotá del Siglo XXI",57,{"$f":"IF(ISERROR(VLOOKUP(K20,Proposito_programa!$C$2:$E$59,2,FALSE)),\" \",VLOOKUP(K20,Proposito_programa!$C$2:$E$59,2,FALSE))","v":"Gestión pública local"},{"$f":"IF(ISERROR(VLOOKUP(K20,Proposito_programa!$C$2:$E$59,3,FALSE)),\" \",VLOOKUP(K20,Proposito_programa!$C$2:$E$59,3,FALSE))","v":"Propósito 5: Construir Bogotá - Región con gobierno abierto, transparente y ciudadanía consciente"},2198,1,1013684748,"NICOL DANIELA PARRA","Persona Natural",null,null,null,null,19680000,null,null,null,19680000,19680000,"2022-01-12","2022-01-14","2022-09-11",240,null,null,null,null,null,null,"En ejecución",1]
[8,2022,"FDLANCD-008-2022(66818)","https://community.secop.gov.co/Public/Tendering/OpportunityDetail/Index?noticeUID=CO1.NTC.2530059&isFromPublicArea=True&isModal=False","Contratos de prestación de servicios profesionales y de apoyo a la gestión","Contratación directa","Prestación de servicios profesionales y de apoyo a la gestión, o para la ejecución de trabajos artísticos que sólo puedan encomendarse a determinadas personas naturales","Prestar servicios de apoyo a la gestión del fondo de desarrollo local de Antonio Nariño en los asuntos operativos relacionados con la seguridad, la convivencia y el desarrollo de actividad económica en la localidad, con conformidad con el marco normativo aplicable en la materia.","Inversión","Un nuevo contrato social y ambiental para la Bogotá del Siglo XXI",57,{"$f":"IF(ISERROR(VLOOKUP(K21,Proposito_programa!$C$2:$E$59,2,FALSE)),\" \",VLOOKUP(K21,Proposito_programa!$C$2:$E$59,2,FALSE))","v":"Gestión pública local"},{"$f":"IF(ISERROR(VLOOKUP(K21,Proposito_programa!$C$2:$E$59,3,FALSE)),\" \",VLOOKUP(K21,Proposito_programa!$C$2:$E$59,3,FALSE))","v":"Propósito 5: Construir Bogotá - Región con gobierno abierto, transparente y ciudadanía consciente"},2198,1,51591147,"ROSA MARIA PATIÑO","Persona Natural",null,null,null,null,19680000,null,null,null,19680000,19680000,"2022-01-12","2022-01-14","2022-09-12",240,null,null,null,null,null,null,"En ejecución",1]
[9,2022,"FDLANCD-009-2022(66611)","https://community.secop.gov.co/Public/Tendering/OpportunityDetail/Index?noticeUID=CO1.NTC.2530018&isFromPublicArea=True&isModal=False","Contratos de prestación de servicios profesionales y de apoyo a la gestión","Contratación directa","Prestación de servicios profesionales y de apoyo a la gestión, o para la ejecución de trabajos artísticos que sólo puedan encomendarse a determinadas personas naturales","Prestacion de servicios profesionales de apoyo al despacho del alcalde local de Antonio Nariño en el seguimiento y control de la planeacion y ejecucion del plan de desarrollo local.","Inversión","Un nuevo contrato social y ambiental para la Bogotá del Siglo XXI",57,{"$f":"IF(ISERROR(VLOOKUP(K22,Proposito_programa!$C$2:$E$59,2,FALSE)),\" \",VLOOKUP(K22,Proposito_programa!$C$2:$E$59,2,FALSE))","v":"Gestión pública local"},{"$f":"IF(ISERROR(VLOOKUP(K22,Proposito_programa!$C$2:$E$59,3,FALSE)),\" \",VLOOKUP(K22,Proposito_programa!$C$2:$E$59,3,FALSE))","v":"Propósito 5: Construir Bogotá - Región con gobierno abierto, transparente y ciudadanía consciente"},2198,1,1019049203,"JUAN GUILLERMO RODRIGUEZ TRIANA","Persona Natural",null,null,null,null,81840000,null,1,4464000,86304000,78368000,"2022-01-12","2022-01-14","2022-12-30",330,null,null,1019049203,"JUAN GUILLERMO RODRIGUEZ TRIANA ","2022-02-14",81840000,"En ejecución",0.90804597701149425]
[10,2022,"FDLANCD-010-2022(66606)","https://community.secop.gov.co/Public/Tendering/OpportunityDetail/Index?noticeUID=CO1.NTC.2530540&isFromPublicArea=True&isModal=False","Contratos de prestación de servicios profesionales y de apoyo a la gestión","Contratación directa","Prestación de servicios profesionales y de apoyo a la gestión, o para la ejecución de trabajos artísticos que sólo puedan encomendarse a determinadas personas naturales","Prestación de servicios profesionales especializados para apoyar al alcalde local en el diseño de estrategias y acciones de seguimiento a los diferentes asuntos competencia del despacho para el cumplimiento de sus funciones y del Plan de Desarrollo Local","Inversión","Un nuevo contrato social y ambiental para la Bogotá del Siglo XXI",57,{"$f":"IF(ISERROR(VLOOKUP(K23,Proposito_programa!$C$2:$E$59,2,FALSE)),\" \",VLOOKUP(K23,Proposito_programa!$C$2:$E$59,2,FALSE))","v":"Gestión pública local"},{"$f":"IF(ISERROR(VLOOKUP(K23,Proposito_programa!$C$2:$E$59,3,FALSE)),\" \",VLOOKUP(K23,Proposito_programa!$C$2:$E$59,3,FALSE))","v":"Propósito 5: Construir Bogotá - Región con gobierno abierto, transparente y ciudadanía consciente"},2198,1,1117513872,"VICTOR RAUL TOVAR MENDEZ","Persona Natural",null,null,null,null,105600000,null,1,6080000,111680000,102080000,"2022-01-12","2022-01-13","2022-12-30",330,null,null,1117513872,"VICTOR RAUL TOVAR MENDEZ","2022-10-28","$ 105.600.000","En ejecución",0.91404011461318047]
[11,2022,"FDLANCD-011-2022(66610)","https://community.secop.gov.co/Public/Tendering/OpportunityDetail/Index?noticeUID=CO1.NTC.2533555&isFromPublicArea=True&isModal=False","Contratos de prestación de servicios profesionales y de apoyo a la gestión","Contratación directa","Prestación de servicios profesionales y de apoyo a la gestión, o para la ejecución de trabajos artísticos que sólo puedan encomendarse a determinadas personas naturales","Prestar servicios profesionales como abogado para fortalecer el equipo del área de gestión de desarrollo local de Antonio Nariño en los diferentes trámites jurídicos y contractuales necesarios para la ejecución del plan de desarrollo local relacionados con procesos de infraestructura","Inversión","Un nuevo contrato social y ambiental para la Bogotá del Siglo XXI",49,{"$f":"IF(ISERROR(VLOOKUP(K24,Proposito_programa!$C$2:$E$59,2,FALSE)),\" \",VLOOKUP(K24,Proposito_programa!$C$2:$E$59,2,FALSE))","v":"Movilidad segura, sostenible y accesible"},{"$f":"IF(ISERROR(VLOOKUP(K24,Proposito_programa!$C$2:$E$59,3,FALSE)),\" \",VLOOKUP(K24,Proposito_programa!$C$2:$E$59,3,FALSE))","v":"Propósito 4: Hacer de Bogotá Región un modelo de movilidad multimodal, incluyente y sostenible"},2186,1,1024542049,"YURANI ANDREA ANGULO PEÑARALDA","Persona Natural",null,null,null,null,51840000,null,2,22032000,73872000,66744000,"2022-01-12","2022-01-13","2023-01-15",240,1,109,1083902434,"FRANCISCO JAVIER SALAZAR GURRUTE ","2022-10-11",70632000,"En ejecución",0.90350877192982459]
[12,2022,"FDLANCD-012-2022(66752)","https://community.secop.gov.co/Public/Tendering/OpportunityDetail/Index?noticeUID=CO1.NTC.2533542&isFromPublicArea=True&isModal=False","Contratos de prestación de servicios profesionales y de apoyo a la gestión","Contratación directa","Prestación de servicios profesionales y de apoyo a la gestión, o para la ejecución de trabajos artísticos que sólo puedan encomendarse a determinadas personas naturales","Apoyar al Alcalde Local en la gestión de los asuntos relacionados con seguridad ciudadana, convivencia y prevención de conflictividades, violencias y delitos en la localidad, de conformidad con el marco normativo aplicable en la materia.","Inversión","Un nuevo contrato social y ambiental para la Bogotá del Siglo XXI",57,{"$f":"IF(ISERROR(VLOOKUP(K25,Proposito_programa!$C$2:$E$59,2,FALSE)),\" \",VLOOKUP(K25,Proposito_programa!$C$2:$E$59,2,FALSE))","v":"Gestión pública local"},{"$f":"IF(ISERROR(VLOOKUP(K25,Proposito_programa!$C$2:$E$59,3,FALSE)),\" \",VLOOKUP(K25,Proposito_programa!$C$2:$E$59,3,FALSE))","v":"Propósito 5: Construir Bogotá - Región con gobierno abierto, transparente y ciudadanía consciente"},2198,1,1055226889,"JUAN DAVID CUERVO ZORRO","Persona Natural",null,null,null,null,32400000,null,null,null,32400000,30240000,"2022-01-12","2022-01-14","2022-07-12",180,null,null,null,null,null,null,"En ejecución",0.93333333333333335]
[13,2022,"FDLANCD-013-2022(67761)","https://community.secop.gov.co/Public/Tendering/OpportunityDetail/Index?noticeUID=CO1.NTC.2536539&isFromPublicArea=True&isModal=False","Contratos de prestación de servicios profesionales y de apoyo a la gestión","Contratación directa","Prestación de servicios profesionales y de apoyo a la gestión, o para la ejecución de trabajos artísticos que sólo puedan encomendarse a determinadas personas naturales","Prestación de servicios de apoyo en el manejo de sistemas de información en lo relacionado con la contratación que realiza el área de gestión de desarrollo del Fondo de Desarrollo Local de Antonio Nariño","Inversión","Un nuevo contrato social y ambiental para la Bogotá del Siglo XXI",57,{"$f":"IF(ISERROR(VLOOKUP(K26,Proposito_programa!$C$2:$E$59,2,FALSE)),\" \",VLOOKUP(K26,Proposito_programa!$C$2:$E$59,2,FALSE))","v":"Gestión pública local"},{"$f":"IF(ISERROR(VLOOKUP(K26,Proposito_programa!$C$2:$E$59,3,FALSE)),\" \",VLOOKUP(K26,Proposito_programa!$C$2:$E$59,3,FALSE))","v":"Propósito 5: Construir Bogotá - Región con gobierno abierto, transparente y ciudadanía consciente"},2198,1,80793701,"JAIME ERNESTO ALARCON LOPEZ","Persona Natural",null,null,null,null,14760000,null,null,null,14760000,14760000,"2022-01-12","2022-01-13","2022-07-11",180,null,null,null,null,null,null,"En ejecución",1]
[14,2022,"FDLANCD-014-2022(66854)","https://community.secop.gov.co/Public/Tendering/OpportunityDetail/Index?noticeUID=CO1.NTC.2536740&isFromPublicArea=True&isModal=False","Contratos de prestación de servicios profesionales y de apoyo a la gestión","Contratación directa","Prestación de servicios profesionales y de apoyo a la gestión, o para la ejecución de trabajos artísticos que sólo puedan encomendarse a determinadas personas naturales","Prestar los servicios profesionales como abogado en los diversos temas contractuales que requiera el área de gestión de desarrollo del Fondo de Desarrollo Local de Antonio Nariño.","Inversión","Un nuevo contrato social y ambiental para la Bogotá del Siglo XXI",57,{"$f":"IF(ISERROR(VLOOKUP(K27,Proposito_programa!$C$2:$E$59,2,FALSE)),\" \",VLOOKUP(K27,Proposito_programa!$C$2:$E$59,2,FALSE))","v":"Gestión pública local"},{"$f":"IF(ISERROR(VLOOKUP(K27,Proposito_programa!$C$2:$E$59,3,FALSE)),\" \",VLOOKUP(K27,Proposito_programa!$C$2:$E$59,3,FALSE))","v":"Propósito 5: Construir Bogotá - Región con gobierno abierto, transparente y ciudadanía consciente"},2198,1,1083902434,"FRANCISCO JAVIR SALAZAR GURRUTE","Persona Natural",null,null,null,null,66000000,null,1,6800000,72800000,63800000,"2022-01-12","2022-01-13","2023-01-14",330,null,null,1026292206,"MARIA CAMILA ZAMBRANO CUELLAR","2022-10-11",66000000,"En ejecución",0.87637362637362637]
[15,2022,"FDLANCD-015-2022(67104)","https://community.secop.gov.co/Public/Tendering/OpportunityDetail/Index?noticeUID=CO1.NTC.2536769&isFromPublicArea=True&isModal=False","Contratos de prestación de servicios profesionales y de apoyo a la gestión","Contratación directa","Prestación de servicios profesionales y de apoyo a la gestión, o para la ejecución de trabajos artísticos que sólo puedan encomendarse a determinadas personas naturales","Prestación de servicios profesionales para brindar apoyo al Alcalde Local de Antonio Nariño en el control, evaluación y seguimiento jurídico-administrativo en los procesos de planeación y gestión institucional del Fondo de Desarrollo Local de Antonio Nariño","Inversión","Un nuevo contrato social y ambiental para la Bogotá del Siglo XXI",57,{"$f":"IF(ISERROR(VLOOKUP(K28,Proposito_programa!$C$2:$E$59,2,FALSE)),\" \",VLOOKUP(K28,Proposito_programa!$C$2:$E$59,2,FALSE))","v":"Gestión pública local"},{"$f":"IF(ISERROR(VLOOKUP(K28,Proposito_programa!$C$2:$E$59,3,FALSE)),\" \",VLOOKUP(K28,Proposito_programa!$C$2:$E$59,3,FALSE))","v":"Propósito 5: Construir Bogotá - Región con gobierno abierto, transparente y ciudadanía consciente"},2198,1,1144024602,"MARCELA ALEJANDRA AYALA PERDOMO","Persona Natural",null,null,null,null,66000000,null,1,6800000,72800000,63800000,"2022-01-12","2022-01-13","2023-01-15",330,1,34,null,null,null,null,"En ejecución",{"$f":"IF(ISERROR(AB28/AA28),\"-\",(AB28/AA28))","v":0.87637362637362637}]
[16,2022,"FDLANCD-016-2022(66610)","https://community.secop.gov.co/Public/Tendering/OpportunityDetail/Index?noticeUID=CO1.NTC.2541036&isFromPublicArea=True&isModal=False","Contratos de prestación de servicios profesionales y de apoyo a la gestión","Contratación directa","Prestación de servicios profesionales y de apoyo a la gestión, o para la ejecución de trabajos artísticos que sólo puedan encomendarse a determinadas personas naturales","Prestar servicios profesionales como abogado para fortalecer el equipo del área de gestión de desarrollo local de Antonio Nariño en los diferentes trámites jurídicos y contractuales necesarios para la ejecución del plan de desarrollo local relacionados con procesos de infraestructura","Inversión","Un nuevo contrato social y ambiental para la Bogotá del Siglo XXI",49,{"$f":"IF(ISERROR(VLOOKUP(K29,Proposito_programa!$C$2:$E$59,2,FALSE)),\" \",VLOOKUP(K29,Proposito_programa!$C$2:$E$59,2,FALSE))","v":"Movilidad segura, sostenible y accesible"},{"$f":"IF(ISERROR(VLOOKUP(K29,Proposito_programa!$C$2:$E$59,3,FALSE)),\" \",VLOOKUP(K29,Proposito_programa!$C$2:$E$59,3,FALSE))","v":"Propósito 4: Hacer de Bogotá Región un modelo de movilidad multimodal, incluyente y sostenible"},2186,1,39725525,"GINA PAOLA CUBILLOS CASTAÑEDA","Persona Natural",null,null,null,null,51840000,null,null,22464000,74304000,67824000,"2022-01-13","2022-01-18","2022-12-31",240,1,104,null,null,null,null,"En ejecución",{"$f":"IF(ISERROR(AB29/AA29),\"-\",(AB29/AA29))","v":0.91279069767441856}]
[17,2022,"FDLANCD-017-2022(69866)","https://community.secop.gov.co/Public/Tendering/OpportunityDetail/Index?noticeUID=CO1.NTC.2542142&isFromPublicArea=True&isModal=False","Contratos de prestación de servicios profesionales y de apoyo a la gestión","Contratación directa","Prestación de servicios profesionales y de apoyo a la gestión, o para la ejecución de trabajos artísticos que sólo puedan encomendarse a determinadas personas naturales","Prestación de servicios de apoyo a las actividades administrativas en cuanto a notificación de la correspondencia generada por el área de gestión del desarrollo, administrativa y financiera y área de gestión policiva de la Alcaldía de Antonio Nariño.","Inversión","Un nuevo contrato social y ambiental para la Bogotá del Siglo XXI",57,{"$f":"IF(ISERROR(VLOOKUP(K30,Proposito_programa!$C$2:$E$59,2,FALSE)),\" \",VLOOKUP(K30,Proposito_programa!$C$2:$E$59,2,FALSE))","v":"Gestión pública local"},{"$f":"IF(ISERROR(VLOOKUP(K30,Proposito_programa!$C$2:$E$59,3,FALSE)),\" \",VLOOKUP(K30,Proposito_programa!$C$2:$E$59,3,FALSE))","v":"Propósito 5: Construir Bogotá - Región con gobierno abierto, transparente y ciudadanía consciente"},2198,1,79469325,"EVERARDO YARA YARA","Persona Natural",null,null,null,null,16200000,null,null,null,16200000,16200000,"2022-01-13","2022-01-14","2022-07-12",180,null,null,null,null,null,null,"En ejecución",1]
[18,2022,"FDLANCD-018-2022((66818)","https://community.secop.gov.co/Public/Tendering/OpportunityDetail/Index?noticeUID=CO1.NTC.2542748&isFromPublicArea=True&isModal=False","Contratos de prestación de servicios profesionales y de apoyo a la gestión","Contratación directa","Prestación de servicios profesionales y de apoyo a la gestión, o para la ejecución de trabajos artísticos que sólo puedan encomendarse a determinadas personas naturales","Prestar servicios de apoyo a la gestión del fondo de desarrollo local de Antonio Nariño en los asuntos operativos relacionados con la seguridad, la convivencia y el desarrollo de actividad económica en la localidad, con conformidad con el marco normativo aplicable en la materia.","Inversión","Un nuevo contrato social y ambiental para la Bogotá del Siglo XXI",57,{"$f":"IF(ISERROR(VLOOKUP(K31,Proposito_programa!$C$2:$E$59,2,FALSE)),\" \",VLOOKUP(K31,Proposito_programa!$C$2:$E$59,2,FALSE))","v":"Gestión pública local"},{"$f":"IF(ISERROR(VLOOKUP(K31,Proposito_programa!$C$2:$E$59,3,FALSE)),\" \",VLOOKUP(K31,Proposito_programa!$C$2:$E$59,3,FALSE))","v":"Propósito 5: Construir Bogotá - Región con gobierno abierto, transparente y ciudadanía consciente"},2198,1,51678981,"BLANCA IDALY SUAREZ HERNANDEZ","Persona Natural",null,null,null,null,19680000,null,null,null,19680000,19680000,"2022-01-13","2022-01-14","2022-09-12",240,null,null,null,null,null,null,"En ejecución",1]
[19,2022,"FDLANCD-019-2022(66818)","https://community.secop.gov.co/Public/Tendering/OpportunityDetail/Index?noticeUID=CO1.NTC.2542873&isFromPublicArea=True&isModal=False","Contratos de prestación de servicios profesionales y de apoyo a la gestión","Contratación directa","Prestación de servicios profesionales y de apoyo a la gestión, o para la ejecución de trabajos artísticos que sólo puedan encomendarse a determinadas personas naturales","Prestar servicios de apoyo a la gestión del fondo de desarrollo local de Antonio Nariño en los asuntos operativos relacionados con la seguridad, la convivencia y el desarrollo de actividad económica en la localidad, con conformidad con el marco normativo aplicable en la materia.","Inversión","Un nuevo contrato social y ambiental para la Bogotá del Siglo XXI",57,{"$f":"IF(ISERROR(VLOOKUP(K32,Proposito_programa!$C$2:$E$59,2,FALSE)),\" \",VLOOKUP(K32,Proposito_programa!$C$2:$E$59,2,FALSE))","v":"Gestión pública local"},{"$f":"IF(ISERROR(VLOOKUP(K32,Proposito_programa!$C$2:$E$59,3,FALSE)),\" \",VLOOKUP(K32,Proposito_programa!$C$2:$E$59,3,FALSE))","v":"Propósito 5: Construir Bogotá - Región con gobierno abierto, transparente y ciudadanía consciente"},2198,1,79370565,"JORGE RAMIRO ORTIZ JARAMILLO","Persona Natural",null,null,null,null,19680000,null,null,null,19680000,19680000,"2022-01-13","2022-07-11","2022-09-12",240,null,null,null,null,null,null,"En ejecución",1]
[20,2022,"FDLANCD-020-2022(66608)","https://community.secop.gov.co/Public/Tendering/OpportunityDetail/Index?noticeUID=CO1.NTC.2545410&isFromPublicArea=True&isModal=False","Contratos de prestación de servicios profesionales y de apoyo a la gestión","Contratación directa","Prestación de servicios profesionales y de apoyo a la gestión, o para la ejecución de trabajos artísticos que sólo puedan encomendarse a determinadas personas naturales","Prestación de servicios de apoyo en la ejecución de actividades administrativas y operativas adelantadas en la Junta Administradora Local de Antonio Nariño","Inversión","Un nuevo contrato social y ambiental para la Bogotá del Siglo XXI",57,{"$f":"IF(ISERROR(VLOOKUP(K33,Proposito_programa!$C$2:$E$59,2,FALSE)),\" \",VLOOKUP(K33,Proposito_programa!$C$2:$E$59,2,FALSE))","v":"Gestión pública local"},{"$f":"IF(ISERROR(VLOOKUP(K33,Proposito_programa!$C$2:$E$59,3,FALSE)),\" \",VLOOKUP(K33,Proposito_programa!$C$2:$E$59,3,FALSE))","v":"Propósito 5: Construir Bogotá - Región con gobierno abierto, transparente y ciudadanía consciente"},2198,1,1013643851,"PAULA ANDREA PEDRAZA QUIÑONES","Persona Natural",null,null,null,null,14760000,null,null,null,14760000,14760000,"2022-01-13","2022-01-14","2022-07-12",180,null,null,null,null,null,null,"En ejecución",1]
[21,2022,"FDLANCD-021-2022(66607)","https://community.secop.gov.co/Public/Tendering/OpportunityDetail/Index?noticeUID=CO1.NTC.2546200&isFromPublicArea=True&isModal=False","Contratos de prestación de servicios profesionales y de apoyo a la gestión","Contratación directa","Prestación de servicios profesionales y de apoyo a la gestión, o para la ejecución de trabajos artísticos que sólo puedan encomendarse a determinadas personas naturales","Prestación de servicios técnico administrativo de apoyo al Alcalde Local de Antonio Nariño en el manejo de los distintos asuntos y trámites asociados con la gestión administrativa local","Inversión","Un nuevo contrato social y ambiental para la Bogotá del Siglo XXI",57,{"$f":"IF(ISERROR(VLOOKUP(K34,Proposito_programa!$C$2:$E$59,2,FALSE)),\" \",VLOOKUP(K34,Proposito_programa!$C$2:$E$59,2,FALSE))","v":"Gestión pública local"},{"$f":"IF(ISERROR(VLOOKUP(K34,Proposito_programa!$C$2:$E$59,3,FALSE)),\" \",VLOOKUP(K34,Proposito_programa!$C$2:$E$59,3,FALSE))","v":"Propósito 5: Construir Bogotá - Región con gobierno abierto, transparente y ciudadanía consciente"},2198,1,1126908588,"ANGELICA MARIA HERNANDEZ DORIA","Persona Natural",null,null,null,null,48840000,null,1,4884000,53724000,47064000,"2022-01-13","2022-01-14","2023-01-15",330,1,33,null,null,null,null,"En ejecución",0.87603305785123964]
[22,2022,"FDLANCD-022-2022(66699)","https://community.secop.gov.co/Public/Tendering/OpportunityDetail/Index?noticeUID=CO1.NTC.2554218&isFromPublicArea=True&isModal=False","Contratos de prestación de servicios profesionales y de apoyo a la gestión","Contratación directa","Prestación de servicios profesionales y de apoyo a la gestión, o para la ejecución de trabajos artísticos que sólo puedan encomendarse a determinadas personas naturales","Prestar los servicios profesionales como administrador de red brindando asistencia y soporte técnico de la infraestructura tecnológica de la Alcaldía Local, así como a los usuarios que desarrollen sus actividades en las áreas de la Alcaldía Local y Junta Administradora Local.","Inversión","Un nuevo contrato social y ambiental para la Bogotá del Siglo XXI",57,{"$f":"IF(ISERROR(VLOOKUP(K35,Proposito_programa!$C$2:$E$59,2,FALSE)),\" \",VLOOKUP(K35,Proposito_programa!$C$2:$E$59,2,FALSE))","v":"Gestión pública local"},{"$f":"IF(ISERROR(VLOOKUP(K35,Proposito_programa!$C$2:$E$59,3,FALSE)),\" \",VLOOKUP(K35,Proposito_programa!$C$2:$E$59,3,FALSE))","v":"Propósito 5: Construir Bogotá - Región con gobierno abierto, transparente y ciudadanía consciente"},2198,1,79890568,"ABEL ERNESTO CASTIBLANCO DURAN","Persona Natural",null,null,null,null,32400000,null,null,null,32400000,32400000,"2022-01-14","2022-01-17","2022-07-16",180,null,null,null,null,null,null,"En ejecución",1]
[23,2022,"FDLANCD-023-2022(66818)","https://community.secop.gov.co/Public/Tendering/OpportunityDetail/Index?noticeUID=CO1.NTC.2546577&isFromPublicArea=True&isModal=False","Contratos de prestación de servicios profesionales y de apoyo a la gestión","Contratación directa","Prestación de servicios profesionales y de apoyo a la gestión, o para la ejecución de trabajos artísticos que sólo puedan encomendarse a determinadas personas naturales","Prestar servicios de apoyo a la gestión del fondo de desarrollo local de Antonio Nariño en los asuntos operativos relacionados con la seguridad, la convivencia y el desarrollo de actividad económica en la localidad, con conformidad con el marco normativo aplicable en la materia.","Inversión","Un nuevo contrato social y ambiental para la Bogotá del Siglo XXI",57,{"$f":"IF(ISERROR(VLOOKUP(K36,Proposito_programa!$C$2:$E$59,2,FALSE)),\" \",VLOOKUP(K36,Proposito_programa!$C$2:$E$59,2,FALSE))","v":"Gestión pública local"},{"$f":"IF(ISERROR(VLOOKUP(K36,Proposito_programa!$C$2:$E$59,3,FALSE)),\" \",VLOOKUP(K36,Proposito_programa!$C$2:$E$59,3,FALSE))","v":"Propósito 5: Construir Bogotá - Región con gobierno abierto, transparente y ciudadanía consciente"},2198,1,51879613,"YAZMIN PARRA MARQUEZ","Persona Natural",null,null,null,null,19680000,null,null,null,19680000,19680000,"2022-01-13","2022-01-14","2022-09-12",240,null,null,null,null,null,null,"En ejecución",1]
[24,2022,"FDLANCD-024-2022(67660)","https://community.secop.gov.co/Public/Tendering/OpportunityDetail/Index?noticeUID=CO1.NTC.2548422&isFromPublicArea=True&isModal=False","Contratos de prestación de servicios profesionales y de apoyo a la gestión","Contratación directa","Prestación de servicios profesionales y de apoyo a la gestión, o para la ejecución de trabajos artísticos que sólo puedan encomendarse a determinadas personas naturales","Prestacion de servicios profesionales como apoyo en la formulacion, seguimiento, supervicion y liquidacion de proyectos de obra e infraestructura relacionados con malla vial y espacio publico en la localidad Antonio Nariño.","Inversión","Un nuevo contrato social y ambiental para la Bogotá del Siglo XXI",49,{"$f":"IF(ISERROR(VLOOKUP(K37,Proposito_programa!$C$2:$E$59,2,FALSE)),\" \",VLOOKUP(K37,Proposito_programa!$C$2:$E$59,2,FALSE))","v":"Movilidad segura, sostenible y accesible"},{"$f":"IF(ISERROR(VLOOKUP(K37,Proposito_programa!$C$2:$E$59,3,FALSE)),\" \",VLOOKUP(K37,Proposito_programa!$C$2:$E$59,3,FALSE))","v":"Propósito 4: Hacer de Bogotá Región un modelo de movilidad multimodal, incluyente y sostenible"},2186,1,1074133645,"MANUEL EDUARDO ALVAREZ VANEGAS","Persona Natural",null,null,null,null,36000000,null,null,null,36000000,33600000,"2022-01-13","2022-01-14","2022-07-12",180,null,null,null,null,null,null,"En ejecución",0.93333333333333335]
[25,2022,"FDLANCD-025-2022(66717)","https://community.secop.gov.co/Public/Tendering/OpportunityDetail/Index?noticeUID=CO1.NTC.2548081&isFromPublicArea=True&isModal=False","Contratos de prestación de servicios profesionales y de apoyo a la gestión","Contratación directa","Prestación de servicios profesionales y de apoyo a la gestión, o para la ejecución de trabajos artísticos que sólo puedan encomendarse a determinadas personas naturales","Apoyar al Alcalde Local en la formulación, seguimiento e implementación de la estrategia local para la terminación jurídica o inactivación de las actuaciones administrativas que cursan en la Alcaldía Local.","Inversión","Un nuevo contrato social y ambiental para la Bogotá del Siglo XXI",57,"Gestión pública local",{"$f":"IF(ISERROR(VLOOKUP(K38,Proposito_programa!$C$2:$E$59,3,FALSE)),\" \",VLOOKUP(K38,Proposito_programa!$C$2:$E$59,3,FALSE))","v":"Propósito 5: Construir Bogotá - Región con gobierno abierto, transparente y ciudadanía consciente"},2189,1,79614602,"RAUL ANTONIO VARGAS CAMARGO","Persona Natural",null,null,null,null,57600000,null,null,null,57600000,57600000,"2022-01-13","2022-01-18","2022-09-16",240,null,null,null,null,null,null,"En ejecución",1]
[26,2022,"FDLANCD-026-2022(67699)","https://community.secop.gov.co/Public/Tendering/OpportunityDetail/Index?noticeUID=CO1.NTC.2550322&isFromPublicArea=True&isModal=False","Contratos de prestación de servicios profesionales y de apoyo a la gestión","Contratación directa","Prestación de servicios profesionales y de apoyo a la gestión, o para la ejecución de trabajos artísticos que sólo puedan encomendarse a determinadas personas naturales","Apoyar al equipo de prensa y comunicaciones de la Alcaldía Local en la realización de productos y piezas digitales, impresas y publicitarias de gran formato y de animación gráfica, así como apoyar la producción y montaje de eventos","Inversión","Un nuevo contrato social y ambiental para la Bogotá del Siglo XXI",57,{"$f":"IF(ISERROR(VLOOKUP(K39,Proposito_programa!$C$2:$E$59,2,FALSE)),\" \",VLOOKUP(K39,Proposito_programa!$C$2:$E$59,2,FALSE))","v":"Gestión pública local"},{"$f":"IF(ISERROR(VLOOKUP(K39,Proposito_programa!$C$2:$E$59,3,FALSE)),\" \",VLOOKUP(K39,Proposito_programa!$C$2:$E$59,3,FALSE))","v":"Propósito 5: Construir Bogotá - Región con gobierno abierto, transparente y ciudadanía consciente"},2198,1,1018456962,"JUAN CAMILO MONTENGRO SANCHEZ","Persona Natural",null,null,null,null,27720000,null,null,null,27720000,27720000,"2022-01-13","2022-01-14","2022-07-12",180,null,null,null,null,null,null,"En ejecución",1]
[27,2022,"FDLANCD-027-2022(67094)","https://community.secop.gov.co/Public/Tendering/OpportunityDetail/Index?noticeUID=CO1.NTC.2596936&isFromPublicArea=True&isModal=False","Contratos de prestación de servicios profesionales y de apoyo a la gestión","Contratación directa","Prestación de servicios profesionales y de apoyo a la gestión, o para la ejecución de trabajos artísticos que sólo puedan encomendarse a determinadas personas naturales","Apoyar jurídicamente la ejecución de las acciones requeridas para el trámite e impulso procesal de las actuaciones contravencionales y/o querellas que cursen en las Inspecciones de Policía de la Localidad","Inversión","Un nuevo contrato social y ambiental para la Bogotá del Siglo XXI",57,{"$f":"IF(ISERROR(VLOOKUP(K40,Proposito_programa!$C$2:$E$59,2,FALSE)),\" \",VLOOKUP(K40,Proposito_programa!$C$2:$E$59,2,FALSE))","v":"Gestión pública local"},{"$f":"IF(ISERROR(VLOOKUP(K40,Proposito_programa!$C$2:$E$59,3,FALSE)),\" \",VLOOKUP(K40,Proposito_programa!$C$2:$E$59,3,FALSE))","v":"Propósito 5: Construir Bogotá - Región con gobierno abierto, transparente y ciudadanía consciente"},2189,1,10194914219,"OSCAR MAURICIO CARMONA CELIS","Persona Natural",null,null,null,null,27720000,null,null,null,27720000,27720000,"2022-01-18","2022-01-19","2022-07-17",180,null,null,null,null,null,null,"En ejecución",1]
[28,2022,"FDLANCD-028-2022(66612)","https://community.secop.gov.co/Public/Tendering/OpportunityDetail/Index?noticeUID=CO1.NTC.2589310&isFromPublicArea=True&isModal=False","Contratos de prestación de servicios profesionales y de apoyo a la gestión","Contratación directa","Prestación de servicios profesionales y de apoyo a la gestión, o para la ejecución de trabajos artísticos que sólo puedan encomendarse a determinadas personas naturales","Prestar los servicios profesionales para la operación, prestación, seguimiento y cumplimiento de los procedimientos administrativos, operativos y programáticos del Servicio Apoyo Económico Tipo C, que contribuyan a la garantía de los derechos de la población mayor en el marco de la Política Pública Social para el Envejecimiento y la Vejez en el Distrito Capital a cargo de la Alcaldía Local de Antonio Nariño","Inversión","Un nuevo contrato social y ambiental para la Bogotá del Siglo XXI",1,{"$f":"IF(ISERROR(VLOOKUP(K41,Proposito_programa!$C$2:$E$59,2,FALSE)),\" \",VLOOKUP(K41,Proposito_programa!$C$2:$E$59,2,FALSE))","v":"Subsidios y transferencias para la equidad"},{"$f":"IF(ISERROR(VLOOKUP(K41,Proposito_programa!$C$2:$E$59,3,FALSE)),\" \",VLOOKUP(K41,Proposito_programa!$C$2:$E$59,3,FALSE))","v":"Propósito 1: Hacer un nuevo contrato social para incrementar la inclusión social, productiva y política"},1851,1,"CE 423466","SUSANA PATRICIA ENRIQUEZ","Persona Natural",null,null,null,null,32400000,null,null,null,32400000,32400000,"2022-01-17","2022-01-19","2022-07-17",180,null,null,null,null,null,null,"En ejecución",1]
[29,2022,"FDLANCD-029-2022(69835)","https://community.secop.gov.co/Public/Tendering/OpportunityDetail/Index?noticeUID=CO1.NTC.2582183&isFromPublicArea=True&isModal=False","Contratos de prestación de servicios profesionales y de apoyo a la gestión","Contratación directa","Prestación de servicios profesionales y de apoyo a la gestión, o para la ejecución de trabajos artísticos que sólo puedan encomendarse a determinadas personas naturales","Prestacion de servicios de apoyo asistencial en el Área de Gestion del Desarrollo, Administrativa y Financiera del Fondo de Desarrollo Local de Antonio Nariño","Inversión","Un nuevo contrato social y ambiental para la Bogotá del Siglo XXI",57,{"$f":"IF(ISERROR(VLOOKUP(K42,Proposito_programa!$C$2:$E$59,2,FALSE)),\" \",VLOOKUP(K42,Proposito_programa!$C$2:$E$59,2,FALSE))","v":"Gestión pública local"},{"$f":"IF(ISERROR(VLOOKUP(K42,Proposito_programa!$C$2:$E$59,3,FALSE)),\" \",VLOOKUP(K42,Proposito_programa!$C$2:$E$59,3,FALSE))","v":"Propósito 5: Construir Bogotá - Región con gobierno abierto, transparente y ciudadanía consciente"},2198,1,1023875489,"JORGE DIEGO ALBERTO VEGA POVEDA","Persona Natural",null,null,null,null,11160000,null,null,null,11160000,11160000,"2022-01-17","2022-01-18","2022-07-16",180,null,null,null,null,null,null,"En ejecución",1]
[30,2022,"FDLANCD-030-2022(66793)","https://community.secop.gov.co/Public/Tendering/OpportunityDetail/Index?noticeUID=CO1.NTC.2558255&isFromPublicArea=True&isModal=False","Contratos de prestación de servicios profesionales y de apoyo a la gestión","Contratación directa","Prestación de servicios profesionales y de apoyo a la gestión, o para la ejecución de trabajos artísticos que sólo puedan encomendarse a determinadas personas naturales","Prestación de servicios de apoyo a la gestión para la conducción de los vehículos que conforman el parque automotor en propiedad o custodia del Fondo de Desarrollo Local de Antonio Nariño, y el transporte de funcionarios y contratistas para la realización de las actividades misionales de la Alcaldía Local de Antonio Nariño","Inversión","Un nuevo contrato social y ambiental para la Bogotá del Siglo XXI",57,{"$f":"IF(ISERROR(VLOOKUP(K43,Proposito_programa!$C$2:$E$59,2,FALSE)),\" \",VLOOKUP(K43,Proposito_programa!$C$2:$E$59,2,FALSE))","v":"Gestión pública local"},{"$f":"IF(ISERROR(VLOOKUP(K43,Proposito_programa!$C$2:$E$59,3,FALSE)),\" \",VLOOKUP(K43,Proposito_programa!$C$2:$E$59,3,FALSE))","v":"Propósito 5: Construir Bogotá - Región con gobierno abierto, transparente y ciudadanía consciente"},2198,1,79488817,"CARLOS MARTIN BOJACA TORRES","Persona Natural",null,null,null,null,29997000,null,1,2727000,32724000,28633500,"2022-01-14","2022-01-17","2023-01-15",330,1,30,null,null,null,null,"En ejecución",0.875]
[31,2022,"FDLANCD-031-2022(67406)","https://community.secop.gov.co/Public/Tendering/OpportunityDetail/Index?noticeUID=CO1.NTC.2560328&isFromPublicArea=True&isModal=False","Contratos de prestación de servicios profesionales y de apoyo a la gestión","Contratación directa","Prestación de servicios profesionales y de apoyo a la gestión, o para la ejecución de trabajos artísticos que sólo puedan encomendarse a determinadas personas naturales","Apoyar técnicamente las distintas etapas de los procesos de competencia de las Inspecciones de Policía de la Localidad, según reparto.","Inversión","Un nuevo contrato social y ambiental para la Bogotá del Siglo XXI",57,{"$f":"IF(ISERROR(VLOOKUP(K44,Proposito_programa!$C$2:$E$59,2,FALSE)),\" \",VLOOKUP(K44,Proposito_programa!$C$2:$E$59,2,FALSE))","v":"Gestión pública local"},{"$f":"IF(ISERROR(VLOOKUP(K44,Proposito_programa!$C$2:$E$59,3,FALSE)),\" \",VLOOKUP(K44,Proposito_programa!$C$2:$E$59,3,FALSE))","v":"Propósito 5: Construir Bogotá - Región con gobierno abierto, transparente y ciudadanía consciente"},2198,1,5230855,"WILFREDO MUÑOZ ARAUJO","Persona Natural",null,null,null,null,59400000,null,null,null,59400000,56700000,"2022-01-14","2022-01-17","2022-12-15",330,null,null,null,null,null,null,"En ejecución",0.95454545454545459]
[32,2022,"FDLANCD-032-2022(66852)","https://community.secop.gov.co/Public/Tendering/OpportunityDetail/Index?noticeUID=CO1.NTC.2564288&isFromPublicArea=True&isModal=False","Contratos de prestación de servicios profesionales y de apoyo a la gestión","Contratación directa","Prestación de servicios profesionales y de apoyo a la gestión, o para la ejecución de trabajos artísticos que sólo puedan encomendarse a determinadas personas naturales","Apoyar al Alcalde (sa) Local en la promoción, acompañamiento, articulación y atención de las instancias de coordinación interinstitucionales y las instancias de participación locales, así como los procesos comunitarios en la localidad.","Inversión","Un nuevo contrato social y ambiental para la Bogotá del Siglo XXI",55,{"$f":"IF(ISERROR(VLOOKUP(K45,Proposito_programa!$C$2:$E$59,2,FALSE)),\" \",VLOOKUP(K45,Proposito_programa!$C$2:$E$59,2,FALSE))","v":"Fortalecimiento de cultura ciudadana y su institucionalidad"},{"$f":"IF(ISERROR(VLOOKUP(K45,Proposito_programa!$C$2:$E$59,3,FALSE)),\" \",VLOOKUP(K45,Proposito_programa!$C$2:$E$59,3,FALSE))","v":"Propósito 5: Construir Bogotá - Región con gobierno abierto, transparente y ciudadanía consciente"},2190,1,1082896812,"ANGELA VANESSA ABELLA","Persona Natural",null,null,null,null,27720000,null,null,null,27720000,27720000,"2022-01-14","2022-01-17","2022-07-16",180,null,null,null,null,null,null,"En ejecución",1]
[33,2022,"FDLANCD-033-2022(66801)","https://community.secop.gov.co/Public/Tendering/OpportunityDetail/Index?noticeUID=CO1.NTC.2579578&isFromPublicArea=True&isModal=False","Contratos de prestación de servicios profesionales y de apoyo a la gestión","Contratación directa","Prestación de servicios profesionales y de apoyo a la gestión, o para la ejecución de trabajos artísticos que sólo puedan encomendarse a determinadas personas naturales","Prestar los servicios profesionales apoyando en la revisión y designación en los diferentes trámites relacionados con los procesos de selección de contratistas del Fondo de Desarrollo Local de Antonio Nariño","Inversión","Un nuevo contrato social y ambiental para la Bogotá del Siglo XXI",57,{"$f":"IF(ISERROR(VLOOKUP(K46,Proposito_programa!$C$2:$E$59,2,FALSE)),\" \",VLOOKUP(K46,Proposito_programa!$C$2:$E$59,2,FALSE))","v":"Gestión pública local"},{"$f":"IF(ISERROR(VLOOKUP(K46,Proposito_programa!$C$2:$E$59,3,FALSE)),\" \",VLOOKUP(K46,Proposito_programa!$C$2:$E$59,3,FALSE))","v":"Propósito 5: Construir Bogotá - Región con gobierno abierto, transparente y ciudadanía consciente"},2198,1,1015449672,"JULIANA ANDREA PINILLOS SANCHEZ","Persona Natural",null,null,null,null,77220000,null,1,7020000,84240000,73476000,"2022-01-17","2022-01-18","2023-01-15",330,1,30,null,null,null,null,"En ejecución",0.87222222222222223]
[34,2022,"FDLANCD-034-2022(67678)","https://community.secop.gov.co/Public/Tendering/OpportunityDetail/Index?noticeUID=CO1.NTC.2650192&isFromPublicArea=True&isModal=False","Contratos de prestación de servicios profesionales y de apoyo a la gestión","Contratación directa","Prestación de servicios profesionales y de apoyo a la gestión, o para la ejecución de trabajos artísticos que sólo puedan encomendarse a determinadas personas naturales","Prestar servicios profesionales como abogado para apoyar al despacho del alcalde local de Antonio Nariño en los distintos aspectos jurídicos y de acompañamiento asociados con la inspección, vigilancia y control de la alcaldía local en materia de actividad económica, despachos comisorios, convivencia ciudadana y uso del espacio público de conformidad con la normatividad nacional, distrital y local vigente.","Inversión","Un nuevo contrato social y ambiental para la Bogotá del Siglo XXI",57,{"$f":"IF(ISERROR(VLOOKUP(K47,Proposito_programa!$C$2:$E$59,2,FALSE)),\" \",VLOOKUP(K47,Proposito_programa!$C$2:$E$59,2,FALSE))","v":"Gestión pública local"},{"$f":"IF(ISERROR(VLOOKUP(K47,Proposito_programa!$C$2:$E$59,3,FALSE)),\" \",VLOOKUP(K47,Proposito_programa!$C$2:$E$59,3,FALSE))","v":"Propósito 5: Construir Bogotá - Región con gobierno abierto, transparente y ciudadanía consciente"},2198,1,65716349,"ERIKA ANDREA MACIAS CARDENAS","Persona Natural",null,null,null,null,42318000,null,null,null,{"$f":"+W47+X47+Z47","v":42318000},42318000,"2022-01-21","2022-02-04","2022-08-05",180,null,null,null,null,null,null,"En ejecución",1]
[35,2022,"FDLANCD-035-2022(66850)","https://community.secop.gov.co/Public/Tendering/OpportunityDetail/Index?noticeUID=CO1.NTC.2581270&isFromPublicArea=True&isModal=False","Contratos de prestación de servicios profesionales y de apoyo a la gestión","Contratación directa","Prestación de servicios profesionales y de apoyo a la gestión, o para la ejecución de trabajos artísticos que sólo puedan encomendarse a determinadas personas naturales","Prestación de servicios profesionales como abogado para apoyar la estructuración, seguimiento y control de procesos contractuales que deriven del proyecto de inversión 2200 conforme a las Acciones de fomento y promoción de actividades en el campo deportivo del Fondo de Desarrollo Local de Antonio Nariño","Inversión","Un nuevo contrato social y ambiental para la Bogotá del Siglo XXI",20,{"$f":"IF(ISERROR(VLOOKUP(K48,Proposito_programa!$C$2:$E$59,2,FALSE)),\" \",VLOOKUP(K48,Proposito_programa!$C$2:$E$59,2,FALSE))","v":"Bogotá, referente en cultura, deporte, recreación y actividad física, con parques para el desarrollo y la salud"},{"$f":"IF(ISERROR(VLOOKUP(K48,Proposito_programa!$C$2:$E$59,3,FALSE)),\" \",VLOOKUP(K48,Proposito_programa!$C$2:$E$59,3,FALSE))","v":"Propósito 1: Hacer un nuevo contrato social para incrementar la inclusión social, productiva y política"},2200,1,1019002889,"EFREY ARMANDO SANABRIA MORENO","Persona Natural",null,null,null,null,32400000,null,null,null,32400000,32400000,"2022-01-17","2022-01-18","2022-07-16",180,null,null,null,null,null,null,"En ejecución",1]
[36,2022,"FDLANCD-036-2022(66837)","https://community.secop.gov.co/Public/Tendering/OpportunityDetail/Index?noticeUID=CO1.NTC.2583308&isFromPublicArea=True&isModal=False","Contratos de prestación de servicios profesionales y de apoyo a la gestión","Contratación directa","Prestación de servicios profesionales y de apoyo a la gestión, o para la ejecución de trabajos artísticos que sólo puedan encomendarse a determinadas personas naturales","Prestación de servicios profesionales como abogado para apoyar la estructuración, seguimiento y control de procesos contractuales que deriven del proyecto de inversión 2048 conforme a las acciones de promoción para la educación de la localidad de Antonio Nariño.","Inversión","Un nuevo contrato social y ambiental para la Bogotá del Siglo XXI",17,{"$f":"IF(ISERROR(VLOOKUP(K49,Proposito_programa!$C$2:$E$59,2,FALSE)),\" \",VLOOKUP(K49,Proposito_programa!$C$2:$E$59,2,FALSE))","v":"Jóvenes con capacidades: Proyecto de vida para la ciudadanía, la innovación y el trabajo del siglo XXI"},{"$f":"IF(ISERROR(VLOOKUP(K49,Proposito_programa!$C$2:$E$59,3,FALSE)),\" \",VLOOKUP(K49,Proposito_programa!$C$2:$E$59,3,FALSE))","v":"Propósito 1: Hacer un nuevo contrato social para incrementar la inclusión social, productiva y política"},2048,1,1072715196,"ANDRES FELIPE ROJAS GARZON","Persona Natural",null,null,null,null,32400000,null,null,null,32400000,32400000,"2022-01-17","2022-01-18","2022-07-16",180,null,null,null,null,null,null,"En ejecución",1]
[37,2022,"FDLANCD-037-2022(67406)","https://community.secop.gov.co/Public/Tendering/OpportunityDetail/Index?noticeUID=CO1.NTC.2590833&isFromPublicArea=True&isModal=False","Contratos de prestación de servicios profesionales y de apoyo a la gestión","Contratación directa","Prestación de servicios profesionales y de apoyo a la gestión, o para la ejecución de trabajos artísticos que sólo puedan encomendarse a determinadas personas naturales","Apoyar técnicamente las distintas etapas de los procesos de competencia de las Inspecciones de Policía de la Localidad, según reparto.","Inversión","Un nuevo contrato social y ambiental para la Bogotá del Siglo XXI",57,{"$f":"IF(ISERROR(VLOOKUP(K50,Proposito_programa!$C$2:$E$59,2,FALSE)),\" \",VLOOKUP(K50,Proposito_programa!$C$2:$E$59,2,FALSE))","v":"Gestión pública local"},{"$f":"IF(ISERROR(VLOOKUP(K50,Proposito_programa!$C$2:$E$59,3,FALSE)),\" \",VLOOKUP(K50,Proposito_programa!$C$2:$E$59,3,FALSE))","v":"Propósito 5: Construir Bogotá - Región con gobierno abierto, transparente y ciudadanía consciente"},2198,1,1019047566,"LAURA ALEJANDRA MORENO MOLINA","Persona Natural",null,null,null,null,59400000,null,1,5220000,{"$f":"+W50+X50+Z50","v":64620000},56520000,"2022-01-17","2022-01-18","2023-01-15",330,1,29,null,null,null,null,"En ejecución",0.87465181058495822]
[38,2022,"FDLANCD-038-2022(67784)","https://community.secop.gov.co/Public/Tendering/OpportunityDetail/Index?noticeUID=CO1.NTC.2590548&isFromPublicArea=True&isModal=False","Contratos de prestación de servicios profesionales y de apoyo a la gestión","Contratación directa","Prestación de servicios profesionales y de apoyo a la gestión, o para la ejecución de trabajos artísticos que sólo puedan encomendarse a determinadas personas naturales","Prestación de servicios profesionales para apoyar al área gestión del desarrollo, administrativa y financiera en el diligenciamiento de las actuaciones de los documentos técnicos de soporte y fichas de estadística básicas de inversión y elaboración de los documentos soporte necesarios para ejecutar los proyectos de inversión del fondo de desarrollo local de Antonio Nariño","Inversión","Un nuevo contrato social y ambiental para la Bogotá del Siglo XXI",57,{"$f":"IF(ISERROR(VLOOKUP(K51,Proposito_programa!$C$2:$E$59,2,FALSE)),\" \",VLOOKUP(K51,Proposito_programa!$C$2:$E$59,2,FALSE))","v":"Gestión pública local"},{"$f":"IF(ISERROR(VLOOKUP(K51,Proposito_programa!$C$2:$E$59,3,FALSE)),\" \",VLOOKUP(K51,Proposito_programa!$C$2:$E$59,3,FALSE))","v":"Propósito 5: Construir Bogotá - Región con gobierno abierto, transparente y ciudadanía consciente"},2198,1,1016009101,"CRISTIAN ANDRÉS ALBARRACÍN MÁRQUEZ","Persona Natural",null,null,null,null,27720000,null,null,null,27720000,27720000,"2022-01-17","2022-01-18","2022-07-16",180,null,null,null,null,null,null,"En ejecución",1]
[39,2022,"FDLANCD-039-2022(68134)","https://community.secop.gov.co/Public/Tendering/OpportunityDetail/Index?noticeUID=CO1.NTC.2597530&isFromPublicArea=True&isModal=False","Contratos de prestación de servicios profesionales y de apoyo a la gestión","Contratación directa","Prestación de servicios profesionales y de apoyo a la gestión, o para la ejecución de trabajos artísticos que sólo puedan encomendarse a determinadas personas naturales","Prestar servicios de apoyo a la gestión al fondo de desarrollo local de Antonio Nariño en el seguimiento a los procesos con jóvenes, así como en los procesos de participación ciudadana en la localidad.","Inversión","Un nuevo contrato social y ambiental para la Bogotá del Siglo XXI",17,{"$f":"IF(ISERROR(VLOOKUP(K52,Proposito_programa!$C$2:$E$59,2,FALSE)),\" \",VLOOKUP(K52,Proposito_programa!$C$2:$E$59,2,FALSE))","v":"Jóvenes con capacidades: Proyecto de vida para la ciudadanía, la innovación y el trabajo del siglo XXI"},{"$f":"IF(ISERROR(VLOOKUP(K52,Proposito_programa!$C$2:$E$59,3,FALSE)),\" \",VLOOKUP(K52,Proposito_programa!$C$2:$E$59,3,FALSE))","v":"Propósito 1: Hacer un nuevo contrato social para incrementar la inclusión social, productiva y política"},2199,1,1013632075,"JUAN SEBASTIAN MARIN MARIN","Persona Natural",null,null,null,null,14760000,null,null,null,14760000,14760000,"2022-01-18","2022-01-19","2022-07-17",180,null,null,null,null,null,null,"En ejecución",1]
[40,2022,"FDLANCD-040-2022(67158)","https://community.secop.gov.co/Public/Tendering/OpportunityDetail/Index?noticeUID=CO1.NTC.2598376&isFromPublicArea=True&isModal=False","Contratos de prestación de servicios profesionales y de apoyo a la gestión","Contratación directa","Prestación de servicios profesionales y de apoyo a la gestión, o para la ejecución de trabajos artísticos que sólo puedan encomendarse a determinadas personas naturales","Prestar los servicios de apoyo como técnico administrativo en el área de gestión de desarrollo del Fondo de Desarrollo Local de Antonio Nariño para los diferentes asuntos contractuales que adelanta la entidad.","Inversión","Un nuevo contrato social y ambiental para la Bogotá del Siglo XXI",57,{"$f":"IF(ISERROR(VLOOKUP(K53,Proposito_programa!$C$2:$E$59,2,FALSE)),\" \",VLOOKUP(K53,Proposito_programa!$C$2:$E$59,2,FALSE))","v":"Gestión pública local"},{"$f":"IF(ISERROR(VLOOKUP(K53,Proposito_programa!$C$2:$E$59,3,FALSE)),\" \",VLOOKUP(K53,Proposito_programa!$C$2:$E$59,3,FALSE))","v":"Propósito 5: Construir Bogotá - Región con gobierno abierto, transparente y ciudadanía consciente"},2198,1,101422250,"SEBASTIAN FELIPE MERCHAN GIRALDO","Persona Natural",null,null,null,null,16740000,null,null,null,16740000,14694000,"2022-01-18","2022-01-24","2022-07-22",180,null,null,null,null,null,null,"En ejecución",0.87777777777777777]
[41,2022,"FDLANCD-041-2022(67774)","https://community.secop.gov.co/Public/Tendering/OpportunityDetail/Index?noticeUID=CO1.NTC.2595375&isFromPublicArea=True&isModal=False","Contratos de prestación de servicios profesionales y de apoyo a la gestión","Contratación directa","Prestación de servicios profesionales y de apoyo a la gestión, o para la ejecución de trabajos artísticos que sólo puedan encomendarse a determinadas personas naturales","Prestación de servicios de apoyo a la gestión para la conducción de los vehículos que conforman el parque automotor en propiedad o custodia del Fondo de Desarrollo Local de Antonio Nariño, y el transporte de funcionarios y contratistas para la realización de las actividades misionales de la Alcaldía Local de Antonio Nariño","Inversión","Un nuevo contrato social y ambiental para la Bogotá del Siglo XXI",57,{"$f":"IF(ISERROR(VLOOKUP(K54,Proposito_programa!$C$2:$E$59,2,FALSE)),\" \",VLOOKUP(K54,Proposito_programa!$C$2:$E$59,2,FALSE))","v":"Gestión pública local"},{"$f":"IF(ISERROR(VLOOKUP(K54,Proposito_programa!$C$2:$E$59,3,FALSE)),\" \",VLOOKUP(K54,Proposito_programa!$C$2:$E$59,3,FALSE))","v":"Propósito 5: Construir Bogotá - Región con gobierno abierto, transparente y ciudadanía consciente"},2198,1,79392568,"HECTOR GIOVANNY AYALA RODRIGUEZ","Persona Natural",null,null,null,null,14760000,null,null,null,14760000,14760000,"2022-01-18","2022-01-19","2022-07-17",180,null,null,null,null,null,null,"En ejecución",1]
[42,2022,"FDLANCD-042-2022(69866)","https://community.secop.gov.co/Public/Tendering/OpportunityDetail/Index?noticeUID=CO1.NTC.2595183&isFromPublicArea=True&isModal=False","Contratos de prestación de servicios profesionales y de apoyo a la gestión","Contratación directa","Prestación de servicios profesionales y de apoyo a la gestión, o para la ejecución de trabajos artísticos que sólo puedan encomendarse a determinadas personas naturales","Prestación de servicios de apoyo a las actividades administrativas en cuanto a notificación de la correspondencia generada por el área de gestión del desarrollo, administrativa y financiera y área de gestión policiva de la Alcaldía de Antonio Nariño.","Inversión","Un nuevo contrato social y ambiental para la Bogotá del Siglo XXI",57,{"$f":"IF(ISERROR(VLOOKUP(K55,Proposito_programa!$C$2:$E$59,2,FALSE)),\" \",VLOOKUP(K55,Proposito_programa!$C$2:$E$59,2,FALSE))","v":"Gestión pública local"},{"$f":"IF(ISERROR(VLOOKUP(K55,Proposito_programa!$C$2:$E$59,3,FALSE)),\" \",VLOOKUP(K55,Proposito_programa!$C$2:$E$59,3,FALSE))","v":"Propósito 5: Construir Bogotá - Región con gobierno abierto, transparente y ciudadanía consciente"},2198,1,71594128,"JHON JAIRO MORENO PANIAGUA","Persona Natural",null,null,null,null,16200000,null,null,null,16200000,16200000,"2022-01-18","2022-01-19","2022-07-17",180,null,null,null,null,null,null,"En ejecución",1]
[43,2022,"FDLANCD-043-2022(66764)","https://community.secop.gov.co/Public/Tendering/OpportunityDetail/Index?noticeUID=CO1.NTC.2602992&isFromPublicArea=True&isModal=False","Contratos de prestación de servicios profesionales y de apoyo a la gestión","Contratación directa","Prestación de servicios profesionales y de apoyo a la gestión, o para la ejecución de trabajos artísticos que sólo puedan encomendarse a determinadas personas naturales","Prestar servicios profesionales para apoyar al despacho de la Alcaldía Local de Antonio Nariño en la planeación, articulación, seguimiento, ejecución y fortalecimiento de las capacidades de la alcaldía local en el cumplimiento de las funciones de inspección, vigilancia y control aplicando la normatividad nacional, distrital y local vigente.","Inversión","Un nuevo contrato social y ambiental para la Bogotá del Siglo XXI",57,{"$f":"IF(ISERROR(VLOOKUP(K56,Proposito_programa!$C$2:$E$59,2,FALSE)),\" \",VLOOKUP(K56,Proposito_programa!$C$2:$E$59,2,FALSE))","v":"Gestión pública local"},{"$f":"IF(ISERROR(VLOOKUP(K56,Proposito_programa!$C$2:$E$59,3,FALSE)),\" \",VLOOKUP(K56,Proposito_programa!$C$2:$E$59,3,FALSE))","v":"Propósito 5: Construir Bogotá - Región con gobierno abierto, transparente y ciudadanía consciente"},2189,1,87090158,"LUIS CARLOS ERIRA TUPAZ","Persona Natural",null,null,null,null,105600000,null,1,8320000,113920000,99840000,"2022-01-18","2022-01-20","2023-01-14",330,null,null,null,null,null,null,"En ejecución",0.8764044943820225]
[44,2022,"FDLANCD-044-2022(67114)","https://community.secop.gov.co/Public/Tendering/OpportunityDetail/Index?noticeUID=CO1.NTC.2599552&isFromPublicArea=True&isModal=False","Contratos de prestación de servicios profesionales y de apoyo a la gestión","Contratación directa","Prestación de servicios profesionales y de apoyo a la gestión, o para la ejecución de trabajos artísticos que sólo puedan encomendarse a determinadas personas naturales","Prestación de servicios de apoyo a la gestión al Despacho del Alcalde Local de Antonio Nariño en el manejo de los distintos asuntos y tramites asociados con la gestión administrativa local","Inversión","Un nuevo contrato social y ambiental para la Bogotá del Siglo XXI",57,{"$f":"IF(ISERROR(VLOOKUP(K57,Proposito_programa!$C$2:$E$59,2,FALSE)),\" \",VLOOKUP(K57,Proposito_programa!$C$2:$E$59,2,FALSE))","v":"Gestión pública local"},{"$f":"IF(ISERROR(VLOOKUP(K57,Proposito_programa!$C$2:$E$59,3,FALSE)),\" \",VLOOKUP(K57,Proposito_programa!$C$2:$E$59,3,FALSE))","v":"Propósito 5: Construir Bogotá - Región con gobierno abierto, transparente y ciudadanía consciente"},2198,1,1070979522,"MARIA DANIELA MONTERO ","Persona Natural",null,null,null,null,14760000,null,null,null,14760000,14760000,"2022-01-18","2022-01-20","2022-07-18",180,null,null,1053869262,"MARIA DANIELA MONTERO DIAZ","2022-06-01",14760000,"En ejecución",1]
[45,2022,"FDLANCD-045-2022(67784)","https://community.secop.gov.co/Public/Tendering/OpportunityDetail/Index?noticeUID=CO1.NTC.2599793&isFromPublicArea=True&isModal=False","Contratos de prestación de servicios profesionales y de apoyo a la gestión","Contratación directa","Prestación de servicios profesionales y de apoyo a la gestión, o para la ejecución de trabajos artísticos que sólo puedan encomendarse a determinadas personas naturales","Prestación de servicios profesionales para apoyar al área gestión del desarrollo, administrativa y financiera en el diligenciamiento de las actuaciones de los documentos técnicos de soporte y fichas de estadística básicas de inversión y elaboración de los documentos soporte necesarios para ejecutar los proyectos de inversión del fondo de desarrollo local de Antonio Nariño","Inversión","Un nuevo contrato social y ambiental para la Bogotá del Siglo XXI",57,{"$f":"IF(ISERROR(VLOOKUP(K58,Proposito_programa!$C$2:$E$59,2,FALSE)),\" \",VLOOKUP(K58,Proposito_programa!$C$2:$E$59,2,FALSE))","v":"Gestión pública local"},{"$f":"IF(ISERROR(VLOOKUP(K58,Proposito_programa!$C$2:$E$59,3,FALSE)),\" \",VLOOKUP(K58,Proposito_programa!$C$2:$E$59,3,FALSE))","v":"Propósito 5: Construir Bogotá - Región con gobierno abierto, transparente y ciudadanía consciente"},2198,1,80252467,"MARIA FERNANDA GUARIN ROMERO ","Persona Natural",null,null,null,null,27720000,null,null,null,27720000,24332000,"2022-01-18","2022-01-21","2022-07-19",180,null,null,80252467,"JAIRO LEON VARGAS","2022-05-03",27720000,"En ejecución",0.87777777777777777]
[46,2022,"FDLANCD-046-2022(66978)","https://community.secop.gov.co/Public/Tendering/OpportunityDetail/Index?noticeUID=CO1.NTC.2604016&isFromPublicArea=True&isModal=False","Contratos de prestación de servicios profesionales y de apoyo a la gestión","Contratación directa","Prestación de servicios profesionales y de apoyo a la gestión, o para la ejecución de trabajos artísticos que sólo puedan encomendarse a determinadas personas naturales","Prestacion de servicios profesionales al area de gestion de desarrollo local Antonio Nariño para apoyar la formulacion, socializacion y seguimiento de los programas y proyectos de inversion, relacionados con la infraestructura del fondo, necesarios para el cumplimiento del plan de desarrollo local.","Inversión","Un nuevo contrato social y ambiental para la Bogotá del Siglo XXI",33,{"$f":"IF(ISERROR(VLOOKUP(K59,Proposito_programa!$C$2:$E$59,2,FALSE)),\" \",VLOOKUP(K59,Proposito_programa!$C$2:$E$59,2,FALSE))","v":"Más árboles y más y mejor espacio público"},{"$f":"IF(ISERROR(VLOOKUP(K59,Proposito_programa!$C$2:$E$59,3,FALSE)),\" \",VLOOKUP(K59,Proposito_programa!$C$2:$E$59,3,FALSE))","v":"Propósito 2 : Cambiar Nuestros Hábitos de Vida para Reverdecer a Bogotá y Adaptarnos y Mitigar la Crisis Climática"},2207,1,30204199,"ANA NICELY CASAS GERENA","Persona Natural",null,null,null,null,27720000,null,null,null,27720000,27720000,"2022-01-18","2022-01-19","2022-07-17",180,null,null,null,null,null,null,"En ejecución",1]
[47,2022,"FDLANCD-047-2022(66692)","https://community.secop.gov.co/Public/Tendering/OpportunityDetail/Index?noticeUID=CO1.NTC.2607498&isFromPublicArea=True&isModal=False","Contratos de prestación de servicios profesionales y de apoyo a la gestión","Contratación directa","Prestación de servicios profesionales y de apoyo a la gestión, o para la ejecución de trabajos artísticos que sólo puedan encomendarse a determinadas personas naturales","Apoyar técnicamente a los responsables e integrantes de los procesos en la implementación de herramientas de gestión, siguiendo los lineamientos metodológicos establecidos por la Oficina Asesora de Planeación de la Secretaría Distrital de Gobierno.","Inversión","Un nuevo contrato social y ambiental para la Bogotá del Siglo XXI",57,{"$f":"IF(ISERROR(VLOOKUP(K60,Proposito_programa!$C$2:$E$59,2,FALSE)),\" \",VLOOKUP(K60,Proposito_programa!$C$2:$E$59,2,FALSE))","v":"Gestión pública local"},{"$f":"IF(ISERROR(VLOOKUP(K60,Proposito_programa!$C$2:$E$59,3,FALSE)),\" \",VLOOKUP(K60,Proposito_programa!$C$2:$E$59,3,FALSE))","v":"Propósito 5: Construir Bogotá - Región con gobierno abierto, transparente y ciudadanía consciente"},2198,1,52951852,"ANGELA FERNANDA DIAZ TORRES","Persona Natural",null,null,null,null,32400000,null,null,null,32400000,29160000,"2021-01-19","2022-01-20","2022-07-18",180,null,null,null,null,null,null,"En ejecución",0.9]
[48,2022,"FDLANCD-048-2022(66818 )","https://community.secop.gov.co/Public/Tendering/OpportunityDetail/Index?noticeUID=CO1.NTC.2607573&isFromPublicArea=True&isModal=False","Contratos de prestación de servicios profesionales y de apoyo a la gestión","Contratación directa","Prestación de servicios profesionales y de apoyo a la gestión, o para la ejecución de trabajos artísticos que sólo puedan encomendarse a determinadas personas naturales","Prestar servicios de apoyo a la gestión del fondo de desarrollo local de Antonio Nariño en los asuntos operativos relacionados con la seguridad, la convivencia y el desarrollo de actividad económica en la localidad, con conformidad con el marco normativo aplicable en la materia.","Inversión","Un nuevo contrato social y ambiental para la Bogotá del Siglo XXI",57,{"$f":"IF(ISERROR(VLOOKUP(K61,Proposito_programa!$C$2:$E$59,2,FALSE)),\" \",VLOOKUP(K61,Proposito_programa!$C$2:$E$59,2,FALSE))","v":"Gestión pública local"},{"$f":"IF(ISERROR(VLOOKUP(K61,Proposito_programa!$C$2:$E$59,3,FALSE)),\" \",VLOOKUP(K61,Proposito_programa!$C$2:$E$59,3,FALSE))","v":"Propósito 5: Construir Bogotá - Región con gobierno abierto, transparente y ciudadanía consciente"},2198,1,1013659896,"FELIPE ARANGO MORALES","Persona Natural",null,null,null,null,19680000,null,null,null,19680000,19680000,"2021-01-19","2022-01-20","2022-09-18",240,null,null,null,null,null,null,"En ejecución",1]
[49,2022,"FDLANCD-049-2022(68249)","https://community.secop.gov.co/Public/Tendering/OpportunityDetail/Index?noticeUID=CO1.NTC.2609975&isFromPublicArea=True&isModal=False","Contratos de prestación de servicios profesionales y de apoyo a la gestión","Contratación directa","Prestación de servicios profesionales y de apoyo a la gestión, o para la ejecución de trabajos artísticos que sólo puedan encomendarse a determinadas personas naturales","Prestar servicios de apoyo a la gestión al fondo de desarrollo local de Antonio Nariño en el acompañamiento a las actividades realizadas dentro de los procesos de participación local.","Inversión","Un nuevo contrato social y ambiental para la Bogotá del Siglo XXI",55,{"$f":"IF(ISERROR(VLOOKUP(K62,Proposito_programa!$C$2:$E$59,2,FALSE)),\" \",VLOOKUP(K62,Proposito_programa!$C$2:$E$59,2,FALSE))","v":"Fortalecimiento de cultura ciudadana y su institucionalidad"},{"$f":"IF(ISERROR(VLOOKUP(K62,Proposito_programa!$C$2:$E$59,3,FALSE)),\" \",VLOOKUP(K62,Proposito_programa!$C$2:$E$59,3,FALSE))","v":"Propósito 5: Construir Bogotá - Región con gobierno abierto, transparente y ciudadanía consciente"},2190,1,1013590912,"JHON NUMAEL URREGO BELTRAN","Persona Natural",null,null,null,null,14760000,null,null,null,14760000,14760000,"2021-01-19","2022-01-20","2022-09-18",180,null,null,null,null,null,null,"En ejecución",1]
[50,2022,"FDLANCD-050-2022(67706)","https://community.secop.gov.co/Public/Tendering/OpportunityDetail/Index?noticeUID=CO1.NTC.2612169&isFromPublicArea=True&isModal=False","Contratos de prestación de servicios profesionales y de apoyo a la gestión","Contratación directa","Prestación de servicios profesionales y de apoyo a la gestión, o para la ejecución de trabajos artísticos que sólo puedan encomendarse a determinadas personas naturales","Prestar los servicios técnicos para la operación, seguimiento y cumplimiento de los procesos y procedimientos del servicio social apoyo económico Tipo C, requeridos para el oportuno y adecuado registro, cruce y reporte de los datos del sistema de información y registro de beneficiarios-SIRBE, que contribuyan a la garantía de los derechos de la población mayor en el marco de la política pública social para envejecimiento y la vejez en el Distrito Capital a cargo de la Alcaldía Local","Inversión","Un nuevo contrato social y ambiental para la Bogotá del Siglo XXI",1,{"$f":"IF(ISERROR(VLOOKUP(K63,Proposito_programa!$C$2:$E$59,2,FALSE)),\" \",VLOOKUP(K63,Proposito_programa!$C$2:$E$59,2,FALSE))","v":"Subsidios y transferencias para la equidad"},{"$f":"IF(ISERROR(VLOOKUP(K63,Proposito_programa!$C$2:$E$59,3,FALSE)),\" \",VLOOKUP(K63,Proposito_programa!$C$2:$E$59,3,FALSE))","v":"Propósito 1: Hacer un nuevo contrato social para incrementar la inclusión social, productiva y política"},1851,1,1013690740,"SEBASTIAN EDUARDO BRAVO ZAFRA","Persona Natural",null,null,null,null,20160000,null,null,null,20160000,20160000,"2021-01-19","2022-01-21","2022-07-19",180,null,null,null,null,null,null,"En ejecución",1]
[51,2022,"FDLANCD-051-2022(67709)","https://community.secop.gov.co/Public/Tendering/OpportunityDetail/Index?noticeUID=CO1.NTC.2612161&isFromPublicArea=True&isModal=False","Contratos de prestación de servicios profesionales y de apoyo a la gestión","Contratación directa","Prestación de servicios profesionales y de apoyo a la gestión, o para la ejecución de trabajos artísticos que sólo puedan encomendarse a determinadas personas naturales","Prestar servicios profesionales, para apoyar la formulación, ejecución, supervisión, seguimiento cierre y/o liquidación de los procesos contractuales que den respuesta al proyecto de inversión de acciones para establecer acuerdos ciudadanos de la localidad de Antonio Nariño.","Inversión","Un nuevo contrato social y ambiental para la Bogotá del Siglo XXI",45,{"$f":"IF(ISERROR(VLOOKUP(K64,Proposito_programa!$C$2:$E$59,2,FALSE)),\" \",VLOOKUP(K64,Proposito_programa!$C$2:$E$59,2,FALSE))","v":"Espacio público más seguro y construido colectivamente"},{"$f":"IF(ISERROR(VLOOKUP(K64,Proposito_programa!$C$2:$E$59,3,FALSE)),\" \",VLOOKUP(K64,Proposito_programa!$C$2:$E$59,3,FALSE))","v":"Propósito 3: Inspirar confianza y legitimidad para vivir sin miedo y ser epicentro de cultura ciudadana, paz y reconciliación"},2183,1,51966940,"ALEYRA CAPERA RODRIGUEZ","Persona Natural",null,null,null,null,27720000,null,null,null,27720000,18172000,"2021-01-19","2022-01-21","2022-07-19",180,null,null,51966940,"ALEYRA CAPERA RODRIGUEZ ","2022-03-03",27720000,"En ejecución",0.65555555555555556]
[52,2022,"FDLANCD-052-2022(67094)","https://community.secop.gov.co/Public/Tendering/OpportunityDetail/Index?noticeUID=CO1.NTC.2612066&isFromPublicArea=True&isModal=False","Contratos de prestación de servicios profesionales y de apoyo a la gestión","Contratación directa","Prestación de servicios profesionales y de apoyo a la gestión, o para la ejecución de trabajos artísticos que sólo puedan encomendarse a determinadas personas naturales","Apoyar jurídicamente la ejecución de las acciones requeridas para el trámite e impulso procesal de las actuaciones contravencionales y/o querellas que cursen en las Inspecciones de Policía de la Localidad","Inversión","Un nuevo contrato social y ambiental para la Bogotá del Siglo XXI",57,{"$f":"IF(ISERROR(VLOOKUP(K65,Proposito_programa!$C$2:$E$59,2,FALSE)),\" \",VLOOKUP(K65,Proposito_programa!$C$2:$E$59,2,FALSE))","v":"Gestión pública local"},{"$f":"IF(ISERROR(VLOOKUP(K65,Proposito_programa!$C$2:$E$59,3,FALSE)),\" \",VLOOKUP(K65,Proposito_programa!$C$2:$E$59,3,FALSE))","v":"Propósito 5: Construir Bogotá - Región con gobierno abierto, transparente y ciudadanía consciente"},2189,1,53029627,"JENNY PAOLA MENDIVELSO DUARTE","Persona Natural",null,null,null,null,27720000,null,null,null,27720000,27720000,"2021-01-19","2022-01-21","2022-07-19",180,null,null,null,null,null,null,"En ejecución",1]
[53,2022,"FDLANCD-053-2022(68140)","https://community.secop.gov.co/Public/Tendering/OpportunityDetail/Index?noticeUID=CO1.NTC.2612650&isFromPublicArea=True&isModal=False","Contratos de prestación de servicios profesionales y de apoyo a la gestión","Contratación directa","Prestación de servicios profesionales y de apoyo a la gestión, o para la ejecución de trabajos artísticos que sólo puedan encomendarse a determinadas personas naturales","Prestacion de servicios profesionales para la formulacion, definicion,socializacion y seguimiento de una propuesta integral de intervencion urbanistica en espacios y escenarios locales y su inclusion en los distintos planes, programas y proyectos de inversion..","Inversión","Un nuevo contrato social y ambiental para la Bogotá del Siglo XXI",49,{"$f":"IF(ISERROR(VLOOKUP(K66,Proposito_programa!$C$2:$E$59,2,FALSE)),\" \",VLOOKUP(K66,Proposito_programa!$C$2:$E$59,2,FALSE))","v":"Movilidad segura, sostenible y accesible"},{"$f":"IF(ISERROR(VLOOKUP(K66,Proposito_programa!$C$2:$E$59,3,FALSE)),\" \",VLOOKUP(K66,Proposito_programa!$C$2:$E$59,3,FALSE))","v":"Propósito 4: Hacer de Bogotá Región un modelo de movilidad multimodal, incluyente y sostenible"},2186,1,79600820,"JUAN ANTONIO ZAFRA","Persona Natural",null,null,null,null,51840000,null,1,22032000,73872000,67392000,"2021-01-19","2022-01-20","2022-12-31",240,1,102,null,null,null,null,"En ejecución",0.91228070175438591]
[54,2022,"FDLANCD-054-2022(68140)","https://community.secop.gov.co/Public/Tendering/OpportunityDetail/Index?noticeUID=CO1.NTC.2612934&isFromPublicArea=True&isModal=False","Contratos de prestación de servicios profesionales y de apoyo a la gestión","Contratación directa","Prestación de servicios profesionales y de apoyo a la gestión, o para la ejecución de trabajos artísticos que sólo puedan encomendarse a determinadas personas naturales","Prestacion de servicios profesionales para la formulacion, definicion,socializacion y seguimiento de una propuesta integral de intervencion urbanistica en espacios y escenarios locales y su inclusion en los distintos planes, programas y proyectos de inversion..","Inversión","Un nuevo contrato social y ambiental para la Bogotá del Siglo XXI",49,{"$f":"IF(ISERROR(VLOOKUP(K67,Proposito_programa!$C$2:$E$59,2,FALSE)),\" \",VLOOKUP(K67,Proposito_programa!$C$2:$E$59,2,FALSE))","v":"Movilidad segura, sostenible y accesible"},{"$f":"IF(ISERROR(VLOOKUP(K67,Proposito_programa!$C$2:$E$59,3,FALSE)),\" \",VLOOKUP(K67,Proposito_programa!$C$2:$E$59,3,FALSE))","v":"Propósito 4: Hacer de Bogotá Región un modelo de movilidad multimodal, incluyente y sostenible"},2186,1,1019067443,"JUAN CAMILO GALLEGO VIVES","Persona Natural",null,null,null,null,51840000,null,1,22032000,73872000,67392000,"2021-01-19","2022-01-20","2022-12-31",240,1,102,null,null,null,null,"En ejecución",0.91228070175438591]
[55,2022,"FDLANCD-055-2022(68140)","https://community.secop.gov.co/Public/Tendering/OpportunityDetail/Index?noticeUID=CO1.NTC.2613203&isFromPublicArea=True&isModal=False","Contratos de prestación de servicios profesionales y de apoyo a la gestión","Contratación directa","Prestación de servicios profesionales y de apoyo a la gestión, o para la ejecución de trabajos artísticos que sólo puedan encomendarse a determinadas personas naturales","Prestacion de servicios profesionales para la formulacion, definicion,socializacion y seguimiento de una propuesta integral de intervencion urbanistica en espacios y escenarios locales y su inclusion en los distintos planes, programas y proyectos de inversion..","Inversión","Un nuevo contrato social y ambiental para la Bogotá del Siglo XXI",49,{"$f":"IF(ISERROR(VLOOKUP(K68,Proposito_programa!$C$2:$E$59,2,FALSE)),\" \",VLOOKUP(K68,Proposito_programa!$C$2:$E$59,2,FALSE))","v":"Movilidad segura, sostenible y accesible"},{"$f":"IF(ISERROR(VLOOKUP(K68,Proposito_programa!$C$2:$E$59,3,FALSE)),\" \",VLOOKUP(K68,Proposito_programa!$C$2:$E$59,3,FALSE))","v":"Propósito 4: Hacer de Bogotá Región un modelo de movilidad multimodal, incluyente y sostenible"},2186,1,1013656467,"DAVID FELIPE GIRALDO","Persona Natural",null,null,null,null,51840000,null,2,{"$f":"22032000+3240000","v":25272000},77112000,67392000,"2021-01-19","2022-01-20","2022-12-31",240,2,117,null,null,null,null,"En ejecución",0.87394957983193278]
[56,2022,"FDLANCD-056-2022(68140)","https://community.secop.gov.co/Public/Tendering/OpportunityDetail/Index?noticeUID=CO1.NTC.2613354&isFromPublicArea=True&isModal=False","Contratos de prestación de servicios profesionales y de apoyo a la gestión","Contratación directa","Prestación de servicios profesionales y de apoyo a la gestión, o para la ejecución de trabajos artísticos que sólo puedan encomendarse a determinadas personas naturales","Prestacion de servicios profesionales para la formulacion, definicion,socializacion y seguimiento de una propuesta integral de intervencion urbanistica en espacios y escenarios locales y su inclusion en los distintos planes, programas y proyectos de inversion..","Inversión","Un nuevo contrato social y ambiental para la Bogotá del Siglo XXI",49,{"$f":"IF(ISERROR(VLOOKUP(K69,Proposito_programa!$C$2:$E$59,2,FALSE)),\" \",VLOOKUP(K69,Proposito_programa!$C$2:$E$59,2,FALSE))","v":"Movilidad segura, sostenible y accesible"},{"$f":"IF(ISERROR(VLOOKUP(K69,Proposito_programa!$C$2:$E$59,3,FALSE)),\" \",VLOOKUP(K69,Proposito_programa!$C$2:$E$59,3,FALSE))","v":"Propósito 4: Hacer de Bogotá Región un modelo de movilidad multimodal, incluyente y sostenible"},2186,1,1026570525,"JUAN JOSE LONDOÑO","Persona Natural",null,null,null,null,51840000,null,1,22032000,73872000,67392000,"2021-01-19","2022-01-20","2022-12-31",240,1,102,null,null,null,null,"En ejecución",0.91228070175438591]
[57,2022,"FDLANCD-057-2022(67781)","https://community.secop.gov.co/Public/Tendering/OpportunityDetail/Index?noticeUID=CO1.NTC.2614727&isFromPublicArea=True&isModal=False","Contratos de prestación de servicios profesionales y de apoyo a la gestión","Contratación directa","Prestación de servicios profesionales y de apoyo a la gestión, o para la ejecución de trabajos artísticos que sólo puedan encomendarse a determinadas personas naturales","Prestar servicios profesionales, para apoyar la formulación, ejecución, supervisión, seguimiento cierre y/o liquidación de los procesos contractuales que den respuesta al proyecto de inversión de acciones integrales para la productividad y el emprendimiento de la localidad de Antonio Nariño.","Inversión","Un nuevo contrato social y ambiental para la Bogotá del Siglo XXI",6,{"$f":"IF(ISERROR(VLOOKUP(K70,Proposito_programa!$C$2:$E$59,2,FALSE)),\" \",VLOOKUP(K70,Proposito_programa!$C$2:$E$59,2,FALSE))","v":"Sistema Distrital de Cuidado"},{"$f":"IF(ISERROR(VLOOKUP(K70,Proposito_programa!$C$2:$E$59,3,FALSE)),\" \",VLOOKUP(K70,Proposito_programa!$C$2:$E$59,3,FALSE))","v":"Propósito 1: Hacer un nuevo contrato social para incrementar la inclusión social, productiva y política"},2191,1,19378831,"JULIO ROBERTO FUENTES MURILLO","Persona Natural",null,null,null,null,27720000,null,null,null,27720000,27720000,"2021-01-19","2022-01-21","2022-07-19",180,null,null,null,null,null,null,"En ejecución",1]
[58,2022,"FDLANCD-058-2022(67569)","https://community.secop.gov.co/Public/Tendering/OpportunityDetail/Index?noticeUID=CO1.NTC.2619822&isFromPublicArea=True&isModal=False","Contratos de prestación de servicios profesionales y de apoyo a la gestión","Contratación directa","Prestación de servicios profesionales y de apoyo a la gestión, o para la ejecución de trabajos artísticos que sólo puedan encomendarse a determinadas personas naturales","Coordina, lidera y asesora los planes y estrategias de comunicación interna y externa para la divulgación de los programas, proyectos y actividades de la Alcaldía Local.","Inversión","Un nuevo contrato social y ambiental para la Bogotá del Siglo XXI",57,{"$f":"IF(ISERROR(VLOOKUP(K71,Proposito_programa!$C$2:$E$59,2,FALSE)),\" \",VLOOKUP(K71,Proposito_programa!$C$2:$E$59,2,FALSE))","v":"Gestión pública local"},{"$f":"IF(ISERROR(VLOOKUP(K71,Proposito_programa!$C$2:$E$59,3,FALSE)),\" \",VLOOKUP(K71,Proposito_programa!$C$2:$E$59,3,FALSE))","v":"Propósito 5: Construir Bogotá - Región con gobierno abierto, transparente y ciudadanía consciente"},2198,1,83161135,"CARLOS HIGUITA VARGAS","Persona Natural",null,null,null,null,42120000,null,null,null,42120000,42120000,"2021-01-19","2022-01-21","2022-07-19",180,null,null,null,null,null,null,"En ejecución",1]
[59,2022,"FDLANCD-059-2022(67406)","https://community.secop.gov.co/Public/Tendering/OpportunityDetail/Index?noticeUID=CO1.NTC.2618379&isFromPublicArea=True&isModal=False","Contratos de prestación de servicios profesionales y de apoyo a la gestión","Contratación directa","Prestación de servicios profesionales y de apoyo a la gestión, o para la ejecución de trabajos artísticos que sólo puedan encomendarse a determinadas personas naturales","Apoyar técnicamente las distintas etapas de los procesos de competencia de las Inspecciones de Policía de la Localidad, según reparto.","Inversión","Un nuevo contrato social y ambiental para la Bogotá del Siglo XXI",57,{"$f":"IF(ISERROR(VLOOKUP(K72,Proposito_programa!$C$2:$E$59,2,FALSE)),\" \",VLOOKUP(K72,Proposito_programa!$C$2:$E$59,2,FALSE))","v":"Gestión pública local"},{"$f":"IF(ISERROR(VLOOKUP(K72,Proposito_programa!$C$2:$E$59,3,FALSE)),\" \",VLOOKUP(K72,Proposito_programa!$C$2:$E$59,3,FALSE))","v":"Propósito 5: Construir Bogotá - Región con gobierno abierto, transparente y ciudadanía consciente"},2198,1,87070701,"DAVID GARCIA JIMENEZ","Persona Natural",null,null,null,null,59400000,null,null,null,59400000,56160000,"2021-01-19","2022-01-20","2022-12-18",330,null,null,null,null,null,null,"En ejecución",0.94545454545454544]
[60,2022,"FDLANCD-060-2022(68805)","https://community.secop.gov.co/Public/Tendering/OpportunityDetail/Index?noticeUID=CO1.NTC.2619369&isFromPublicArea=True&isModal=False","Contratos de prestación de servicios profesionales y de apoyo a la gestión","Contratación directa","Prestación de servicios profesionales y de apoyo a la gestión, o para la ejecución de trabajos artísticos que sólo puedan encomendarse a determinadas personas naturales","Prestación de servicios para apoyar la gestión y ejecución de actividades administrativas y operativas que se adelantan en el Área de Gestión del Desarrollo, Administrativa y Financiera de la Alcaldía Local de Antonio Nariño","Inversión","Un nuevo contrato social y ambiental para la Bogotá del Siglo XXI",57,{"$f":"IF(ISERROR(VLOOKUP(K73,Proposito_programa!$C$2:$E$59,2,FALSE)),\" \",VLOOKUP(K73,Proposito_programa!$C$2:$E$59,2,FALSE))","v":"Gestión pública local"},{"$f":"IF(ISERROR(VLOOKUP(K73,Proposito_programa!$C$2:$E$59,3,FALSE)),\" \",VLOOKUP(K73,Proposito_programa!$C$2:$E$59,3,FALSE))","v":"Propósito 5: Construir Bogotá - Región con gobierno abierto, transparente y ciudadanía consciente"},2198,1,1022351156,"JHON FREDY ALVAREZ BARRERA","Persona Natural",null,null,null,null,11160000,null,null,null,11160000,11160000,"2021-01-19","2022-01-20","2022-07-18",180,null,null,null,null,null,null,"En ejecución",1]
[61,2022,"FDLANCD-061-2022(69673)","https://community.secop.gov.co/Public/Tendering/OpportunityDetail/Index?noticeUID=CO1.NTC.2627549&isFromPublicArea=True&isModal=False","Contratos de prestación de servicios profesionales y de apoyo a la gestión","Contratación directa","Prestación de servicios profesionales y de apoyo a la gestión, o para la ejecución de trabajos artísticos que sólo puedan encomendarse a determinadas personas naturales","Apoyar la formulación, gestión y seguimiento de actividades enfocadas a la gestión ambiental externa, encaminadas a la mitigación de los diferentes impactos ambientales y la conservación de los recursos naturales de la localidad","Inversión","Un nuevo contrato social y ambiental para la Bogotá del Siglo XXI",33,{"$f":"IF(ISERROR(VLOOKUP(K74,Proposito_programa!$C$2:$E$59,2,FALSE)),\" \",VLOOKUP(K74,Proposito_programa!$C$2:$E$59,2,FALSE))","v":"Más árboles y más y mejor espacio público"},{"$f":"IF(ISERROR(VLOOKUP(K74,Proposito_programa!$C$2:$E$59,3,FALSE)),\" \",VLOOKUP(K74,Proposito_programa!$C$2:$E$59,3,FALSE))","v":"Propósito 2 : Cambiar Nuestros Hábitos de Vida para Reverdecer a Bogotá y Adaptarnos y Mitigar la Crisis Climática"},2206,1,1013636599,"MAYRA JIMENA WILCHES GONZALEZ","Persona Natural",null,null,null,null,13860000,null,null,null,13860000,13860000,"2022-01-20","2022-01-26","2022-07-24",180]
[61,2022,"FDLANCD-061-2022(69673)","https://community.secop.gov.co/Public/Tendering/OpportunityDetail/Index?noticeUID=CO1.NTC.2627549&isFromPublicArea=True&isModal=False","Contratos de prestación de servicios profesionales y de apoyo a la gestión","Contratación directa","Prestación de servicios profesionales y de apoyo a la gestión, o para la ejecución de trabajos artísticos que sólo puedan encomendarse a determinadas personas naturales","Apoyar la formulación, gestión y seguimiento de actividades enfocadas a la gestión ambiental externa, encaminadas a la mitigación de los diferentes impactos ambientales y la conservación de los recursos naturales de la localidad","Inversión","Un nuevo contrato social y ambiental para la Bogotá del Siglo XXI",38,{"$f":"IF(ISERROR(VLOOKUP(K75,Proposito_programa!$C$2:$E$59,2,FALSE)),\" \",VLOOKUP(K75,Proposito_programa!$C$2:$E$59,2,FALSE))","v":"Ecoeficiencia, reciclaje, manejo de residuos e inclusión de la población recicladora"},{"$f":"IF(ISERROR(VLOOKUP(K75,Proposito_programa!$C$2:$E$59,3,FALSE)),\" \",VLOOKUP(K75,Proposito_programa!$C$2:$E$59,3,FALSE))","v":"Propósito 2 : Cambiar Nuestros Hábitos de Vida para Reverdecer a Bogotá y Adaptarnos y Mitigar la Crisis Climática"},2210,null,null,null,null,null,null,null,null,4620000,null,null,null,{"$f":"+W75+X75+Z75","v":4620000},4620000]
[61,2022,"FDLANCD-061-2022(69673)","https://community.secop.gov.co/Public/Tendering/OpportunityDetail/Index?noticeUID=CO1.NTC.2627549&isFromPublicArea=True&isModal=False","Contratos de prestación de servicios profesionales y de apoyo a la gestión","Contratación directa","Prestación de servicios profesionales y de apoyo a la gestión, o para la ejecución de trabajos artísticos que sólo puedan encomendarse a determinadas personas naturales","Apoyar la formulación, gestión y seguimiento de actividades enfocadas a la gestión ambiental externa, encaminadas a la mitigación de los diferentes impactos ambientales y la conservación de los recursos naturales de la localidad","Inversión","Un nuevo contrato social y ambiental para la Bogotá del Siglo XXI",27,"Cambio cultural para la gestión de la crisis climática","Propósito 2 : Cambiar Nuestros Hábitos de Vida para Reverdecer a Bogotá y Adaptarnos y Mitigar la Crisis Climática",2204,null,null,null,null,null,null,null,null,4620000,null,null,null,{"$f":"+W76+X76+Z76","v":4620000},4620000,"2022-01-20","2022-01-26","2022-07-24",180]
[61,2022,"FDLANCD-061-2022(69673)","https://community.secop.gov.co/Public/Tendering/OpportunityDetail/Index?noticeUID=CO1.NTC.2627549&isFromPublicArea=True&isModal=False","Contratos de prestación de servicios profesionales y de apoyo a la gestión","Contratación directa","Prestación de servicios profesionales y de apoyo a la gestión, o para la ejecución de trabajos artísticos que sólo puedan encomendarse a determinadas personas naturales","Apoyar la formulación, gestión y seguimiento de actividades enfocadas a la gestión ambiental externa, encaminadas a la mitigación de los diferentes impactos ambientales y la conservación de los recursos naturales de la localidad","Inversión","Un nuevo contrato social y ambiental para la Bogotá del Siglo XXI",24,{"$f":"IF(ISERROR(VLOOKUP(K77,Proposito_programa!$C$2:$E$59,2,FALSE)),\" \",VLOOKUP(K77,Proposito_programa!$C$2:$E$59,2,FALSE))","v":"Bogotá región emprendedora e innovadora"},{"$f":"IF(ISERROR(VLOOKUP(K77,Proposito_programa!$C$2:$E$59,3,FALSE)),\" \",VLOOKUP(K77,Proposito_programa!$C$2:$E$59,3,FALSE))","v":"Propósito 1: Hacer un nuevo contrato social para incrementar la inclusión social, productiva y política"},2203,1,1013636599,"MAYRA JIMENA WILCHEZ GONZALEZ","Persona Natural",null,null,null,null,4620000,null,null,null,4620000,4620000,"2022-01-20","2022-01-26","2022-07-24",180,null,null,null,null,null,null,"En ejecución",1]
[62,2022,"FDLANCD-062-2022(67828)","https://community.secop.gov.co/Public/Tendering/OpportunityDetail/Index?noticeUID=CO1.NTC.2627329&isFromPublicArea=True&isModal=False","Contratos de prestación de servicios profesionales y de apoyo a la gestión","Contratación directa","Prestación de servicios profesionales y de apoyo a la gestión, o para la ejecución de trabajos artísticos que sólo puedan encomendarse a determinadas personas naturales","Prestar servicios de apoyo a las labores de caracter operacional y/o administrativas que se adelanten en el area de gestion de desarrollo local en el marco del desarrollo de los proyectos de infraestructura de la localidad de Antonio Nariño.","Inversión","Un nuevo contrato social y ambiental para la Bogotá del Siglo XXI",33,{"$f":"IF(ISERROR(VLOOKUP(K78,Proposito_programa!$C$2:$E$59,2,FALSE)),\" \",VLOOKUP(K78,Proposito_programa!$C$2:$E$59,2,FALSE))","v":"Más árboles y más y mejor espacio público"},{"$f":"IF(ISERROR(VLOOKUP(K78,Proposito_programa!$C$2:$E$59,3,FALSE)),\" \",VLOOKUP(K78,Proposito_programa!$C$2:$E$59,3,FALSE))","v":"Propósito 2 : Cambiar Nuestros Hábitos de Vida para Reverdecer a Bogotá y Adaptarnos y Mitigar la Crisis Climática"},2207,1,1013633122,"JAIME PRIETO RUIZ","Persona Natural",null,null,null,null,11160000,null,null,null,11160000,11160000,"2022-01-20","2022-01-21","2022-07-19",180,null,null,null,null,null,null,"En ejecución",1]
[63,2022,"FDLANCD-063-2022(66854)","https://community.secop.gov.co/Public/Tendering/OpportunityDetail/Index?noticeUID=CO1.NTC.2633703&isFromPublicArea=True&isModal=False","Contratos de prestación de servicios profesionales y de apoyo a la gestión","Contratación directa","Prestación de servicios profesionales y de apoyo a la gestión, o para la ejecución de trabajos artísticos que sólo puedan encomendarse a determinadas personas naturales","Prestar los servicios profesionales como abogado en los diversos temas contractuales que requiera el área de gestión de desarrollo del Fondo de Desarrollo Local de Antonio Nariño.","Inversión","Un nuevo contrato social y ambiental para la Bogotá del Siglo XXI",57,{"$f":"IF(ISERROR(VLOOKUP(K79,Proposito_programa!$C$2:$E$59,2,FALSE)),\" \",VLOOKUP(K79,Proposito_programa!$C$2:$E$59,2,FALSE))","v":"Gestión pública local"},{"$f":"IF(ISERROR(VLOOKUP(K79,Proposito_programa!$C$2:$E$59,3,FALSE)),\" \",VLOOKUP(K79,Proposito_programa!$C$2:$E$59,3,FALSE))","v":"Propósito 5: Construir Bogotá - Región con gobierno abierto, transparente y ciudadanía consciente"},2198,1,52231157,"OMAIRA HEREDIA CRUZ","Persona Natural",null,null,null,null,66000000,null,1,2200000,{"$f":"+W79+X79+Z79","v":68200000},62200000,"2022-01-20","2022-01-21","2022-12-30",330,1,11,null,null,null,null,"En ejecución",0.91202346041055715]
[64,2022,"FDLANCD-064-2022(67781)","https://community.secop.gov.co/Public/Tendering/OpportunityDetail/Index?noticeUID=CO1.NTC.2627875&isFromPublicArea=True&isModal=False","Contratos de prestación de servicios profesionales y de apoyo a la gestión","Contratación directa","Prestación de servicios profesionales y de apoyo a la gestión, o para la ejecución de trabajos artísticos que sólo puedan encomendarse a determinadas personas naturales","Prestar servicios profesionales, para apoyar la formulación, ejecución, supervisión, seguimiento cierre y/o liquidación de los procesos contractuales que den respuesta al proyecto de inversión de acciones integrales para la productividad y el emprendimiento de la localidad de Antonio Nariño.","Inversión","Un nuevo contrato social y ambiental para la Bogotá del Siglo XXI",6,{"$f":"IF(ISERROR(VLOOKUP(K80,Proposito_programa!$C$2:$E$59,2,FALSE)),\" \",VLOOKUP(K80,Proposito_programa!$C$2:$E$59,2,FALSE))","v":"Sistema Distrital de Cuidado"},{"$f":"IF(ISERROR(VLOOKUP(K80,Proposito_programa!$C$2:$E$59,3,FALSE)),\" \",VLOOKUP(K80,Proposito_programa!$C$2:$E$59,3,FALSE))","v":"Propósito 1: Hacer un nuevo contrato social para incrementar la inclusión social, productiva y política"},2191,1,87067788,"CARLOS HERNANDO CASTRO GUEVARA","Persona Natural",null,null,null,null,27720000,null,null,null,27720000,27720000,"2022-01-20","2022-01-24","2022-07-22",180,null,null,null,null,null,null,"En ejecución",1]
[65,2022,"FDLANCD-065-2022(66978)","https://community.secop.gov.co/Public/Tendering/OpportunityDetail/Index?noticeUID=CO1.NTC.2643860&isFromPublicArea=True&isModal=False","Contratos de prestación de servicios profesionales y de apoyo a la gestión","Contratación directa","Prestación de servicios profesionales y de apoyo a la gestión, o para la ejecución de trabajos artísticos que sólo puedan encomendarse a determinadas personas naturales","Prestacion de servicios profesionales al area de gestion de desarrollo local Antonio Nariño para apoyar la formulacion, socializacion y seguimiento de los programas y proyectos de inversion, relacionados con la infraestructura del fond, necesarios para el cumplimiento del plan de desarrollo local.","Inversión","Un nuevo contrato social y ambiental para la Bogotá del Siglo XXI",33,{"$f":"IF(ISERROR(VLOOKUP(K81,Proposito_programa!$C$2:$E$59,2,FALSE)),\" \",VLOOKUP(K81,Proposito_programa!$C$2:$E$59,2,FALSE))","v":"Más árboles y más y mejor espacio público"},{"$f":"IF(ISERROR(VLOOKUP(K81,Proposito_programa!$C$2:$E$59,3,FALSE)),\" \",VLOOKUP(K81,Proposito_programa!$C$2:$E$59,3,FALSE))","v":"Propósito 2 : Cambiar Nuestros Hábitos de Vida para Reverdecer a Bogotá y Adaptarnos y Mitigar la Crisis Climática"},2207,1,1015471920,"VALENTINA ROCHA VEGA","Persona Natural",null,null,null,null,27720000,null,null,null,27720000,27720000,"2022-01-21","2022-01-24","2022-07-22",180,null,null,null,null,null,null,"En ejecución",1]
[66,2022,"FDLANCD-066-2020(70779)","https://community.secop.gov.co/Public/Tendering/OpportunityDetail/Index?noticeUID=CO1.NTC.2637827&isFromPublicArea=True&isModal=False","Contratos de prestación de servicios profesionales y de apoyo a la gestión","Contratación directa","Prestación de servicios profesionales y de apoyo a la gestión, o para la ejecución de trabajos artísticos que sólo puedan encomendarse a determinadas personas naturales","Prestar servicios de apoyo que adelanta el área de gestión local de Antonio Nariño para dar respuesta a derechos de petición y apoyo de trámites requeridos por las entidades distritales relacionado al proceso de planeación","Inversión","Un nuevo contrato social y ambiental para la Bogotá del Siglo XXI",55,{"$f":"IF(ISERROR(VLOOKUP(K82,Proposito_programa!$C$2:$E$59,2,FALSE)),\" \",VLOOKUP(K82,Proposito_programa!$C$2:$E$59,2,FALSE))","v":"Fortalecimiento de cultura ciudadana y su institucionalidad"},{"$f":"IF(ISERROR(VLOOKUP(K82,Proposito_programa!$C$2:$E$59,3,FALSE)),\" \",VLOOKUP(K82,Proposito_programa!$C$2:$E$59,3,FALSE))","v":"Propósito 5: Construir Bogotá - Región con gobierno abierto, transparente y ciudadanía consciente"},2190,1,79352014,"JUAN PABLO ZAMBRANO","Persona Natural",null,null,null,null,10080000,null,null,null,10080000,10080000,"2022-01-20","2022-01-21","2022-07-19",180,null,null,null,null,null,null,"En ejecución",1]
[67,2022,"FDLANCD-067-2022(68818)","https://community.secop.gov.co/Public/Tendering/OpportunityDetail/Index?noticeUID=CO1.NTC.2637942&isFromPublicArea=True&isModal=False","Contratos de prestación de servicios profesionales y de apoyo a la gestión","Contratación directa","Prestación de servicios profesionales y de apoyo a la gestión, o para la ejecución de trabajos artísticos que sólo puedan encomendarse a determinadas personas naturales","Apoyar al (la) alcalde (sa) local en la promoción, articulación, acompañamiento y seguimiento para la atención y protección de los animales domésticos y silvestres de la localidad.","Inversión","Un nuevo contrato social y ambiental para la Bogotá del Siglo XXI",34,{"$f":"IF(ISERROR(VLOOKUP(K83,Proposito_programa!$C$2:$E$59,2,FALSE)),\" \",VLOOKUP(K83,Proposito_programa!$C$2:$E$59,2,FALSE))","v":"Bogotá protectora de los animales"},{"$f":"IF(ISERROR(VLOOKUP(K83,Proposito_programa!$C$2:$E$59,3,FALSE)),\" \",VLOOKUP(K83,Proposito_programa!$C$2:$E$59,3,FALSE))","v":"Propósito 2 : Cambiar Nuestros Hábitos de Vida para Reverdecer a Bogotá y Adaptarnos y Mitigar la Crisis Climática"},2209,1,1085293465,"BRAYAN NICOLAS ACOSTA LUCERO","Persona Natural",null,null,null,null,27720000,null,null,null,27720000,27720000,"2022-01-20","2022-01-24","2022-07-22",180,null,null,1026583068,"BRAYAN NICOLAS ACOSTA LUCERO","2022-02-22",27720000,"En ejecución",{"$f":"IF(ISERROR(AB83/AA83),\"-\",(AB83/AA83))","v":1}]
[68,2022,"FDLANCD-068-2022(67707)","https://community.secop.gov.co/Public/Tendering/OpportunityDetail/Index?noticeUID=CO1.NTC.2644674&isFromPublicArea=True&isModal=False","Contratos de prestación de servicios profesionales y de apoyo a la gestión","Contratación directa","Prestación de servicios profesionales y de apoyo a la gestión, o para la ejecución de trabajos artísticos que sólo puedan encomendarse a determinadas personas naturales","PRESTACIÓN DE SERVICIOS PROFESIONALES PARA LA ADMINISTRACIÓN, DESARROLLO Y FORTALECIMIENTO DE LAS ACTIVIDADES CULTURALES Y ARTÍSTICAS QUE SE BRINDAN A LA COMUNIDAD EN EL TEATRO VILLA MAYOR DE LA LOCALIDAD ANTONIO NARIÑO","Inversión","Un nuevo contrato social y ambiental para la Bogotá del Siglo XXI",21,{"$f":"IF(ISERROR(VLOOKUP(K84,Proposito_programa!$C$2:$E$59,2,FALSE)),\" \",VLOOKUP(K84,Proposito_programa!$C$2:$E$59,2,FALSE))","v":"Creación y vida cotidiana: Apropiación ciudadana del arte, la cultura y el patrimonio, para la democracia cultural"},{"$f":"IF(ISERROR(VLOOKUP(K84,Proposito_programa!$C$2:$E$59,3,FALSE)),\" \",VLOOKUP(K84,Proposito_programa!$C$2:$E$59,3,FALSE))","v":"Propósito 1: Hacer un nuevo contrato social para incrementar la inclusión social, productiva y política"},2201,1,80871795,"ALVARO ANDRES MARTINEZ CORONEL","Persona Natural",null,null,null,null,40860000,null,null,null,40860000,40860000,"2022-01-21","2022-02-01","2022-07-28",180,null,null,null,null,null,null,"En ejecución",1]
[69,2022,"FDLANCD-069-2022(68723)","https://community.secop.gov.co/Public/Tendering/OpportunityDetail/Index?noticeUID=CO1.NTC.2649276&isFromPublicArea=True&isModal=False","Contratos de prestación de servicios profesionales y de apoyo a la gestión","Contratación directa","Prestación de servicios profesionales y de apoyo a la gestión, o para la ejecución de trabajos artísticos que sólo puedan encomendarse a determinadas personas naturales","PRESTAR SERVICIOS PROFESIONALES COMO ABOGADO PARA APOYAR LOS DISTINTOS PROCEDIMIENTOS SANCIONATORIOS Y TRÁMITES ADMINISTRATIVOS QUE ADELANTA EL EQUIPO DE INSPECCIÓN, VIGILANCIA Y CONTROL DEL ÁREA DE GESTIÓN POLICIVA Y JURÍDICA DEL FONDO DE DESARROLLO LOCAL ANTONIO NARIÑO, CON OCASIÓN A LA INFRACCIÓN Y APLICACIÓN DE NORMAS POLICIVAS EN MATERIA DE PROTECCIÓN AL CONSUMIDOR, CONTROL DE CALIDAD, PRECIOS, PESAS Y MEDIDAS.","Inversión","Un nuevo contrato social y ambiental para la Bogotá del Siglo XXI",57,{"$f":"IF(ISERROR(VLOOKUP(K85,Proposito_programa!$C$2:$E$59,2,FALSE)),\" \",VLOOKUP(K85,Proposito_programa!$C$2:$E$59,2,FALSE))","v":"Gestión pública local"},{"$f":"IF(ISERROR(VLOOKUP(K85,Proposito_programa!$C$2:$E$59,3,FALSE)),\" \",VLOOKUP(K85,Proposito_programa!$C$2:$E$59,3,FALSE))","v":"Propósito 5: Construir Bogotá - Región con gobierno abierto, transparente y ciudadanía consciente"},2189,1,1013631878,"ADRIANA KATTERINE HERRERA URIBE","Persona Natural",null,null,null,null,27720000,null,null,null,27720000,27720000,"2022-01-21","2022-01-25","2022-07-23",180,null,null,null,null,null,null,"En ejecución",1]
[70,2022,"FDLANCD-070-2022(67161)","https://community.secop.gov.co/Public/Tendering/OpportunityDetail/Index?noticeUID=CO1.NTC.2647125&isFromPublicArea=True&isModal=False","Contratos de prestación de servicios profesionales y de apoyo a la gestión","Contratación directa","Prestación de servicios profesionales y de apoyo a la gestión, o para la ejecución de trabajos artísticos que sólo puedan encomendarse a determinadas personas naturales","Prestación de servicios de apoyo en el manejo de sistemas de información en lo relacionado con la contratación que realiza el área de gestión de desarrollo del Fondo de Desarrollo Local de Antonio Nariño","Inversión","Un nuevo contrato social y ambiental para la Bogotá del Siglo XXI",57,{"$f":"IF(ISERROR(VLOOKUP(K86,Proposito_programa!$C$2:$E$59,2,FALSE)),\" \",VLOOKUP(K86,Proposito_programa!$C$2:$E$59,2,FALSE))","v":"Gestión pública local"},{"$f":"IF(ISERROR(VLOOKUP(K86,Proposito_programa!$C$2:$E$59,3,FALSE)),\" \",VLOOKUP(K86,Proposito_programa!$C$2:$E$59,3,FALSE))","v":"Propósito 5: Construir Bogotá - Región con gobierno abierto, transparente y ciudadanía consciente"},2198,1,1032474556,"MARIA ALEJANDRA CASTRILLON CORREDOR ","Persona Natural",null,null,null,null,14760000,null,null,null,14760000,13120000,"2022-01-21","2022-01-25","2022-07-23",180,null,null,1010203444,"MARIA ALEJANDRA CASTRILLON CORREDOR ","2022-04-06",14760000,"En ejecución",0.88888888888888884]
[71,2022,"FDLANCD-071-2022(68818)","https://community.secop.gov.co/Public/Tendering/OpportunityDetail/Index?noticeUID=CO1.NTC.2653497&isFromPublicArea=True&isModal=False","Contratos de prestación de servicios profesionales y de apoyo a la gestión","Contratación directa","Prestación de servicios profesionales y de apoyo a la gestión, o para la ejecución de trabajos artísticos que sólo puedan encomendarse a determinadas personas naturales","Prestar servicios de apoyo a la gestión del fondo de desarrollo local de Antonio Nariño en los asuntos operativos relacionados con la seguridad, la convivencia y el desarrollo de actividad económica en la localidad, con conformidad con el marco normativo aplicable en la materia.","Inversión","Un nuevo contrato social y ambiental para la Bogotá del Siglo XXI",57,{"$f":"IF(ISERROR(VLOOKUP(K87,Proposito_programa!$C$2:$E$59,2,FALSE)),\" \",VLOOKUP(K87,Proposito_programa!$C$2:$E$59,2,FALSE))","v":"Gestión pública local"},{"$f":"IF(ISERROR(VLOOKUP(K87,Proposito_programa!$C$2:$E$59,3,FALSE)),\" \",VLOOKUP(K87,Proposito_programa!$C$2:$E$59,3,FALSE))","v":"Propósito 5: Construir Bogotá - Región con gobierno abierto, transparente y ciudadanía consciente"},2198,1,19425371,"LIBARDO RUBEN CUELLAR BURGOS","Persona Natural",null,null,null,null,19680000,null,null,null,{"$f":"+W87+X87+Z87","v":19680000},19680000,"2022-01-21","2022-01-24","2022-09-22",240,null,null,null,null,null,null,"En ejecución",1]
[72,2022,"FDLANCD-072-2022(67094)","https://community.secop.gov.co/Public/Tendering/OpportunityDetail/Index?noticeUID=CO1.NTC.2652304&isFromPublicArea=True&isModal=False","Contratos de prestación de servicios profesionales y de apoyo a la gestión","Contratación directa","Prestación de servicios profesionales y de apoyo a la gestión, o para la ejecución de trabajos artísticos que sólo puedan encomendarse a determinadas personas naturales","Apoyar jurídicamente la ejecución de las acciones requeridas para el trámite e impulso procesal de las actuaciones contravencionales y/o querellas que cursen en las Inspecciones de Policía de la Localidad","Inversión","Un nuevo contrato social y ambiental para la Bogotá del Siglo XXI",57,{"$f":"IF(ISERROR(VLOOKUP(K88,Proposito_programa!$C$2:$E$59,2,FALSE)),\" \",VLOOKUP(K88,Proposito_programa!$C$2:$E$59,2,FALSE))","v":"Gestión pública local"},{"$f":"IF(ISERROR(VLOOKUP(K88,Proposito_programa!$C$2:$E$59,3,FALSE)),\" \",VLOOKUP(K88,Proposito_programa!$C$2:$E$59,3,FALSE))","v":"Propósito 5: Construir Bogotá - Región con gobierno abierto, transparente y ciudadanía consciente"},2189,1,64558733,"JARDIN IDALIS DIAZ PAYARES","Persona Natural",null,null,null,null,27720000,null,null,null,27720000,19404000,"2022-01-21","2022-01-26","2022-07-24",180,null,null,null,null,null,null,"En ejecución",0.7]
[73,2022,"FDLNACD-073-2022(66818)","https://community.secop.gov.co/Public/Tendering/OpportunityDetail/Index?noticeUID=CO1.NTC.2653339&isFromPublicArea=True&isModal=False","Contratos de prestación de servicios profesionales y de apoyo a la gestión","Contratación directa","Prestación de servicios profesionales y de apoyo a la gestión, o para la ejecución de trabajos artísticos que sólo puedan encomendarse a determinadas personas naturales","Prestar servicios de apoyo a la gestión del fondo de desarrollo local de Antonio Nariño en los asuntos operativos relacionados con la seguridad, la convivencia y el desarrollo de actividad económica en la localidad, con conformidad con el marco normativo aplicable en la materia.","Inversión","Un nuevo contrato social y ambiental para la Bogotá del Siglo XXI",57,{"$f":"IF(ISERROR(VLOOKUP(K89,Proposito_programa!$C$2:$E$59,2,FALSE)),\" \",VLOOKUP(K89,Proposito_programa!$C$2:$E$59,2,FALSE))","v":"Gestión pública local"},{"$f":"IF(ISERROR(VLOOKUP(K89,Proposito_programa!$C$2:$E$59,3,FALSE)),\" \",VLOOKUP(K89,Proposito_programa!$C$2:$E$59,3,FALSE))","v":"Propósito 5: Construir Bogotá - Región con gobierno abierto, transparente y ciudadanía consciente"},2198,1,80920065,"DIEGO ALEJANDRO SILVA ZAPATA","Persona Natural",null,null,null,null,19680000,null,null,null,19680000,18122000,"2022-01-21","2022-02-16","2022-10-17",240,null,null,80920065,"DIEGO ALEJANDRO SILVA ","2022-02-17","$ 19.680.000","En ejecución",0.92083333333333328]
[74,2022,"FDLNACD-074-2022(68931)","https://community.secop.gov.co/Public/Tendering/OpportunityDetail/Index?noticeUID=CO1.NTC.2653860&isFromPublicArea=True&isModal=False","Contratos de prestación de servicios profesionales y de apoyo a la gestión","Contratación directa","Prestación de servicios profesionales y de apoyo a la gestión, o para la ejecución de trabajos artísticos que sólo puedan encomendarse a determinadas personas naturales","Prestar servicios profesionales para coordinar la articulación, asistencia y acompañamiento de los procesos de planeación local, para la promoción de la participación de las mujeres y de la equidad de género, para materializar en la localidad las estrategias de territorialización y transversalización de la Política Publica de Mujeres y Equidad de género, PPMYEG.","Inversión","Un nuevo contrato social y ambiental para la Bogotá del Siglo XXI",40,{"$f":"IF(ISERROR(VLOOKUP(K90,Proposito_programa!$C$2:$E$59,2,FALSE)),\" \",VLOOKUP(K90,Proposito_programa!$C$2:$E$59,2,FALSE))","v":"Más mujeres viven una vida libre de violencias, se sienten seguras y acceden con confianza al sistema de justicia"},{"$f":"IF(ISERROR(VLOOKUP(K90,Proposito_programa!$C$2:$E$59,3,FALSE)),\" \",VLOOKUP(K90,Proposito_programa!$C$2:$E$59,3,FALSE))","v":"Propósito 3: Inspirar confianza y legitimidad para vivir sin miedo y ser epicentro de cultura ciudadana, paz y reconciliación"},2197,1,1018438731,"YEISSON GERARDO SUA CAJAMARCA ","Persona Natural",null,null,null,null,32400000,null,null,null,32400000,30420000,"2022-01-21","2022-01-24","2022-07-22",180,null,null,1018438731,"YEISSON GERARDO SUA CAJAMARCA ","2022-05-03",32400000,"En ejecución",0.93888888888888888]
[75,2022,"FDLNACD-075-2022(68723)","https://community.secop.gov.co/Public/Tendering/OpportunityDetail/Index?noticeUID=CO1.NTC.2683822&isFromPublicArea=True&isModal=False","Contratos de prestación de servicios profesionales y de apoyo a la gestión","Contratación directa","Prestación de servicios profesionales y de apoyo a la gestión, o para la ejecución de trabajos artísticos que sólo puedan encomendarse a determinadas personas naturales","PRESTAR SERVICIOS PROFESIONALES COMO ABOGADO PARA APOYAR LOS DISTINTOS PROCEDIMIENTOS SANCIONATORIOS Y TRÁMITES ADMINISTRATIVOS QUE ADELANTA EL EQUIPO DE INSPECCIÓN, VIGILANCIA Y CONTROL DEL ÁREA DE GESTIÓN POLICIVA Y JURÍDICA DEL FONDO DE DESARROLLO LOCAL ANTONIO NARIÑO, CON OCASIÓN A LA INFRACCIÓN Y APLICACIÓN DE NORMAS POLICIVAS EN MATERIA DE PROTECCIÓN AL CONSUMIDOR, CONTROL DE CALIDAD, PRECIOS, PESAS Y MEDIDAS.","Inversión","Un nuevo contrato social y ambiental para la Bogotá del Siglo XXI",57,{"$f":"IF(ISERROR(VLOOKUP(K91,Proposito_programa!$C$2:$E$59,2,FALSE)),\" \",VLOOKUP(K91,Proposito_programa!$C$2:$E$59,2,FALSE))","v":"Gestión pública local"},{"$f":"IF(ISERROR(VLOOKUP(K91,Proposito_programa!$C$2:$E$59,3,FALSE)),\" \",VLOOKUP(K91,Proposito_programa!$C$2:$E$59,3,FALSE))","v":"Propósito 5: Construir Bogotá - Región con gobierno abierto, transparente y ciudadanía consciente"},2189,1,1085300011,"JOHANA VANESSA ALVAREZ RODRIGUEZ","Persona Natural",null,null,null,null,27720000,null,null,null,27720000,27720000,"2022-01-24","2022-02-01","2022-07-31",180,null,null,null,null,null,null,"En ejecución",1]
[76,2022,"FDLNACD-076-2022(68795)","https://community.secop.gov.co/Public/Tendering/OpportunityDetail/Index?noticeUID=CO1.NTC.2683814&isFromPublicArea=True&isModal=False","Contratos de prestación de servicios profesionales y de apoyo a la gestión","Contratación directa","Prestación de servicios profesionales y de apoyo a la gestión, o para la ejecución de trabajos artísticos que sólo puedan encomendarse a determinadas personas naturales","Servicios profesionales para apoyar al alcalde de la Localidad Antonio Nariño en la implementación de mejoras a nivel medio ambientales y la gestión del riesgo.","Inversión","Un nuevo contrato social y ambiental para la Bogotá del Siglo XXI",30,"Eficiencia en la atención de emergencias","Propósito 2 : Cambiar Nuestros Hábitos de Vida para Reverdecer a Bogotá y Adaptarnos y Mitigar la Crisis Climática",2205,1,1018466952,"MARIA ALEJANDRA MORENO GIRALDO","Persona Natural",null,null,null,null,43200000,null,null,null,43200000,43200000,"2022-01-24","2022-02-01","2022-07-31",180]
[76,2022,"FDLNACD-076-2022(68795)","https://community.secop.gov.co/Public/Tendering/OpportunityDetail/Index?noticeUID=CO1.NTC.2683814&isFromPublicArea=True&isModal=False","Contratos de prestación de servicios profesionales y de apoyo a la gestión","Contratación directa","Prestación de servicios profesionales y de apoyo a la gestión, o para la ejecución de trabajos artísticos que sólo puedan encomendarse a determinadas personas naturales","Servicios profesionales para apoyar al alcalde de la Localidad Antonio Nariño en la implementación de mejoras a nivel medio ambientales y la gestión del riesgo.","Inversión","Un nuevo contrato social y ambiental para la Bogotá del Siglo XXI",38,{"$f":"IF(ISERROR(VLOOKUP(K93,Proposito_programa!$C$2:$E$59,2,FALSE)),\" \",VLOOKUP(K93,Proposito_programa!$C$2:$E$59,2,FALSE))","v":"Ecoeficiencia, reciclaje, manejo de residuos e inclusión de la población recicladora"},{"$f":"IF(ISERROR(VLOOKUP(K93,Proposito_programa!$C$2:$E$59,3,FALSE)),\" \",VLOOKUP(K93,Proposito_programa!$C$2:$E$59,3,FALSE))","v":"Propósito 2 : Cambiar Nuestros Hábitos de Vida para Reverdecer a Bogotá y Adaptarnos y Mitigar la Crisis Climática"},2210,1,1018466952,"MARIA ALEJANDRA MORENO GIRALDO","Persona Natural",null,null,null,null,16200000,null,null,null,16200000,6660000,"2022-01-24","2022-01-25","2022-12-23",330,null,null,null,null,null,null,"En ejecución",0.41111111111111109]
[77,2022,"FDLNACD-077-2022(66854)","https://community.secop.gov.co/Public/Tendering/OpportunityDetail/Index?noticeUID=CO1.NTC.2693463&isFromPublicArea=True&isModal=False","Contratos de prestación de servicios profesionales y de apoyo a la gestión","Contratación directa","Prestación de servicios profesionales y de apoyo a la gestión, o para la ejecución de trabajos artísticos que sólo puedan encomendarse a determinadas personas naturales","Prestar los servicios profesionales como abogado en los diversos temas contractuales que requiera el área de gestión de desarrollo del Fondo de Desarrollo Local de Antonio Nariño.","Inversión","Un nuevo contrato social y ambiental para la Bogotá del Siglo XXI",57,{"$f":"IF(ISERROR(VLOOKUP(K94,Proposito_programa!$C$2:$E$59,2,FALSE)),\" \",VLOOKUP(K94,Proposito_programa!$C$2:$E$59,2,FALSE))","v":"Gestión pública local"},{"$f":"IF(ISERROR(VLOOKUP(K94,Proposito_programa!$C$2:$E$59,3,FALSE)),\" \",VLOOKUP(K94,Proposito_programa!$C$2:$E$59,3,FALSE))","v":"Propósito 5: Construir Bogotá - Región con gobierno abierto, transparente y ciudadanía consciente"},2198,1,1022363943,"MARIA NATALIA MARCILLO VELA","Persona Natural",null,null,null,null,66000000,null,1,1400000,67400000,61400000,"2022-01-24","2022-01-25","2022-12-30",330,null,null,null,null,null,null,"En ejecución",0.91097922848664692]
[78,2022,"FDLNACD-078-2022(67771)","https://community.secop.gov.co/Public/Tendering/OpportunityDetail/Index?noticeUID=CO1.NTC.2684240&isFromPublicArea=True&isModal=False","Contratos de prestación de servicios profesionales y de apoyo a la gestión","Contratación directa","Prestación de servicios profesionales y de apoyo a la gestión, o para la ejecución de trabajos artísticos que sólo puedan encomendarse a determinadas personas naturales","Prestar servicios profesionales, para apoyar la formulación, ejecución, supervisión, seguimiento cierre y/o liquidación de los procesos contractuales que den respuesta al proyecto de inversión de acciones para la construcción de memoria, verdad, reparación, víctimas, paz y reconciliación de la localidad de Antonio Nariño","Inversión","Un nuevo contrato social y ambiental para la Bogotá del Siglo XXI",39,{"$f":"IF(ISERROR(VLOOKUP(K95,Proposito_programa!$C$2:$E$59,2,FALSE)),\" \",VLOOKUP(K95,Proposito_programa!$C$2:$E$59,2,FALSE))","v":"Bogotá territorio de paz y atención integral a las víctimas del conflicto armado"},{"$f":"IF(ISERROR(VLOOKUP(K95,Proposito_programa!$C$2:$E$59,3,FALSE)),\" \",VLOOKUP(K95,Proposito_programa!$C$2:$E$59,3,FALSE))","v":"Propósito 3: Inspirar confianza y legitimidad para vivir sin miedo y ser epicentro de cultura ciudadana, paz y reconciliación"},2165,1,1233897079,"CELESTE VALENTINA PESCADOR ALBA","Persona Natural",null,null,null,null,27720000,null,null,null,27720000,27720000,"2022-01-24","2022-01-25","2022-07-23",180,null,null,null,null,null,null,"En ejecución",1]
[79,2022,"FDLNACD-079-2022(67792)","https://community.secop.gov.co/Public/Tendering/OpportunityDetail/Index?noticeUID=CO1.NTC.2695308&isFromPublicArea=True&isModal=False","Contratos de prestación de servicios profesionales y de apoyo a la gestión","Contratación directa","Prestación de servicios profesionales y de apoyo a la gestión, o para la ejecución de trabajos artísticos que sólo puedan encomendarse a determinadas personas naturales","Prestar servicios profesionales al despacho del Alcalde local para el seguimiento de la gestión financiera del presupuesto del Plan de Desarrollo Local y el apoyo a las actividades inherentes al Modelo de Planeación y Gestión","Inversión","Un nuevo contrato social y ambiental para la Bogotá del Siglo XXI",57,{"$f":"IF(ISERROR(VLOOKUP(K96,Proposito_programa!$C$2:$E$59,2,FALSE)),\" \",VLOOKUP(K96,Proposito_programa!$C$2:$E$59,2,FALSE))","v":"Gestión pública local"},{"$f":"IF(ISERROR(VLOOKUP(K96,Proposito_programa!$C$2:$E$59,3,FALSE)),\" \",VLOOKUP(K96,Proposito_programa!$C$2:$E$59,3,FALSE))","v":"Propósito 5: Construir Bogotá - Región con gobierno abierto, transparente y ciudadanía consciente"},2198,1,19244462,"MANUEL EDUARDO ROJAS GUZMAN","Persona Natural",null,null,null,null,30600000,null,null,null,30600000,26350000,"2022-01-24","2022-01-27","2022-07-25",180,null,null,19244462,"MANUEL EDUARDO ROJAS GUZMAN ","2022-03-01",30600000,"En ejecución",0.86111111111111116]
[80,2022,"FDLNACD-080-2022(67795)","https://community.secop.gov.co/Public/Tendering/OpportunityDetail/Index?noticeUID=CO1.NTC.2695359&isFromPublicArea=True&isModal=False","Contratos de prestación de servicios profesionales y de apoyo a la gestión","Contratación directa","Prestación de servicios profesionales y de apoyo a la gestión, o para la ejecución de trabajos artísticos que sólo puedan encomendarse a determinadas personas naturales","PRESTACIÓN DE SERVICIOS PROFESIONALES PARA APOYAR AL ÁREA GESTIÓN DEL DESARROLLO, ADMINISTRATIVA Y FINANCIERA DE LA ALCALDÍA LOCAL EN LA ELABORACIÓN DE ESTUDIOS DEL SECTOR Y DEMÁS ACTIVIDADES FINANCIERAS Y PRESUPUESTALES NECESARIAS PARA LOS PROCESOS DE CONTRATACIÓN QUE ADELANTA EL FONDO DE DESARROLLO LOCAL DE ANTONIO NARIÑO","Inversión","Un nuevo contrato social y ambiental para la Bogotá del Siglo XXI",57,{"$f":"IF(ISERROR(VLOOKUP(K97,Proposito_programa!$C$2:$E$59,2,FALSE)),\" \",VLOOKUP(K97,Proposito_programa!$C$2:$E$59,2,FALSE))","v":"Gestión pública local"},{"$f":"IF(ISERROR(VLOOKUP(K97,Proposito_programa!$C$2:$E$59,3,FALSE)),\" \",VLOOKUP(K97,Proposito_programa!$C$2:$E$59,3,FALSE))","v":"Propósito 5: Construir Bogotá - Región con gobierno abierto, transparente y ciudadanía consciente"},2198,1,79436634,"JAIME ARIAS GUZMAN","Persona Natural",null,null,null,null,27720000,null,null,null,27720000,27720000,"2022-01-24","2022-01-25","2022-07-23",180,null,null,null,null,null,null,"En ejecución",1]
[81,2022,"FDLANCD-081-2022(66818)","https://community.secop.gov.co/Public/Tendering/OpportunityDetail/Index?noticeUID=CO1.NTC.2693979&isFromPublicArea=True&isModal=False","Contratos de prestación de servicios profesionales y de apoyo a la gestión","Contratación directa","Prestación de servicios profesionales y de apoyo a la gestión, o para la ejecución de trabajos artísticos que sólo puedan encomendarse a determinadas personas naturales","Prestar servicios de apoyo a la gestión del fondo de desarrollo local de Antonio Nariño en los asuntos operativos relacionados con la seguridad, la convivencia y el desarrollo de actividad económica en la localidad, con conformidad con el marco normativo aplicable en la materia","Inversión","Un nuevo contrato social y ambiental para la Bogotá del Siglo XXI",57,{"$f":"IF(ISERROR(VLOOKUP(K98,Proposito_programa!$C$2:$E$59,2,FALSE)),\" \",VLOOKUP(K98,Proposito_programa!$C$2:$E$59,2,FALSE))","v":"Gestión pública local"},{"$f":"IF(ISERROR(VLOOKUP(K98,Proposito_programa!$C$2:$E$59,3,FALSE)),\" \",VLOOKUP(K98,Proposito_programa!$C$2:$E$59,3,FALSE))","v":"Propósito 5: Construir Bogotá - Región con gobierno abierto, transparente y ciudadanía consciente"},2198,1,74327554,"WILLIAN ARMANDO VELA ULLOA","Persona Natural",null,null,null,null,19680000,null,null,null,19680000,19680000,"2022-01-24","2022-02-01","2022-09-30",240,null,null,null,null,null,null,"En ejecución",1]
[82,2022,"FDLANCD-082-2022(66818)","https://community.secop.gov.co/Public/Tendering/OpportunityDetail/Index?noticeUID=CO1.NTC.2704484&isFromPublicArea=True&isModal=False","Contratos de prestación de servicios profesionales y de apoyo a la gestión","Contratación directa","Prestación de servicios profesionales y de apoyo a la gestión, o para la ejecución de trabajos artísticos que sólo puedan encomendarse a determinadas personas naturales","Prestar servicios de apoyo a la gestión del fondo de desarrollo local de Antonio Nariño en los asuntos operativos relacionados con la seguridad, la convivencia y el desarrollo de actividad económica en la localidad, con conformidad con el marco normativo aplicable en la materia.","Inversión","Un nuevo contrato social y ambiental para la Bogotá del Siglo XXI",57,{"$f":"IF(ISERROR(VLOOKUP(K99,Proposito_programa!$C$2:$E$59,2,FALSE)),\" \",VLOOKUP(K99,Proposito_programa!$C$2:$E$59,2,FALSE))","v":"Gestión pública local"},{"$f":"IF(ISERROR(VLOOKUP(K99,Proposito_programa!$C$2:$E$59,3,FALSE)),\" \",VLOOKUP(K99,Proposito_programa!$C$2:$E$59,3,FALSE))","v":"Propósito 5: Construir Bogotá - Región con gobierno abierto, transparente y ciudadanía consciente"},2198,1,19341321,"ALVARO AMARIS ROJAS","Persona Natural",null,null,null,null,19680000,null,null,null,19680000,19680000,"2022-01-25","2022-01-27","2022-09-25",240,null,null,null,null,null,null,"En ejecución",1]
[83,2022,"FDLANCD-083-2022(70024)","https://community.secop.gov.co/Public/Tendering/OpportunityDetail/Index?noticeUID=CO1.NTC.2724380&isFromPublicArea=True&isModal=False","Contratos de prestación de servicios profesionales y de apoyo a la gestión","Contratación directa","Prestación de servicios profesionales y de apoyo a la gestión, o para la ejecución de trabajos artísticos que sólo puedan encomendarse a determinadas personas naturales","PRESTAR SERVICIOS DE APOYO A LA ALCALDÍA LOCAL DE ANTONIO NARIÑO A LA GESTIÓN ADMINISTRATIVA DEL TEATRO VILLA MAYOR","Inversión","Un nuevo contrato social y ambiental para la Bogotá del Siglo XXI",21,{"$f":"IF(ISERROR(VLOOKUP(K100,Proposito_programa!$C$2:$E$59,2,FALSE)),\" \",VLOOKUP(K100,Proposito_programa!$C$2:$E$59,2,FALSE))","v":"Creación y vida cotidiana: Apropiación ciudadana del arte, la cultura y el patrimonio, para la democracia cultural"},{"$f":"IF(ISERROR(VLOOKUP(K100,Proposito_programa!$C$2:$E$59,3,FALSE)),\" \",VLOOKUP(K100,Proposito_programa!$C$2:$E$59,3,FALSE))","v":"Propósito 1: Hacer un nuevo contrato social para incrementar la inclusión social, productiva y política"},2201,1,1143835530,"SARA JIMENEZ NIETO","Persona Natural",null,null,null,null,14760000,null,null,null,14760000,14760000,"2022-01-26","2022-02-02","2022-08-01",180,null,null,null,null,null,null,"En ejecución",1]
[84,2022,"FDLANCD-084-2022(68249)","https://community.secop.gov.co/Public/Tendering/OpportunityDetail/Index?noticeUID=CO1.NTC.2698845&isFromPublicArea=True&isModal=False","Contratos de prestación de servicios profesionales y de apoyo a la gestión","Contratación directa","Prestación de servicios profesionales y de apoyo a la gestión, o para la ejecución de trabajos artísticos que sólo puedan encomendarse a determinadas personas naturales","Prestar servicios de apoyo a la gestión al fondo de desarrollo local de Antonio Nariño en el acompañamiento a las actividades realizadas dentro de los procesos de participación local","Inversión","Un nuevo contrato social y ambiental para la Bogotá del Siglo XXI",55,{"$f":"IF(ISERROR(VLOOKUP(K101,Proposito_programa!$C$2:$E$59,2,FALSE)),\" \",VLOOKUP(K101,Proposito_programa!$C$2:$E$59,2,FALSE))","v":"Fortalecimiento de cultura ciudadana y su institucionalidad"},{"$f":"IF(ISERROR(VLOOKUP(K101,Proposito_programa!$C$2:$E$59,3,FALSE)),\" \",VLOOKUP(K101,Proposito_programa!$C$2:$E$59,3,FALSE))","v":"Propósito 5: Construir Bogotá - Región con gobierno abierto, transparente y ciudadanía consciente"},2190,1,1013681550,"NORELLA DEL PILAR FLECHAS GUERRERO","Persona Natural",null,null,null,null,14760000,null,null,null,14760000,14760000,"2022-01-24","2022-01-27","2022-07-25",180,null,null,null,null,null,null,"En ejecución",1]
[85,2022,"FDLANCD-085-2022(67473)","https://community.secop.gov.co/Public/Tendering/OpportunityDetail/Index?noticeUID=CO1.NTC.2698456&isFromPublicArea=True&isModal=False","Contratos de prestación de servicios profesionales y de apoyo a la gestión","Contratación directa","Prestación de servicios profesionales y de apoyo a la gestión, o para la ejecución de trabajos artísticos que sólo puedan encomendarse a determinadas personas naturales","Prestar servicios de apoyo a la gestion en las labores asistenciales a las actividades relacionadas con la inspeccion, vigilancia y control que deba adelantar la alcaldia local en materia de actividad economica, despachos comisorios y convivencia ciudadana en la localidad.","Inversión","Un nuevo contrato social y ambiental para la Bogotá del Siglo XXI",57,{"$f":"IF(ISERROR(VLOOKUP(K102,Proposito_programa!$C$2:$E$59,2,FALSE)),\" \",VLOOKUP(K102,Proposito_programa!$C$2:$E$59,2,FALSE))","v":"Gestión pública local"},{"$f":"IF(ISERROR(VLOOKUP(K102,Proposito_programa!$C$2:$E$59,3,FALSE)),\" \",VLOOKUP(K102,Proposito_programa!$C$2:$E$59,3,FALSE))","v":"Propósito 5: Construir Bogotá - Región con gobierno abierto, transparente y ciudadanía consciente"},2189,1,1069176392,"NATALY ACEVEDO BUITRAGO","Persona Natural",null,null,null,null,14760000,null,null,null,14760000,14760000,"2022-01-24","2022-01-27","2022-07-25",180,null,null,null,null,null,null,"En ejecución",1]
[86,2022,"FDLANCD-086-2022(67789)","https://community.secop.gov.co/Public/Tendering/OpportunityDetail/Index?noticeUID=CO1.NTC.2708750&isFromPublicArea=True&isModal=False","Contratos de prestación de servicios profesionales y de apoyo a la gestión","Contratación directa","Prestación de servicios profesionales y de apoyo a la gestión, o para la ejecución de trabajos artísticos que sólo puedan encomendarse a determinadas personas naturales","Prestar servicios profesionales, para apoyar la formulación, ejecución, supervisión,seguimiento cierre y/o liquidación de los procesos contractuales que den respuesta al proyecto de inversión relacionado con acciones de promoción para la educación superior de la localidad de Antonio Nariño.","Inversión","Un nuevo contrato social y ambiental para la Bogotá del Siglo XXI",17,{"$f":"IF(ISERROR(VLOOKUP(K103,Proposito_programa!$C$2:$E$59,2,FALSE)),\" \",VLOOKUP(K103,Proposito_programa!$C$2:$E$59,2,FALSE))","v":"Jóvenes con capacidades: Proyecto de vida para la ciudadanía, la innovación y el trabajo del siglo XXI"},{"$f":"IF(ISERROR(VLOOKUP(K103,Proposito_programa!$C$2:$E$59,3,FALSE)),\" \",VLOOKUP(K103,Proposito_programa!$C$2:$E$59,3,FALSE))","v":"Propósito 1: Hacer un nuevo contrato social para incrementar la inclusión social, productiva y política"},2048,1,51826370,"MARTA YANET MORALES CASTILLO","Persona Natural",null,null,null,null,27720000,null,null,null,27720000,27720000,"2022-01-25","2022-02-01","2022-07-31",180,null,null,null,null,null,null,"En ejecución",1]
[87,2022,"FDLANCD-087-2022(67114)","https://community.secop.gov.co/Public/Tendering/OpportunityDetail/Index?noticeUID=CO1.NTC.2707022&isFromPublicArea=True&isModal=False","Contratos de prestación de servicios profesionales y de apoyo a la gestión","Contratación directa","Prestación de servicios profesionales y de apoyo a la gestión, o para la ejecución de trabajos artísticos que sólo puedan encomendarse a determinadas personas naturales","PRESTACIÓN DE SERVICIOS DE APOYO A LA GESTIÓN AL DESPACHO DEL ALCALDE LOCAL DE ANTONIO NARIÑO EN EL MANEJO DE LOS DISTINTOS ASUNTOS Y TRAMITES ASOCIADOS CON LA GESTIÓN ADMINISTRATIVA LOCAL.","Inversión","Un nuevo contrato social y ambiental para la Bogotá del Siglo XXI",57,{"$f":"IF(ISERROR(VLOOKUP(K104,Proposito_programa!$C$2:$E$59,2,FALSE)),\" \",VLOOKUP(K104,Proposito_programa!$C$2:$E$59,2,FALSE))","v":"Gestión pública local"},{"$f":"IF(ISERROR(VLOOKUP(K104,Proposito_programa!$C$2:$E$59,3,FALSE)),\" \",VLOOKUP(K104,Proposito_programa!$C$2:$E$59,3,FALSE))","v":"Propósito 5: Construir Bogotá - Región con gobierno abierto, transparente y ciudadanía consciente"},2198,1,51953774,"AMPARO TORRES ESGUERRA","Persona Natural",null,null,null,null,14760000,null,null,null,14760000,14760000,"2022-01-25","2022-02-01","2022-07-31",180,null,null,null,null,null,null,"En ejecución",1]
[88,2022,"FDLANCD-088-2022(67785)","https://community.secop.gov.co/Public/Tendering/OpportunityDetail/Index?noticeUID=CO1.NTC.2705126&isFromPublicArea=True&isModal=False","Contratos de prestación de servicios profesionales y de apoyo a la gestión","Contratación directa","Prestación de servicios profesionales y de apoyo a la gestión, o para la ejecución de trabajos artísticos que sólo puedan encomendarse a determinadas personas naturales","Prestar servicios profesionales, para apoyar la formulación, ejecución, supervisión, seguimiento cierre y/o liquidación de los procesos contractuales que den respuesta al proyecto de inversión para acciones de fomento y promoción de actividades en el campo deportivo de la localidad de Antonio Nariño","Inversión","Un nuevo contrato social y ambiental para la Bogotá del Siglo XXI",20,{"$f":"IF(ISERROR(VLOOKUP(K105,Proposito_programa!$C$2:$E$59,2,FALSE)),\" \",VLOOKUP(K105,Proposito_programa!$C$2:$E$59,2,FALSE))","v":"Bogotá, referente en cultura, deporte, recreación y actividad física, con parques para el desarrollo y la salud"},{"$f":"IF(ISERROR(VLOOKUP(K105,Proposito_programa!$C$2:$E$59,3,FALSE)),\" \",VLOOKUP(K105,Proposito_programa!$C$2:$E$59,3,FALSE))","v":"Propósito 1: Hacer un nuevo contrato social para incrementar la inclusión social, productiva y política"},2200,1,1013681219,"JENNIFFER ROJAS HERNANDEZ","Persona Natural",null,null,null,null,27720000,null,null,null,27720000,27720000,"2022-01-25","2022-01-26","2022-07-24",180,null,null,null,null,null,null,"En ejecución",1]
[89,2022,"FDLANCD-089-2022(67774)","https://community.secop.gov.co/Public/Tendering/OpportunityDetail/Index?noticeUID=CO1.NTC.2707241&isFromPublicArea=True&isModal=False","Contratos de prestación de servicios profesionales y de apoyo a la gestión","Contratación directa","Prestación de servicios profesionales y de apoyo a la gestión, o para la ejecución de trabajos artísticos que sólo puedan encomendarse a determinadas personas naturales","Prestación de servicios de apoyo a la gestión para la conducción de los vehículos que conforman el parque automotor en propiedad o custodia del Fondo de Desarrollo Local de Antonio Nariño, y el transporte de funcionarios y contratistas para la realización de las actividades misionales de la Alcaldía Local de Antonio Nariño","Inversión","Un nuevo contrato social y ambiental para la Bogotá del Siglo XXI",57,{"$f":"IF(ISERROR(VLOOKUP(K106,Proposito_programa!$C$2:$E$59,2,FALSE)),\" \",VLOOKUP(K106,Proposito_programa!$C$2:$E$59,2,FALSE))","v":"Gestión pública local"},{"$f":"IF(ISERROR(VLOOKUP(K106,Proposito_programa!$C$2:$E$59,3,FALSE)),\" \",VLOOKUP(K106,Proposito_programa!$C$2:$E$59,3,FALSE))","v":"Propósito 5: Construir Bogotá - Región con gobierno abierto, transparente y ciudadanía consciente"},2198,1,1033752784,"ANDRES FELIPE ARIZA PANQUEBA ","Persona Natural",null,null,null,null,14760000,null,null,null,14760000,14760000,"2022-01-25","2022-01-26","2022-07-24",180,null,null,1033752784,"ANDRES FELIPE ARIZA PANQUEBA ","2022-03-01",14760000,"En ejecución",1]
[90,2022,"FDLANCD-090-2022(67791)","https://community.secop.gov.co/Public/Tendering/OpportunityDetail/Index?noticeUID=CO1.NTC.2705384&isFromPublicArea=True&isModal=False","Contratos de prestación de servicios profesionales y de apoyo a la gestión","Contratación directa","Prestación de servicios profesionales y de apoyo a la gestión, o para la ejecución de trabajos artísticos que sólo puedan encomendarse a determinadas personas naturales","Prestar servicios profesionales, para apoyar la formulación, ejecución, supervisión, seguimiento cierre y/o liquidación de los procesos contractuales que den respuesta al proyecto de inversión de acciones de fomento y fortalecimiento de procesos participativos de la localidad de Antonio Nariño.","Inversión","Un nuevo contrato social y ambiental para la Bogotá del Siglo XXI",55,{"$f":"IF(ISERROR(VLOOKUP(K107,Proposito_programa!$C$2:$E$59,2,FALSE)),\" \",VLOOKUP(K107,Proposito_programa!$C$2:$E$59,2,FALSE))","v":"Fortalecimiento de cultura ciudadana y su institucionalidad"},{"$f":"IF(ISERROR(VLOOKUP(K107,Proposito_programa!$C$2:$E$59,3,FALSE)),\" \",VLOOKUP(K107,Proposito_programa!$C$2:$E$59,3,FALSE))","v":"Propósito 5: Construir Bogotá - Región con gobierno abierto, transparente y ciudadanía consciente"},2190,1,1070979522,"SERGIO NICOLAS POVEDA LEON","Persona Natural",null,null,null,null,27720000,null,null,null,27720000,22330000,"2022-01-25","2022-01-27","2022-09-30",180,null,null,1070979522,"SERGIO NICOLÁS POVEDA LEÓN","11/07/20222","$ 27.720.000","En ejecución",0.80555555555555558]
[91,2022,"FDLANCD-091-2022(69423)","https://community.secop.gov.co/Public/Tendering/OpportunityDetail/Index?noticeUID=CO1.NTC.2795109&isFromPublicArea=True&isModal=False","Contratos de prestación de servicios profesionales y de apoyo a la gestión","Contratación directa","Prestación de servicios profesionales y de apoyo a la gestión, o para la ejecución de trabajos artísticos que sólo puedan encomendarse a determinadas personas naturales","Apoyar y dar soporte técnico al administrador y usuario final de la red de sistemas y tecnología e información de la Alcaldía Local","Inversión","Un nuevo contrato social y ambiental para la Bogotá del Siglo XXI",57,{"$f":"IF(ISERROR(VLOOKUP(K108,Proposito_programa!$C$2:$E$59,2,FALSE)),\" \",VLOOKUP(K108,Proposito_programa!$C$2:$E$59,2,FALSE))","v":"Gestión pública local"},{"$f":"IF(ISERROR(VLOOKUP(K108,Proposito_programa!$C$2:$E$59,3,FALSE)),\" \",VLOOKUP(K108,Proposito_programa!$C$2:$E$59,3,FALSE))","v":"Propósito 5: Construir Bogotá - Región con gobierno abierto, transparente y ciudadanía consciente"},2198,1,1000136904,"YEORGETH SUSANA RUBIANO CRISTIANO","Persona Natural",null,null,null,null,16740000,null,null,null,16740000,16740000,"2022-01-28","2022-02-08","2022-08-09",180,null,null,null,null,null,null,"En ejecución",1]
[92,2022,"FDLANCD-092-2022(69794)","https://community.secop.gov.co/Public/Tendering/OpportunityDetail/Index?noticeUID=CO1.NTC.2709177&isFromPublicArea=True&isModal=False","Contratos de prestación de servicios profesionales y de apoyo a la gestión","Contratación directa","Prestación de servicios profesionales y de apoyo a la gestión, o para la ejecución de trabajos artísticos que sólo puedan encomendarse a determinadas personas naturales","PRESTACION DE SERVICIOS DE APOYO A LA GESTION COMO AUXILAR PARA LA TRANSCRIPCION DE LAS ACTAS QUE EXPIDA LA JUNTA ADMINISTRADORA LOCAL DE ANTONIO NARIÑO","Inversión","Un nuevo contrato social y ambiental para la Bogotá del Siglo XXI",57,{"$f":"IF(ISERROR(VLOOKUP(K109,Proposito_programa!$C$2:$E$59,2,FALSE)),\" \",VLOOKUP(K109,Proposito_programa!$C$2:$E$59,2,FALSE))","v":"Gestión pública local"},{"$f":"IF(ISERROR(VLOOKUP(K109,Proposito_programa!$C$2:$E$59,3,FALSE)),\" \",VLOOKUP(K109,Proposito_programa!$C$2:$E$59,3,FALSE))","v":"Propósito 5: Construir Bogotá - Región con gobierno abierto, transparente y ciudadanía consciente"},2198,1,1018511981,"LEIDY DAYANNA RODRIGUEZ","Persona Natural",null,null,null,null,14760000,null,null,null,14760000,14760000,"2022-01-25","2022-01-26","2022-07-24",180,null,null,null,null,null,null,"En ejecución",1]
[93,2022,"FDLANCD-093-2022(67730)","https://community.secop.gov.co/Public/Tendering/OpportunityDetail/Index?noticeUID=CO1.NTC.2709355&isFromPublicArea=True&isModal=False","Contratos de prestación de servicios profesionales y de apoyo a la gestión","Contratación directa","Prestación de servicios profesionales y de apoyo a la gestión, o para la ejecución de trabajos artísticos que sólo puedan encomendarse a determinadas personas naturales","Apoya el cubrimiento de las actividades, cronogramas y agenda de la Alcaldía local a nivel interno y externo, así como la generación de contenidos periodísticos","Inversión","Un nuevo contrato social y ambiental para la Bogotá del Siglo XXI",57,{"$f":"IF(ISERROR(VLOOKUP(K110,Proposito_programa!$C$2:$E$59,2,FALSE)),\" \",VLOOKUP(K110,Proposito_programa!$C$2:$E$59,2,FALSE))","v":"Gestión pública local"},{"$f":"IF(ISERROR(VLOOKUP(K110,Proposito_programa!$C$2:$E$59,3,FALSE)),\" \",VLOOKUP(K110,Proposito_programa!$C$2:$E$59,3,FALSE))","v":"Propósito 5: Construir Bogotá - Región con gobierno abierto, transparente y ciudadanía consciente"},2198,1,52103693,"MARIA CONSUELO BELTRAN BURGOS","Persona Natural",null,null,null,null,31032000,null,null,null,31032000,31032000,"2022-01-25","2022-01-27","2022-07-25",180,null,null,null,null,null,null,"En ejecución",1]
[94,2022,"FDLANCD-094-2022(66818)","https://community.secop.gov.co/Public/Tendering/OpportunityDetail/Index?noticeUID=CO1.NTC.2715050&isFromPublicArea=True&isModal=False","Contratos de prestación de servicios profesionales y de apoyo a la gestión","Contratación directa","Prestación de servicios profesionales y de apoyo a la gestión, o para la ejecución de trabajos artísticos que sólo puedan encomendarse a determinadas personas naturales","Prestar servicios de apoyo a la gestión del fondo de desarrollo local de Antonio Nariño en los asuntos operativos relacionados con la seguridad, la convivencia y el desarrollo de actividad económica en la localidad, con conformidad con el marco normativo aplicable en la materia","Inversión","Un nuevo contrato social y ambiental para la Bogotá del Siglo XXI",57,{"$f":"IF(ISERROR(VLOOKUP(K111,Proposito_programa!$C$2:$E$59,2,FALSE)),\" \",VLOOKUP(K111,Proposito_programa!$C$2:$E$59,2,FALSE))","v":"Gestión pública local"},{"$f":"IF(ISERROR(VLOOKUP(K111,Proposito_programa!$C$2:$E$59,3,FALSE)),\" \",VLOOKUP(K111,Proposito_programa!$C$2:$E$59,3,FALSE))","v":"Propósito 5: Construir Bogotá - Región con gobierno abierto, transparente y ciudadanía consciente"},2198,1,51876386,"CLAUDIA IOMARA AYALA BELTRAN","Persona Natural",null,null,null,null,19680000,null,null,null,19680000,19680000,"2022-01-25","2022-02-01","2022-09-30",240,null,null,null,null,null,null,"En ejecución",1]
[95,2022,"FDLANCD-095-2022(67795)","https://community.secop.gov.co/Public/Tendering/OpportunityDetail/Index?noticeUID=CO1.NTC.2724669&isFromPublicArea=True&isModal=False","Contratos de prestación de servicios profesionales y de apoyo a la gestión","Contratación directa","Prestación de servicios profesionales y de apoyo a la gestión, o para la ejecución de trabajos artísticos que sólo puedan encomendarse a determinadas personas naturales","PRESTACIÓN DE SERVICIOS PROFESIONALES PARA APOYAR AL ÁREA GESTIÓN DEL DESARROLLO, ADMINISTRATIVA Y FINANCIERA DE LA ALCALDÍA LOCAL EN LA ELABORACIÓN DE ESTUDIOS DEL SECTOR Y DEMÁS ACTIVIDADES FINANCIERAS Y PRESUPUESTALES NECESARIAS PARA LOS PROCESOS DE CONTRATACIÓN QUE ADELANTA EL FONDO DE DESARROLLO LOCAL DE ANTONIO NARIÑO","Inversión","Un nuevo contrato social y ambiental para la Bogotá del Siglo XXI",57,{"$f":"IF(ISERROR(VLOOKUP(K112,Proposito_programa!$C$2:$E$59,2,FALSE)),\" \",VLOOKUP(K112,Proposito_programa!$C$2:$E$59,2,FALSE))","v":"Gestión pública local"},{"$f":"IF(ISERROR(VLOOKUP(K112,Proposito_programa!$C$2:$E$59,3,FALSE)),\" \",VLOOKUP(K112,Proposito_programa!$C$2:$E$59,3,FALSE))","v":"Propósito 5: Construir Bogotá - Región con gobierno abierto, transparente y ciudadanía consciente"},2198,1,79442095,"SERGIO AUGUSTO BELTRAN MARTIN","Persona Natural",null,null,null,null,27720000,null,null,null,27720000,27720000,"2022-01-26","2022-01-27","2022-07-25",180,null,null,null,null,null,null,"En ejecución",1]
[96,2022,"FDLANCD-96-2022(68255)","https://community.secop.gov.co/Public/Tendering/OpportunityDetail/Index?noticeUID=CO1.NTC.2730785&isFromPublicArea=True&isModal=False","Contratos de prestación de servicios profesionales y de apoyo a la gestión","Contratación directa","Prestación de servicios profesionales y de apoyo a la gestión, o para la ejecución de trabajos artísticos que sólo puedan encomendarse a determinadas personas naturales","Apoyar jurídicamente la ejecución de las acciones requeridas para la depuración de las actuaciones administrativas que cursan en la Alcaldía Local","Inversión","Un nuevo contrato social y ambiental para la Bogotá del Siglo XXI",57,{"$f":"IF(ISERROR(VLOOKUP(K113,Proposito_programa!$C$2:$E$59,2,FALSE)),\" \",VLOOKUP(K113,Proposito_programa!$C$2:$E$59,2,FALSE))","v":"Gestión pública local"},{"$f":"IF(ISERROR(VLOOKUP(K113,Proposito_programa!$C$2:$E$59,3,FALSE)),\" \",VLOOKUP(K113,Proposito_programa!$C$2:$E$59,3,FALSE))","v":"Propósito 5: Construir Bogotá - Región con gobierno abierto, transparente y ciudadanía consciente"},2198,1,1013609653,"JULIO CESAR GONZALEZ GOMEZ","Persona Natural",null,null,null,null,27720000,null,null,null,27720000,27720000,"2022-01-26","2022-01-27","2022-07-25",180,null,null,null,null,null,null,"En ejecución",1]
[97,2022,"FDLANCD-097-2022(67788)","https://community.secop.gov.co/Public/Tendering/OpportunityDetail/Index?noticeUID=CO1.NTC.2729431&isFromPublicArea=True&isModal=False","Contratos de prestación de servicios profesionales y de apoyo a la gestión","Contratación directa","Prestación de servicios profesionales y de apoyo a la gestión, o para la ejecución de trabajos artísticos que sólo puedan encomendarse a determinadas personas naturales","Prestar servicios profesionales, para apoyar la formulación, ejecución, supervisión, seguimiento cierre y/o liquidación de los procesos contractuales que den respuesta al proyecto de inversión para las acciones de fomento y promoción de actividades artísticas, interculturales, culturales y/o patrimoniales de la localidad de Antonio Nariño.","Inversión","Un nuevo contrato social y ambiental para la Bogotá del Siglo XXI",21,{"$f":"IF(ISERROR(VLOOKUP(K114,Proposito_programa!$C$2:$E$59,2,FALSE)),\" \",VLOOKUP(K114,Proposito_programa!$C$2:$E$59,2,FALSE))","v":"Creación y vida cotidiana: Apropiación ciudadana del arte, la cultura y el patrimonio, para la democracia cultural"},{"$f":"IF(ISERROR(VLOOKUP(K114,Proposito_programa!$C$2:$E$59,3,FALSE)),\" \",VLOOKUP(K114,Proposito_programa!$C$2:$E$59,3,FALSE))","v":"Propósito 1: Hacer un nuevo contrato social para incrementar la inclusión social, productiva y política"},2201,1,7570624,"FABIAN ENRIQUE DAZA MORALES","Persona Natural",null,null,null,null,27720000,null,null,null,27720000,27258000,"2022-01-26","2022-02-02","2022-08-03",180,null,null,null,null,null,null,"En ejecución",0.98333333333333328]
[98,2022,"FDLANCD-098-2022(68255)","https://community.secop.gov.co/Public/Tendering/OpportunityDetail/Index?noticeUID=CO1.NTC.2734604&isFromPublicArea=True&isModal=False","Contratos de prestación de servicios profesionales y de apoyo a la gestión","Contratación directa","Prestación de servicios profesionales y de apoyo a la gestión, o para la ejecución de trabajos artísticos que sólo puedan encomendarse a determinadas personas naturales","Apoyar jurídicamente la ejecución de las acciones requeridas para la depuración de las actuaciones administrativas que cursan en la Alcaldía Local.","Inversión","Un nuevo contrato social y ambiental para la Bogotá del Siglo XXI",57,{"$f":"IF(ISERROR(VLOOKUP(K115,Proposito_programa!$C$2:$E$59,2,FALSE)),\" \",VLOOKUP(K115,Proposito_programa!$C$2:$E$59,2,FALSE))","v":"Gestión pública local"},{"$f":"IF(ISERROR(VLOOKUP(K115,Proposito_programa!$C$2:$E$59,3,FALSE)),\" \",VLOOKUP(K115,Proposito_programa!$C$2:$E$59,3,FALSE))","v":"Propósito 5: Construir Bogotá - Región con gobierno abierto, transparente y ciudadanía consciente"},2198,1,1032472221,"ANGEE BRIGETH PACHECO AMADO","Persona Natural",null,null,null,null,27720000,null,null,null,27720000,27720000,"2022-01-26","2022-02-01","2022-07-31",180,null,null,null,null,null,null,"En ejecución",1]
[99,2022,"FDLANCD-099-2022(68255)","https://community.secop.gov.co/Public/Tendering/OpportunityDetail/Index?noticeUID=CO1.NTC.2734795&isFromPublicArea=True&isModal=False","Contratos de prestación de servicios profesionales y de apoyo a la gestión","Contratación directa","Prestación de servicios profesionales y de apoyo a la gestión, o para la ejecución de trabajos artísticos que sólo puedan encomendarse a determinadas personas naturales","Apoyar jurídicamente la ejecución de las acciones requeridas para la depuración de las actuaciones administrativas que cursan en la Alcaldía Local.","Inversión","Un nuevo contrato social y ambiental para la Bogotá del Siglo XXI",57,{"$f":"IF(ISERROR(VLOOKUP(K116,Proposito_programa!$C$2:$E$59,2,FALSE)),\" \",VLOOKUP(K116,Proposito_programa!$C$2:$E$59,2,FALSE))","v":"Gestión pública local"},{"$f":"IF(ISERROR(VLOOKUP(K116,Proposito_programa!$C$2:$E$59,3,FALSE)),\" \",VLOOKUP(K116,Proposito_programa!$C$2:$E$59,3,FALSE))","v":"Propósito 5: Construir Bogotá - Región con gobierno abierto, transparente y ciudadanía consciente"},2198,1,1015447288,"ADRIANA KATHERIN AVILA TORRES","Persona Natural",null,null,null,null,27720000,null,null,null,27720000,27720000,"2022-01-26","2022-01-27","2022-07-25",180,null,null,null,null,null,null,"En ejecución",1]
[100,2022,"FDLANCD-100-2022(68255)","https://community.secop.gov.co/Public/Tendering/OpportunityDetail/Index?noticeUID=CO1.NTC.2736764&isFromPublicArea=True&isModal=False","Contratos de prestación de servicios profesionales y de apoyo a la gestión","Contratación directa","Prestación de servicios profesionales y de apoyo a la gestión, o para la ejecución de trabajos artísticos que sólo puedan encomendarse a determinadas personas naturales","Apoyar jurídicamente la ejecución de las acciones requeridas para la depuración de las actuaciones administrativas que cursan en la Alcaldía Local.","Inversión","Un nuevo contrato social y ambiental para la Bogotá del Siglo XXI",57,{"$f":"IF(ISERROR(VLOOKUP(K117,Proposito_programa!$C$2:$E$59,2,FALSE)),\" \",VLOOKUP(K117,Proposito_programa!$C$2:$E$59,2,FALSE))","v":"Gestión pública local"},{"$f":"IF(ISERROR(VLOOKUP(K117,Proposito_programa!$C$2:$E$59,3,FALSE)),\" \",VLOOKUP(K117,Proposito_programa!$C$2:$E$59,3,FALSE))","v":"Propósito 5: Construir Bogotá - Región con gobierno abierto, transparente y ciudadanía consciente"},2198,1,1085925841,"JOSE DANIEL CHAMORRO VASQUEZ","Persona Natural",null,null,null,null,27720000,null,null,null,27720000,27720000,"2022-01-26","2022-02-01","2022-07-31",180,null,null,null,null,null,null,"En ejecución",1]
[101,2022,"FDLANCD-101-2022(67771)","https://community.secop.gov.co/Public/Tendering/OpportunityDetail/Index?noticeUID=CO1.NTC.2732985&isFromPublicArea=True&isModal=False","Contratos de prestación de servicios profesionales y de apoyo a la gestión","Contratación directa","Prestación de servicios profesionales y de apoyo a la gestión, o para la ejecución de trabajos artísticos que sólo puedan encomendarse a determinadas personas naturales","Prestar servicios profesionales, para apoyar la formulación, ejecución, supervisión, seguimiento cierre y/o liquidación de los procesos contractuales que den respuesta al proyecto de inversión de acciones para la construcción de memoria, verdad, reparación, víctimas, paz y reconciliación de la localidad de Antonio Nariño","Inversión","Un nuevo contrato social y ambiental para la Bogotá del Siglo XXI",39,{"$f":"IF(ISERROR(VLOOKUP(K118,Proposito_programa!$C$2:$E$59,2,FALSE)),\" \",VLOOKUP(K118,Proposito_programa!$C$2:$E$59,2,FALSE))","v":"Bogotá territorio de paz y atención integral a las víctimas del conflicto armado"},{"$f":"IF(ISERROR(VLOOKUP(K118,Proposito_programa!$C$2:$E$59,3,FALSE)),\" \",VLOOKUP(K118,Proposito_programa!$C$2:$E$59,3,FALSE))","v":"Propósito 3: Inspirar confianza y legitimidad para vivir sin miedo y ser epicentro de cultura ciudadana, paz y reconciliación"},2165,1,1012399674,"GINNA LIZETH SERNA","Persona Natural",null,null,null,null,27720000,null,null,null,27720000,27720000,"2022-01-26","2022-01-27","2022-07-25",180,null,null,null,null,null,null,"En ejecución",1]
[102,2022,"FDLANCD-102-2022(68195)","https://community.secop.gov.co/Public/Tendering/OpportunityDetail/Index?noticeUID=CO1.NTC.2741330&isFromPublicArea=True&isModal=False","Contratos de prestación de servicios profesionales y de apoyo a la gestión","Contratación directa","Prestación de servicios profesionales y de apoyo a la gestión, o para la ejecución de trabajos artísticos que sólo puedan encomendarse a determinadas personas naturales","Prestar servicios profesionales como abogado para apoyar los distintos procedimientos sancionatorios y trámites administrativos que adelante el equipo de inspección, vigilancia y control del área de gestión policiva y jurídica del Fondo de Desarrollo Local Antonio Nariño, con ocasión a la infracción y aplicación de normas policivas y apoyo al despacho del alcalde local en asuntos relacionados con despachos comisorios","Inversión","Un nuevo contrato social y ambiental para la Bogotá del Siglo XXI",57,{"$f":"IF(ISERROR(VLOOKUP(K119,Proposito_programa!$C$2:$E$59,2,FALSE)),\" \",VLOOKUP(K119,Proposito_programa!$C$2:$E$59,2,FALSE))","v":"Gestión pública local"},{"$f":"IF(ISERROR(VLOOKUP(K119,Proposito_programa!$C$2:$E$59,3,FALSE)),\" \",VLOOKUP(K119,Proposito_programa!$C$2:$E$59,3,FALSE))","v":"Propósito 5: Construir Bogotá - Región con gobierno abierto, transparente y ciudadanía consciente"},2198,1,1013649960,"CRISTIAN ALFONSO MONCADA LUGO","Persona Natural",null,null,null,null,50820000,null,null,null,50820000,46970000,"2022-01-26","2022-01-27","2022-12-25",330,null,null,null,null,null,null,"En ejecución",0.9242424242424242]
[103,2022,"FDLANCD-103-2022(68255)","https://community.secop.gov.co/Public/Tendering/OpportunityDetail/Index?noticeUID=CO1.NTC.2736552&isFromPublicArea=True&isModal=False","Contratos de prestación de servicios profesionales y de apoyo a la gestión","Contratación directa","Prestación de servicios profesionales y de apoyo a la gestión, o para la ejecución de trabajos artísticos que sólo puedan encomendarse a determinadas personas naturales","Apoyar jurídicamente la ejecución de las acciones requeridas para la depuración de las actuaciones administrativas que cursan en la Alcaldía Local.","Inversión","Un nuevo contrato social y ambiental para la Bogotá del Siglo XXI",57,{"$f":"IF(ISERROR(VLOOKUP(K120,Proposito_programa!$C$2:$E$59,2,FALSE)),\" \",VLOOKUP(K120,Proposito_programa!$C$2:$E$59,2,FALSE))","v":"Gestión pública local"},{"$f":"IF(ISERROR(VLOOKUP(K120,Proposito_programa!$C$2:$E$59,3,FALSE)),\" \",VLOOKUP(K120,Proposito_programa!$C$2:$E$59,3,FALSE))","v":"Propósito 5: Construir Bogotá - Región con gobierno abierto, transparente y ciudadanía consciente"},2198,1,1085294675,"JAIRO CAMILO MUÑOZ SANTACRUZ","Persona Natural",null,null,null,null,27720000,null,null,null,27720000,27720000,"2022-01-26","2022-02-04","2022-08-05",180,null,null,null,null,null,null,"En ejecución",1]
[104,2022,"FDLANCD-104-2022(66978)","https://community.secop.gov.co/Public/Tendering/OpportunityDetail/Index?noticeUID=CO1.NTC.2741857&isFromPublicArea=True&isModal=False","Contratos de prestación de servicios profesionales y de apoyo a la gestión","Contratación directa","Prestación de servicios profesionales y de apoyo a la gestión, o para la ejecución de trabajos artísticos que sólo puedan encomendarse a determinadas personas naturales","PRESTACIÓN DE SERVICIOS PROFESIONALES AL ÁREA DE GESTIÓN DE DESARROLLO LOCAL ANTONIO NARIÑO PARA APOYAR LA FORMULACIÓN, SOCIALIZACIÓN Y SEGUIMIENTO DE LOS PROGRAMAS Y PROYECTOS DE INVERSIÓN, RELACIONADOS CON LA INFRAESTRUCTURA DEL FONDO, NECESARIOS PARA EL CUMPLIMIENTO DEL PLAN DE DESARROLLO LOCAL","Inversión","Un nuevo contrato social y ambiental para la Bogotá del Siglo XXI",33,{"$f":"IF(ISERROR(VLOOKUP(K121,Proposito_programa!$C$2:$E$59,2,FALSE)),\" \",VLOOKUP(K121,Proposito_programa!$C$2:$E$59,2,FALSE))","v":"Más árboles y más y mejor espacio público"},{"$f":"IF(ISERROR(VLOOKUP(K121,Proposito_programa!$C$2:$E$59,3,FALSE)),\" \",VLOOKUP(K121,Proposito_programa!$C$2:$E$59,3,FALSE))","v":"Propósito 2 : Cambiar Nuestros Hábitos de Vida para Reverdecer a Bogotá y Adaptarnos y Mitigar la Crisis Climática"},2207,1,1052401425,"NELLY CATALINA ORTEGA GOMEZ","Persona Natural",null,null,null,null,27720000,null,null,null,27720000,4620000,"2022-01-26","2022-02-01","2022-07-31",180,null,null,null,null,null,null,"En ejecución",0.16666666666666666]
[105,2022,"FDLANCD-105-2022(68189)","https://community.secop.gov.co/Public/Tendering/OpportunityDetail/Index?noticeUID=CO1.NTC.2741778&isFromPublicArea=True&isModal=False","Contratos de prestación de servicios profesionales y de apoyo a la gestión","Contratación directa","Prestación de servicios profesionales y de apoyo a la gestión, o para la ejecución de trabajos artísticos que sólo puedan encomendarse a determinadas personas naturales","Prestar los servicios profesionales como abogado para fortalecer el equipo de inspección, vigilancia y control del área de gestión policiva del fondo de desarrollolocal de Antonio Nariño en cobros persuasivos","Inversión","Un nuevo contrato social y ambiental para la Bogotá del Siglo XXI",57,{"$f":"IF(ISERROR(VLOOKUP(K122,Proposito_programa!$C$2:$E$59,2,FALSE)),\" \",VLOOKUP(K122,Proposito_programa!$C$2:$E$59,2,FALSE))","v":"Gestión pública local"},{"$f":"IF(ISERROR(VLOOKUP(K122,Proposito_programa!$C$2:$E$59,3,FALSE)),\" \",VLOOKUP(K122,Proposito_programa!$C$2:$E$59,3,FALSE))","v":"Propósito 5: Construir Bogotá - Región con gobierno abierto, transparente y ciudadanía consciente"},2189,1,1033811955,"LAURA YESSENIA LOPEZ","Persona Natural",null,null,null,null,27720000,null,null,null,27720000,27720000,"2022-01-26","2022-02-03","2022-08-04",180,null,null,null,null,null,null,"En ejecución",1]
[106,2022,"FDLANCD-106-2022(68232)","https://community.secop.gov.co/Public/Tendering/OpportunityDetail/Index?noticeUID=CO1.NTC.2743024&isFromPublicArea=True&isModal=False","Contratos de prestación de servicios profesionales y de apoyo a la gestión","Contratación directa","Prestación de servicios profesionales y de apoyo a la gestión, o para la ejecución de trabajos artísticos que sólo puedan encomendarse a determinadas personas naturales","Apoyar administrativa y asistencialmente a las Inspecciones de Policía de la Localidad.","Inversión","Un nuevo contrato social y ambiental para la Bogotá del Siglo XXI",57,{"$f":"IF(ISERROR(VLOOKUP(K123,Proposito_programa!$C$2:$E$59,2,FALSE)),\" \",VLOOKUP(K123,Proposito_programa!$C$2:$E$59,2,FALSE))","v":"Gestión pública local"},{"$f":"IF(ISERROR(VLOOKUP(K123,Proposito_programa!$C$2:$E$59,3,FALSE)),\" \",VLOOKUP(K123,Proposito_programa!$C$2:$E$59,3,FALSE))","v":"Propósito 5: Construir Bogotá - Región con gobierno abierto, transparente y ciudadanía consciente"},2189,1,1065619444,"ANDRES GUILLERMO ARRIETA GARCIA","Persona Natural",null,null,null,null,11286000,null,null,null,11286000,11286000,"2022-01-26","2022-02-01","2022-07-31",180,null,null,null,null,null,null,"En ejecución",1]
[107,2022,"FDLANCD-107-2022(68232)","https://community.secop.gov.co/Public/Tendering/OpportunityDetail/Index?noticeUID=CO1.NTC.2743287&isFromPublicArea=True&isModal=False","Contratos de prestación de servicios profesionales y de apoyo a la gestión","Contratación directa","Prestación de servicios profesionales y de apoyo a la gestión, o para la ejecución de trabajos artísticos que sólo puedan encomendarse a determinadas personas naturales","Apoyar administrativa y asistencialmente a las Inspecciones de Policía de la Localidad.","Inversión","Un nuevo contrato social y ambiental para la Bogotá del Siglo XXI",57,{"$f":"IF(ISERROR(VLOOKUP(K124,Proposito_programa!$C$2:$E$59,2,FALSE)),\" \",VLOOKUP(K124,Proposito_programa!$C$2:$E$59,2,FALSE))","v":"Gestión pública local"},{"$f":"IF(ISERROR(VLOOKUP(K124,Proposito_programa!$C$2:$E$59,3,FALSE)),\" \",VLOOKUP(K124,Proposito_programa!$C$2:$E$59,3,FALSE))","v":"Propósito 5: Construir Bogotá - Región con gobierno abierto, transparente y ciudadanía consciente"},2189,1,1024560826,"ANGIE MARCELA PERILLA BARAHONA ","Persona Natural",null,null,null,null,11286000,null,null,null,{"$f":"+W124+X124+Z124","v":11286000},11286000,"2022-01-26","2022-02-01","2022-07-31",180,null,null,1000469481,"ANGIE MARCELA PERILLA BARAHONA ","2022-03-22",11286000,"En ejecución",1]
[108,2022,"FDLANCD-108-2022(68791)","https://community.secop.gov.co/Public/Tendering/OpportunityDetail/Index?noticeUID=CO1.NTC.2743059&isFromPublicArea=True&isModal=False","Contratos de prestación de servicios profesionales y de apoyo a la gestión","Contratación directa","Prestación de servicios profesionales y de apoyo a la gestión, o para la ejecución de trabajos artísticos que sólo puedan encomendarse a determinadas personas naturales","Prestar servicios de apoyo al fondo de desarrollo local de Antonio Nariño en los diferentes tramites requeridos por las entidades distritales y/o locales en los procesos de planeacion","Inversión","Un nuevo contrato social y ambiental para la Bogotá del Siglo XXI",6,{"$f":"IF(ISERROR(VLOOKUP(K125,Proposito_programa!$C$2:$E$59,2,FALSE)),\" \",VLOOKUP(K125,Proposito_programa!$C$2:$E$59,2,FALSE))","v":"Sistema Distrital de Cuidado"},{"$f":"IF(ISERROR(VLOOKUP(K125,Proposito_programa!$C$2:$E$59,3,FALSE)),\" \",VLOOKUP(K125,Proposito_programa!$C$2:$E$59,3,FALSE))","v":"Propósito 1: Hacer un nuevo contrato social para incrementar la inclusión social, productiva y política"},2191,1,1013590697,"YURI ANDREA ALARCON RODRIGUEZ","Persona Natural",null,null,null,null,14760000,null,null,null,14760000,14760000,"2022-01-26","2022-02-01","2022-07-31",180,null,null,null,null,null,null,"En ejecución",1]
[109,2022,"FDLANCD-109-2022(68278)","https://community.secop.gov.co/Public/Tendering/OpportunityDetail/Index?noticeUID=CO1.NTC.2745640&isFromPublicArea=True&isModal=False","Contratos de prestación de servicios profesionales y de apoyo a la gestión","Contratación directa","Prestación de servicios profesionales y de apoyo a la gestión, o para la ejecución de trabajos artísticos que sólo puedan encomendarse a determinadas personas naturales","APOYAR TÉCNICAMENTE LAS DISTINTAS ETAPAS DE LOS PROCESOS DE COMPETENCIA DE LA ALCALDÍA LOCAL PARA LA DEPURACIÓN DE ACTUACIONES ADMINISTRATIVAS","Inversión","Un nuevo contrato social y ambiental para la Bogotá del Siglo XXI",57,{"$f":"IF(ISERROR(VLOOKUP(K126,Proposito_programa!$C$2:$E$59,2,FALSE)),\" \",VLOOKUP(K126,Proposito_programa!$C$2:$E$59,2,FALSE))","v":"Gestión pública local"},{"$f":"IF(ISERROR(VLOOKUP(K126,Proposito_programa!$C$2:$E$59,3,FALSE)),\" \",VLOOKUP(K126,Proposito_programa!$C$2:$E$59,3,FALSE))","v":"Propósito 5: Construir Bogotá - Región con gobierno abierto, transparente y ciudadanía consciente"},2189,1,1074129871,"SANTIAGO NICOLAS MORA GUTIERREZ","Persona Natural",null,null,null,null,32400000,null,null,null,32400000,32400000,"2022-01-27","2022-02-01","2022-07-31",180,null,null,null,null,null,null,"En ejecución",1]
[110,2022,"FDLANCD-110-2022(68263)","https://community.secop.gov.co/Public/Tendering/OpportunityDetail/Index?noticeUID=CO1.NTC.2751720&isFromPublicArea=True&isModal=False","Contratos de prestación de servicios profesionales y de apoyo a la gestión","Contratación directa","Prestación de servicios profesionales y de apoyo a la gestión, o para la ejecución de trabajos artísticos que sólo puedan encomendarse a determinadas personas naturales","PRESTACIÓN DE SERVICIOS DE APOYO A LA GESTIÓN EN LAS LABORES ASISTENCIALES DEL ÁREA DE GESTIÓN POLICIVA, PARA LOS DISTINTOS PROCEDIMIENTOS SANCIONATORIOS Y TRÁMITES ADMINISTRATIVOS QUE ADELANTA EL EQUIPO DE INSPECCIÓN, VIGILANCIA Y CONTROL DE LA ALCALDÍA LOCAL DE ANTONIO NARIÑO","Inversión","Un nuevo contrato social y ambiental para la Bogotá del Siglo XXI",57,{"$f":"IF(ISERROR(VLOOKUP(K127,Proposito_programa!$C$2:$E$59,2,FALSE)),\" \",VLOOKUP(K127,Proposito_programa!$C$2:$E$59,2,FALSE))","v":"Gestión pública local"},{"$f":"IF(ISERROR(VLOOKUP(K127,Proposito_programa!$C$2:$E$59,3,FALSE)),\" \",VLOOKUP(K127,Proposito_programa!$C$2:$E$59,3,FALSE))","v":"Propósito 5: Construir Bogotá - Región con gobierno abierto, transparente y ciudadanía consciente"},2189,1,79850361,"CARLOS VLADIMIR PINZON VEGA","Persona Natural",null,null,null,null,14760000,null,null,null,14760000,14514000,"2022-01-27","2022-02-02","2022-08-03",180,null,null,null,null,null,null,"En ejecución",0.98333333333333328]
[111,2022,"FDLANCD-111-2022(66605)","https://community.secop.gov.co/Public/Tendering/OpportunityDetail/Index?noticeUID=CO1.NTC.2762498&isFromPublicArea=True&isModal=False","Contratos de prestación de servicios profesionales y de apoyo a la gestión","Contratación directa","Prestación de servicios profesionales y de apoyo a la gestión, o para la ejecución de trabajos artísticos que sólo puedan encomendarse a determinadas personas naturales","PRESTAR SERVICIOS PROFESIONALES DE APOYO EN LOS PROCESOS ADMINISTRATIVOS, CONTABLES Y FINANCIEROS EN EL FONDO DE DESARROLLO LOCAL DE ANTONIO NARIÑO EN EL MARCO DE LAS NORMAS DE DERECHO CONTABLE, DE SEGURIDAD SOCIAL Y LOS PROCEDIMIENTOS VIGENTES","Inversión","Un nuevo contrato social y ambiental para la Bogotá del Siglo XXI",57,{"$f":"IF(ISERROR(VLOOKUP(K128,Proposito_programa!$C$2:$E$59,2,FALSE)),\" \",VLOOKUP(K128,Proposito_programa!$C$2:$E$59,2,FALSE))","v":"Gestión pública local"},{"$f":"IF(ISERROR(VLOOKUP(K128,Proposito_programa!$C$2:$E$59,3,FALSE)),\" \",VLOOKUP(K128,Proposito_programa!$C$2:$E$59,3,FALSE))","v":"Propósito 5: Construir Bogotá - Región con gobierno abierto, transparente y ciudadanía consciente"},2198,1,1022379187,"NATALIA DELGADO PUENTES","Persona Natural",null,null,null,null,32400000,null,null,null,32400000,32400000,"2022-01-27","2022-02-03","2022-08-04",180,null,null,1022379187,"NATHALIA DELGADO PUENTES ","2022-03-01",32400000,"En ejecución",1]
[112,2022,"FDLANCD-112-2022(68232)","https://community.secop.gov.co/Public/Tendering/OpportunityDetail/Index?noticeUID=CO1.NTC.2791298&isFromPublicArea=True&isModal=False","Contratos de prestación de servicios profesionales y de apoyo a la gestión","Contratación directa","Prestación de servicios profesionales y de apoyo a la gestión, o para la ejecución de trabajos artísticos que sólo puedan encomendarse a determinadas personas naturales","Apoyar administrativa y asistencialmente a las Inspecciones de Policía de la Localidad.","Inversión","Un nuevo contrato social y ambiental para la Bogotá del Siglo XXI",57,{"$f":"IF(ISERROR(VLOOKUP(K129,Proposito_programa!$C$2:$E$59,2,FALSE)),\" \",VLOOKUP(K129,Proposito_programa!$C$2:$E$59,2,FALSE))","v":"Gestión pública local"},{"$f":"IF(ISERROR(VLOOKUP(K129,Proposito_programa!$C$2:$E$59,3,FALSE)),\" \",VLOOKUP(K129,Proposito_programa!$C$2:$E$59,3,FALSE))","v":"Propósito 5: Construir Bogotá - Región con gobierno abierto, transparente y ciudadanía consciente"},2189,1,1018433251,"LADY JOHANA DIAZ MORENO","Persona Natural",null,null,null,null,11286000,null,null,null,11286000,9216900,"2022-01-28","2022-02-02","2022-07-31",180,null,null,null,null,null,null,"En ejecución",0.81666666666666665]
[113,2022,"FDLANCD-113-2022(69882)","https://community.secop.gov.co/Public/Tendering/OpportunityDetail/Index?noticeUID=CO1.NTC.2756414&isFromPublicArea=True&isModal=False","Contratos de prestación de servicios profesionales y de apoyo a la gestión","Contratación directa","Prestación de servicios profesionales y de apoyo a la gestión, o para la ejecución de trabajos artísticos que sólo puedan encomendarse a determinadas personas naturales","Prestar servicios de apoyo a la gestión a la Alcaldía Local de Antonio Nariño en el seguimiento a casos de violencia intrafamiliar y sexual en poblaciones vulnerables, así como en los procesos de participación ciudadana en la localidad.","Inversión","Un nuevo contrato social y ambiental para la Bogotá del Siglo XXI",6,{"$f":"IF(ISERROR(VLOOKUP(K130,Proposito_programa!$C$2:$E$59,2,FALSE)),\" \",VLOOKUP(K130,Proposito_programa!$C$2:$E$59,2,FALSE))","v":"Sistema Distrital de Cuidado"},{"$f":"IF(ISERROR(VLOOKUP(K130,Proposito_programa!$C$2:$E$59,3,FALSE)),\" \",VLOOKUP(K130,Proposito_programa!$C$2:$E$59,3,FALSE))","v":"Propósito 1: Hacer un nuevo contrato social para incrementar la inclusión social, productiva y política"},2192,1,1007749906,"LIZETH DAYANA RUBIANO PULIDO","Persona Natural",null,null,null,null,14760000,null,null,null,14760000,14760000,"2022-01-27","2022-02-01","2022-07-31",180,null,null,null,null,null,null,"En ejecución",1]
[114,2022,"FDLANCD-114-2022(68790)","https://community.secop.gov.co/Public/Tendering/OpportunityDetail/Index?noticeUID=CO1.NTC.2757687&isFromPublicArea=True&isModal=False","Contratos de prestación de servicios profesionales y de apoyo a la gestión","Contratación directa","Prestación de servicios profesionales y de apoyo a la gestión, o para la ejecución de trabajos artísticos que sólo puedan encomendarse a determinadas personas naturales","Prestar servicios profesionales, para apoyar la formulación, ejecución, supervisión, seguimiento cierre y/o liquidación de los procesos contractuales que den respuesta al proyecto de inversión acciones para las personas cuidadoras de la localidad de Antonio Nariño.","Inversión","Un nuevo contrato social y ambiental para la Bogotá del Siglo XXI",6,{"$f":"IF(ISERROR(VLOOKUP(K131,Proposito_programa!$C$2:$E$59,2,FALSE)),\" \",VLOOKUP(K131,Proposito_programa!$C$2:$E$59,2,FALSE))","v":"Sistema Distrital de Cuidado"},{"$f":"IF(ISERROR(VLOOKUP(K131,Proposito_programa!$C$2:$E$59,3,FALSE)),\" \",VLOOKUP(K131,Proposito_programa!$C$2:$E$59,3,FALSE))","v":"Propósito 1: Hacer un nuevo contrato social para incrementar la inclusión social, productiva y política"},2193,1,51922115,"BERENICE CUEVAS PINZON","Persona Natural",null,null,null,null,27720000,null,null,null,27720000,27720000,"2022-01-27","2022-02-01","2022-07-31",180,null,null,null,null,null,null,"En ejecución",1]
[115,2022,"FDLANCD-115-2022(68790)","https://community.secop.gov.co/Public/Tendering/OpportunityDetail/Index?noticeUID=CO1.NTC.2757889&isFromPublicArea=True&isModal=False","Contratos de prestación de servicios profesionales y de apoyo a la gestión","Contratación directa","Prestación de servicios profesionales y de apoyo a la gestión, o para la ejecución de trabajos artísticos que sólo puedan encomendarse a determinadas personas naturales","Prestar servicios profesionales, para apoyar la formulación, ejecución, supervisión, seguimiento cierre y/o liquidación de los procesos contractuales que den respuesta al proyecto de inversión acciones para las personas cuidadoras de la localidad de Antonio Nariño.","Inversión","Un nuevo contrato social y ambiental para la Bogotá del Siglo XXI",6,{"$f":"IF(ISERROR(VLOOKUP(K132,Proposito_programa!$C$2:$E$59,2,FALSE)),\" \",VLOOKUP(K132,Proposito_programa!$C$2:$E$59,2,FALSE))","v":"Sistema Distrital de Cuidado"},{"$f":"IF(ISERROR(VLOOKUP(K132,Proposito_programa!$C$2:$E$59,3,FALSE)),\" \",VLOOKUP(K132,Proposito_programa!$C$2:$E$59,3,FALSE))","v":"Propósito 1: Hacer un nuevo contrato social para incrementar la inclusión social, productiva y política"},2193,1,79330371,"NESTOR VARGAS LOZANO","Persona Natural",null,null,null,null,27720000,null,null,null,27720000,27720000,"2022-01-27","2022-02-01","2022-07-31",180,null,null,null,null,null,null,"En ejecución",1]
[116,2022,"FDLANCD-116-2022(68821)","https://community.secop.gov.co/Public/Tendering/OpportunityDetail/Index?noticeUID=CO1.NTC.2757236&isFromPublicArea=True&isModal=False","Contratos de prestación de servicios profesionales y de apoyo a la gestión","Contratación directa","Prestación de servicios profesionales y de apoyo a la gestión, o para la ejecución de trabajos artísticos que sólo puedan encomendarse a determinadas personas naturales","Apoyar en las tareas operativas de carácter archivístico desarrolladas en la Alcaldía Local para garantizar la aplicación correcta de los procedimientos técnicos.","Inversión","Un nuevo contrato social y ambiental para la Bogotá del Siglo XXI",57,{"$f":"IF(ISERROR(VLOOKUP(K133,Proposito_programa!$C$2:$E$59,2,FALSE)),\" \",VLOOKUP(K133,Proposito_programa!$C$2:$E$59,2,FALSE))","v":"Gestión pública local"},{"$f":"IF(ISERROR(VLOOKUP(K133,Proposito_programa!$C$2:$E$59,3,FALSE)),\" \",VLOOKUP(K133,Proposito_programa!$C$2:$E$59,3,FALSE))","v":"Propósito 5: Construir Bogotá - Región con gobierno abierto, transparente y ciudadanía consciente"},2198,1,1031154492,"DIANA MARCELA SANCHEZ","Persona Natural",null,null,null,null,20160000,null,null,null,20160000,20160000,"2022-01-27","2022-02-01","2022-07-31",180,null,null,null,null,null,null,"En ejecución",1]
[117,2022,"FDLANCD-117-2022(69996)","https://community.secop.gov.co/Public/Tendering/OpportunityDetail/Index?noticeUID=CO1.NTC.2757622&isFromPublicArea=True&isModal=False","Contratos de prestación de servicios profesionales y de apoyo a la gestión","Contratación directa","Prestación de servicios profesionales y de apoyo a la gestión, o para la ejecución de trabajos artísticos que sólo puedan encomendarse a determinadas personas naturales","Apoyar al (a) Alcalde (sa) Local en el fortalecimiento e inclusión de las comunidades negras, afrocolombianas y palenqueras en el marco de la política pública Distrital Afrodescendientes y los espacios de participación","Inversión","Un nuevo contrato social y ambiental para la Bogotá del Siglo XXI",55,{"$f":"IF(ISERROR(VLOOKUP(K134,Proposito_programa!$C$2:$E$59,2,FALSE)),\" \",VLOOKUP(K134,Proposito_programa!$C$2:$E$59,2,FALSE))","v":"Fortalecimiento de cultura ciudadana y su institucionalidad"},{"$f":"IF(ISERROR(VLOOKUP(K134,Proposito_programa!$C$2:$E$59,3,FALSE)),\" \",VLOOKUP(K134,Proposito_programa!$C$2:$E$59,3,FALSE))","v":"Propósito 5: Construir Bogotá - Región con gobierno abierto, transparente y ciudadanía consciente"},2190,1,1131084170,"IVET ELISABET OLAYA LOEBEL","Persona Natural",null,null,null,null,27720000,null,null,null,27720000,22638000,"2022-01-27","2022-02-01","2022-07-31",180,null,null,null,null,null,null,"En ejecución",0.81666666666666665]
[118,2022,"FDLANCD-118-2022(70005)","https://community.secop.gov.co/Public/Tendering/OpportunityDetail/Index?noticeUID=CO1.NTC.2758942&isFromPublicArea=True&isModal=False","Contratos de prestación de servicios profesionales y de apoyo a la gestión","Contratación directa","Prestación de servicios profesionales y de apoyo a la gestión, o para la ejecución de trabajos artísticos que sólo puedan encomendarse a determinadas personas naturales","Prestar servicios profesionales a la alcaldía local de Antonio Nariño para realizar acompañamiento a procesos comunitarios y apoyar la realización de las actividades de asociados al desarrollo e implementación de presupuestos participativos.","Inversión","Un nuevo contrato social y ambiental para la Bogotá del Siglo XXI",55,{"$f":"IF(ISERROR(VLOOKUP(K135,Proposito_programa!$C$2:$E$59,2,FALSE)),\" \",VLOOKUP(K135,Proposito_programa!$C$2:$E$59,2,FALSE))","v":"Fortalecimiento de cultura ciudadana y su institucionalidad"},{"$f":"IF(ISERROR(VLOOKUP(K135,Proposito_programa!$C$2:$E$59,3,FALSE)),\" \",VLOOKUP(K135,Proposito_programa!$C$2:$E$59,3,FALSE))","v":"Propósito 5: Construir Bogotá - Región con gobierno abierto, transparente y ciudadanía consciente"},2190,1,1023898578,"LAURA ALEJANDRA AGUILAR CRUZ","Persona Natural",null,null,null,null,50820000,null,null,null,50820000,46200000,"2022-01-27","2022-02-01","2022-12-31",330,null,null,null,null,null,null,"En ejecución",0.90909090909090906]
[119,2022,"FDLANCD-119-2022(67695)","https://community.secop.gov.co/Public/Tendering/OpportunityDetail/Index?noticeUID=CO1.NTC.2763154&isFromPublicArea=True&isModal=False","Contratos de prestación de servicios profesionales y de apoyo a la gestión","Contratación directa","Prestación de servicios profesionales y de apoyo a la gestión, o para la ejecución de trabajos artísticos que sólo puedan encomendarse a determinadas personas naturales","PRESTAR SERVICIOS PROFESIONALES AL DESPACHO DEL ALCALDE LOCAL EN LA ORIENTACIÓN Y APLICACIÓN DE LA NORMATIVIDAD NACIONAL, DISTRITAL Y LOCAL, LA PROYECCIÓN DE ACTOS ADMINISTRATIVOS, RESPUESTAS A RECLAMACIONES, REQUERIMIENTOS Y DERECHOS DE PETICIÓN","Inversión","Un nuevo contrato social y ambiental para la Bogotá del Siglo XXI",57,{"$f":"IF(ISERROR(VLOOKUP(K136,Proposito_programa!$C$2:$E$59,2,FALSE)),\" \",VLOOKUP(K136,Proposito_programa!$C$2:$E$59,2,FALSE))","v":"Gestión pública local"},{"$f":"IF(ISERROR(VLOOKUP(K136,Proposito_programa!$C$2:$E$59,3,FALSE)),\" \",VLOOKUP(K136,Proposito_programa!$C$2:$E$59,3,FALSE))","v":"Propósito 5: Construir Bogotá - Región con gobierno abierto, transparente y ciudadanía consciente"},2198,1,1020773830,"ANDRES GUILLERMO LOPEZ RAMIREZ","Persona Natural",null,null,null,null,43200000,null,null,null,43200000,43200000,"2022-01-27","2022-02-01","2022-09-30",240,null,null,null,null,null,null,"En ejecución",1]
[120,2022,"FDLANCD-120-2022(68793)","https://community.secop.gov.co/Public/Tendering/OpportunityDetail/Index?noticeUID=CO1.NTC.2764705&isFromPublicArea=True&isModal=False","Contratos de prestación de servicios profesionales y de apoyo a la gestión","Contratación directa","Prestación de servicios profesionales y de apoyo a la gestión, o para la ejecución de trabajos artísticos que sólo puedan encomendarse a determinadas personas naturales","Prestación de servicios de apoyo para el Fondo de Desarrollo Local de Antonio Nariño para fortalecer el montaje y el buen desarrollo de las actividades culturales y artísticas que brindan a la comunidad en el Teatro Villa Mayor","Inversión","Un nuevo contrato social y ambiental para la Bogotá del Siglo XXI",57,{"$f":"IF(ISERROR(VLOOKUP(K137,Proposito_programa!$C$2:$E$59,2,FALSE)),\" \",VLOOKUP(K137,Proposito_programa!$C$2:$E$59,2,FALSE))","v":"Gestión pública local"},{"$f":"IF(ISERROR(VLOOKUP(K137,Proposito_programa!$C$2:$E$59,3,FALSE)),\" \",VLOOKUP(K137,Proposito_programa!$C$2:$E$59,3,FALSE))","v":"Propósito 5: Construir Bogotá - Región con gobierno abierto, transparente y ciudadanía consciente"},2198,1,1023891911,"MIGUEL FERNANDO HERNANDEZ CHICANGO","Persona Natural",null,null,null,null,16740000,null,null,null,16740000,16740000,"2022-01-27","2022-02-01","2022-07-31",180,null,null,null,null,null,null,"En ejecución",1]
[121,2022,"FDLANCD-121-2022(68245)","https://community.secop.gov.co/Public/Tendering/OpportunityDetail/Index?noticeUID=CO1.NTC.2763795&isFromPublicArea=True&isModal=False","Contratos de prestación de servicios profesionales y de apoyo a la gestión","Contratación directa","Prestación de servicios profesionales y de apoyo a la gestión, o para la ejecución de trabajos artísticos que sólo puedan encomendarse a determinadas personas naturales","Apoyar las labores de entrega y recibo de las comunicaciones emitidas o recibidas por las Inspecciones de Policía de la Localidad","Inversión","Un nuevo contrato social y ambiental para la Bogotá del Siglo XXI",57,{"$f":"IF(ISERROR(VLOOKUP(K138,Proposito_programa!$C$2:$E$59,2,FALSE)),\" \",VLOOKUP(K138,Proposito_programa!$C$2:$E$59,2,FALSE))","v":"Gestión pública local"},{"$f":"IF(ISERROR(VLOOKUP(K138,Proposito_programa!$C$2:$E$59,3,FALSE)),\" \",VLOOKUP(K138,Proposito_programa!$C$2:$E$59,3,FALSE))","v":"Propósito 5: Construir Bogotá - Región con gobierno abierto, transparente y ciudadanía consciente"},2189,1,1013646511,"ANGIE PAOLA BAYONA CONTRERAS","Persona Natural",null,null,null,null,11862000,null,null,null,{"$f":"+W138+X138+Z138","v":11862000},11862000,"2022-01-27","2022-02-01","2022-07-31",180,null,null,null,null,null,null,"En ejecución",1]
[122,2022,"FDLANCD-122-2022(69416)","https://community.secop.gov.co/Public/Tendering/OpportunityDetail/Index?noticeUID=CO1.NTC.2766544&isFromPublicArea=True&isModal=False","Contratos de prestación de servicios profesionales y de apoyo a la gestión","Contratación directa","Prestación de servicios profesionales y de apoyo a la gestión, o para la ejecución de trabajos artísticos que sólo puedan encomendarse a determinadas personas naturales","Apoyar la gestión documental de la Alcaldía Local en la implementación de los procesos de clasificación, ordenación, selección natural, foliación, identificación, levantamiento de inventarios, almacenamiento y aplicación de protocolos de eliminación y transferencias documentales","Inversión","Un nuevo contrato social y ambiental para la Bogotá del Siglo XXI",57,{"$f":"IF(ISERROR(VLOOKUP(K139,Proposito_programa!$C$2:$E$59,2,FALSE)),\" \",VLOOKUP(K139,Proposito_programa!$C$2:$E$59,2,FALSE))","v":"Gestión pública local"},{"$f":"IF(ISERROR(VLOOKUP(K139,Proposito_programa!$C$2:$E$59,3,FALSE)),\" \",VLOOKUP(K139,Proposito_programa!$C$2:$E$59,3,FALSE))","v":"Propósito 5: Construir Bogotá - Región con gobierno abierto, transparente y ciudadanía consciente"},2198,1,79558171,"JHON NEIL CORDOBA PARRA","Persona Natural",null,null,null,null,11160000,null,null,null,11160000,11160000,"2022-01-27","2022-02-01","2022-07-31",180,null,null,null,null,null,null,"En ejecución",1]
[123,2022,"FDLAN-CD-123-2022(68263)","https://community.secop.gov.co/Public/Tendering/OpportunityDetail/Index?noticeUID=CO1.NTC.2767917&isFromPublicArea=True&isModal=False","Contratos de prestación de servicios profesionales y de apoyo a la gestión","Contratación directa","Prestación de servicios profesionales y de apoyo a la gestión, o para la ejecución de trabajos artísticos que sólo puedan encomendarse a determinadas personas naturales","Prestación de servicios de apoyo a la gestión en las labores asistenciales del área de gestión policiva, para los distintos procedimientos sancionatorios y trámites administrativos que adelanta el equipo de inspección, vigilancia y control de la Alcaldía Local de Antonio Nariño","Inversión","Un nuevo contrato social y ambiental para la Bogotá del Siglo XXI",57,{"$f":"IF(ISERROR(VLOOKUP(K140,Proposito_programa!$C$2:$E$59,2,FALSE)),\" \",VLOOKUP(K140,Proposito_programa!$C$2:$E$59,2,FALSE))","v":"Gestión pública local"},{"$f":"IF(ISERROR(VLOOKUP(K140,Proposito_programa!$C$2:$E$59,3,FALSE)),\" \",VLOOKUP(K140,Proposito_programa!$C$2:$E$59,3,FALSE))","v":"Propósito 5: Construir Bogotá - Región con gobierno abierto, transparente y ciudadanía consciente"},2189,1,93399784,"JUAN CARLOS CASALLAS","Persona Natural",null,null,null,null,14760000,null,null,null,14760000,14514000,"2022-01-27","2022-02-02","2022-08-03",180,null,null,null,null,null,null,"En ejecución",0.98333333333333328]
[124,2022,"FDLANCD-124-2022(66818)","https://community.secop.gov.co/Public/Tendering/OpportunityDetail/Index?noticeUID=CO1.NTC.2770843&isFromPublicArea=True&isModal=False","Contratos de prestación de servicios profesionales y de apoyo a la gestión","Contratación directa","Prestación de servicios profesionales y de apoyo a la gestión, o para la ejecución de trabajos artísticos que sólo puedan encomendarse a determinadas personas naturales","Prestar servicios de apoyo a la gestión del fondo de desarrollo local de Antonio Nariño en los asuntos operativos relacionados con la seguridad, la convivencia y el desarrollo de actividad económica en la localidad, con conformidad con el marco normativo aplicable en la materia.","Inversión","Un nuevo contrato social y ambiental para la Bogotá del Siglo XXI",57,{"$f":"IF(ISERROR(VLOOKUP(K141,Proposito_programa!$C$2:$E$59,2,FALSE)),\" \",VLOOKUP(K141,Proposito_programa!$C$2:$E$59,2,FALSE))","v":"Gestión pública local"},{"$f":"IF(ISERROR(VLOOKUP(K141,Proposito_programa!$C$2:$E$59,3,FALSE)),\" \",VLOOKUP(K141,Proposito_programa!$C$2:$E$59,3,FALSE))","v":"Propósito 5: Construir Bogotá - Región con gobierno abierto, transparente y ciudadanía consciente"},2198,1,1000120198,"AARON SIERRA PARDO","Persona Natural",null,null,null,null,19680000,null,null,null,19680000,19680000,"2022-01-28","2022-02-01","2022-09-30",240,null,null,null,null,null,null,"En ejecución",1]
[125,2022,"FDLANCD-125-2022(68793)","https://community.secop.gov.co/Public/Tendering/OpportunityDetail/Index?noticeUID=CO1.NTC.2770550&isFromPublicArea=True&isModal=False","Contratos de prestación de servicios profesionales y de apoyo a la gestión","Contratación directa","Prestación de servicios profesionales y de apoyo a la gestión, o para la ejecución de trabajos artísticos que sólo puedan encomendarse a determinadas personas naturales","Prestación de servicios de apoyo para el Fondo de Desarrollo Local de Antonio Nariño para fortalecer el montaje y el buen desarrollo de las actividades culturales y artísticas que brindan a la comunidad en el Teatro Villa Mayor","Inversión","Un nuevo contrato social y ambiental para la Bogotá del Siglo XXI",57,{"$f":"IF(ISERROR(VLOOKUP(K142,Proposito_programa!$C$2:$E$59,2,FALSE)),\" \",VLOOKUP(K142,Proposito_programa!$C$2:$E$59,2,FALSE))","v":"Gestión pública local"},{"$f":"IF(ISERROR(VLOOKUP(K142,Proposito_programa!$C$2:$E$59,3,FALSE)),\" \",VLOOKUP(K142,Proposito_programa!$C$2:$E$59,3,FALSE))","v":"Propósito 5: Construir Bogotá - Región con gobierno abierto, transparente y ciudadanía consciente"},2198,1,1020724886,"MARTHA JIMENA RUBIANO CASTRO","Persona Natural",null,null,null,null,16740000,null,null,null,16740000,16740000,"2022-01-28","2022-02-01","2022-07-31",180,null,null,null,null,null,null,"En ejecución",1]
[126,2022,"FDLAN-CD-126-2022(68259)","https://community.secop.gov.co/Public/Tendering/OpportunityDetail/Index?noticeUID=CO1.NTC.2786710&isFromPublicArea=True&isModal=False","Contratos de prestación de servicios profesionales y de apoyo a la gestión","Contratación directa","Prestación de servicios profesionales y de apoyo a la gestión, o para la ejecución de trabajos artísticos que sólo puedan encomendarse a determinadas personas naturales","Prestar servicios de apoyo al Fondo de Desarrollo Local de Antonio Nariño en la implementación de estrategias que garanticen la promoción y protección del derecho a la participación democrática de los habitantes de la localidad Antonio Nariño.","Inversión","Un nuevo contrato social y ambiental para la Bogotá del Siglo XXI",55,{"$f":"IF(ISERROR(VLOOKUP(K143,Proposito_programa!$C$2:$E$59,2,FALSE)),\" \",VLOOKUP(K143,Proposito_programa!$C$2:$E$59,2,FALSE))","v":"Fortalecimiento de cultura ciudadana y su institucionalidad"},{"$f":"IF(ISERROR(VLOOKUP(K143,Proposito_programa!$C$2:$E$59,3,FALSE)),\" \",VLOOKUP(K143,Proposito_programa!$C$2:$E$59,3,FALSE))","v":"Propósito 5: Construir Bogotá - Región con gobierno abierto, transparente y ciudadanía consciente"},2190,1,19179939,"HECTOR HUGO CORTES LOZANO","Persona Natural",null,null,null,null,25560000,null,null,null,25560000,25560000,"2022-01-28","2022-02-01","2022-07-31",180,null,null,null,null,null,null,"En ejecución",1]
[127,2022,"FDLANCD-127-2022(68821)","https://community.secop.gov.co/Public/Tendering/OpportunityDetail/Index?noticeUID=CO1.NTC.2787556&isFromPublicArea=True&isModal=False","Contratos de prestación de servicios profesionales y de apoyo a la gestión","Contratación directa","Prestación de servicios profesionales y de apoyo a la gestión, o para la ejecución de trabajos artísticos que sólo puedan encomendarse a determinadas personas naturales","Apoyar en las tareas operativas de carácter archivístico desarrolladas en la Alcaldía Local para garantizar la aplicación correcta de los procedimientos técnicos.","Inversión","Un nuevo contrato social y ambiental para la Bogotá del Siglo XXI",57,{"$f":"IF(ISERROR(VLOOKUP(K144,Proposito_programa!$C$2:$E$59,2,FALSE)),\" \",VLOOKUP(K144,Proposito_programa!$C$2:$E$59,2,FALSE))","v":"Gestión pública local"},{"$f":"IF(ISERROR(VLOOKUP(K144,Proposito_programa!$C$2:$E$59,3,FALSE)),\" \",VLOOKUP(K144,Proposito_programa!$C$2:$E$59,3,FALSE))","v":"Propósito 5: Construir Bogotá - Región con gobierno abierto, transparente y ciudadanía consciente"},2198,1,52289797,"JAKELIN MENDEZ ORJUELA","Persona Natural",null,null,null,null,20160000,null,null,null,20160000,20160000,"2022-01-28","2022-02-01","2022-07-31",180,null,null,null,null,null,null,"En ejecución",1]
[128,2022,"FDLANCD-128-2022(69799)","https://community.secop.gov.co/Public/Tendering/OpportunityDetail/Index?noticeUID=CO1.NTC.2789460&isFromPublicArea=True&isModal=False","Contratos de prestación de servicios profesionales y de apoyo a la gestión","Contratación directa","Prestación de servicios profesionales y de apoyo a la gestión, o para la ejecución de trabajos artísticos que sólo puedan encomendarse a determinadas personas naturales","Prestar los servicios profesionales para apoyar el diseño de piezas gráficas, realización, dirección, producción y edición de material videográfico, manejo de redes y cubrimiento de eventos del Teatro Villa Mayor","Inversión","Un nuevo contrato social y ambiental para la Bogotá del Siglo XXI",57,{"$f":"IF(ISERROR(VLOOKUP(K145,Proposito_programa!$C$2:$E$59,2,FALSE)),\" \",VLOOKUP(K145,Proposito_programa!$C$2:$E$59,2,FALSE))","v":"Gestión pública local"},{"$f":"IF(ISERROR(VLOOKUP(K145,Proposito_programa!$C$2:$E$59,3,FALSE)),\" \",VLOOKUP(K145,Proposito_programa!$C$2:$E$59,3,FALSE))","v":"Propósito 5: Construir Bogotá - Región con gobierno abierto, transparente y ciudadanía consciente"},2198,1,1010216127,"RUBEN DARIO MONTAÑEZ AGUDELO","Persona Natural",null,null,null,null,27720000,null,null,null,27720000,27720000,"2022-01-28","2022-02-04","2022-08-05",180,null,null,1010216127,"RUBEN DARIO MONTAÑEZ AGUDELO","2022-02-15",27720000,"En ejecución",1]
[129,2022,"FDLANCD-129-2022(66712)","https://community.secop.gov.co/Public/Tendering/OpportunityDetail/Index?noticeUID=CO1.NTC.2789388&isFromPublicArea=True&isModal=False","Contratos de prestación de servicios profesionales y de apoyo a la gestión","Contratación directa","Prestación de servicios profesionales y de apoyo a la gestión, o para la ejecución de trabajos artísticos que sólo puedan encomendarse a determinadas personas naturales","Prestacion de servicios de apoyo como auxiliar administrativo en el Área de Gestion de Desarrollo Local, Administrativa y Financiera del Fondo de Desarrollo Local de Antonio Nariño","Inversión","Un nuevo contrato social y ambiental para la Bogotá del Siglo XXI",57,{"$f":"IF(ISERROR(VLOOKUP(K146,Proposito_programa!$C$2:$E$59,2,FALSE)),\" \",VLOOKUP(K146,Proposito_programa!$C$2:$E$59,2,FALSE))","v":"Gestión pública local"},{"$f":"IF(ISERROR(VLOOKUP(K146,Proposito_programa!$C$2:$E$59,3,FALSE)),\" \",VLOOKUP(K146,Proposito_programa!$C$2:$E$59,3,FALSE))","v":"Propósito 5: Construir Bogotá - Región con gobierno abierto, transparente y ciudadanía consciente"},2198,1,79910314,"MIGUEL ANGEL PRIETO ZAMUDIO","Persona Natural",null,null,null,null,14760000,null,null,null,14760000,14514000,"2022-01-28","2022-02-02","2022-07-31",180,null,null,79910314,"MIGUEL ANGEL PRIETO ZAMUDIO ","2022-03-01",14760000,"En ejecución",0.98333333333333328]
[130,2022,"FDLANCD-130-2022(69416)","https://community.secop.gov.co/Public/Tendering/OpportunityDetail/Index?noticeUID=CO1.NTC.2790852&isFromPublicArea=True&isModal=False","Contratos de prestación de servicios profesionales y de apoyo a la gestión","Contratación directa","Prestación de servicios profesionales y de apoyo a la gestión, o para la ejecución de trabajos artísticos que sólo puedan encomendarse a determinadas personas naturales","Apoyar la gestión documental de la Alcaldía Local en la implementación de los procesos de clasificación, ordenación, selección natural, foliación, identificación, levantamiento de inventarios, almacenamiento y aplicación de protocolos de eliminación y transferencias documentales","Inversión","Un nuevo contrato social y ambiental para la Bogotá del Siglo XXI",57,{"$f":"IF(ISERROR(VLOOKUP(K147,Proposito_programa!$C$2:$E$59,2,FALSE)),\" \",VLOOKUP(K147,Proposito_programa!$C$2:$E$59,2,FALSE))","v":"Gestión pública local"},{"$f":"IF(ISERROR(VLOOKUP(K147,Proposito_programa!$C$2:$E$59,3,FALSE)),\" \",VLOOKUP(K147,Proposito_programa!$C$2:$E$59,3,FALSE))","v":"Propósito 5: Construir Bogotá - Región con gobierno abierto, transparente y ciudadanía consciente"},2198,1,52015276,"AMPARO RAMIREZ CASTILLO","Persona Natural",null,null,null,null,11160000,null,null,null,11160000,11160000,"2022-01-28","2022-02-01","2022-07-31",180,null,null,null,null,null,null,"En ejecución",1]
[131,2022,"FDLANCD-131-2022(67741)","https://community.secop.gov.co/Public/Tendering/OpportunityDetail/Index?noticeUID=CO1.NTC.2794137&isFromPublicArea=True&isModal=False","Contratos de prestación de servicios profesionales y de apoyo a la gestión","Contratación directa","Prestación de servicios profesionales y de apoyo a la gestión, o para la ejecución de trabajos artísticos que sólo puedan encomendarse a determinadas personas naturales","Apoyar al equipo de prensa y comunicaciones de la Alcaldía Local en la realización y publicación de contenidos de redes sociales y canales de divulgación digital (sitio web) de la Alcaldía local.","Inversión","Un nuevo contrato social y ambiental para la Bogotá del Siglo XXI",57,{"$f":"IF(ISERROR(VLOOKUP(K148,Proposito_programa!$C$2:$E$59,2,FALSE)),\" \",VLOOKUP(K148,Proposito_programa!$C$2:$E$59,2,FALSE))","v":"Gestión pública local"},{"$f":"IF(ISERROR(VLOOKUP(K148,Proposito_programa!$C$2:$E$59,3,FALSE)),\" \",VLOOKUP(K148,Proposito_programa!$C$2:$E$59,3,FALSE))","v":"Propósito 5: Construir Bogotá - Región con gobierno abierto, transparente y ciudadanía consciente"},2198,1,1022367369,"NATHALIA VASQUEZ CARDENAS","Persona Natural",null,null,null,null,31032000,null,null,null,31032000,31032000,"2022-01-28","2022-02-04","2022-08-05",180,null,null,null,null,null,null,"En ejecución",{"$f":"IF(ISERROR(AB148/AA148),\"-\",(AB148/AA148))","v":1}]
[132,2022,"FDLANCD-132-2022(69416)","https://community.secop.gov.co/Public/Tendering/OpportunityDetail/Index?noticeUID=CO1.NTC.2792204&isFromPublicArea=True&isModal=False","Contratos de prestación de servicios profesionales y de apoyo a la gestión","Contratación directa","Prestación de servicios profesionales y de apoyo a la gestión, o para la ejecución de trabajos artísticos que sólo puedan encomendarse a determinadas personas naturales","Apoyar la gestión documental de la Alcaldía Local en la implementación de los procesos de clasificación, ordenación, selección natural, foliación, identificación, levantamiento de inventarios, almacenamiento y aplicación de protocolos de eliminación y transferencias documentales","Inversión","Un nuevo contrato social y ambiental para la Bogotá del Siglo XXI",57,{"$f":"IF(ISERROR(VLOOKUP(K149,Proposito_programa!$C$2:$E$59,2,FALSE)),\" \",VLOOKUP(K149,Proposito_programa!$C$2:$E$59,2,FALSE))","v":"Gestión pública local"},{"$f":"IF(ISERROR(VLOOKUP(K149,Proposito_programa!$C$2:$E$59,3,FALSE)),\" \",VLOOKUP(K149,Proposito_programa!$C$2:$E$59,3,FALSE))","v":"Propósito 5: Construir Bogotá - Región con gobierno abierto, transparente y ciudadanía consciente"},2198,1,39677722,"SILVIA MILENA NIETO","Persona Natural",null,null,null,null,11160000,null,null,null,11160000,11160000,"2022-01-28","2022-02-01","2022-07-31",180,null,null,null,null,null,null,"En ejecución",1]
[133,2022,"FDLANCD-133-2022 (68232)","https://community.secop.gov.co/Public/Tendering/OpportunityDetail/Index?noticeUID=CO1.NTC.2795362&isFromPublicArea=True&isModal=False","Contratos de prestación de servicios profesionales y de apoyo a la gestión","Contratación directa","Prestación de servicios profesionales y de apoyo a la gestión, o para la ejecución de trabajos artísticos que sólo puedan encomendarse a determinadas personas naturales","Apoyar administrativa y asistencialmente a las Inspecciones de Policía de la Localidad.","Inversión","Un nuevo contrato social y ambiental para la Bogotá del Siglo XXI",57,{"$f":"IF(ISERROR(VLOOKUP(K150,Proposito_programa!$C$2:$E$59,2,FALSE)),\" \",VLOOKUP(K150,Proposito_programa!$C$2:$E$59,2,FALSE))","v":"Gestión pública local"},{"$f":"IF(ISERROR(VLOOKUP(K150,Proposito_programa!$C$2:$E$59,3,FALSE)),\" \",VLOOKUP(K150,Proposito_programa!$C$2:$E$59,3,FALSE))","v":"Propósito 5: Construir Bogotá - Región con gobierno abierto, transparente y ciudadanía consciente"},2189,1,80206518,"EDWIN HARVEY GUTIERREZ LOZANO","Persona Natural",null,null,null,null,11286000,null,null,null,11286000,9405000,"2022-01-28","2022-02-01","2022-07-31",180,null,null,null,null,null,null,"En ejecución",0.83333333333333337]
[134,2022,"FDLAN-SAMC-001-2022","https://community.secop.gov.co/Public/Tendering/OpportunityDetail/Index?noticeUID=CO1.NTC.2851463&isFromPublicArea=True&isModal=False","Otros","Selección abreviada","Selección abreviada por menor cuantía ","PRESTACIÓN DEL SERVICIO DE VIGILANCIA Y SEGURIDAD PRIVADA PARA LA SEDE ADMINISTRATIVA DE LA ALCALDÍA LOCAL DE ANTONIO NARIÑO, EL TEATRO VILLA MAYOR Y EL SALÓN COMUNAL DE LA FRAGUA Y DE TODOS AQUELLOS DE LOS CUALES SEA O LLEGARE A SER LEGALMENTE RESPONSABLES","Funcionamiento","Un nuevo contrato social y ambiental para la Bogotá del Siglo XXI",null,{"$f":"IF(ISERROR(VLOOKUP(K151,Proposito_programa!$C$2:$E$59,2,FALSE)),\" \",VLOOKUP(K151,Proposito_programa!$C$2:$E$59,2,FALSE))","v":" "},{"$f":"IF(ISERROR(VLOOKUP(K151,Proposito_programa!$C$2:$E$59,3,FALSE)),\" \",VLOOKUP(K151,Proposito_programa!$C$2:$E$59,3,FALSE))","v":" "},5250,30,860526793,"PROTECCION VIGILANCIA SEGURIDAD EN REORGANIZACION","Persona Jurídica",null,null,null,null,264481261,null,1,43460282,307941543,232743513,"2022-03-15","2022-03-18","2022-11-30",250,null,null,null,null,null,null,"En ejecución",0.75580420469608411]
[135,2022,"FDLAN-CMA-001-2022","https://community.secop.gov.co/Public/Tendering/OpportunityDetail/Index?noticeUID=CO1.NTC.2864324&isFromPublicArea=True&isModal=False","Consultoría","Concurso de méritos","No aplica","CONTRATAR LOS SERVICIOS ESPECIALIZADOS DE INTERMEDIACIÓN DE SEGUROS Y ASESORÍA PARA LA FORMULACIÓN Y EL MANEJO DEL PROCESO DE SEGUROS, DESTINADOS A PROTEGER LAS PERSONAS, BIENES E INTERESES PATRIMONIALES DEL FONDO DE DESARROLLO LOCAL DE ANTONIO NARIÑO O AQUELLOS POR LOS QUE SEA LEGALMENTE RESPONSABLE","Funcionamiento","Un nuevo contrato social y ambiental para la Bogotá del Siglo XXI",null,{"$f":"IF(ISERROR(VLOOKUP(K152,Proposito_programa!$C$2:$E$59,2,FALSE)),\" \",VLOOKUP(K152,Proposito_programa!$C$2:$E$59,2,FALSE))","v":" "},{"$f":"IF(ISERROR(VLOOKUP(K152,Proposito_programa!$C$2:$E$59,3,FALSE)),\" \",VLOOKUP(K152,Proposito_programa!$C$2:$E$59,3,FALSE))","v":" "},0,4,900357596,"CAF ASESORES DE SEGUROS LTDA","Persona Jurídica",null,null,null,null,0,null,null,null,{"$f":"+W152+X152+Z152","v":0},0,"2022-03-25","2022-03-28","2023-03-27",365,null,null,null,null,null,null,"En ejecución","-"]
[136,2022,"FDLAN-MC-001-2022(71872)","https://community.secop.gov.co/Public/Tendering/OpportunityDetail/Index?noticeUID=CO1.NTC.2891206&isFromPublicArea=True&isModal=False","Otros","Contratación mínima cuantia","No aplica","CONTRATAR BAJO LA MODALIDAD DE PRECIOS UNITARIOS FIJOS A MONTO AGOTABLE Y SIN FÓRMULA DE REAJUSTE, LAS OBRAS REQUERIDAS PARA EL MANTENIMIENTO DEL TEATRO VILLA MAYOR UBICADO EN LA LOCALIDAD ANTONIO NARIÑO","Inversión","Un nuevo contrato social y ambiental para la Bogotá del Siglo XXI",21,{"$f":"IF(ISERROR(VLOOKUP(K153,Proposito_programa!$C$2:$E$59,2,FALSE)),\" \",VLOOKUP(K153,Proposito_programa!$C$2:$E$59,2,FALSE))","v":"Creación y vida cotidiana: Apropiación ciudadana del arte, la cultura y el patrimonio, para la democracia cultural"},{"$f":"IF(ISERROR(VLOOKUP(K153,Proposito_programa!$C$2:$E$59,3,FALSE)),\" \",VLOOKUP(K153,Proposito_programa!$C$2:$E$59,3,FALSE))","v":"Propósito 1: Hacer un nuevo contrato social para incrementar la inclusión social, productiva y política"},2201,4,901288767,"MAPPER CONSULTORA S.A.S.","Persona Jurídica",null,null,null,null,28000000,null,null,null,28000000,27999932,"2022-04-08","2022-04-25","2022-05-17",30,null,null,null,null,null,null,"En ejecución",0.99999757142857137]
[137,2022,"FDLAN-MC-002-2022 (71881)","https://community.secop.gov.co/Public/Tendering/OpportunityDetail/Index?noticeUID=CO1.NTC.2892922&isFromPublicArea=True&isModal=False","Contratos de prestación de servicios","Contratación mínima cuantia","No aplica","CONTRATAR EL SERVICIO DE OUTSOURCING DE MAQUINAS FOTOCOPIADORAS MULTIFUNCIONALES, INCLUIDO SU MANTENIMIENTO PREVENTIVO Y CORRECTIVO, SOPORTE TÉCNICO, REPUESTOS E INSUMOS REQUERIDOS POR LAS MISMAS Y DISPOSICIÓN FINAL DE LOS MISMOS, PARA SER INSTALADAS EN LAS DIFERENTES DEPENDENCIAS DE LA ALCALDÍA LOCAL DE ANTONIO NARIÑO, DE CONFORMIDAD CON LAS ESPECIFICACIONES TÉCNICAS","Funcionamiento","Un nuevo contrato social y ambiental para la Bogotá del Siglo XXI",null,{"$f":"IF(ISERROR(VLOOKUP(K154,Proposito_programa!$C$2:$E$59,2,FALSE)),\" \",VLOOKUP(K154,Proposito_programa!$C$2:$E$59,2,FALSE))","v":" "},{"$f":"IF(ISERROR(VLOOKUP(K154,Proposito_programa!$C$2:$E$59,3,FALSE)),\" \",VLOOKUP(K154,Proposito_programa!$C$2:$E$59,3,FALSE))","v":" "},5951,2,9004553145,"NEW COPIERS TECNOLOGY LTDA","Persona Jurídica",null,null,null,null,18659200,null,2,7285973,25945173,15993600,"2022-04-21","2022-06-26","2023-02-16",210,null,null,null,null,null,null,"En ejecución",0.61643836408413999]
[138,2022,"FDLAN-SAMC-002-2022","https://community.secop.gov.co/Public/Tendering/OpportunityDetail/Index?noticeUID=CO1.NTC.2910510&isFromPublicArea=True&isModal=False","Seguro","Selección abreviada","Selección abreviada por menor cuantía ","CONTRATAR LOS SEGUROS QUE AMPAREN LOS INTERESES PATRIMONIALES ACTUALES Y FUTUROS, ASÍ COMO LOS BIENES DE PROPIEDAD DEL FONDO DE DESARROLLO LOCAL DE ANTONIO NARIÑO, QUE ESTÉN BAJO SU RESPONSABILIDAD Y CUSTODIA Y AQUELLOS QUE SEAN ADQUIRIDOS PARA DESARROLLAR LAS FUNCIONES INHERENTES A SU ACTIVIDAD, ASÍ COMO LA EXPEDICIÓN DE UNA PÓLIZA COLECTIVA DE SEGURO DE VIDA PARA LOS EDILES DE LA LOCALIDAD Y CUALQUIER OTRA PÓLIZA DE SEGUROS QUE REQUIERA LA ENTIDAD EN EL DESARROLLO DE SU ACTIVIDAD","Funcionamiento","Un nuevo contrato social y ambiental para la Bogotá del Siglo XXI",null,{"$f":"IF(ISERROR(VLOOKUP(K155,Proposito_programa!$C$2:$E$59,2,FALSE)),\" \",VLOOKUP(K155,Proposito_programa!$C$2:$E$59,2,FALSE))","v":" "},{"$f":"IF(ISERROR(VLOOKUP(K155,Proposito_programa!$C$2:$E$59,3,FALSE)),\" \",VLOOKUP(K155,Proposito_programa!$C$2:$E$59,3,FALSE))","v":" "},1311,1,860002400,"LA PREVISORA S.A. COMPAÑIA DE SEGUROS","Persona Jurídica",null,null,null,null,56697033,null,2,13447834,70144867,56697033,"2022-05-02","2022-05-04","2022-12-07",216,null,null,null,null,null,null,"En ejecución",0.80828484570367776]
[139,2022,"FDLAN-SAMC-003-2022 (71831)","https://community.secop.gov.co/Public/Tendering/OpportunityDetail/Index?noticeUID=CO1.NTC.2946702&isFromPublicArea=True&isModal=False","Obra pública","Selección abreviada","Selección abreviada por menor cuantía ","CONTRATAR BAJO LA MODALIDAD DE PRECIOS UNITARIOS FIJOS A MONTO AGOTABLE Y SIN FÓRMULA DE REAJUSTE, LAS OBRAS REQUERIDAS PARA EL MANTENIMIENTO Y CONSERVACIÓN DE SALONES COMUNALES UBICADOS EN LA LOCALIDAD ANTONIO NARIÑO","Inversión","Un nuevo contrato social y ambiental para la Bogotá del Siglo XXI",55,{"$f":"IF(ISERROR(VLOOKUP(K156,Proposito_programa!$C$2:$E$59,2,FALSE)),\" \",VLOOKUP(K156,Proposito_programa!$C$2:$E$59,2,FALSE))","v":"Fortalecimiento de cultura ciudadana y su institucionalidad"},{"$f":"IF(ISERROR(VLOOKUP(K156,Proposito_programa!$C$2:$E$59,3,FALSE)),\" \",VLOOKUP(K156,Proposito_programa!$C$2:$E$59,3,FALSE))","v":"Propósito 5: Construir Bogotá - Región con gobierno abierto, transparente y ciudadanía consciente"},2190,5,901288767,"MAPPER CONSULTORA S.A.S.","Persona Jurídica",null,null,null,null,161380000,null,null,null,161380000,130349050,"2022-06-07","2022-08-29","2022-10-28",60,null,null,null,null,null,null,"En ejecución",0.80771502044863053]
[140,2022,"FDLAN-MC-003-2022 (72846)","https://community.secop.gov.co/Public/Tendering/OpportunityDetail/Index?noticeUID=CO1.NTC.2991257&isFromPublicArea=True&isModal=False","Compraventa de bienes muebles","Contratación mínima cuantia","No aplica","ADQUISICIÓN DE INSUMOS A MONTO AGOTABLE, NECESARIOS PARA SEPARACIÓN EN LA FUENTE Y RECICLAJE, EN CUMPLIMIENTO DEL PROYECTO 2210 ACCIONES QUE FOMENTAN EL CAMBIO DE HÁBITOS Y MEJORAMIENTO DE LAS CONDICIONES AMBIENTALES EN LA LOCALIDAD DE ANTONIO.","Inversión","Un nuevo contrato social y ambiental para la Bogotá del Siglo XXI",38,{"$f":"IF(ISERROR(VLOOKUP(K157,Proposito_programa!$C$2:$E$59,2,FALSE)),\" \",VLOOKUP(K157,Proposito_programa!$C$2:$E$59,2,FALSE))","v":"Ecoeficiencia, reciclaje, manejo de residuos e inclusión de la población recicladora"},{"$f":"IF(ISERROR(VLOOKUP(K157,Proposito_programa!$C$2:$E$59,3,FALSE)),\" \",VLOOKUP(K157,Proposito_programa!$C$2:$E$59,3,FALSE))","v":"Propósito 2 : Cambiar Nuestros Hábitos de Vida para Reverdecer a Bogotá y Adaptarnos y Mitigar la Crisis Climática"},2210,5,900975944,"FEC SUMINISTROS Y SERVICIOS SAS","Persona Jurídica",null,null,null,null,26930000,null,null,null,26930000,0,"2022-06-07","2022-08-08","2022-11-05",30,null,null,null,null,null,null,"En ejecución",0]
[141,2022,"FDLAN-CD-141-2022(73901)","https://community.secop.gov.co/Public/Tendering/OpportunityDetail/Index?noticeUID=CO1.NTC.3031006&isFromPublicArea=True&isModal=False","Contratos de prestación de servicios profesionales y de apoyo a la gestión","Contratación directa","Prestación de servicios profesionales y de apoyo a la gestión, o para la ejecución de trabajos artísticos que sólo puedan encomendarse a determinadas personas naturales","PRESTAR SERVICIOS PROFESIONALES DE APOYO EN LOS PROCESOS ADMINISTRATIVOS, CONTABLES Y FINANCIEROS EN EL FONDO DE DESARROLLO LOCAL DE ANTONIO NARIÑO EN EL MARCO DE LAS NORMAS DE DERECHO CONTABLE, DE SEGURIDAD SOCIAL Y LOS PROCEDIMIENTOS VIGENTES","Inversión","Un nuevo contrato social y ambiental para la Bogotá del Siglo XXI",57,{"$f":"IF(ISERROR(VLOOKUP(K158,Proposito_programa!$C$2:$E$59,2,FALSE)),\" \",VLOOKUP(K158,Proposito_programa!$C$2:$E$59,2,FALSE))","v":"Gestión pública local"},{"$f":"IF(ISERROR(VLOOKUP(K158,Proposito_programa!$C$2:$E$59,3,FALSE)),\" \",VLOOKUP(K158,Proposito_programa!$C$2:$E$59,3,FALSE))","v":"Propósito 5: Construir Bogotá - Región con gobierno abierto, transparente y ciudadanía consciente"},2198,1,1022342284,"YULY ANDREA SOLANO GUERRERO","Persona Natural",null,null,null,null,27000000,null,1,5940000,32940000,24840000,"2022-07-12","2022-07-13","2023-01-15",150,null,null,null,null,null,null,"En ejecución",0.75409836065573765]
[142,2022,"FDLAN-CD-142-2022(73957)","https://community.secop.gov.co/Public/Tendering/OpportunityDetail/Index?noticeUID=CO1.NTC.3031764&isFromPublicArea=True&isModal=False","Contratos de prestación de servicios profesionales y de apoyo a la gestión","Contratación directa","Prestación de servicios profesionales y de apoyo a la gestión, o para la ejecución de trabajos artísticos que sólo puedan encomendarse a determinadas personas naturales","PRESTACIÓN DE SERVICIOS DE APOYO EN EL MANEJO DE SISTEMAS DE INFORMACIÓN EN LO RELACIONADO CON LA CONTRATACIÓN QUE REALIZA EL ÁREA DE GESTIÓN DE DESARROLLO DEL FONDO DE DESARROLLO LOCAL DE ANTONIO NARIÑO.","Inversión","Un nuevo contrato social y ambiental para la Bogotá del Siglo XXI",57,{"$f":"IF(ISERROR(VLOOKUP(K159,Proposito_programa!$C$2:$E$59,2,FALSE)),\" \",VLOOKUP(K159,Proposito_programa!$C$2:$E$59,2,FALSE))","v":"Gestión pública local"},{"$f":"IF(ISERROR(VLOOKUP(K159,Proposito_programa!$C$2:$E$59,3,FALSE)),\" \",VLOOKUP(K159,Proposito_programa!$C$2:$E$59,3,FALSE))","v":"Propósito 5: Construir Bogotá - Región con gobierno abierto, transparente y ciudadanía consciente"},2198,1,80793701,"JAIME ERNESTO ALARCON LOPEZ","Persona Natural",null,null,null,null,12300000,null,null,null,12300000,11234000,"2022-07-13","2022-07-14","2022-12-13",150,null,null,null,null,null,null,"En ejecución",0.91333333333333333]
[143,2022,"FDLAN-CD-143-2022-CPS-P (73784)","https://community.secop.gov.co/Public/Tendering/OpportunityDetail/Index?noticeUID=CO1.NTC.3036988&isFromPublicArea=True&isModal=False","Contratos de prestación de servicios profesionales y de apoyo a la gestión","Contratación directa","Prestación de servicios profesionales y de apoyo a la gestión, o para la ejecución de trabajos artísticos que sólo puedan encomendarse a determinadas personas naturales","PRESTACIÓN DE SERVICIOS PROFESIONALES COMO ABOGADO PARA APOYAR LA ESTRUCTURACIÓN, SEGUIMIENTO Y CONTROL DE PROCESOS CONTRACTUALES QUE DERIVEN DEL PROYECTO DE INVERSIÓN 2201 CONFORME A LAS ACCIONES DE FOMENTO Y PROMOCIÓN DE ACTIVIDADES ARTÍSTICAS, INTERCULTURALES, CULTURALES Y/O PATRIMONIALES DE LA LOCALIDAD DE ANTONIO NARIÑO","Inversión","Un nuevo contrato social y ambiental para la Bogotá del Siglo XXI",21,{"$f":"IF(ISERROR(VLOOKUP(K160,Proposito_programa!$C$2:$E$59,2,FALSE)),\" \",VLOOKUP(K160,Proposito_programa!$C$2:$E$59,2,FALSE))","v":"Creación y vida cotidiana: Apropiación ciudadana del arte, la cultura y el patrimonio, para la democracia cultural"},{"$f":"IF(ISERROR(VLOOKUP(K160,Proposito_programa!$C$2:$E$59,3,FALSE)),\" \",VLOOKUP(K160,Proposito_programa!$C$2:$E$59,3,FALSE))","v":"Propósito 1: Hacer un nuevo contrato social para incrementar la inclusión social, productiva y política"},2201,1,79696837,"EDWIN GUILLERMO MOLINA CARDONA","Persona Natural",null,null,null,null,27000000,null,1,2880000,29880000,24480000,"2022-07-14","2022-07-15","2022-12-30",150,1,16,null,null,null,null,"En ejecución",0.81927710843373491]
[144,2022,"FDLANCD-144-2022-CPS(73903)","https://community.secop.gov.co/Public/Tendering/OpportunityDetail/Index?noticeUID=CO1.NTC.3037323&isFromPublicArea=True&isModal=False","Contratos de prestación de servicios profesionales y de apoyo a la gestión","Contratación directa","Prestación de servicios profesionales y de apoyo a la gestión, o para la ejecución de trabajos artísticos que sólo puedan encomendarse a determinadas personas naturales","APOYAR AL EQUIPO DE PRENSA Y COMUNICACIONES DE LA ALCALDÍA LOCAL EN LA REALIZACIÓN DE PRODUCTOS Y PIEZAS DIGITALES, IMPRESAS Y PUBLICITARIAS DE GRAN FORMATO Y DE ANIMACIÓN GRÁFICA, ASÍ COMO APOYAR LA PRODUCCIÓN Y MONTAJE DE EVENTOS","Inversión","Un nuevo contrato social y ambiental para la Bogotá del Siglo XXI",57,{"$f":"IF(ISERROR(VLOOKUP(K161,Proposito_programa!$C$2:$E$59,2,FALSE)),\" \",VLOOKUP(K161,Proposito_programa!$C$2:$E$59,2,FALSE))","v":"Gestión pública local"},{"$f":"IF(ISERROR(VLOOKUP(K161,Proposito_programa!$C$2:$E$59,3,FALSE)),\" \",VLOOKUP(K161,Proposito_programa!$C$2:$E$59,3,FALSE))","v":"Propósito 5: Construir Bogotá - Región con gobierno abierto, transparente y ciudadanía consciente"},2198,1,1018456962,"JUAN CAMILO MONTENEGRO SANCHEZ ","Persona Natural",null,null,null,null,23100000,null,null,2464000,{"$f":"+W161+X161+Z161","v":25564000},20944000,"2022-07-14","2022-07-15","2022-12-30",150,1,16,null,null,null,null,"En ejecución",0.81927710843373491]
[145,2022,"FDLANCD-145-2022 (73854)","https://community.secop.gov.co/Public/Tendering/OpportunityDetail/Index?noticeUID=CO1.NTC.3040659&isFromPublicArea=True&isModal=False","Contratos de prestación de servicios profesionales y de apoyo a la gestión","Contratación directa","Prestación de servicios profesionales y de apoyo a la gestión, o para la ejecución de trabajos artísticos que sólo puedan encomendarse a determinadas personas naturales","PRESTACIÓN DE SERVICIOS PROFESIONALES COMO APOYO EN LA FORMULACIÓN, SEGUIMIENTO, SUPERVISIÓN Y LIQUIDACIÓN DE PROYECTOS DE OBRA E INFRAESTRUCTURA RELACIONADOS CON MALLA VIAL Y ESPACIO PÚBLICO EN LA LOCALIDAD ANTONIO NARIÑO.","Inversión","Un nuevo contrato social y ambiental para la Bogotá del Siglo XXI",49,{"$f":"IF(ISERROR(VLOOKUP(K162,Proposito_programa!$C$2:$E$59,2,FALSE)),\" \",VLOOKUP(K162,Proposito_programa!$C$2:$E$59,2,FALSE))","v":"Movilidad segura, sostenible y accesible"},{"$f":"IF(ISERROR(VLOOKUP(K162,Proposito_programa!$C$2:$E$59,3,FALSE)),\" \",VLOOKUP(K162,Proposito_programa!$C$2:$E$59,3,FALSE))","v":"Propósito 4: Hacer de Bogotá Región un modelo de movilidad multimodal, incluyente y sostenible"},2186,1,1074133645,"MANUEL EDUARDO ALVAREZ VANEGAS","Persona Natural",null,null,null,null,32400000,null,1,3200000,{"$f":"+W162+X162+Z162","v":35600000},26600000,"2022-07-15","2022-07-18","2022-12-29",162,1,16,null,null,null,null,"En ejecución",0.7471910112359551]
[146,2022,"FDLANCD-146-2022 (73868)","https://community.secop.gov.co/Public/Tendering/OpportunityDetail/Index?noticeUID=CO1.NTC.3042277&isFromPublicArea=True&isModal=False","Contratos de prestación de servicios profesionales y de apoyo a la gestión","Contratación directa","Prestación de servicios profesionales y de apoyo a la gestión, o para la ejecución de trabajos artísticos que sólo puedan encomendarse a determinadas personas naturales","PRESTACIÓN DE SERVICIOS PROFESIONALES AL ÁREA DE GESTIÓN DE DESARROLLO LOCAL ANTONIO NARIÑO PARA APOYAR LA FORMULACIÓN, SOCIALIZACIÓN Y SEGUIMIENTO DE LOS PROGRAMAS Y PROYECTOS DE INVERSIÓN, RELACIONADOS CON LA INFRAESTRUCTURA DEL FONDO, NECESARIOS PARA EL CUMPLIMIENTO DEL PLAN DE DESARROLLO LOCAL.","Inversión","Un nuevo contrato social y ambiental para la Bogotá del Siglo XXI",33,{"$f":"IF(ISERROR(VLOOKUP(K163,Proposito_programa!$C$2:$E$59,2,FALSE)),\" \",VLOOKUP(K163,Proposito_programa!$C$2:$E$59,2,FALSE))","v":"Más árboles y más y mejor espacio público"},{"$f":"IF(ISERROR(VLOOKUP(K163,Proposito_programa!$C$2:$E$59,3,FALSE)),\" \",VLOOKUP(K163,Proposito_programa!$C$2:$E$59,3,FALSE))","v":"Propósito 2 : Cambiar Nuestros Hábitos de Vida para Reverdecer a Bogotá y Adaptarnos y Mitigar la Crisis Climática"},2207,1,19272504,"CESAR AUGUSTO LARA RUGELES","Persona Natural",null,null,null,null,23870000,null,null,null,{"$f":"+W163+X163+Z163","v":23870000},20482000,"2022-07-15","2022-07-18","2022-12-22",155,null,null,null,null,null,null,"En ejecución",0.85806451612903223]
[147,2022,"FDLANCD-147-2022 (73802)","https://community.secop.gov.co/Public/Tendering/OpportunityDetail/Index?noticeUID=CO1.NTC.3046713&isFromPublicArea=True&isModal=False","Contratos de prestación de servicios profesionales y de apoyo a la gestión","Contratación directa","Prestación de servicios profesionales y de apoyo a la gestión, o para la ejecución de trabajos artísticos que sólo puedan encomendarse a determinadas personas naturales","PRESTACIÓN DE SERVICIOS PROFESIONALES COMO ABOGADO PARA APOYAR LA ESTRUCTURACIÓN, SEGUIMIENTO Y CONTROL DE PROCESOS CONTRACTUALES QUE DERIVEN DEL PROYECTO DE INVERSIÓN 2191 CONFORME A LAS ACCIONES INTEGRALES PARA LA PRODUCTIVIDAD Y EMPRENDIMIENTO DEL FONDO DE DESARROLLO LOCAL DE ANTONIO NARIÑO.","Inversión","Un nuevo contrato social y ambiental para la Bogotá del Siglo XXI",6,{"$f":"IF(ISERROR(VLOOKUP(K164,Proposito_programa!$C$2:$E$59,2,FALSE)),\" \",VLOOKUP(K164,Proposito_programa!$C$2:$E$59,2,FALSE))","v":"Sistema Distrital de Cuidado"},{"$f":"IF(ISERROR(VLOOKUP(K164,Proposito_programa!$C$2:$E$59,3,FALSE)),\" \",VLOOKUP(K164,Proposito_programa!$C$2:$E$59,3,FALSE))","v":"Propósito 1: Hacer un nuevo contrato social para incrementar la inclusión social, productiva y política"},2191,1,1094906434,"SANTIAGO DUQUE TABARES","Persona Natural",null,null,null,null,27000000,null,1,1620000,{"$f":"+W164+X164+Z164","v":28620000},7020000,"2022-07-19","2022-07-22","2022-12-30",150,1,25,1128447239," LUDWING FABIAN ABRIL GRANADOS","2022-11-28","$ 27.000.000","En ejecución",0.24528301886792453]
[148,2022,"FDLAN-CD-148-2022(73806)","https://community.secop.gov.co/Public/Tendering/OpportunityDetail/Index?noticeUID=CO1.NTC.3047816&isFromPublicArea=True&isModal=False","Contratos de prestación de servicios profesionales y de apoyo a la gestión","Contratación directa","Prestación de servicios profesionales y de apoyo a la gestión, o para la ejecución de trabajos artísticos que sólo puedan encomendarse a determinadas personas naturales","PRESTACIÓN DE SERVICIOS PROFESIONALES COMO ABOGADO PARA APOYAR LA ESTRUCTURACIÓN, SEGUIMIENTO Y CONTROL DE PROCESOS CONTRACTUALES QUE DERIVEN DEL PROYECTO DE INVERSIÓN 2200 CONFORME A LAS ACCIONES DE FOMENTO Y PROMOCIÓN DE ACTIVIDADES EN EL CAMPO DEPORTIVO DEL FONDO DE DESARROLLO LOCAL DE ANTONIO NARIÑO","Inversión","Un nuevo contrato social y ambiental para la Bogotá del Siglo XXI",20,{"$f":"IF(ISERROR(VLOOKUP(K165,Proposito_programa!$C$2:$E$59,2,FALSE)),\" \",VLOOKUP(K165,Proposito_programa!$C$2:$E$59,2,FALSE))","v":"Bogotá, referente en cultura, deporte, recreación y actividad física, con parques para el desarrollo y la salud"},{"$f":"IF(ISERROR(VLOOKUP(K165,Proposito_programa!$C$2:$E$59,3,FALSE)),\" \",VLOOKUP(K165,Proposito_programa!$C$2:$E$59,3,FALSE))","v":"Propósito 1: Hacer un nuevo contrato social para incrementar la inclusión social, productiva y política"},2200,1,1019002889,"EFREY ARMANDO SANABRIA MORENO","Persona Natural",null,null,null,null,27000000,null,null,null,{"$f":"+W165+X165+Z165","v":27000000},23760000,"2022-07-18","2022-07-19","2022-12-18",150,null,null,null,null,null,null,"En ejecución",0.88]
[149,2022,"FDLAN-CD-149-2022(73906)","https://community.secop.gov.co/Public/Tendering/OpportunityDetail/Index?noticeUID=CO1.NTC.3049131&isFromPublicArea=True&isModal=False","Contratos de prestación de servicios profesionales y de apoyo a la gestión","Contratación directa","Prestación de servicios profesionales y de apoyo a la gestión, o para la ejecución de trabajos artísticos que sólo puedan encomendarse a determinadas personas naturales","PRESTAR LOS SERVICIOS PROFESIONALES COMO ADMINISTRADOR DE RED BRINDANDO ASISTENCIA Y SOPORTE TÉCNICO DE LA INFRAESTRUCTURA TECNOLÓGICA DE LA ALCALDÍA LOCAL, ASÍ COMO A LOS USUARIOS QUE DESARROLLEN SUS ACTIVIDADES EN LAS ÁREAS DE LA ALCALDÍA LOCAL Y JUNTA ADMINISTRADORA LOCAL.","Inversión","Un nuevo contrato social y ambiental para la Bogotá del Siglo XXI",57,{"$f":"IF(ISERROR(VLOOKUP(K166,Proposito_programa!$C$2:$E$59,2,FALSE)),\" \",VLOOKUP(K166,Proposito_programa!$C$2:$E$59,2,FALSE))","v":"Gestión pública local"},{"$f":"IF(ISERROR(VLOOKUP(K166,Proposito_programa!$C$2:$E$59,3,FALSE)),\" \",VLOOKUP(K166,Proposito_programa!$C$2:$E$59,3,FALSE))","v":"Propósito 5: Construir Bogotá - Región con gobierno abierto, transparente y ciudadanía consciente"},2198,1,79890568,"ABEL ERNESTO CASTIBLANCO DURAN","Persona Natural",null,null,null,null,27000000,null,1,4680000,{"$f":"+W166+X166+Z166","v":31680000},23400000,"2022-07-18","2022-07-21","2023-01-15",150,1,26,null,null,null,null,"En ejecución",0.73863636363636365]
[150,2022,"FDLAN-CD-150-2022-CPS-AG- (73904)","https://community.secop.gov.co/Public/Tendering/OpportunityDetail/Index?noticeUID=CO1.NTC.3051417&isFromPublicArea=True&isModal=False","Contratos de prestación de servicios profesionales y de apoyo a la gestión","Contratación directa","Prestación de servicios profesionales y de apoyo a la gestión, o para la ejecución de trabajos artísticos que sólo puedan encomendarse a determinadas personas naturales","PRESTACIÓN DE SERVICIOS DE APOYO A LAS ACTIVIDADES ADMINISTRATIVAS EN CUANTO A NOTIFICACIÓN DE LA CORRESPONDENCIA GENERADA POR EL ÁREA DE GESTIÓN DEL DESARROLLO, ADMINISTRATIVA Y FINANCIERA Y ÁREA DE GESTIÓN POLICIVA DE LA ALCALDÍA DE ANTONIO NARIÑO","Inversión","Un nuevo contrato social y ambiental para la Bogotá del Siglo XXI",57,{"$f":"IF(ISERROR(VLOOKUP(K167,Proposito_programa!$C$2:$E$59,2,FALSE)),\" \",VLOOKUP(K167,Proposito_programa!$C$2:$E$59,2,FALSE))","v":"Gestión pública local"},{"$f":"IF(ISERROR(VLOOKUP(K167,Proposito_programa!$C$2:$E$59,3,FALSE)),\" \",VLOOKUP(K167,Proposito_programa!$C$2:$E$59,3,FALSE))","v":"Propósito 5: Construir Bogotá - Región con gobierno abierto, transparente y ciudadanía consciente"},2198,1,79469325,"EVERARDO YARA ","Persona Natural",null,null,null,null,13500000,null,null,null,13500000,11700000,"2022-07-19","2022-07-21","2022-12-20",150,null,null,null,null,null,null,"En ejecución",0.8666666666666667]
[151,2022,"FDLANCD-151-2022(73956)","https://community.secop.gov.co/Public/Tendering/OpportunityDetail/Index?noticeUID=CO1.NTC.3053054&isFromPublicArea=True&isModal=False","Contratos de prestación de servicios profesionales y de apoyo a la gestión","Contratación directa","Prestación de servicios profesionales y de apoyo a la gestión, o para la ejecución de trabajos artísticos que sólo puedan encomendarse a determinadas personas naturales","APOYAR AL ALCALDE LOCAL EN LA GESTIÓN DE LOS ASUNTOS RELACIONADOS CON SEGURIDAD CIUDADANA, CONVIVENCIA Y PREVENCIÓN DE CONFLICTIVIDADES, VIOLENCIAS Y DELITOS EN LA LOCALIDAD, DE CONFORMIDAD CON EL MARCO NORMATIVO APLICABLE EN LA MATERIA","Inversión","Un nuevo contrato social y ambiental para la Bogotá del Siglo XXI",57,{"$f":"IF(ISERROR(VLOOKUP(K168,Proposito_programa!$C$2:$E$59,2,FALSE)),\" \",VLOOKUP(K168,Proposito_programa!$C$2:$E$59,2,FALSE))","v":"Gestión pública local"},{"$f":"IF(ISERROR(VLOOKUP(K168,Proposito_programa!$C$2:$E$59,3,FALSE)),\" \",VLOOKUP(K168,Proposito_programa!$C$2:$E$59,3,FALSE))","v":"Propósito 5: Construir Bogotá - Región con gobierno abierto, transparente y ciudadanía consciente"},2198,1,1055226889,"JUAN DAVID CUERVO ZORRO","Persona Natural",null,null,null,null,27000000,null,1,4500000,{"$f":"+W168+X168+Z168","v":31500000},0,"2022-07-20","2022-07-22","2023-01-15",150,1,25,null,null,null,null,"En ejecución",0]
[152,2022,"FDLANCD-152-2022","https://community.secop.gov.co/Public/Tendering/OpportunityDetail/Index?noticeUID=CO1.NTC.3055964&isFromPublicArea=True&isModal=False","Contratos de prestación de servicios profesionales y de apoyo a la gestión","Contratación directa","Prestación de servicios profesionales y de apoyo a la gestión, o para la ejecución de trabajos artísticos que sólo puedan encomendarse a determinadas personas naturales","PRESTACIÓN DE SERVICIOS DE APOYO A LA GESTIÓN AL DESPACHO DEL ALCALDE LOCAL DE ANTONIO NARIÑO EN EL MANEJO DE LOS DISTINTOS ASUNTOS Y TRAMITES ASOCIADOS CON LA GESTIÓN ADMINISTRATIVA LOCAL","Inversión","Un nuevo contrato social y ambiental para la Bogotá del Siglo XXI",57,{"$f":"IF(ISERROR(VLOOKUP(K169,Proposito_programa!$C$2:$E$59,2,FALSE)),\" \",VLOOKUP(K169,Proposito_programa!$C$2:$E$59,2,FALSE))","v":"Gestión pública local"},{"$f":"IF(ISERROR(VLOOKUP(K169,Proposito_programa!$C$2:$E$59,3,FALSE)),\" \",VLOOKUP(K169,Proposito_programa!$C$2:$E$59,3,FALSE))","v":"Propósito 5: Construir Bogotá - Región con gobierno abierto, transparente y ciudadanía consciente"},2198,1,1053869262,"MARIA DANIELA MONTERO DIAZ","Persona Natural",null,null,null,null,5740000,null,null,null,5740000,5740000,"2022-07-21","2022-07-22","2022-12-21",150,null,null,null,null,null,null,"En ejecución",1]
[153,2022,"FDLANCD-153-2022 (73902)","https://community.secop.gov.co/Public/Tendering/OpportunityDetail/Index?noticeUID=CO1.NTC.3053021&isFromPublicArea=True&isModal=False","Contratos de prestación de servicios profesionales y de apoyo a la gestión","Contratación directa","Prestación de servicios profesionales y de apoyo a la gestión, o para la ejecución de trabajos artísticos que sólo puedan encomendarse a determinadas personas naturales","PRESTACIÓN DE SERVICIOS DE APOYO EN LA EJECUCIÓN DE ACTIVIDADES ADMINISTRATIVAS Y OPERATIVAS ADELANTADAS EN LA JUNTA ADMINISTRADORA LOCAL DE ANTONIO NARIÑO.","Inversión","Un nuevo contrato social y ambiental para la Bogotá del Siglo XXI",57,{"$f":"IF(ISERROR(VLOOKUP(K170,Proposito_programa!$C$2:$E$59,2,FALSE)),\" \",VLOOKUP(K170,Proposito_programa!$C$2:$E$59,2,FALSE))","v":"Gestión pública local"},{"$f":"IF(ISERROR(VLOOKUP(K170,Proposito_programa!$C$2:$E$59,3,FALSE)),\" \",VLOOKUP(K170,Proposito_programa!$C$2:$E$59,3,FALSE))","v":"Propósito 5: Construir Bogotá - Región con gobierno abierto, transparente y ciudadanía consciente"},2198,1,1013643851,"PAULA ANDREA PEDRAZA QUIÑONES","Persona Natural",null,null,null,null,12300000,null,null,null,12300000,10660000,"2022-07-19","2022-07-21","2022-12-20",150,null,null,null,null,null,null,"En ejecución",0.8666666666666667]
[154,2022,"FDLANCD-154-2022 (73848)","https://community.secop.gov.co/Public/Tendering/OpportunityDetail/Index?noticeUID=CO1.NTC.3052668&isFromPublicArea=True&isModal=False","Contratos de prestación de servicios profesionales y de apoyo a la gestión","Contratación directa","Prestación de servicios profesionales y de apoyo a la gestión, o para la ejecución de trabajos artísticos que sólo puedan encomendarse a determinadas personas naturales","PRESTAR LOS SERVICIOS DE APOYO COMO TÉCNICO ADMINISTRATIVO EN EL ÁREA DE GESTIÓN DE DESARROLLO DEL FONDO DE DESARROLLO LOCAL DE ANTONIO NARIÑO PARA LOS DIFERENTES ASUNTOS CONTRACTUALES QUE ADELANTA LA ENTIDAD.","Inversión","Un nuevo contrato social y ambiental para la Bogotá del Siglo XXI",57,{"$f":"IF(ISERROR(VLOOKUP(K171,Proposito_programa!$C$2:$E$59,2,FALSE)),\" \",VLOOKUP(K171,Proposito_programa!$C$2:$E$59,2,FALSE))","v":"Gestión pública local"},{"$f":"IF(ISERROR(VLOOKUP(K171,Proposito_programa!$C$2:$E$59,3,FALSE)),\" \",VLOOKUP(K171,Proposito_programa!$C$2:$E$59,3,FALSE))","v":"Propósito 5: Construir Bogotá - Región con gobierno abierto, transparente y ciudadanía consciente"},2198,1,1019113136,"LUZ ADRIANA SANCHEZ VELANDIA","Persona Natural",null,null,null,null,13950000,null,1,2418000,{"$f":"+W171+X171+Z171","v":16368000},12090000,"2022-07-19","2022-07-21","2023-01-15",150,1,26,null,null,null,null,"En ejecución",0.73863636363636365]
[155,2022,"FDLAN-CD-155-2022 (73907)","https://community.secop.gov.co/Public/Tendering/OpportunityDetail/Index?noticeUID=CO1.NTC.3057326&isFromPublicArea=True&isModal=False","Contratos de prestación de servicios profesionales y de apoyo a la gestión","Contratación directa","Prestación de servicios profesionales y de apoyo a la gestión, o para la ejecución de trabajos artísticos que sólo puedan encomendarse a determinadas personas naturales","PRESTAR LOS SERVICIOS PROFESIONALES PARA LA OPERACIÓN, PRESTACIÓN, SEGUIMIENTO Y CUMPLIMIENTO DE LOS PROCEDIMIENTOS ADMINISTRATIVOS, OPERATIVOS Y PROGRAMÁTICOS DEL SERVICIO APOYO ECONÓMICO TIPO C, QUE CONTRIBUYAN A LA GARANTÍA DE LOS DERECHOS DE LA POBLACIÓN MAYOR EN EL MARCO DE LA POLÍTICA PÚBLICA SOCIAL PARA EL ENVEJECIMIENTO Y LA VEJEZ EN EL DISTRITO CAPITAL A CARGO DE LA ALCALDÍA LOCAL DE ANTONIO NARIÑO","Inversión","Un nuevo contrato social y ambiental para la Bogotá del Siglo XXI",1,{"$f":"IF(ISERROR(VLOOKUP(K172,Proposito_programa!$C$2:$E$59,2,FALSE)),\" \",VLOOKUP(K172,Proposito_programa!$C$2:$E$59,2,FALSE))","v":"Subsidios y transferencias para la equidad"},{"$f":"IF(ISERROR(VLOOKUP(K172,Proposito_programa!$C$2:$E$59,3,FALSE)),\" \",VLOOKUP(K172,Proposito_programa!$C$2:$E$59,3,FALSE))","v":"Propósito 1: Hacer un nuevo contrato social para incrementar la inclusión social, productiva y política"},1851,1,423466,"SUSANA PATRICIA ENRIQUEZ UGALDE","Persona Natural",null,null,null,null,27000000,null,null,null,27000000,22680000,"2022-07-21","2022-07-25","2022-12-24",150,null,null,null,null,null,null,"En ejecución",0.84]
[156,2022,"FDLAN-CD-156-2022-CPS-P(73909)","https://community.secop.gov.co/Public/Tendering/OpportunityDetail/Index?noticeUID=CO1.NTC.3055391&isFromPublicArea=True&isModal=False","Contratos de prestación de servicios profesionales y de apoyo a la gestión","Contratación directa","Prestación de servicios profesionales y de apoyo a la gestión, o para la ejecución de trabajos artísticos que sólo puedan encomendarse a determinadas personas naturales","APOYAR TÉCNICAMENTE A LOS RESPONSABLES E INTEGRANTES DE LOS PROCESOS EN LA IMPLEMENTACIÓN DE HERRAMIENTAS DE GESTIÓN, SIGUIENDO LOS LINEAMIENTOS METODOLÓGICOS ESTABLECIDOS POR LA OFICINA ASESORA DE PLANEACIÓN DE LA SECRETARÍA DISTRITAL DE GOBIERNO","Inversión","Un nuevo contrato social y ambiental para la Bogotá del Siglo XXI",57,{"$f":"IF(ISERROR(VLOOKUP(K173,Proposito_programa!$C$2:$E$59,2,FALSE)),\" \",VLOOKUP(K173,Proposito_programa!$C$2:$E$59,2,FALSE))","v":"Gestión pública local"},{"$f":"IF(ISERROR(VLOOKUP(K173,Proposito_programa!$C$2:$E$59,3,FALSE)),\" \",VLOOKUP(K173,Proposito_programa!$C$2:$E$59,3,FALSE))","v":"Propósito 5: Construir Bogotá - Región con gobierno abierto, transparente y ciudadanía consciente"},2198,1,52951852,"ANGELA FERNANDA DIAZ TORRES","Persona Natural",null,null,null,null,27000000,null,null,null,27000000,22680000,"2022-07-21","2022-07-25","2022-12-24",150,null,null,null,null,null,null,"En ejecución",0.84]
[157,2022,"FDLAN-CD-157-2022-CPS-P (74094)","https://community.secop.gov.co/Public/Tendering/OpportunityDetail/Index?noticeUID=CO1.NTC.3059956&isFromPublicArea=True&isModal=False","Contratos de prestación de servicios profesionales y de apoyo a la gestión","Contratación directa","Prestación de servicios profesionales y de apoyo a la gestión, o para la ejecución de trabajos artísticos que sólo puedan encomendarse a determinadas personas naturales","PRESTAR SERVICIOS PROFESIONALES, PARA APOYAR LA FORMULACIÓN, EJECUCIÓN, SUPERVISIÓN, SEGUIMIENTO CIERRE Y/O LIQUIDACIÓN DE LOS PROCESOS CONTRACTUALES QUE DEN RESPUESTA AL PROYECTO DE INVERSIÓN DE ACCIONES PARA ESTABLECER ACUERDOS CIUDADANOS DE LA LOCALIDAD DE ANTONIO NARIÑO.","Inversión","Un nuevo contrato social y ambiental para la Bogotá del Siglo XXI",45,{"$f":"IF(ISERROR(VLOOKUP(K174,Proposito_programa!$C$2:$E$59,2,FALSE)),\" \",VLOOKUP(K174,Proposito_programa!$C$2:$E$59,2,FALSE))","v":"Espacio público más seguro y construido colectivamente"},{"$f":"IF(ISERROR(VLOOKUP(K174,Proposito_programa!$C$2:$E$59,3,FALSE)),\" \",VLOOKUP(K174,Proposito_programa!$C$2:$E$59,3,FALSE))","v":"Propósito 3: Inspirar confianza y legitimidad para vivir sin miedo y ser epicentro de cultura ciudadana, paz y reconciliación"},2183,1,52854610,"JOHANNA MARCELA TARAZONA TARAZONA","Persona Natural",null,null,null,null,23100000,null,null,null,23100000,19404000,"2022-07-22","2022-07-25","2022-12-24",150,null,null,1093784129,"DIEGO ALEJANDRO OSORIO ARTEAGA","2022-10-13",23100000,"En ejecución",0.84]
[158,2022,"FDLANCD-158-2022 (73848)","https://community.secop.gov.co/Public/Tendering/OpportunityDetail/Index?noticeUID=CO1.NTC.3059270&isFromPublicArea=True&isModal=False","Contratos de prestación de servicios profesionales y de apoyo a la gestión","Contratación directa","Prestación de servicios profesionales y de apoyo a la gestión, o para la ejecución de trabajos artísticos que sólo puedan encomendarse a determinadas personas naturales","PRESTAR LOS SERVICIOS DE APOYO COMO TÉCNICO ADMINISTRATIVO EN EL ÁREA DE GESTIÓN DE DESARROLLO DEL FONDO DE DESARROLLO LOCAL DE ANTONIO NARIÑO PARA LOS DIFERENTES ASUNTOS CONTRACTUALES QUE ADELANTA LA ENTIDAD.","Inversión","Un nuevo contrato social y ambiental para la Bogotá del Siglo XXI",57,{"$f":"IF(ISERROR(VLOOKUP(K175,Proposito_programa!$C$2:$E$59,2,FALSE)),\" \",VLOOKUP(K175,Proposito_programa!$C$2:$E$59,2,FALSE))","v":"Gestión pública local"},{"$f":"IF(ISERROR(VLOOKUP(K175,Proposito_programa!$C$2:$E$59,3,FALSE)),\" \",VLOOKUP(K175,Proposito_programa!$C$2:$E$59,3,FALSE))","v":"Propósito 5: Construir Bogotá - Región con gobierno abierto, transparente y ciudadanía consciente"},2198,1,52352104,"ANA ISABEL BEJARANO BABATIVA","Persona Natural",null,null,null,null,13950000,null,null,null,13950000,11625000,"2022-07-22","2022-07-26","2022-12-24",150,null,null,null,null,null,null,"En ejecución",0.83333333333333337]
[159,2022,"FDLAN-CD-159-2022-CPS-P (74344)","https://community.secop.gov.co/Public/Tendering/OpportunityDetail/Index?noticeUID=CO1.NTC.3060935&isFromPublicArea=True&isModal=False","Contratos de prestación de servicios profesionales y de apoyo a la gestión","Contratación directa","Prestación de servicios profesionales y de apoyo a la gestión, o para la ejecución de trabajos artísticos que sólo puedan encomendarse a determinadas personas naturales","COORDINA, LIDERA Y ASESORA LOS PLANES Y ESTRATEGIAS DE COMUNICACIÓN INTERNA Y EXTERNA PARA LA DIVULGACIÓN DE LOS PROGRAMAS, PROYECTOS Y ACTIVIDADES DE LA ALCALDÍA LOCAL.","Inversión","Un nuevo contrato social y ambiental para la Bogotá del Siglo XXI",57,{"$f":"IF(ISERROR(VLOOKUP(K176,Proposito_programa!$C$2:$E$59,2,FALSE)),\" \",VLOOKUP(K176,Proposito_programa!$C$2:$E$59,2,FALSE))","v":"Gestión pública local"},{"$f":"IF(ISERROR(VLOOKUP(K176,Proposito_programa!$C$2:$E$59,3,FALSE)),\" \",VLOOKUP(K176,Proposito_programa!$C$2:$E$59,3,FALSE))","v":"Propósito 5: Construir Bogotá - Región con gobierno abierto, transparente y ciudadanía consciente"},2198,1,83161135,"CARLOS ANDRES HIGUITA VARGAS","Persona Natural",null,null,null,null,21060000,null,null,null,21060000,21060000,"2022-07-22","2022-07-25","2022-10-24",90,null,null,null,null,null,null,"En ejecución",1]
[160,2022,"FDLAN-CD-160-2022(74026)","https://community.secop.gov.co/Public/Tendering/OpportunityDetail/Index?noticeUID=CO1.NTC.3061806&isFromPublicArea=True&isModal=False","Contratos de prestación de servicios profesionales y de apoyo a la gestión","Contratación directa","Prestación de servicios profesionales y de apoyo a la gestión, o para la ejecución de trabajos artísticos que sólo puedan encomendarse a determinadas personas naturales","PRESTAR SERVICIOS DE APOYO A LAS LABORES DE CARÁCTER OPERACIONAL Y/O ADMINISTRATIVAS QUE SE ADELANTEN EN EL ÁREA DE GESTIÓN DE DESARROLLO LOCAL EN EL MARCO DEL DESARROLLO DE LOS PROYECTOS DE INFRAESTRUCTURA DE LA LOCALIDAD DE ANTONIO NARIÑO.","Inversión","Un nuevo contrato social y ambiental para la Bogotá del Siglo XXI",33,{"$f":"IF(ISERROR(VLOOKUP(K177,Proposito_programa!$C$2:$E$59,2,FALSE)),\" \",VLOOKUP(K177,Proposito_programa!$C$2:$E$59,2,FALSE))","v":"Más árboles y más y mejor espacio público"},{"$f":"IF(ISERROR(VLOOKUP(K177,Proposito_programa!$C$2:$E$59,3,FALSE)),\" \",VLOOKUP(K177,Proposito_programa!$C$2:$E$59,3,FALSE))","v":"Propósito 2 : Cambiar Nuestros Hábitos de Vida para Reverdecer a Bogotá y Adaptarnos y Mitigar la Crisis Climática"},2207,1,1013633122,"JAIME PRIETO RUIZ ","Persona Natural",null,null,null,null,9610000,null,null,null,9610000,7750000,"2022-07-26","2022-07-26","2022-12-30",155,null,null,null,null,null,null,"En ejecución",0.80645161290322576]
[161,2022,"FDLANCD-161-2022(73791)","https://community.secop.gov.co/Public/Tendering/OpportunityDetail/Index?noticeUID=CO1.NTC.3065757&isFromPublicArea=True&isModal=False","Contratos de prestación de servicios profesionales y de apoyo a la gestión","Contratación directa","Prestación de servicios profesionales y de apoyo a la gestión, o para la ejecución de trabajos artísticos que sólo puedan encomendarse a determinadas personas naturales","EL CONTRATO QUE SE PRETENDE CELEBRAR, TENDRÁ POR OBJETO PRESTACIÓN DE SERVICIOS PROFESIONALES COMO ABOGADO PARA APOYAR LA ESTRUCTURACIÓN, SEGUIMIENTO Y CONTROL DE PROCESOS CONTRACTUALES QUE DERIVEN DEL PROYECTO DE INVERSIÓN 2048 CONFORME A LAS ACCIONES DE PROMOCIÓN PARA LA EDUCACIÓN DE LA LOCALIDAD DE ANTONIO NARIÑO.","Inversión","Un nuevo contrato social y ambiental para la Bogotá del Siglo XXI",17,{"$f":"IF(ISERROR(VLOOKUP(K178,Proposito_programa!$C$2:$E$59,2,FALSE)),\" \",VLOOKUP(K178,Proposito_programa!$C$2:$E$59,2,FALSE))","v":"Jóvenes con capacidades: Proyecto de vida para la ciudadanía, la innovación y el trabajo del siglo XXI"},{"$f":"IF(ISERROR(VLOOKUP(K178,Proposito_programa!$C$2:$E$59,3,FALSE)),\" \",VLOOKUP(K178,Proposito_programa!$C$2:$E$59,3,FALSE))","v":"Propósito 1: Hacer un nuevo contrato social para incrementar la inclusión social, productiva y política"},2048,1,1026289089,"ADRIANA KATHERIN AVILA TORRES","Persona Natural",null,null,null,null,27000000,null,null,null,27000000,22500000,"2022-07-25","2022-07-26","2022-12-25",150,null,null,1015447288,"ADRIANA KATHERIN AVILA TORRES","2022-08-31",27720000,"En ejecución",0.83333333333333337]
[162,2022,"FDLANCD-162-2022 (73868)","https://community.secop.gov.co/Public/Tendering/OpportunityDetail/Index?noticeUID=CO1.NTC.3065918&isFromPublicArea=True&isModal=False","Contratos de prestación de servicios profesionales y de apoyo a la gestión","Contratación directa","Prestación de servicios profesionales y de apoyo a la gestión, o para la ejecución de trabajos artísticos que sólo puedan encomendarse a determinadas personas naturales","PRESTACIÓN DE SERVICIOS PROFESIONALES AL ÁREA DE GESTIÓN DE DESARROLLO LOCAL ANTONIO NARIÑO PARA APOYAR LA FORMULACIÓN, SOCIALIZACIÓN Y SEGUIMIENTO DE LOS PROGRAMAS Y PROYECTOS DE INVERSIÓN, RELACIONADOS CON LA INFRAESTRUCTURA DEL FONDO, NECESARIOS PARA EL CUMPLIMIENTO DEL PLAN DE DESARROLLO LOCAL.","Inversión","Un nuevo contrato social y ambiental para la Bogotá del Siglo XXI",33,{"$f":"IF(ISERROR(VLOOKUP(K179,Proposito_programa!$C$2:$E$59,2,FALSE)),\" \",VLOOKUP(K179,Proposito_programa!$C$2:$E$59,2,FALSE))","v":"Más árboles y más y mejor espacio público"},{"$f":"IF(ISERROR(VLOOKUP(K179,Proposito_programa!$C$2:$E$59,3,FALSE)),\" \",VLOOKUP(K179,Proposito_programa!$C$2:$E$59,3,FALSE))","v":"Propósito 2 : Cambiar Nuestros Hábitos de Vida para Reverdecer a Bogotá y Adaptarnos y Mitigar la Crisis Climática"},2207,1,1015471920,"VALENTINA ROCHA VEGA ","Persona Natural",null,null,null,null,23870000,null,null,null,23870000,19250000,"2022-07-25","2022-07-26","2022-12-30",155,null,null,null,null,null,null,"En ejecución",0.80645161290322576]
[163,2022,"FDLAN-CD-163-2022(73908)","https://community.secop.gov.co/Public/Tendering/OpportunityDetail/Index?noticeUID=CO1.NTC.3066193&isFromPublicArea=True&isModal=False","Contratos de prestación de servicios profesionales y de apoyo a la gestión","Contratación directa","Prestación de servicios profesionales y de apoyo a la gestión, o para la ejecución de trabajos artísticos que sólo puedan encomendarse a determinadas personas naturales","PRESTACIÓN DE SERVICIOS DE APOYO A LA GESTIÓN PARA LA CONDUCCIÓN DE LOS VEHÍCULOS QUE CONFORMAN EL PARQUE AUTOMOTOR EN PROPIEDAD O CUSTODIA DEL FONDO DE DESARROLLO LOCAL DE ANTONIO NARIÑO, Y EL TRANSPORTE DE FUNCIONARIOS Y CONTRATISTAS PARA LA REALIZACIÓN DE LAS ACTIVIDADES MISIONALES DE LA ALCALDÍA LOCAL DE ANTONIO NARIÑO.","Inversión","Un nuevo contrato social y ambiental para la Bogotá del Siglo XXI",57,{"$f":"IF(ISERROR(VLOOKUP(K180,Proposito_programa!$C$2:$E$59,2,FALSE)),\" \",VLOOKUP(K180,Proposito_programa!$C$2:$E$59,2,FALSE))","v":"Gestión pública local"},{"$f":"IF(ISERROR(VLOOKUP(K180,Proposito_programa!$C$2:$E$59,3,FALSE)),\" \",VLOOKUP(K180,Proposito_programa!$C$2:$E$59,3,FALSE))","v":"Propósito 5: Construir Bogotá - Región con gobierno abierto, transparente y ciudadanía consciente"},2198,1,79392568,"HECTOR GIOVANNY AYALA RODRIGUEZ","Persona Natural",null,null,null,null,12300000,null,null,null,12300000,10250000,"2022-07-25","2022-07-26","2022-12-25",150,null,null,null,null,null,null,"En ejecución",0.83333333333333337]
[164,2022,"FDLAN-SAMC-004-2022","https://community.secop.gov.co/Public/Tendering/OpportunityDetail/Index?noticeUID=CO1.NTC.3014210&isFromPublicArea=True&isModal=False","Contratos de prestación de servicios","Selección abreviada","Selección abreviada por menor cuantía ","PRESTACIÓN DE SERVICIOS PARA LA PREVENCIÓN DEL EMBARAZO ADOLESCENTE Y LA DISMINUCIÓN EN LOS FACTORES DE RIESGO FRENTE AL CONSUMO DE SUSTANCIAS PSICOACTIVAS EN LA LOCALIDAD DE ANTONIO NARIÑO","Inversión","Un nuevo contrato social y ambiental para la Bogotá del Siglo XXI",6,{"$f":"IF(ISERROR(VLOOKUP(K181,Proposito_programa!$C$2:$E$59,2,FALSE)),\" \",VLOOKUP(K181,Proposito_programa!$C$2:$E$59,2,FALSE))","v":"Sistema Distrital de Cuidado"},{"$f":"IF(ISERROR(VLOOKUP(K181,Proposito_programa!$C$2:$E$59,3,FALSE)),\" \",VLOOKUP(K181,Proposito_programa!$C$2:$E$59,3,FALSE))","v":"Propósito 1: Hacer un nuevo contrato social para incrementar la inclusión social, productiva y política"},2194,4,901233617,"CORPORACION INTEGRAL PARA EL DESARROLLO DE LAS REGIONES- CONDERE","Persona Jurídica",null,null,null,null,23953537,null,null,null,23953537,16306369,"2022-07-22","2022-08-22","2022-11-21",90,null,null,null,null,null,null,"En ejecución",0.68074994519598508]
[164,2022,"FDLAN-SAMC-004-2022","https://community.secop.gov.co/Public/Tendering/OpportunityDetail/Index?noticeUID=CO1.NTC.3014210&isFromPublicArea=True&isModal=False","Contratos de prestación de servicios","Selección abreviada","Selección abreviada por menor cuantía ","PRESTACIÓN DE SERVICIOS PARA LA PREVENCIÓN DEL EMBARAZO ADOLESCENTE Y LA DISMINUCIÓN EN LOS FACTORES DE RIESGO FRENTE AL CONSUMO DE SUSTANCIAS PSICOACTIVAS EN LA LOCALIDAD DE ANTONIO NARIÑO","Inversión","Un nuevo contrato social y ambiental para la Bogotá del Siglo XXI",8,{"$f":"IF(ISERROR(VLOOKUP(K182,Proposito_programa!$C$2:$E$59,2,FALSE)),\" \",VLOOKUP(K182,Proposito_programa!$C$2:$E$59,2,FALSE))","v":"Prevención y atención de maternidad temprana"},{"$f":"IF(ISERROR(VLOOKUP(K182,Proposito_programa!$C$2:$E$59,3,FALSE)),\" \",VLOOKUP(K182,Proposito_programa!$C$2:$E$59,3,FALSE))","v":"Propósito 1: Hacer un nuevo contrato social para incrementar la inclusión social, productiva y política"},2195,1,null,null,null,null,null,null,null,22636092,null,null,null,{"$f":"+W182+X182+Z182","v":22636092},16306371,"2022-07-22","2022-08-22","2022-11-21",90,null,null,null,null,null,null,"En ejecución",{"$f":"IF(ISERROR(AB182/AA182),\"-\",(AB182/AA182))","v":0.72037041552932368}]
[165,2022,"FDLANCD-165-2022(74074)","https://community.secop.gov.co/Public/Tendering/OpportunityDetail/Index?noticeUID=CO1.NTC.3100091&isFromPublicArea=True&isModal=False","Contratos de prestación de servicios profesionales y de apoyo a la gestión","Contratación directa","Prestación de servicios profesionales y de apoyo a la gestión, o para la ejecución de trabajos artísticos que sólo puedan encomendarse a determinadas personas naturales","prestar los servicios técnicos para la operación, seguimiento y cumplimiento de los procesos y procedimientos del servicio social apoyo económico tipo c, requeridos para el oportuno y adecuado registro, cruce y reporte de los datos del sistema de información y registro de beneficiarios-sirbe, que contribuyan a la garantía de los derechos de la población mayor en el marco de la política pública social para envejecimiento y la vejez en el distrito capital a cargo de la alcaldía local","Inversión","Un nuevo contrato social y ambiental para la Bogotá del Siglo XXI",1,{"$f":"IF(ISERROR(VLOOKUP(K183,Proposito_programa!$C$2:$E$59,2,FALSE)),\" \",VLOOKUP(K183,Proposito_programa!$C$2:$E$59,2,FALSE))","v":"Subsidios y transferencias para la equidad"},{"$f":"IF(ISERROR(VLOOKUP(K183,Proposito_programa!$C$2:$E$59,3,FALSE)),\" \",VLOOKUP(K183,Proposito_programa!$C$2:$E$59,3,FALSE))","v":"Propósito 1: Hacer un nuevo contrato social para incrementar la inclusión social, productiva y política"},1851,1,1013690740,"SEBASTIAN EDUARDO BRAVO ZAFRA","Persona Natural",null,null,null,null,16800000,null,null,null,16800000,13216000,"2022-08-02","2022-08-03","2022-12-31",148,null,null,null,null,null,null,"En ejecución",0.78666666666666663]
[166,2022,"FDLANCD-166-2022 (73957)","https://community.secop.gov.co/Public/Tendering/OpportunityDetail/Index?noticeUID=CO1.NTC.3071793&isFromPublicArea=True&isModal=False","Contratos de prestación de servicios profesionales y de apoyo a la gestión","Contratación directa","Prestación de servicios profesionales y de apoyo a la gestión, o para la ejecución de trabajos artísticos que sólo puedan encomendarse a determinadas personas naturales","PRESTACIÓN DE SERVICIOS DE APOYO EN EL MANEJO DE SISTEMAS DE INFORMACIÓN EN LO RELACIONADO CON LA CONTRATACIÓN QUE REALIZA EL ÁREA DE GESTIÓN DE DESARROLLO DEL FONDO DE DESARROLLO LOCAL DE ANTONIO NARIÑO","Inversión","Un nuevo contrato social y ambiental para la Bogotá del Siglo XXI",57,{"$f":"IF(ISERROR(VLOOKUP(K184,Proposito_programa!$C$2:$E$59,2,FALSE)),\" \",VLOOKUP(K184,Proposito_programa!$C$2:$E$59,2,FALSE))","v":"Gestión pública local"},{"$f":"IF(ISERROR(VLOOKUP(K184,Proposito_programa!$C$2:$E$59,3,FALSE)),\" \",VLOOKUP(K184,Proposito_programa!$C$2:$E$59,3,FALSE))","v":"Propósito 5: Construir Bogotá - Región con gobierno abierto, transparente y ciudadanía consciente"},2198,1,1010203444,"MARIA ALEJANDRA CASTRILLON CORREDOR ","Persona Natural",null,null,null,null,12300000,null,null,null,12300000,10168000,"2022-07-26","2022-07-27","2022-12-26",150,null,null,null,null,null,null,"En ejecución",0.82666666666666666]
[167,2022,"FDLANCD-167-2022 (74171","https://community.secop.gov.co/Public/Tendering/OpportunityDetail/Index?noticeUID=CO1.NTC.3072759&isFromPublicArea=True&isModal=False","Contratos de prestación de servicios profesionales y de apoyo a la gestión","Contratación directa","Prestación de servicios profesionales y de apoyo a la gestión, o para la ejecución de trabajos artísticos que sólo puedan encomendarse a determinadas personas naturales","PRESTAR SERVICIOS PROFESIONALES, PARA APOYAR LA FORMULACIÓN, EJECUCIÓN, SUPERVISIÓN, SEGUIMIENTO CIERRE Y/O LIQUIDACIÓN DE LOS PROCESOS CONTRACTUALES QUE DEN RESPUESTA AL PROYECTO DE INVERSIÓN RELACIONADO CON ACCIONES DE PROMOCIÓN PARA LA EDUCACIÓN SUPERIOR DE LA LOCALIDAD DE ANTONIO NARIÑO.","Inversión","Un nuevo contrato social y ambiental para la Bogotá del Siglo XXI",17,{"$f":"IF(ISERROR(VLOOKUP(K185,Proposito_programa!$C$2:$E$59,2,FALSE)),\" \",VLOOKUP(K185,Proposito_programa!$C$2:$E$59,2,FALSE))","v":"Jóvenes con capacidades: Proyecto de vida para la ciudadanía, la innovación y el trabajo del siglo XXI"},{"$f":"IF(ISERROR(VLOOKUP(K185,Proposito_programa!$C$2:$E$59,3,FALSE)),\" \",VLOOKUP(K185,Proposito_programa!$C$2:$E$59,3,FALSE))","v":"Propósito 1: Hacer un nuevo contrato social para incrementar la inclusión social, productiva y política"},2048,1,1012399674,"GINA LIZETH SERNA GARCIA ","Persona Natural",null,null,null,null,23100000,null,null,null,23100000,19096000,"2022-07-26","2022-07-27","2022-12-26",150,null,null,null,null,null,null,"En ejecución",0.82666666666666666]
[168,2022,"FDLAN-CD-168-2022(73908)","https://community.secop.gov.co/Public/Tendering/OpportunityDetail/Index?noticeUID=CO1.NTC.3082631&isFromPublicArea=True&isModal=False","Contratos de prestación de servicios profesionales y de apoyo a la gestión","Contratación directa","Prestación de servicios profesionales y de apoyo a la gestión, o para la ejecución de trabajos artísticos que sólo puedan encomendarse a determinadas personas naturales","PRESTACIÓN DE SERVICIOS DE APOYO A LA GESTIÓN PARA LA CONDUCCIÓN DE LOS VEHÍCULOS QUE CONFORMAN EL PARQUE AUTOMOTOR EN PROPIEDAD O CUSTODIA DEL FONDO DE DESARROLLO LOCAL DE ANTONIO NARIÑO, Y EL TRANSPORTE DE FUNCIONARIOS Y CONTRATISTAS PARA LA REALIZACIÓN DE LAS ACTIVIDADES MISIONALES DE LA ALCALDÍA LOCAL DE ANTONIO NARIÑO.","Inversión","Un nuevo contrato social y ambiental para la Bogotá del Siglo XXI",57,{"$f":"IF(ISERROR(VLOOKUP(K186,Proposito_programa!$C$2:$E$59,2,FALSE)),\" \",VLOOKUP(K186,Proposito_programa!$C$2:$E$59,2,FALSE))","v":"Gestión pública local"},{"$f":"IF(ISERROR(VLOOKUP(K186,Proposito_programa!$C$2:$E$59,3,FALSE)),\" \",VLOOKUP(K186,Proposito_programa!$C$2:$E$59,3,FALSE))","v":"Propósito 5: Construir Bogotá - Región con gobierno abierto, transparente y ciudadanía consciente"},2198,1,93410082,"JOHN JAIRO CASTILLO BUSTOS","Persona Natural",null,null,null,null,9840000,null,null,null,9840000,9758000,"2022-07-29","2022-08-02","2022-12-31",150,null,null,null,null,null,null,"En ejecución",0.9916666666666667]
[169,2022,"FDLAN-CD-169-2022(73905)","https://community.secop.gov.co/Public/Tendering/OpportunityDetail/Index?noticeUID=CO1.NTC.3076636&isFromPublicArea=True&isModal=False","Contratos de prestación de servicios profesionales y de apoyo a la gestión","Contratación directa","Prestación de servicios profesionales y de apoyo a la gestión, o para la ejecución de trabajos artísticos que sólo puedan encomendarse a determinadas personas naturales","PRESTACIÓN DE SERVICIOS DE APOYO ASISTENCIAL EN EL ÁREA DE GESTIÓN DEL DESARROLLO, ADMINISTRATIVA Y FINANCIERA DEL FONDO DE DESARROLLO LOCAL DE ANTONIO NARIÑO.","Inversión","Un nuevo contrato social y ambiental para la Bogotá del Siglo XXI",57,{"$f":"IF(ISERROR(VLOOKUP(K187,Proposito_programa!$C$2:$E$59,2,FALSE)),\" \",VLOOKUP(K187,Proposito_programa!$C$2:$E$59,2,FALSE))","v":"Gestión pública local"},{"$f":"IF(ISERROR(VLOOKUP(K187,Proposito_programa!$C$2:$E$59,3,FALSE)),\" \",VLOOKUP(K187,Proposito_programa!$C$2:$E$59,3,FALSE))","v":"Propósito 5: Construir Bogotá - Región con gobierno abierto, transparente y ciudadanía consciente"},2198,1,1023875489,"JORGE DIEGO ALBERTO VEGA","Persona Natural",null,null,null,null,9300000,null,null,null,9300000,7564000,"2022-07-27","2022-07-29","2022-12-27",150,null,null,null,null,null,null,"En ejecución",0.81333333333333335]
[170,2022,"FDLAN-LP-001-2022","https://community.secop.gov.co/Public/Tendering/OpportunityDetail/Index?noticeUID=CO1.NTC.2974610&isFromPublicArea=True&isModal=False","Obra pública","Licitación pública","No aplica","\"REALIZAR A TRAVES DEL SISTEMA DE PRECIOS UNITARIOS FIJOS Y A MONTO AGOTABLE, LAS ACTIVIDADES DE CONSERVACIÓN DE LA MALLA VIAL Y DEL ESPACIO PÚBLICO PRIORIZADOS POR EL FONDO DE DESARROLLO LOCAL DE ANTONIO NARIÑO PARA EL CUMPLIMIENTO DE LAS METAS DEFINIDAS EN LA VIGENCIA 2022","Inversión","Un nuevo contrato social y ambiental para la Bogotá del Siglo XXI",49,{"$f":"IF(ISERROR(VLOOKUP(K188,Proposito_programa!$C$2:$E$59,2,FALSE)),\" \",VLOOKUP(K188,Proposito_programa!$C$2:$E$59,2,FALSE))","v":"Movilidad segura, sostenible y accesible"},{"$f":"IF(ISERROR(VLOOKUP(K188,Proposito_programa!$C$2:$E$59,3,FALSE)),\" \",VLOOKUP(K188,Proposito_programa!$C$2:$E$59,3,FALSE))","v":"Propósito 4: Hacer de Bogotá Región un modelo de movilidad multimodal, incluyente y sostenible"},2186,5,790413799,"CONSORCIO K2 2023","Consorcio","NIT. 79041379- NIT. 900.807.530 - 1- NIT. 9005874361","JF CONSTRUCCIONES Y CONSULTORIA  URBANOS INFRAESTRUCTURA S.A.S. . INFRAESTRUCTURA CAR Y CIA SAS ","JF CONSTRUCCIONES Y CONSULTORIA (50,00) URBANOS INFRAESTRUCTURA S.A.S.(40,00) . INFRAESTRUCTURA CAR Y CIA SAS (10,00)",0,4096474658,null,1,1258001883,5354476541,0,"2022-07-21","2022-10-03","2023-02-10",210,null,null,null,null,null,null,"En ejecución",0]
[171,2022,"FDLAN-CD-171-2022(73910)","https://community.secop.gov.co/Public/Tendering/OpportunityDetail/Index?noticeUID=CO1.NTC.3092716&isFromPublicArea=True&isModal=False","Contratos de prestación de servicios profesionales y de apoyo a la gestión","Contratación directa","Prestación de servicios profesionales y de apoyo a la gestión, o para la ejecución de trabajos artísticos que sólo puedan encomendarse a determinadas personas naturales","PRESTAR SERVICIOS PROFESIONALES PARA COORDINAR LA ARTICULACIÓN, ASISTENCIA Y ACOMPAÑAMIENTO DE LOS PROCESOS DE PLANEACIÓN LOCAL, PARA LA PROMOCIÓN DE LA PARTICIPACIÓN DE LAS MUJERES Y DE LA EQUIDAD DE GÉNERO, PARA MATERIALIZAR EN LA LOCALIDAD LAS ESTRATEGIAS DE TERRITORIALIZACIÓN Y TRANSVERSALIZACIÓN DE LA POLÍTICA PUBLICA DE MUJERES Y EQUIDAD DE GÉNERO, PPMYEG.","Inversión","Un nuevo contrato social y ambiental para la Bogotá del Siglo XXI",40,{"$f":"IF(ISERROR(VLOOKUP(K189,Proposito_programa!$C$2:$E$59,2,FALSE)),\" \",VLOOKUP(K189,Proposito_programa!$C$2:$E$59,2,FALSE))","v":"Más mujeres viven una vida libre de violencias, se sienten seguras y acceden con confianza al sistema de justicia"},{"$f":"IF(ISERROR(VLOOKUP(K189,Proposito_programa!$C$2:$E$59,3,FALSE)),\" \",VLOOKUP(K189,Proposito_programa!$C$2:$E$59,3,FALSE))","v":"Propósito 3: Inspirar confianza y legitimidad para vivir sin miedo y ser epicentro de cultura ciudadana, paz y reconciliación"},2197,1,51964393,"GLORIA MARCELA REY FARACO","Persona Natural",null,null,null,null,27000000,null,null,null,27000000,21420000,"2022-08-01","2022-08-02","2022-12-31",149,null,null,null,null,null,null,"En ejecución",0.79333333333333333]
[172,2022,"FDLANCD-172-2022 (74098)","https://community.secop.gov.co/Public/Tendering/OpportunityDetail/Index?noticeUID=CO1.NTC.3094443&isFromPublicArea=True&isModal=False","Contratos de prestación de servicios profesionales y de apoyo a la gestión","Contratación directa","Prestación de servicios profesionales y de apoyo a la gestión, o para la ejecución de trabajos artísticos que sólo puedan encomendarse a determinadas personas naturales","PRESTAR SERVICIOS PROFESIONALES, PARA APOYAR LA FORMULACIÓN, EJECUCIÓN, SUPERVISIÓN, SEGUIMIENTO CIERRE Y/O LIQUIDACIÓN DE LOS PROCESOS CONTRACTUALES QUE DEN RESPUESTA AL PROYECTO DE INVERSIÓN DE ACCIONES INTEGRALES PARA LA PRODUCTIVIDAD Y EL EMPRENDIMIENTO DE LA LOCALIDAD DE ANTONIO NARIÑO.","Inversión","Un nuevo contrato social y ambiental para la Bogotá del Siglo XXI",6,{"$f":"IF(ISERROR(VLOOKUP(K190,Proposito_programa!$C$2:$E$59,2,FALSE)),\" \",VLOOKUP(K190,Proposito_programa!$C$2:$E$59,2,FALSE))","v":"Sistema Distrital de Cuidado"},{"$f":"IF(ISERROR(VLOOKUP(K190,Proposito_programa!$C$2:$E$59,3,FALSE)),\" \",VLOOKUP(K190,Proposito_programa!$C$2:$E$59,3,FALSE))","v":"Propósito 1: Hacer un nuevo contrato social para incrementar la inclusión social, productiva y política"},2191,1,7142638,"JOSE HERNANDEZ ","Persona Natural",null,null,null,null,22946000,null,null,null,22946000,18326000,"2022-08-01","2022-08-08","2022-12-31",149,null,null,null,null,null,null,"En ejecución",0.79865771812080533]
[173,2022,"FDLANCD-173-2022 (33374)","https://community.secop.gov.co/Public/Tendering/OpportunityDetail/Index?noticeUID=CO1.NTC.3093892&isFromPublicArea=True&isModal=False","Contratos de prestación de servicios profesionales y de apoyo a la gestión","Contratación directa","Prestación de servicios profesionales y de apoyo a la gestión, o para la ejecución de trabajos artísticos que sólo puedan encomendarse a determinadas personas naturales","PRESTACIÓN DE SERVICIOS DE APOYO A LA GESTIÓN AL DESPACHO DEL ALCALDE LOCAL DE ANTONIO NARIÑO EN EL MANEJO DE LOS DISTINTOS ASUNTOS Y TRAMITES ASOCIADOS CON LA GESTIÓN ADMINISTRATIVA LOCAL.","Inversión","Un nuevo contrato social y ambiental para la Bogotá del Siglo XXI",57,{"$f":"IF(ISERROR(VLOOKUP(K191,Proposito_programa!$C$2:$E$59,2,FALSE)),\" \",VLOOKUP(K191,Proposito_programa!$C$2:$E$59,2,FALSE))","v":"Gestión pública local"},{"$f":"IF(ISERROR(VLOOKUP(K191,Proposito_programa!$C$2:$E$59,3,FALSE)),\" \",VLOOKUP(K191,Proposito_programa!$C$2:$E$59,3,FALSE))","v":"Propósito 5: Construir Bogotá - Región con gobierno abierto, transparente y ciudadanía consciente"},2198,1,51953774,"AMPARO TORRES ESGUERRA","Persona Natural",null,null,null,null,12300000,null,null,2460000,{"$f":"+W191+X191+Z191","v":14760000},9676000,"2022-08-01","2022-08-02","2023-01-30",150,1,30,null,null,null,null,"En ejecución",0.65555555555555556]
[174,2022,"FDLANCD-174-2022 (73868)","https://community.secop.gov.co/Public/Tendering/OpportunityDetail/Index?noticeUID=CO1.NTC.3094806&isFromPublicArea=True&isModal=False","Contratos de prestación de servicios profesionales y de apoyo a la gestión","Contratación directa","Prestación de servicios profesionales y de apoyo a la gestión, o para la ejecución de trabajos artísticos que sólo puedan encomendarse a determinadas personas naturales","PRESTACIÓN DE SERVICIOS PROFESIONALES AL ÁREA DE GESTIÓN DE DESARROLLO LOCAL ANTONIO NARIÑO PARA APOYAR LA FORMULACIÓN, SOCIALIZACIÓN Y SEGUIMIENTO DE LOS PROGRAMAS Y PROYECTOS DE INVERSIÓN, RELACIONADOS CON LA INFRAESTRUCTURA DEL FONDO, NECESARIOS PARA EL CUMPLIMIENTO DEL PLAN DE DESARROLLO LOCAL.","Inversión","Un nuevo contrato social y ambiental para la Bogotá del Siglo XXI",33,{"$f":"IF(ISERROR(VLOOKUP(K192,Proposito_programa!$C$2:$E$59,2,FALSE)),\" \",VLOOKUP(K192,Proposito_programa!$C$2:$E$59,2,FALSE))","v":"Más árboles y más y mejor espacio público"},{"$f":"IF(ISERROR(VLOOKUP(K192,Proposito_programa!$C$2:$E$59,3,FALSE)),\" \",VLOOKUP(K192,Proposito_programa!$C$2:$E$59,3,FALSE))","v":"Propósito 2 : Cambiar Nuestros Hábitos de Vida para Reverdecer a Bogotá y Adaptarnos y Mitigar la Crisis Climática"},2207,1,13718198,"OSCAR JULIAN DUARTE CUBILLOS","Persona Natural",null,null,null,null,22022000,null,null,null,22022000,17402000,"2022-08-01","2022-08-08","2022-12-31",149,null,null,null,null,null,null,"En ejecución",0.79020979020979021]
[175,2022,"FDLAN-CD-175-2022 (74228)","https://community.secop.gov.co/Public/Tendering/OpportunityDetail/Index?noticeUID=CO1.NTC.3098156&isFromPublicArea=True&isModal=False","Contratos de prestación de servicios profesionales y de apoyo a la gestión","Contratación directa","Prestación de servicios profesionales y de apoyo a la gestión, o para la ejecución de trabajos artísticos que sólo puedan encomendarse a determinadas personas naturales","PRESTAR SERVICIOS DE APOYO AL FONDO DE DESARROLLO LOCAL DE ANTONIO NARIÑO EN LA IMPLEMENTACIÓN DE ESTRATEGIAS QUE GARANTICEN LA PROMOCIÓN Y PROTECCIÓN DEL DERECHO A LA PARTICIPACIÓN DEMOCRÁTICA DE LOS HABITANTES DE LA LOCALIDAD ANTONIO NARIÑO","Inversión","Un nuevo contrato social y ambiental para la Bogotá del Siglo XXI",55,{"$f":"IF(ISERROR(VLOOKUP(K193,Proposito_programa!$C$2:$E$59,2,FALSE)),\" \",VLOOKUP(K193,Proposito_programa!$C$2:$E$59,2,FALSE))","v":"Fortalecimiento de cultura ciudadana y su institucionalidad"},{"$f":"IF(ISERROR(VLOOKUP(K193,Proposito_programa!$C$2:$E$59,3,FALSE)),\" \",VLOOKUP(K193,Proposito_programa!$C$2:$E$59,3,FALSE))","v":"Propósito 5: Construir Bogotá - Región con gobierno abierto, transparente y ciudadanía consciente"},2190,1,19179939,"HECTOR HUGO CORTES LOZANO","Persona Natural",null,null,null,null,20874000,null,null,null,20874000,16614000,"2022-08-02","2022-08-04","2022-12-31",149,null,null,null,null,null,null,"En ejecución",0.79591836734693877]
[176,2022,"FDLAN-CD-176-2022","https://community.secop.gov.co/Public/Tendering/OpportunityDetail/Index?noticeUID=CO1.NTC.3112292&isFromPublicArea=True&isModal=False","Contratos de prestación de servicios profesionales y de apoyo a la gestión","Contratación directa","Prestación de servicios profesionales y de apoyo a la gestión, o para la ejecución de trabajos artísticos que sólo puedan encomendarse a determinadas personas naturales","PRESTACIÓN DE SERVICIOS PROFESIONALES PARA LA ADMINISTRACIÓN, DESARROLLO Y FORTALECIMIENTO DE LAS ACTIVIDADES CULTURALES Y ARTÍSTICAS QUE SE BRINDAN A LA COMUNIDAD EN EL TEATRO VILLA MAYOR DE LA LOCALIDAD ANTONIO NARIÑO","Inversión","Un nuevo contrato social y ambiental para la Bogotá del Siglo XXI",21,{"$f":"IF(ISERROR(VLOOKUP(K194,Proposito_programa!$C$2:$E$59,2,FALSE)),\" \",VLOOKUP(K194,Proposito_programa!$C$2:$E$59,2,FALSE))","v":"Creación y vida cotidiana: Apropiación ciudadana del arte, la cultura y el patrimonio, para la democracia cultural"},{"$f":"IF(ISERROR(VLOOKUP(K194,Proposito_programa!$C$2:$E$59,3,FALSE)),\" \",VLOOKUP(K194,Proposito_programa!$C$2:$E$59,3,FALSE))","v":"Propósito 1: Hacer un nuevo contrato social para incrementar la inclusión social, productiva y política"},2201,1,80871795,"ALVARO ANDRES MARTINEZ CORONEL","Persona Natural",null,null,null,null,33142000,null,null,null,33142000,26332000,"2022-08-05","2022-08-05","2022-12-31",148,null,null,null,null,null,null,"En ejecución",0.79452054794520544]
[177,2022,"FDLAN-SASI-001-2022","https://community.secop.gov.co/Public/Tendering/OpportunityDetail/Index?noticeUID=CO1.NTC.2997922&isFromPublicArea=True&isModal=False","Otros","Selección abreviada","Selección abreviada por menor cuantía ","CONTRATAR LA ADQUISICION DE ELEMENTOS DE INSUMOS TECNOLÓGICOS, MATERIAL DIDÁCTICO, PEDAGOGICO Y DEPORTIVO, PARA APOYAR LA GESTION DE LAS INSTITUCIONES EDUCATIVAS DISTRITALES Y FORTALECER LAS ACCIONES EN MATERIA DE PRIMERA INFANCIA DE LA LOCALIDAD DE ANTONIO NARIÑO","Inversión","Un nuevo contrato social y ambiental para la Bogotá del Siglo XXI",12,{"$f":"IF(ISERROR(VLOOKUP(K195,Proposito_programa!$C$2:$E$59,2,FALSE)),\" \",VLOOKUP(K195,Proposito_programa!$C$2:$E$59,2,FALSE))","v":"Educación inicial: Bases sólidas para la vida."},{"$f":"IF(ISERROR(VLOOKUP(K195,Proposito_programa!$C$2:$E$59,3,FALSE)),\" \",VLOOKUP(K195,Proposito_programa!$C$2:$E$59,3,FALSE))","v":"Propósito 1: Hacer un nuevo contrato social para incrementar la inclusión social, productiva y política"},1864,5,811005267,"ALMACEN EL DEPORTISTA SAS","Persona Jurídica",null,null,null,null,219810614,null,null,null,219810614,0,"2022-08-17","2022-08-17","2023-02-16",90,1,90,null,null,null,null,"En ejecución",0]
[178,2022,"FDLANCD-178-2022(74097)","https://community.secop.gov.co/Public/Tendering/OpportunityDetail/Index?noticeUID=CO1.NTC.3116827&isFromPublicArea=True&isModal=False","Contratos de prestación de servicios profesionales y de apoyo a la gestión","Contratación directa","Prestación de servicios profesionales y de apoyo a la gestión, o para la ejecución de trabajos artísticos que sólo puedan encomendarse a determinadas personas naturales","PRESTAR SERVICIOS PROFESIONALES, PARA APOYAR LA FORMULACIÓN, EJECUCIÓN, SUPERVISIÓN, SEGUIMIENTO CIERRE Y/O LIQUIDACIÓN DE LOS PROCESOS CONTRACTUALES QUE DEN RESPUESTA AL PROYECTO DE INVERSIÓN PARA ACCIONES DE FOMENTO Y PROMOCIÓN DE ACTIVIDADES EN EL CAMPO DEPORTIVO DE LA LOCALIDAD DE ANTONIO NARIÑO.","Inversión","Un nuevo contrato social y ambiental para la Bogotá del Siglo XXI",20,{"$f":"IF(ISERROR(VLOOKUP(K196,Proposito_programa!$C$2:$E$59,2,FALSE)),\" \",VLOOKUP(K196,Proposito_programa!$C$2:$E$59,2,FALSE))","v":"Bogotá, referente en cultura, deporte, recreación y actividad física, con parques para el desarrollo y la salud"},{"$f":"IF(ISERROR(VLOOKUP(K196,Proposito_programa!$C$2:$E$59,3,FALSE)),\" \",VLOOKUP(K196,Proposito_programa!$C$2:$E$59,3,FALSE))","v":"Propósito 1: Hacer un nuevo contrato social para incrementar la inclusión social, productiva y política"},2200,1,1013681219,"JENNYFFER ROJAS HERNANDEZ","Persona Natural",null,null,null,null,24610300,null,null,2409400,{"$f":"+W196+X196+Z196","v":27019700},19447300,"2022-08-05","2022-08-08","2023-01-14",148,1,14,null,null,null,null,"En ejecución",0.71974522292993626]
[179,2022,"FDLANCD-179-2022 (73901)","https://community.secop.gov.co/Public/Tendering/OpportunityDetail/Index?noticeUID=CO1.NTC.3124825&isFromPublicArea=True&isModal=False","Contratos de prestación de servicios profesionales y de apoyo a la gestión","Contratación directa","Prestación de servicios profesionales y de apoyo a la gestión, o para la ejecución de trabajos artísticos que sólo puedan encomendarse a determinadas personas naturales","PRESTAR SERVICIOS PROFESIONALES DE APOYO EN LOS PROCESOS ADMINISTRATIVOS, CONTABLES Y FINANCIEROS EN EL FONDO DE DESARROLLO LOCAL DE ANTONIO NARIÑO EN EL MARCO DE LAS NORMAS DE DERECHO CONTABLE, DE SEGURIDAD SOCIAL Y LOS PROCEDIMIENTOS VIGENTE","Inversión","Un nuevo contrato social y ambiental para la Bogotá del Siglo XXI",57,{"$f":"IF(ISERROR(VLOOKUP(K197,Proposito_programa!$C$2:$E$59,2,FALSE)),\" \",VLOOKUP(K197,Proposito_programa!$C$2:$E$59,2,FALSE))","v":"Gestión pública local"},{"$f":"IF(ISERROR(VLOOKUP(K197,Proposito_programa!$C$2:$E$59,3,FALSE)),\" \",VLOOKUP(K197,Proposito_programa!$C$2:$E$59,3,FALSE))","v":"Propósito 5: Construir Bogotá - Región con gobierno abierto, transparente y ciudadanía consciente"},2198,1,1022379187,"NATALIA DELGADO PUENTES","Persona Natural",null,null,null,null,25560000,null,null,null,25560000,19980000,"2022-08-08","2022-08-10","2022-12-31",142,null,null,null,null,null,null,"En ejecución",0.78169014084507038]
[180,2022,"FDLAN-CMA-002-2022 (72608)","https://community.secop.gov.co/Public/Tendering/OpportunityDetail/Index?noticeUID=CO1.NTC.2991458&isFromPublicArea=True&isModal=False","Interventoría","Concurso de méritos","No aplica","REALIZAR LA INTERVENTORÍA TÉCNICA, ADMINISTRATIVA, JURÍDICA LEGAL, FINANCIERA CONTABL), AMBIENTAL, SOCIAL Y SST AL CONTRATO QUE TIENE POR OBJETO: \"REALIZAR A TRAVÉS DEL SISTEMA DE PRECIOS UNITARIOS FIJOS Y A MONTO AGOTABLE, LAS ACTIVIDADES DE CONSERVACIÓN DE LA MALLA VIAL Y DEL ESPACIO PÚBLICO PRIORIZADOS POR EL FONDO DE DESARROLLO LOCAL DE ANTONIO NARIÑO PARA EL CUMPLIMIENTO DE LAS METAS DEFINIDAS EN LA VIGENCIA 2022","Inversión","Un nuevo contrato social y ambiental para la Bogotá del Siglo XXI",49,{"$f":"IF(ISERROR(VLOOKUP(K198,Proposito_programa!$C$2:$E$59,2,FALSE)),\" \",VLOOKUP(K198,Proposito_programa!$C$2:$E$59,2,FALSE))","v":"Movilidad segura, sostenible y accesible"},{"$f":"IF(ISERROR(VLOOKUP(K198,Proposito_programa!$C$2:$E$59,3,FALSE)),\" \",VLOOKUP(K198,Proposito_programa!$C$2:$E$59,3,FALSE))","v":"Propósito 4: Hacer de Bogotá Región un modelo de movilidad multimodal, incluyente y sostenible"},2186,5,9016207529,"CONSORCIO INGEVIAL LAM","Consorcio","NIT. 901013246- NIT. 79838206- NIT. 78690387","CONSTRUCTORA OCEANA S.A.S - LINO ANDRES MENDOZA VELASQUEZ- ABRAHAM ENRIQUE ESPINOSA DIAZ","CONSTRUCTORA OCEANA S.A.S(50,00) - LINO ANDRES MENDOZA VELASQUEZ(45,00)- ABRAHAM ENRIQUE ESPINOSA DIAZ (50,00)",0,383767455,null,1,113001876,496769331,0,"2022-08-09","2022-10-03","2023-03-11",210,1,60,null,null,null,null,"En ejecución",0]
[181,2022,"FDLAN-CD-181-2022(74224)","https://community.secop.gov.co/Public/Tendering/OpportunityDetail/Index?noticeUID=CO1.NTC.3161707&isFromPublicArea=True&isModal=False","Contratos de prestación de servicios profesionales y de apoyo a la gestión","Contratación directa","Prestación de servicios profesionales y de apoyo a la gestión, o para la ejecución de trabajos artísticos que sólo puedan encomendarse a determinadas personas naturales","APOYAR AL (A) ALCALDE (SA) LOCAL EN EL FORTALECIMIENTO E INCLUSIÓN DE LAS COMUNIDADES NEGRAS, AFROCOLOMBIANAS Y PALENQUERAS EN EL MARCO DE LA POLÍTICA PÚBLICA DISTRITAL AFRODESCENDIENTES Y LOS ESPACIOS DE PARTICIPACIÓN","Inversión","Un nuevo contrato social y ambiental para la Bogotá del Siglo XXI",55,{"$f":"IF(ISERROR(VLOOKUP(K199,Proposito_programa!$C$2:$E$59,2,FALSE)),\" \",VLOOKUP(K199,Proposito_programa!$C$2:$E$59,2,FALSE))","v":"Fortalecimiento de cultura ciudadana y su institucionalidad"},{"$f":"IF(ISERROR(VLOOKUP(K199,Proposito_programa!$C$2:$E$59,3,FALSE)),\" \",VLOOKUP(K199,Proposito_programa!$C$2:$E$59,3,FALSE))","v":"Propósito 5: Construir Bogotá - Región con gobierno abierto, transparente y ciudadanía consciente"},2190,1,1122783927,"SANDRA CLAUDIA CHINDOY JAMIOY","Persona Natural",null,null,null,null,20482000,null,null,null,20482000,11242000,"2022-08-17","2022-08-18","2022-12-31",133,null,null,null,null,null,null,"En ejecución",0.54887218045112784]
[182,2022,"FDLANCD-182-2022(74202)","https://community.secop.gov.co/Public/Tendering/OpportunityDetail/Index?noticeUID=CO1.NTC.3169564&isFromPublicArea=True&isModal=False","Contratos de prestación de servicios profesionales y de apoyo a la gestión","Contratación directa","Prestación de servicios profesionales y de apoyo a la gestión, o para la ejecución de trabajos artísticos que sólo puedan encomendarse a determinadas personas naturales","Prestar servicios de apoyo a la gestión a la Alcaldía Local de Antonio Nariño en el seguimiento a casos de violencia intrafamiliar y sexual en poblaciones vulnerables, así como en los procesos de participación ciudadana en la localidad","Inversión","Un nuevo contrato social y ambiental para la Bogotá del Siglo XXI",6,{"$f":"IF(ISERROR(VLOOKUP(K200,Proposito_programa!$C$2:$E$59,2,FALSE)),\" \",VLOOKUP(K200,Proposito_programa!$C$2:$E$59,2,FALSE))","v":"Sistema Distrital de Cuidado"},{"$f":"IF(ISERROR(VLOOKUP(K200,Proposito_programa!$C$2:$E$59,3,FALSE)),\" \",VLOOKUP(K200,Proposito_programa!$C$2:$E$59,3,FALSE))","v":"Propósito 1: Hacer un nuevo contrato social para incrementar la inclusión social, productiva y política"},2192,1,1007749906,"LIZETH DAYANA RUBIANO PULIDO","Persona Natural",null,null,null,null,10824000,null,null,null,10824000,7954000,"2022-08-19","2022-08-24","2022-12-31",132,null,null,null,null,null,null,"En ejecución",0.73484848484848486]
[183,2022,"FDLAN-CD-183-2022-CPS (74736)","https://community.secop.gov.co/Public/Tendering/OpportunityDetail/Index?noticeUID=CO1.NTC.3165801&isFromPublicArea=True&isModal=False","Contratos de prestación de servicios profesionales y de apoyo a la gestión","Contratación directa","Prestación de servicios profesionales y de apoyo a la gestión, o para la ejecución de trabajos artísticos que sólo puedan encomendarse a determinadas personas naturales","PRESTACION DE SERVICIOS DE APOYO A LA GESTION COMO AUXILAR PARA LA TRANSCRIPCION DE LAS ACTAS QUE EXPIDA LA JUNTA ADMINISTRADORA LOCAL DE ANTONIO NARIÑO","Inversión","Un nuevo contrato social y ambiental para la Bogotá del Siglo XXI",57,{"$f":"IF(ISERROR(VLOOKUP(K201,Proposito_programa!$C$2:$E$59,2,FALSE)),\" \",VLOOKUP(K201,Proposito_programa!$C$2:$E$59,2,FALSE))","v":"Gestión pública local"},{"$f":"IF(ISERROR(VLOOKUP(K201,Proposito_programa!$C$2:$E$59,3,FALSE)),\" \",VLOOKUP(K201,Proposito_programa!$C$2:$E$59,3,FALSE))","v":"Propósito 5: Construir Bogotá - Región con gobierno abierto, transparente y ciudadanía consciente"},2198,1,1018511981,"LEDY DAYANNA RODRIGUEZ ROJAS","Persona Natural",null,null,null,null,9840000,null,null,null,9840000,8364000,"2022-08-18","2022-08-19","2022-12-18",120,null,null,null,null,null,null,"En ejecución",0.85]
[184,2022,"FDLAN-CD-184-2022(74499)","https://community.secop.gov.co/Public/Tendering/OpportunityDetail/Index?noticeUID=CO1.NTC.3190567&isFromPublicArea=True&isModal=False","Contratos de prestación de servicios profesionales y de apoyo a la gestión","Contratación directa","Prestación de servicios profesionales y de apoyo a la gestión, o para la ejecución de trabajos artísticos que sólo puedan encomendarse a determinadas personas naturales","PRESTAR SERVICIOS DE APOYO A LA ALCALDÍA LOCAL DE ANTONIO NARIÑO A LA GESTIÓN ADMINISTRATIVA DEL TEATRO VILLA MAYOR","Inversión","Un nuevo contrato social y ambiental para la Bogotá del Siglo XXI",21,{"$f":"IF(ISERROR(VLOOKUP(K202,Proposito_programa!$C$2:$E$59,2,FALSE)),\" \",VLOOKUP(K202,Proposito_programa!$C$2:$E$59,2,FALSE))","v":"Creación y vida cotidiana: Apropiación ciudadana del arte, la cultura y el patrimonio, para la democracia cultural"},{"$f":"IF(ISERROR(VLOOKUP(K202,Proposito_programa!$C$2:$E$59,3,FALSE)),\" \",VLOOKUP(K202,Proposito_programa!$C$2:$E$59,3,FALSE))","v":"Propósito 1: Hacer un nuevo contrato social para incrementar la inclusión social, productiva y política"},2201,1,1143835530,"SARA JIMENEZ NIETO","Persona Natural",null,null,null,null,9840000,null,null,null,9840000,6642000,"2022-08-24","2022-08-26","2022-12-31",120,null,null,null,null,null,null,"En ejecución",0.67500000000000004]
[185,2022,"FDLANCD-185-2022 (75224)","https://community.secop.gov.co/Public/Tendering/OpportunityDetail/Index?noticeUID=CO1.NTC.3196817&isFromPublicArea=True&isModal=False\n","Contratos de prestación de servicios profesionales y de apoyo a la gestión","Contratación directa","Prestación de servicios profesionales y de apoyo a la gestión, o para la ejecución de trabajos artísticos que sólo puedan encomendarse a determinadas personas naturales","Prestación de servicios de apoyo como auxiliar administrativo en el área de gestión de desarrollo local, administrativa y financiera del fondo de desarrollo local de Antonio Nariño","Inversión","Un nuevo contrato social y ambiental para la Bogotá del Siglo XXI",57,{"$f":"IF(ISERROR(VLOOKUP(K203,Proposito_programa!$C$2:$E$59,2,FALSE)),\" \",VLOOKUP(K203,Proposito_programa!$C$2:$E$59,2,FALSE))","v":"Gestión pública local"},{"$f":"IF(ISERROR(VLOOKUP(K203,Proposito_programa!$C$2:$E$59,3,FALSE)),\" \",VLOOKUP(K203,Proposito_programa!$C$2:$E$59,3,FALSE))","v":"Propósito 5: Construir Bogotá - Región con gobierno abierto, transparente y ciudadanía consciente"},2198,1,79910314,"MIGUEL ANGEL PRIETO ZAMUDIO","Persona Natural",null,null,null,null,9840000,null,null,null,9840000,0,"2022-08-25","2022-08-26","2022-12-25",120,null,null,null,null,null,null,"En ejecución",0]
[186,2022,"FDLAN-CD-186-2022-CPS (75874)","https://community.secop.gov.co/Public/Tendering/OpportunityDetail/Index?noticeUID=CO1.NTC.3210823&isFromPublicArea=True&isModal=False","Contratos de prestación de servicios profesionales y de apoyo a la gestión","Contratación directa","Prestación de servicios profesionales y de apoyo a la gestión, o para la ejecución de trabajos artísticos que sólo puedan encomendarse a determinadas personas naturales","Apoyar al (la) alcalde (sa) local en la promoción, articulación, acompañamiento y seguimiento para la atención y protección de los animales domésticos y silvestres de la localidad.","Inversión","Un nuevo contrato social y ambiental para la Bogotá del Siglo XXI",34,{"$f":"IF(ISERROR(VLOOKUP(K204,Proposito_programa!$C$2:$E$59,2,FALSE)),\" \",VLOOKUP(K204,Proposito_programa!$C$2:$E$59,2,FALSE))","v":"Bogotá protectora de los animales"},{"$f":"IF(ISERROR(VLOOKUP(K204,Proposito_programa!$C$2:$E$59,3,FALSE)),\" \",VLOOKUP(K204,Proposito_programa!$C$2:$E$59,3,FALSE))","v":"Propósito 2 : Cambiar Nuestros Hábitos de Vida para Reverdecer a Bogotá y Adaptarnos y Mitigar la Crisis Climática"},2209,1,1026583068,"BRIAN NICOLAS ACOSTA LUCERO","Persona Natural",null,null,null,null,13860000,null,null,4620000,18480000,13860000,"2022-08-30","2022-09-01","2022-11-30",90,1,30,null,null,null,null,"En ejecución",0.75]
[187,2022,"FDLAN-CD-187-2022-CPS (75717)","https://community.secop.gov.co/Public/Tendering/OpportunityDetail/Index?noticeUID=CO1.NTC.3214392&isFromPublicArea=True&isModal=False","Contratos de prestación de servicios profesionales y de apoyo a la gestión","Contratación directa","Prestación de servicios profesionales y de apoyo a la gestión, o para la ejecución de trabajos artísticos que sólo puedan encomendarse a determinadas personas naturales","Apoyar y dar soporte técnico al administrador y usuario final de la red de sistemas y tecnología e información de la Alcaldía Local.","Inversión","Un nuevo contrato social y ambiental para la Bogotá del Siglo XXI",57,{"$f":"IF(ISERROR(VLOOKUP(K205,Proposito_programa!$C$2:$E$59,2,FALSE)),\" \",VLOOKUP(K205,Proposito_programa!$C$2:$E$59,2,FALSE))","v":"Gestión pública local"},{"$f":"IF(ISERROR(VLOOKUP(K205,Proposito_programa!$C$2:$E$59,3,FALSE)),\" \",VLOOKUP(K205,Proposito_programa!$C$2:$E$59,3,FALSE))","v":"Propósito 5: Construir Bogotá - Región con gobierno abierto, transparente y ciudadanía consciente"},2198,1,1000136904,"YEORGETH SUSANA RUBIANO CRISTIANO","Persona Natural",null,null,null,null,5580000,null,null,null,5580000,5580000,"2022-08-30","2022-09-01","2022-10-30",30,null,null,null,null,null,null,"En ejecución",1]
[188,2022,"FDLAN-SAMC-006-2022 (75029)","https://community.secop.gov.co/Public/Tendering/OpportunityDetail/Index?noticeUID=CO1.NTC.3176445&isFromPublicArea=True&isModal=False","Otros","Selección abreviada","Selección abreviada por menor cuantía ","Prestación de servicios dirigidos a brindar atención médico-veterinaria de animales caninos y felinos en estado de vulnerabilidad con el fin de mejorar las condiciones y calidad de vida de los animales en la Localidad de Antonio Nariño","Inversión","Un nuevo contrato social y ambiental para la Bogotá del Siglo XXI",34,{"$f":"IF(ISERROR(VLOOKUP(K206,Proposito_programa!$C$2:$E$59,2,FALSE)),\" \",VLOOKUP(K206,Proposito_programa!$C$2:$E$59,2,FALSE))","v":"Bogotá protectora de los animales"},{"$f":"IF(ISERROR(VLOOKUP(K206,Proposito_programa!$C$2:$E$59,3,FALSE)),\" \",VLOOKUP(K206,Proposito_programa!$C$2:$E$59,3,FALSE))","v":"Propósito 2 : Cambiar Nuestros Hábitos de Vida para Reverdecer a Bogotá y Adaptarnos y Mitigar la Crisis Climática"},2209,4,901039835,"IMPECOS SAS","Persona Jurídica",null,null,null,null,84564000,null,null,null,{"$f":"+W206+X206+Z206","v":84564000},36481354,"2022-09-05","2022-09-12","2023-01-12",120,null,null,null,null,null,null,"En ejecución",0.43140525519133438]
[189,2022,"FDLAN-SASI-002-2022(73380)\t","https://community.secop.gov.co/Public/Tendering/OpportunityDetail/Index?noticeUID=CO1.NTC.3100466&isFromPublicArea=True&isModal=False","Otros","Selección abreviada","Subasta inversa ","CONTRATAR LA ADQUISICIÓN DE ELEMENTOS DEPORTIVOS, TEGNOLÓGICOS, MUSICALES, FERRETERÍA Y MOBILIARIO PARA LA DOTACION DE LA CASA DE LA JUVENTUD DE LA LOCALIDAD DE ANTONIO NARIÑO EN EL MARCO DEL PROYECTO ACCIONES DE FOMENTO A LA JUVENTUD","Inversión","Un nuevo contrato social y ambiental para la Bogotá del Siglo XXI",17,{"$f":"IF(ISERROR(VLOOKUP(K207,Proposito_programa!$C$2:$E$59,2,FALSE)),\" \",VLOOKUP(K207,Proposito_programa!$C$2:$E$59,2,FALSE))","v":"Jóvenes con capacidades: Proyecto de vida para la ciudadanía, la innovación y el trabajo del siglo XXI"},{"$f":"IF(ISERROR(VLOOKUP(K207,Proposito_programa!$C$2:$E$59,3,FALSE)),\" \",VLOOKUP(K207,Proposito_programa!$C$2:$E$59,3,FALSE))","v":"Propósito 1: Hacer un nuevo contrato social para incrementar la inclusión social, productiva y política"},2199,21,900916649,"C I WARRIORS COMPANY SAS","Persona Jurídica",null,null,null,null,14784000,null,null,null,14784000,null,"2022-08-30","2022-09-16","2022-12-15",90,null,null,null,null,null,null,"En ejecución",0]
[190,2022,"FDLAN-SASI-002-2022(73380)","https://community.secop.gov.co/Public/Tendering/OpportunityDetail/Index?noticeUID=CO1.NTC.3100466&isFromPublicArea=True&isModal=False","Otros","Selección abreviada","Subasta inversa ","CONTRATAR LA ADQUISICIÓN DE ELEMENTOS DEPORTIVOS, TEGNOLÓGICOS, MUSICALES, FERRETERÍA Y MOBILIARIO PARA LA DOTACION DE LA CASA DE LA JUVENTUD DE LA LOCALIDAD DE ANTONIO NARIÑO EN EL MARCO DEL PROYECTO ACCIONES DE FOMENTO A LA JUVENTUD","Inversión","Un nuevo contrato social y ambiental para la Bogotá del Siglo XXI",17,{"$f":"IF(ISERROR(VLOOKUP(K208,Proposito_programa!$C$2:$E$59,2,FALSE)),\" \",VLOOKUP(K208,Proposito_programa!$C$2:$E$59,2,FALSE))","v":"Jóvenes con capacidades: Proyecto de vida para la ciudadanía, la innovación y el trabajo del siglo XXI"},{"$f":"IF(ISERROR(VLOOKUP(K208,Proposito_programa!$C$2:$E$59,3,FALSE)),\" \",VLOOKUP(K208,Proposito_programa!$C$2:$E$59,3,FALSE))","v":"Propósito 1: Hacer un nuevo contrato social para incrementar la inclusión social, productiva y política"},2199,5,901370420,"GN GENERACION DE NEGOCIOS SAS","Persona Jurídica",null,null,null,null,54500000,null,null,null,54500000,0,"2022-08-30","2022-09-16","2022-12-15",90,null,null,null,null,null,null,"En ejecución",0]
[191,2022,"FDLAN-CD-191-2022 (76435)","https://community.secop.gov.co/Public/Tendering/OpportunityDetail/Index?noticeUID=CO1.NTC.3252640&isFromPublicArea=True&isModal=False","Contratos de prestación de servicios profesionales y de apoyo a la gestión","Contratación directa","Prestación de servicios profesionales y de apoyo a la gestión, o para la ejecución de trabajos artísticos que sólo puedan encomendarse a determinadas personas naturales","APOYAR LA FORMULACIÓN, GESTIÓN Y SEGUIMIENTO DE ACTIVIDADES ENFOCADAS A LA GESTIÓN AMBIENTAL EXTERNA, ENCAMINADAS A LA MITIGACIÓN DE LOS DIFERENTES IMPACTOS AMBIENTALES Y LA CONSERVACIÓN DE LOS RECURSOS NATURALES DE LA LOCALIDAD.","Inversión","Un nuevo contrato social y ambiental para la Bogotá del Siglo XXI",33,{"$f":"IF(ISERROR(VLOOKUP(K209,Proposito_programa!$C$2:$E$59,2,FALSE)),\" \",VLOOKUP(K209,Proposito_programa!$C$2:$E$59,2,FALSE))","v":"Más árboles y más y mejor espacio público"},{"$f":"IF(ISERROR(VLOOKUP(K209,Proposito_programa!$C$2:$E$59,3,FALSE)),\" \",VLOOKUP(K209,Proposito_programa!$C$2:$E$59,3,FALSE))","v":"Propósito 2 : Cambiar Nuestros Hábitos de Vida para Reverdecer a Bogotá y Adaptarnos y Mitigar la Crisis Climática"},2206,1,1013636599,"MAYRA JIMENA WILCHES GONZALEZ","Persona Natural",null,null,null,null,13860000,null,1,3542000,17402000,12782000,"2022-09-07","2022-09-08","2022-12-30",90,1,24,null,null,null,null,"En ejecución",0.73451327433628322]
[192,2022,"FDLAN-CD-192-2022(75147)","https://community.secop.gov.co/Public/Tendering/OpportunityDetail/Index?noticeUID=CO1.NTC.3262371&isFromPublicArea=True&isModal=False\n","Contratos de prestación de servicios profesionales y de apoyo a la gestión","Contratación directa","Prestación de servicios profesionales y de apoyo a la gestión, o para la ejecución de trabajos artísticos que sólo puedan encomendarse a determinadas personas naturales","PRESTAR SERVICIOS PROFESIONALES, PARA APOYAR LA FORMULACIÓN, EJECUCIÓN, SUPERVISIÓN, SEGUIMIENTO CIERRE Y/O LIQUIDACIÓN DE LOS PROCESOS CONTRACTUALES QUE DEN RESPUESTA AL PROYECTO DE INVERSIÓN PARA LAS ACCIONES DE FOMENTO Y PROMOCIÓN DE ACTIVIDADES ARTÍSTICAS, INTERCULTURALES, CULTURALES Y/O PATRIMONIALES DE LA LOCALIDAD DE ANTONIO NARIÑO.","Inversión","Un nuevo contrato social y ambiental para la Bogotá del Siglo XXI",21,{"$f":"IF(ISERROR(VLOOKUP(K210,Proposito_programa!$C$2:$E$59,2,FALSE)),\" \",VLOOKUP(K210,Proposito_programa!$C$2:$E$59,2,FALSE))","v":"Creación y vida cotidiana: Apropiación ciudadana del arte, la cultura y el patrimonio, para la democracia cultural"},{"$f":"IF(ISERROR(VLOOKUP(K210,Proposito_programa!$C$2:$E$59,3,FALSE)),\" \",VLOOKUP(K210,Proposito_programa!$C$2:$E$59,3,FALSE))","v":"Propósito 1: Hacer un nuevo contrato social para incrementar la inclusión social, productiva y política"},2201,1,1024567099,"\n\tNATALIA RODRIGUEZ\n","Persona Natural",null,null,null,null,13860000,null,null,null,13860000,12166000,"2022-09-09","2022-09-19","2022-12-11",90,null,null,null,null,null,null,"En ejecución",0.87777777777777777]
[193,2022,"FDLAN-CD-193-2022 (76296)","https://community.secop.gov.co/Public/Tendering/OpportunityDetail/Index?noticeUID=CO1.NTC.3263933&isFromPublicArea=True&isModal=False","Contratos de prestación de servicios profesionales y de apoyo a la gestión","Contratación directa","Prestación de servicios profesionales y de apoyo a la gestión, o para la ejecución de trabajos artísticos que sólo puedan encomendarse a determinadas personas naturales","EL CONTRATO QUE SE PRETENDE CELEBRAR, TENDRÁ POR OBJETO PRESTAR SERVICIOS PROFESIONALES, PARA APOYAR LA FORMULACIÓN, EJECUCIÓN, SUPERVISIÓN, SEGUIMIENTO CIERRE Y/O LIQUIDACIÓN DE LOS PROCESOS CONTRACTUALES QUE DEN RESPUESTA AL PROYECTO DE INVERSIÓN DE ACCIONES INTEGRALES PARA LA PRODUCTIVIDAD Y EL EMPRENDIMIENTO DE LA LOCALIDAD DE ANTONIO NARIÑO.","Inversión","Un nuevo contrato social y ambiental para la Bogotá del Siglo XXI",6,{"$f":"IF(ISERROR(VLOOKUP(K211,Proposito_programa!$C$2:$E$59,2,FALSE)),\" \",VLOOKUP(K211,Proposito_programa!$C$2:$E$59,2,FALSE))","v":"Sistema Distrital de Cuidado"},{"$f":"IF(ISERROR(VLOOKUP(K211,Proposito_programa!$C$2:$E$59,3,FALSE)),\" \",VLOOKUP(K211,Proposito_programa!$C$2:$E$59,3,FALSE))","v":"Propósito 1: Hacer un nuevo contrato social para incrementar la inclusión social, productiva y política"},2191,1,87067788,"DIEGO HERNANDO CASTRO GUEVARA","Persona Natural",null,null,null,null,16786000,null,null,null,16786000,10472000,"2022-09-09","2022-09-12","2022-12-31",109,null,null,1013668763,"CAMILA ANDREA VILLEGAS MOSQUERA","2022-10-14",16786000,"En ejecución",0.62385321100917435]
[194,2022,"FDLAN-CD-194-2022","https://community.secop.gov.co/Public/Tendering/OpportunityDetail/Index?noticeUID=CO1.NTC.3318233&isFromPublicArea=True&isModal=False","Contratos de prestación de servicios profesionales y de apoyo a la gestión","Contratación directa","Prestación de servicios profesionales y de apoyo a la gestión, o para la ejecución de trabajos artísticos que sólo puedan encomendarse a determinadas personas naturales","\nPrestar servicios de apoyo a la gestión del fondo de desarrollo local de Antonio Nariño en los asuntos operativos relacionados con la seguridad, la convivencia y el desarrollo de actividad económica en la localidad, con conformidad con el marco normativo aplicable en la materia.","Inversión","Un nuevo contrato social y ambiental para la Bogotá del Siglo XXI",57,{"$f":"IF(ISERROR(VLOOKUP(K212,Proposito_programa!$C$2:$E$59,2,FALSE)),\" \",VLOOKUP(K212,Proposito_programa!$C$2:$E$59,2,FALSE))","v":"Gestión pública local"},{"$f":"IF(ISERROR(VLOOKUP(K212,Proposito_programa!$C$2:$E$59,3,FALSE)),\" \",VLOOKUP(K212,Proposito_programa!$C$2:$E$59,3,FALSE))","v":"Propósito 5: Construir Bogotá - Región con gobierno abierto, transparente y ciudadanía consciente"},2198,1,51678981,"BLANCA IDALY SUAREZ HERNANDEZ","Persona Natural",null,null,null,null,7380000,null,null,null,7380000,5330000,"2022-09-23","2022-09-26","2022-12-25",90,null,null,null,null,null,null,"En ejecución",0.72222222222222221]
[195,2022,"FDLAN-CD-195-2022(77706)","https://community.secop.gov.co/Public/Tendering/OpportunityDetail/Index?noticeUID=CO1.NTC.3314268&isFromPublicArea=True&isModal=False","Contratos de prestación de servicios profesionales y de apoyo a la gestión","Contratación directa","Prestación de servicios profesionales y de apoyo a la gestión, o para la ejecución de trabajos artísticos que sólo puedan encomendarse a determinadas personas naturales","APOYAR EN LAS TAREAS OPERATIVAS DE CARÁCTER ARCHIVISTICO DESARROLLADAS EN LA ALCALDIA LOCAL PARA GARANTIZAR LA APLICACIÓN CORRECTA DE LOS PROCEDIMIENTOS TECNICOS.","Inversión","Un nuevo contrato social y ambiental para la Bogotá del Siglo XXI",57,{"$f":"IF(ISERROR(VLOOKUP(K213,Proposito_programa!$C$2:$E$59,2,FALSE)),\" \",VLOOKUP(K213,Proposito_programa!$C$2:$E$59,2,FALSE))","v":"Gestión pública local"},{"$f":"IF(ISERROR(VLOOKUP(K213,Proposito_programa!$C$2:$E$59,3,FALSE)),\" \",VLOOKUP(K213,Proposito_programa!$C$2:$E$59,3,FALSE))","v":"Propósito 5: Construir Bogotá - Región con gobierno abierto, transparente y ciudadanía consciente"},2198,1,79558171,"JOHN NEIL CORDOBA PARRA","Persona Natural",null,null,null,null,10080000,null,1,896000,{"$f":"+W213+X213+Z213","v":10976000},7616000,"2022-09-22","2022-09-23","2022-12-30",90,1,8,null,null,null,null,"En ejecución",{"$f":"IF(ISERROR(AB213/AA213),\"-\",(AB213/AA213))","v":0.69387755102040816}]
[196,2022,"FDLAN-CD-196-2022(77656)","https://community.secop.gov.co/Public/Tendering/OpportunityDetail/Index?noticeUID=CO1.NTC.3316658&isFromPublicArea=True&isModal=False","Contratos de prestación de servicios profesionales y de apoyo a la gestión","Contratación directa","Prestación de servicios profesionales y de apoyo a la gestión, o para la ejecución de trabajos artísticos que sólo puedan encomendarse a determinadas personas naturales","\tPRESTAR SERVICIOS DE APOYO A LA GESTIÓN EN LAS LABORES ASISTENCIALES A LAS ACTIVIDADES RELACIONADAS CON LA INSPECCIÓN, VIGILANCIA Y CONTROL QUE DEBA ADELANTAR LA ALCALDÍA LOCAL EN MATERIA DE ACTIVIDAD ECONÓMICA, DESPACHOS COMISORIOS Y CONVIVENCIA CIUDADANA EN LA LOCALIDAD.","Inversión","Un nuevo contrato social y ambiental para la Bogotá del Siglo XXI",57,{"$f":"IF(ISERROR(VLOOKUP(K214,Proposito_programa!$C$2:$E$59,2,FALSE)),\" \",VLOOKUP(K214,Proposito_programa!$C$2:$E$59,2,FALSE))","v":"Gestión pública local"},{"$f":"IF(ISERROR(VLOOKUP(K214,Proposito_programa!$C$2:$E$59,3,FALSE)),\" \",VLOOKUP(K214,Proposito_programa!$C$2:$E$59,3,FALSE))","v":"Propósito 5: Construir Bogotá - Región con gobierno abierto, transparente y ciudadanía consciente"},2189,1,1080266107,"\n\tNATHALIA ROPERO\n\t\n","Persona Natural",null,null,null,null,7380000,null,null,null,7380000,5330000,"2022-09-23","2022-09-26","2022-12-25",90,null,null,null,null,null,null,"En ejecución",0.72222222222222221]
[197,2022,"FDLAN-CD-197-2022(77682)","https://community.secop.gov.co/Public/Tendering/OpportunityDetail/Index?noticeUID=CO1.NTC.3324449&isFromPublicArea=True&isModal=False","Contratos de prestación de servicios profesionales y de apoyo a la gestión","Contratación directa","Prestación de servicios profesionales y de apoyo a la gestión, o para la ejecución de trabajos artísticos que sólo puedan encomendarse a determinadas personas naturales","PRESTAR LOS SERVICIOS PROFESIONALES PARA APOYAR EL DISEÑO DE PIEZAS GRÁFICAS, REALIZACIÓN, DIRECCIÓN, PRODUCCIÓN Y EDICIÓN DE MATERIAL VIDEOGRÁFICO, MANEJO DE REDES Y CUBRIMIENTO DE EVENTOS DEL TEATRO VILLA MAYOR","Inversión","Un nuevo contrato social y ambiental para la Bogotá del Siglo XXI",57,{"$f":"IF(ISERROR(VLOOKUP(K215,Proposito_programa!$C$2:$E$59,2,FALSE)),\" \",VLOOKUP(K215,Proposito_programa!$C$2:$E$59,2,FALSE))","v":"Gestión pública local"},{"$f":"IF(ISERROR(VLOOKUP(K215,Proposito_programa!$C$2:$E$59,3,FALSE)),\" \",VLOOKUP(K215,Proposito_programa!$C$2:$E$59,3,FALSE))","v":"Propósito 5: Construir Bogotá - Región con gobierno abierto, transparente y ciudadanía consciente"},2198,1,1010216127,"RUBEN DARIO MONTAÑEZ AGUDELO","Persona Natural",null,null,null,null,13860000,null,null,null,13860000,9856000,"2022-09-26","2022-09-27","2022-12-26",90,null,null,null,null,null,null,"En ejecución",0.71111111111111114]
[198,2022,"FDLAN-CD-198-2022(77719)\t","https://community.secop.gov.co/Public/Tendering/OpportunityDetail/Index?noticeUID=CO1.NTC.3324768&isFromPublicArea=True&isModal=False","Contratos de prestación de servicios profesionales y de apoyo a la gestión","Contratación directa","Prestación de servicios profesionales y de apoyo a la gestión, o para la ejecución de trabajos artísticos que sólo puedan encomendarse a determinadas personas naturales","Prestar los servicios profesionales como abogado para fortalecer las acciones de inspección, vigilancia y control del área de gestión policiva del fondo de desarrollo local de Antonio Nariño en cobros persuasivos.","Inversión","Un nuevo contrato social y ambiental para la Bogotá del Siglo XXI",57,{"$f":"IF(ISERROR(VLOOKUP(K216,Proposito_programa!$C$2:$E$59,2,FALSE)),\" \",VLOOKUP(K216,Proposito_programa!$C$2:$E$59,2,FALSE))","v":"Gestión pública local"},{"$f":"IF(ISERROR(VLOOKUP(K216,Proposito_programa!$C$2:$E$59,3,FALSE)),\" \",VLOOKUP(K216,Proposito_programa!$C$2:$E$59,3,FALSE))","v":"Propósito 5: Construir Bogotá - Región con gobierno abierto, transparente y ciudadanía consciente"},2189,1,1033811955,"LAURA YESENIA LOPEZ VILLOTA","Persona Natural",null,null,null,null,13860000,null,null,null,13860000,9856000,"2022-09-26","2022-09-27","2022-12-26",90,null,null,null,null,null,null,"En ejecución",0.71111111111111114]
[199,2022,"FDLAN-CD-199-2022(77665)\t","https://community.secop.gov.co/Public/Tendering/OpportunityDetail/Index?noticeUID=CO1.NTC.3325807&isFromPublicArea=True&isModal=False\n","Contratos de prestación de servicios profesionales y de apoyo a la gestión","Contratación directa","Prestación de servicios profesionales y de apoyo a la gestión, o para la ejecución de trabajos artísticos que sólo puedan encomendarse a determinadas personas naturales","\tAPOYAR JURÍDICAMENTE LA EJECUCIÓN DE LAS ACCIONES REQUERIDAS PARA LA DEPURACIÓN DE LAS ACTUACIONES ADMINISTRATIVAS QUE CURSAN EN LA ALCALDÍA LOCAL.","Inversión","Un nuevo contrato social y ambiental para la Bogotá del Siglo XXI",57,{"$f":"IF(ISERROR(VLOOKUP(K217,Proposito_programa!$C$2:$E$59,2,FALSE)),\" \",VLOOKUP(K217,Proposito_programa!$C$2:$E$59,2,FALSE))","v":"Gestión pública local"},{"$f":"IF(ISERROR(VLOOKUP(K217,Proposito_programa!$C$2:$E$59,3,FALSE)),\" \",VLOOKUP(K217,Proposito_programa!$C$2:$E$59,3,FALSE))","v":"Propósito 5: Construir Bogotá - Región con gobierno abierto, transparente y ciudadanía consciente"},2189,1,1085662060,"CHRISTIAN MATEO GOMEZ CERON","Persona Natural",null,null,null,null,13860000,null,null,null,{"$f":"+W217+X217+Z217","v":13860000},9856000,"2022-09-26","2022-09-27","2022-12-26",90,null,null,null,null,null,null,"En ejecución",0.71111111111111114]
[200,2022,"FDLAN-CD-200-2022(77714)","https://community.secop.gov.co/Public/Tendering/OpportunityDetail/Index?noticeUID=CO1.NTC.3325330&isFromPublicArea=True&isModal=False","Contratos de prestación de servicios profesionales y de apoyo a la gestión","Contratación directa","Prestación de servicios profesionales y de apoyo a la gestión, o para la ejecución de trabajos artísticos que sólo puedan encomendarse a determinadas personas naturales","\tPRESTAR SERVICIOS PROFESIONALES, PARA APOYAR LA FORMULACIÓN, EJECUCIÓN, SUPERVISIÓN, SEGUIMIENTO CIERRE Y/O LIQUIDACIÓN DE LOS PROCESOS CONTRACTUALES QUE DEN RESPUESTA AL PROYECTO DE INVERSIÓN ACCIONES PARA LAS PERSONAS CUIDADORAS DE LA LOCALIDAD DE ANTONIO NARIÑO.","Inversión","Un nuevo contrato social y ambiental para la Bogotá del Siglo XXI",57,{"$f":"IF(ISERROR(VLOOKUP(K218,Proposito_programa!$C$2:$E$59,2,FALSE)),\" \",VLOOKUP(K218,Proposito_programa!$C$2:$E$59,2,FALSE))","v":"Gestión pública local"},{"$f":"IF(ISERROR(VLOOKUP(K218,Proposito_programa!$C$2:$E$59,3,FALSE)),\" \",VLOOKUP(K218,Proposito_programa!$C$2:$E$59,3,FALSE))","v":"Propósito 5: Construir Bogotá - Región con gobierno abierto, transparente y ciudadanía consciente"},2198,1,52861828,"NANCY VIVIANA HERNANDEZ HERNANDEZ","Persona Natural",null,null,null,null,13860000,null,null,null,13860000,9856000,"2022-09-26","2022-09-27","2022-12-26",90,null,null,null,null,null,null,"En ejecución",0.71111111111111114]
[201,2022,"FDLANCD-201-2022 (77665)\t","https://community.secop.gov.co/Public/Tendering/OpportunityDetail/Index?noticeUID=CO1.NTC.3325632&isFromPublicArea=True&isModal=False","Contratos de prestación de servicios profesionales y de apoyo a la gestión","Contratación directa","Prestación de servicios profesionales y de apoyo a la gestión, o para la ejecución de trabajos artísticos que sólo puedan encomendarse a determinadas personas naturales","\nApoyar jurídicamente la ejecución de las acciones requeridas para la depuración de las actuaciones administrativas que cursan en la Alcaldía Local","Inversión","Un nuevo contrato social y ambiental para la Bogotá del Siglo XXI",57,{"$f":"IF(ISERROR(VLOOKUP(K219,Proposito_programa!$C$2:$E$59,2,FALSE)),\" \",VLOOKUP(K219,Proposito_programa!$C$2:$E$59,2,FALSE))","v":"Gestión pública local"},{"$f":"IF(ISERROR(VLOOKUP(K219,Proposito_programa!$C$2:$E$59,3,FALSE)),\" \",VLOOKUP(K219,Proposito_programa!$C$2:$E$59,3,FALSE))","v":"Propósito 5: Construir Bogotá - Región con gobierno abierto, transparente y ciudadanía consciente"},2189,1,1013631878,"ADRIANA KATTERINE HERRERA URIBE","Persona Natural",null,null,null,null,13860000,null,null,null,13860000,9856000,"2022-09-26","2022-09-27","2022-12-26",90,null,null,null,null,null,null,"En ejecución",0.71111111111111114]
[202,2022,"FDLANCD-202-2022 (77715)\t","https://community.secop.gov.co/Public/Tendering/OpportunityDetail/Index?noticeUID=CO1.NTC.3325716&isFromPublicArea=True&isModal=False\n","Contratos de prestación de servicios profesionales y de apoyo a la gestión","Contratación directa","Prestación de servicios profesionales y de apoyo a la gestión, o para la ejecución de trabajos artísticos que sólo puedan encomendarse a determinadas personas naturales","Apoyar al equipo de prensa y comunicaciones de la Alcaldía Local en la realización y publicación de contenidos de redes sociales y canales de divulgación digital (sitio web) de la Alcaldía local.","Inversión","Un nuevo contrato social y ambiental para la Bogotá del Siglo XXI",57,{"$f":"IF(ISERROR(VLOOKUP(K220,Proposito_programa!$C$2:$E$59,2,FALSE)),\" \",VLOOKUP(K220,Proposito_programa!$C$2:$E$59,2,FALSE))","v":"Gestión pública local"},{"$f":"IF(ISERROR(VLOOKUP(K220,Proposito_programa!$C$2:$E$59,3,FALSE)),\" \",VLOOKUP(K220,Proposito_programa!$C$2:$E$59,3,FALSE))","v":"Propósito 5: Construir Bogotá - Región con gobierno abierto, transparente y ciudadanía consciente"},2198,1,52103693,"MARIA CONSUELO BELTRAN BURGOS","Persona Natural",null,null,null,null,15516000,null,null,null,15516000,11033600,"2022-09-26","2022-09-27","2022-12-26",90,null,null,null,null,null,null,"En ejecución",0.71111111111111114]
[203,2022,"FDLANCD-203-2022 (77715)","https://community.secop.gov.co/Public/Tendering/OpportunityDetail/Index?noticeUID=CO1.NTC.3325557&isFromPublicArea=True&isModal=False","Contratos de prestación de servicios profesionales y de apoyo a la gestión","Contratación directa","Prestación de servicios profesionales y de apoyo a la gestión, o para la ejecución de trabajos artísticos que sólo puedan encomendarse a determinadas personas naturales","Prestación de servicios profesionales para apoyar el diligenciamiento de las actuaciones de los documentos técnicos de soporte y fichas de estadística básica de inversión y elaboración de los documentos de soporte necesarios para ejecutar los proyectos de inversión del fondo de desarrollo local de Antonio Nariño","Inversión","Un nuevo contrato social y ambiental para la Bogotá del Siglo XXI",57,{"$f":"IF(ISERROR(VLOOKUP(K221,Proposito_programa!$C$2:$E$59,2,FALSE)),\" \",VLOOKUP(K221,Proposito_programa!$C$2:$E$59,2,FALSE))","v":"Gestión pública local"},{"$f":"IF(ISERROR(VLOOKUP(K221,Proposito_programa!$C$2:$E$59,3,FALSE)),\" \",VLOOKUP(K221,Proposito_programa!$C$2:$E$59,3,FALSE))","v":"Propósito 5: Construir Bogotá - Región con gobierno abierto, transparente y ciudadanía consciente"},2198,1,79436634,"JAIME ARIAS GUZMAN","Persona Natural",null,null,null,null,13860000,null,null,null,13860000,9856000,"2022-09-26","2022-09-27","2022-12-26",90,null,null,null,null,null,null,"En ejecución",0.71111111111111114]
[204,2022,"FDLAN-CD-204-2022-CPS-AG (77689)","https://community.secop.gov.co/Public/Tendering/OpportunityDetail/Index?noticeUID=CO1.NTC.3328800&isFromPublicArea=True&isModal=False\n","Contratos de prestación de servicios profesionales y de apoyo a la gestión","Contratación directa","Prestación de servicios profesionales y de apoyo a la gestión, o para la ejecución de trabajos artísticos que sólo puedan encomendarse a determinadas personas naturales","Prestación de servicios de apoyo a las actividades administrativas en cuanto a notificación de la correspondencia generada por el área de gestión del desarrollo, administrativa y financiera y área de gestión policiva de la Alcaldía de Antonio Nariño.","Inversión","Un nuevo contrato social y ambiental para la Bogotá del Siglo XXI",57,{"$f":"IF(ISERROR(VLOOKUP(K222,Proposito_programa!$C$2:$E$59,2,FALSE)),\" \",VLOOKUP(K222,Proposito_programa!$C$2:$E$59,2,FALSE))","v":"Gestión pública local"},{"$f":"IF(ISERROR(VLOOKUP(K222,Proposito_programa!$C$2:$E$59,3,FALSE)),\" \",VLOOKUP(K222,Proposito_programa!$C$2:$E$59,3,FALSE))","v":"Propósito 5: Construir Bogotá - Región con gobierno abierto, transparente y ciudadanía consciente"},2198,1,71594128,"JHON JAIRO MORENO PANIAGUA","Persona Natural",null,null,null,null,7380000,null,null,null,7380000,5084000,"2022-09-27","2022-09-29","2022-12-28",90,null,null,null,null,null,null,"En ejecución",0.68888888888888888]
[205,2022,"FDLAN-CD-205-2022(77665)\t","https://community.secop.gov.co/Public/Tendering/OpportunityDetail/Index?noticeUID=CO1.NTC.3328887&isFromPublicArea=True&isModal=False","Contratos de prestación de servicios profesionales y de apoyo a la gestión","Contratación directa","Prestación de servicios profesionales y de apoyo a la gestión, o para la ejecución de trabajos artísticos que sólo puedan encomendarse a determinadas personas naturales","Apoyar jurídicamente la ejecución de las acciones requeridas para la depuración de las actuaciones administrativas que cursan en la Alcaldía Local.","Inversión","Un nuevo contrato social y ambiental para la Bogotá del Siglo XXI",57,{"$f":"IF(ISERROR(VLOOKUP(K223,Proposito_programa!$C$2:$E$59,2,FALSE)),\" \",VLOOKUP(K223,Proposito_programa!$C$2:$E$59,2,FALSE))","v":"Gestión pública local"},{"$f":"IF(ISERROR(VLOOKUP(K223,Proposito_programa!$C$2:$E$59,3,FALSE)),\" \",VLOOKUP(K223,Proposito_programa!$C$2:$E$59,3,FALSE))","v":"Propósito 5: Construir Bogotá - Región con gobierno abierto, transparente y ciudadanía consciente"},2189,1,1022348896,"IVAN JAVIER SUAREZ QUIROGA","Persona Natural",null,null,null,null,13860000,null,null,null,13860000,9548000,"2022-09-27","2022-09-29","2022-12-28",90,null,null,null,null,null,null,"En ejecución",0.68888888888888888]
[206,2022,"FDLAN-CD-206-2022-CPS-AG (77724)","https://community.secop.gov.co/Public/Tendering/OpportunityDetail/Index?noticeUID=CO1.NTC.3329828&isFromPublicArea=True&isModal=False\n","Contratos de prestación de servicios profesionales y de apoyo a la gestión","Contratación directa","Prestación de servicios profesionales y de apoyo a la gestión, o para la ejecución de trabajos artísticos que sólo puedan encomendarse a determinadas personas naturales","Prestación de servicios de apoyo a la gestión en las labores asistenciales del área de gestión policiva, para los distintos procedimientos sancionatorios y trámites administrativos derivados de las acciones de inspección, vigilancia y control de la Alcaldía Local de Antonio Nariño","Inversión","Un nuevo contrato social y ambiental para la Bogotá del Siglo XXI",57,{"$f":"IF(ISERROR(VLOOKUP(K224,Proposito_programa!$C$2:$E$59,2,FALSE)),\" \",VLOOKUP(K224,Proposito_programa!$C$2:$E$59,2,FALSE))","v":"Gestión pública local"},{"$f":"IF(ISERROR(VLOOKUP(K224,Proposito_programa!$C$2:$E$59,3,FALSE)),\" \",VLOOKUP(K224,Proposito_programa!$C$2:$E$59,3,FALSE))","v":"Propósito 5: Construir Bogotá - Región con gobierno abierto, transparente y ciudadanía consciente"},2189,1,1031168565,"CESAR ALEXANDER LADINO MORENO","Persona Natural",null,null,null,null,7380000,null,null,null,7380000,5084000,"2022-09-27","2022-09-29","2022-12-28",90,null,null,null,null,null,null,"En ejecución",0.68888888888888888]
[208,2022,"FDLAN-CD-208-2022 (77665)\t","https://community.secop.gov.co/Public/Tendering/OpportunityDetail/Index?noticeUID=CO1.NTC.3335399&isFromPublicArea=True&isModal=False","Contratos de prestación de servicios profesionales y de apoyo a la gestión","Contratación directa","Prestación de servicios profesionales y de apoyo a la gestión, o para la ejecución de trabajos artísticos que sólo puedan encomendarse a determinadas personas naturales","Apoyar jurídicamente la ejecución de las acciones requeridas para la depuración de las actuaciones administrativas que cursan en la Alcaldía Local.","Inversión","Un nuevo contrato social y ambiental para la Bogotá del Siglo XXI",57,{"$f":"IF(ISERROR(VLOOKUP(K225,Proposito_programa!$C$2:$E$59,2,FALSE)),\" \",VLOOKUP(K225,Proposito_programa!$C$2:$E$59,2,FALSE))","v":"Gestión pública local"},{"$f":"IF(ISERROR(VLOOKUP(K225,Proposito_programa!$C$2:$E$59,3,FALSE)),\" \",VLOOKUP(K225,Proposito_programa!$C$2:$E$59,3,FALSE))","v":"Propósito 5: Construir Bogotá - Región con gobierno abierto, transparente y ciudadanía consciente"},2189,1,53029627,"JENNY PAOLA MENDIVELSO DUARTE","Persona Natural",null,null,null,null,13860000,null,null,null,13860000,9394000,"2022-09-28","2022-09-30","2022-12-29",90,null,null,null,null,null,null,"En ejecución",0.67777777777777781]
[209,2022,"FDLAN-CD-209-2022(77667)","https://community.secop.gov.co/Public/Tendering/OpportunityDetail/Index?noticeUID=CO1.NTC.3333358&isFromPublicArea=True&isModal=False","Contratos de prestación de servicios profesionales y de apoyo a la gestión","Contratación directa","Prestación de servicios profesionales y de apoyo a la gestión, o para la ejecución de trabajos artísticos que sólo puedan encomendarse a determinadas personas naturales","\tAPOYAR JURÍDICAMENTE LA EJECUCIÓN DE LAS ACCIONES REQUERIDAS PARA EL TRÁMITE E IMPULSO PROCESAL DE LAS ACTUACIONES CONTRAVENCIONALES Y/O QUERELLAS QUE CURSEN EN LAS INSPECCIONES DE POLICÍA DE LA LOCALIDAD","Inversión","Un nuevo contrato social y ambiental para la Bogotá del Siglo XXI",57,{"$f":"IF(ISERROR(VLOOKUP(K226,Proposito_programa!$C$2:$E$59,2,FALSE)),\" \",VLOOKUP(K226,Proposito_programa!$C$2:$E$59,2,FALSE))","v":"Gestión pública local"},{"$f":"IF(ISERROR(VLOOKUP(K226,Proposito_programa!$C$2:$E$59,3,FALSE)),\" \",VLOOKUP(K226,Proposito_programa!$C$2:$E$59,3,FALSE))","v":"Propósito 5: Construir Bogotá - Región con gobierno abierto, transparente y ciudadanía consciente"},2189,1,19141749,"HUMBERTO ANTONIO HERREÑO GARCIA","Persona Natural",null,null,null,null,13860000,null,null,null,13860000,9394000,"2022-09-28","2022-09-30","2022-12-29",90,null,null,null,null,null,null,"En ejecución",0.67777777777777781]
[210,2022,"FDLAN-CD-210-2022 (77715.)\t","https://community.secop.gov.co/Public/Tendering/OpportunityDetail/Index?noticeUID=CO1.NTC.3344668&isFromPublicArea=True&isModal=False","Contratos de prestación de servicios profesionales y de apoyo a la gestión","Contratación directa","Prestación de servicios profesionales y de apoyo a la gestión, o para la ejecución de trabajos artísticos que sólo puedan encomendarse a determinadas personas naturales","Prestación de servicios profesionales para apoyar el diligenciamiento de las actuaciones de los documentos técnicos de soporte y fichas de estadística básicas de inversión y elaboración de los documentos soporte necesarios para ejecutar los proyectos de inversión del fondo de desarrollo local de Antonio Nariño\t","Inversión","Un nuevo contrato social y ambiental para la Bogotá del Siglo XXI",57,{"$f":"IF(ISERROR(VLOOKUP(K227,Proposito_programa!$C$2:$E$59,2,FALSE)),\" \",VLOOKUP(K227,Proposito_programa!$C$2:$E$59,2,FALSE))","v":"Gestión pública local"},{"$f":"IF(ISERROR(VLOOKUP(K227,Proposito_programa!$C$2:$E$59,3,FALSE)),\" \",VLOOKUP(K227,Proposito_programa!$C$2:$E$59,3,FALSE))","v":"Propósito 5: Construir Bogotá - Región con gobierno abierto, transparente y ciudadanía consciente"},2198,1,1022389101,"HERNANDO NICOLAS MOLANO SOTELO","Persona Natural",null,null,null,null,13552000,null,null,null,13552000,8932000,"2022-09-30","2022-09-30","2022-12-29",88,null,null,null,null,null,null,"En ejecución",0.65909090909090906]
[211,2022,"FDLAN-CD-211-2022(77651)\t","https://community.secop.gov.co/Public/Tendering/OpportunityDetail/Index?noticeUID=CO1.NTC.3361154&isFromPublicArea=True&isModal=False","Contratos de prestación de servicios profesionales y de apoyo a la gestión","Contratación directa","Prestación de servicios profesionales y de apoyo a la gestión, o para la ejecución de trabajos artísticos que sólo puedan encomendarse a determinadas personas naturales","Prestar servicios profesionales al despacho del Alcalde local para el seguimiento de la gestión financiera del presupuesto del Plan de Desarrollo Local y el apoyo a las actividades inherentes al Modelo de Planeación y Gestión.\t","Inversión","Un nuevo contrato social y ambiental para la Bogotá del Siglo XXI",57,{"$f":"IF(ISERROR(VLOOKUP(K228,Proposito_programa!$C$2:$E$59,2,FALSE)),\" \",VLOOKUP(K228,Proposito_programa!$C$2:$E$59,2,FALSE))","v":"Gestión pública local"},{"$f":"IF(ISERROR(VLOOKUP(K228,Proposito_programa!$C$2:$E$59,3,FALSE)),\" \",VLOOKUP(K228,Proposito_programa!$C$2:$E$59,3,FALSE))","v":"Propósito 5: Construir Bogotá - Región con gobierno abierto, transparente y ciudadanía consciente"},2198,1,1073682219,"ADRIANA PAOLA MORALES RODRIGUEZ","Persona Natural",null,null,null,null,13244000,null,null,null,13244000,4004000,"2022-10-04","2022-10-06","2022-12-31",86,null,null,null,null,null,null,"En ejecución",0.30232558139534882]
[212,2022,"FDLAN-CD-212-2022(77667)\t","https://community.secop.gov.co/Public/Tendering/OpportunityDetail/Index?noticeUID=CO1.NTC.3366619&isFromPublicArea=True&isModal=False","Contratos de prestación de servicios profesionales y de apoyo a la gestión","Contratación directa","Prestación de servicios profesionales y de apoyo a la gestión, o para la ejecución de trabajos artísticos que sólo puedan encomendarse a determinadas personas naturales","Apoyar jurídicamente la ejecución de las acciones requeridas para el trámite e impulso procesal de las actuaciones contravencionales y/o querellas que cursen en las Inspecciones de Policía de la Localidad","Inversión","Un nuevo contrato social y ambiental para la Bogotá del Siglo XXI",57,{"$f":"IF(ISERROR(VLOOKUP(K229,Proposito_programa!$C$2:$E$59,2,FALSE)),\" \",VLOOKUP(K229,Proposito_programa!$C$2:$E$59,2,FALSE))","v":"Gestión pública local"},{"$f":"IF(ISERROR(VLOOKUP(K229,Proposito_programa!$C$2:$E$59,3,FALSE)),\" \",VLOOKUP(K229,Proposito_programa!$C$2:$E$59,3,FALSE))","v":"Propósito 5: Construir Bogotá - Región con gobierno abierto, transparente y ciudadanía consciente"},2189,1,1085271413,"DANIELA ZAMORA HIDALGO\t","Persona Natural",null,null,null,null,12936000,null,null,null,12936000,8316000,"2022-10-05","2022-10-07","2022-12-31",85,null,null,null,null,null,null,"En ejecución",0.6428571428571429]
[213,2022,"FDLAN-SAMC-008-2022 (76335)","https://community.secop.gov.co/Public/Tendering/OpportunityDetail/Index?noticeUID=CO1.NTC.3291540&isFromPublicArea=True&isModal=False","Otros","Selección abreviada","Selección abreviada por menor cuantía ","\tCONTRATAR LOS SERVICIOS Y ACTIVIDADES COMPLEMENTARIAS QUE MEJOREN LA SALUD Y EL BIENESTAR DE LAS PERSONAS CON DISCAPACIDAD Y SUS CUIDADORAS Y CUIDADORES DE LA LOCALIDAD ANTONIO NARIÑO.","Inversión","Un nuevo contrato social y ambiental para la Bogotá del Siglo XXI",6,{"$f":"IF(ISERROR(VLOOKUP(K230,Proposito_programa!$C$2:$E$59,2,FALSE)),\" \",VLOOKUP(K230,Proposito_programa!$C$2:$E$59,2,FALSE))","v":"Sistema Distrital de Cuidado"},{"$f":"IF(ISERROR(VLOOKUP(K230,Proposito_programa!$C$2:$E$59,3,FALSE)),\" \",VLOOKUP(K230,Proposito_programa!$C$2:$E$59,3,FALSE))","v":"Propósito 1: Hacer un nuevo contrato social para incrementar la inclusión social, productiva y política"},2194,7,901233617,"CORPORACION INTEGRAL PARA EL DESARROLLO DE LAS REGIONES","Persona Jurídica",null,null,null,null,125727435,null,null,null,125727435,0,"2022-10-04","2022-10-24","2023-02-07",120,null,null,null,null,null,null,"En ejecución",0]
[214,2022,"FDLAN-LP-002-2022\t","https://community.secop.gov.co/Public/Tendering/OpportunityDetail/Index?noticeUID=CO1.NTC.3180733&isFromPublicArea=True&isModal=False","Obra pública","Licitación pública","No aplica","CONTRATAR BAJO LA MODALIDAD DE PRECIOS UNITARIOS FIJOS Y A MONTO AGOTABLE LAS OBRAS PARA EL MANTENIMIENTO, ADECUACIÓN, REHABILITACIÓN Y RECUPERACIÓN DE PARQUES VECINALES Y DE BOLSILLO UBICADOS EN LA LOCALIDAD ANTONIO NARIÑO\t","Inversión","Un nuevo contrato social y ambiental para la Bogotá del Siglo XXI",33,{"$f":"IF(ISERROR(VLOOKUP(K231,Proposito_programa!$C$2:$E$59,2,FALSE)),\" \",VLOOKUP(K231,Proposito_programa!$C$2:$E$59,2,FALSE))","v":"Más árboles y más y mejor espacio público"},{"$f":"IF(ISERROR(VLOOKUP(K231,Proposito_programa!$C$2:$E$59,3,FALSE)),\" \",VLOOKUP(K231,Proposito_programa!$C$2:$E$59,3,FALSE))","v":"Propósito 2 : Cambiar Nuestros Hábitos de Vida para Reverdecer a Bogotá y Adaptarnos y Mitigar la Crisis Climática"},2207,18,"900.736.214-3","CONSORCIO ADECUACION PARQUES\t","Consorcio","NIT.901409034- NIT. 900940866- NIT. 901503062","M&G INGENIERIA Y CONSTRUCCIONES S.A.S. - Polo Construcciones e ingenieria sas - ANX INGENIERIA Y SOLUCIONES S.A.S.","M&G INGENIERIA Y CONSTRUCCIONES S.A.S. (47.50%)- Polo Construcciones e ingenieria sas (47.50%)- ANX INGENIERIA Y SOLUCIONES S.A.S. (5.00%)",null,337419410,null,null,null,337419410,0,"2022-09-23","2022-11-09","2023-01-23",75,null,null,null,null,null,null,"En ejecución",0]
[215,2022,"FDLAN-CMA-002-2022\t","https://community.secop.gov.co/Public/Tendering/OpportunityDetail/Index?noticeUID=CO1.NTC.2991458&isFromPublicArea=True&isModal=False","Otros","Concurso de méritos","No aplica","REALIZAR LA INTERVENTORÍA TÉCNICA, ADMINISTRATIVA, JURÍDICA (LEGAL), FINANCIERA (CONTABLE), AMBIENTAL, SOCIAL Y SST AL CONTRATO QUE TIENE POR OBJETO: \"CONTRATAR BAJO LA MODALIDAD DE PRECIOS UNITARIOS FIJOS Y A MONTO AGOTABLE LAS OBRAS PARA EL MANTENIMIENTO, ADECUACIÓN, REHABILITACIÓN Y RECUPERACIÓN DE PARQUES VECINALES Y DE BOLSILLO UBICADOS EN LA LOCALIDAD ANTONIO NARIÑO\t","Inversión","Un nuevo contrato social y ambiental para la Bogotá del Siglo XXI",33,{"$f":"IF(ISERROR(VLOOKUP(K232,Proposito_programa!$C$2:$E$59,2,FALSE)),\" \",VLOOKUP(K232,Proposito_programa!$C$2:$E$59,2,FALSE))","v":"Más árboles y más y mejor espacio público"},{"$f":"IF(ISERROR(VLOOKUP(K232,Proposito_programa!$C$2:$E$59,3,FALSE)),\" \",VLOOKUP(K232,Proposito_programa!$C$2:$E$59,3,FALSE))","v":"Propósito 2 : Cambiar Nuestros Hábitos de Vida para Reverdecer a Bogotá y Adaptarnos y Mitigar la Crisis Climática"},2207,14,901563205,"CONSTRUMAJ SAS","Persona Jurídica",null,"M&G INGENIERIA Y CONSTRUCCIONES S.A.S.- ",null,null,65289565,null,null,null,65289565,0,"2022-09-30","2022-11-09","2023-02-08",90,null,null,null,null,null,null,"En ejecución",0]
[216,2022,"FDLAN-SAMC-007-2022 (74615)","https://community.secop.gov.co/Public/Tendering/OpportunityDetail/Index?noticeUID=CO1.NTC.3289393&isFromPublicArea=True&isModal=False","Otros","Selección abreviada","Selección abreviada por menor cuantía ","REALIZAR APOYO LOGÍSTICO PARA EL DESARROLLO Y REALIZACIÓN DE LAS JORNADAS ARTISTICAS Y CULTURALES PARA ADULTO MAYOR DE LA LOCALIDAD ANTONIO NARIÑO\t","Inversión","Un nuevo contrato social y ambiental para la Bogotá del Siglo XXI",21,{"$f":"IF(ISERROR(VLOOKUP(K233,Proposito_programa!$C$2:$E$59,2,FALSE)),\" \",VLOOKUP(K233,Proposito_programa!$C$2:$E$59,2,FALSE))","v":"Creación y vida cotidiana: Apropiación ciudadana del arte, la cultura y el patrimonio, para la democracia cultural"},{"$f":"IF(ISERROR(VLOOKUP(K233,Proposito_programa!$C$2:$E$59,3,FALSE)),\" \",VLOOKUP(K233,Proposito_programa!$C$2:$E$59,3,FALSE))","v":"Propósito 1: Hacer un nuevo contrato social para incrementar la inclusión social, productiva y política"},2201,13,901154292,"LCB GROUP SAS\t","Persona Jurídica",null,null,null,null,168627998,null,null,null,168627998,0,"2022-10-04","2022-11-29","2023-02-28",120,null,null,null,null,null,null,"En ejecución",0]
[217,2022,"FDLAN-SAMC-009-2022 (77402)","https://community.secop.gov.co/Public/Tendering/OpportunityDetail/Index?noticeUID=CO1.NTC.3329472&isFromPublicArea=True&isModal=False","Otros","Selección abreviada","Selección abreviada por menor cuantía ","PRESTACION DE SERVICIOS DE APOYO LOGISTICO PARA LA REALIZACION DE LOS JUEGOS DEPORTIVOS COMUNALES DENOMINADOS \"MAS DEPORTE ES VIDA\" EN LA LOCALIDAD DE ANTONIO NARIÑO - FDLAN","Inversión","Un nuevo contrato social y ambiental para la Bogotá del Siglo XXI",20,{"$f":"IF(ISERROR(VLOOKUP(K234,Proposito_programa!$C$2:$E$59,2,FALSE)),\" \",VLOOKUP(K234,Proposito_programa!$C$2:$E$59,2,FALSE))","v":"Bogotá, referente en cultura, deporte, recreación y actividad física, con parques para el desarrollo y la salud"},{"$f":"IF(ISERROR(VLOOKUP(K234,Proposito_programa!$C$2:$E$59,3,FALSE)),\" \",VLOOKUP(K234,Proposito_programa!$C$2:$E$59,3,FALSE))","v":"Propósito 1: Hacer un nuevo contrato social para incrementar la inclusión social, productiva y política"},2200,4,901154292,"LCB GROUP SAS\t","Persona Jurídica",null,null,null,null,72855578,null,null,null,72855578,0,"2022-10-13","2022-10-19","2023-01-18",90,null,null,null,null,null,null,"En ejecución",0]
[218,2022,"FDLANCD-218-2022(77667)\t","https://community.secop.gov.co/Public/Tendering/OpportunityDetail/Index?noticeUID=CO1.NTC.3424690&isFromPublicArea=True&isModal=False\n","Contratos de prestación de servicios profesionales y de apoyo a la gestión","Contratación directa","Prestación de servicios profesionales y de apoyo a la gestión, o para la ejecución de trabajos artísticos que sólo puedan encomendarse a determinadas personas naturales","Apoyar jurídicamente la ejecución de las acciones requeridas para el trámite e impulso procesal de las actuaciones contravencionales y/o querellas que cursen en las Inspecciones de Policía de la Localidad.","Inversión","Un nuevo contrato social y ambiental para la Bogotá del Siglo XXI",57,{"$f":"IF(ISERROR(VLOOKUP(K235,Proposito_programa!$C$2:$E$59,2,FALSE)),\" \",VLOOKUP(K235,Proposito_programa!$C$2:$E$59,2,FALSE))","v":"Gestión pública local"},{"$f":"IF(ISERROR(VLOOKUP(K235,Proposito_programa!$C$2:$E$59,3,FALSE)),\" \",VLOOKUP(K235,Proposito_programa!$C$2:$E$59,3,FALSE))","v":"Propósito 5: Construir Bogotá - Región con gobierno abierto, transparente y ciudadanía consciente"},2189,1,79433342,"MIGUEL ARTURO MURCIA CUERVO","Persona Natural",null,null,null,null,10010000,null,null,null,10010000,5390000,"2022-10-20","2022-10-26","2022-12-31",70,null,null,null,null,null,null,"En ejecución",0.53846153846153844]
[219,2022,"FDLAN-CD-219-2022(79268)\t","https://community.secop.gov.co/Public/Tendering/OpportunityDetail/Index?noticeUID=CO1.NTC.3444252&isFromPublicArea=True&isModal=False","Contratos de prestación de servicios profesionales y de apoyo a la gestión","Contratación directa","Prestación de servicios profesionales y de apoyo a la gestión, o para la ejecución de trabajos artísticos que sólo puedan encomendarse a determinadas personas naturales","PRESTAR SERVICIOS PROFESIONALES, PARA APOYAR LA FORMULACIÓN, EJECUCIÓN, SUPERVISIÓN, SEGUIMIENTO CIERRE Y/O LIQUIDACIÓN DE LOS PROCESOS CONTRACTUALES QUE DEN RESPUESTA AL PROYECTO DE INVERSIÓN DE ACCIONES PARA LA CONSTRUCCIÓN DE MEMORIA, VERDAD, REPARACIÓN, VÍCTIMAS, PAZ Y RECONCILIACIÓN DE LA LOCALIDAD DE ANTONIO NARIÑO","Inversión","Un nuevo contrato social y ambiental para la Bogotá del Siglo XXI",57,{"$f":"IF(ISERROR(VLOOKUP(K236,Proposito_programa!$C$2:$E$59,2,FALSE)),\" \",VLOOKUP(K236,Proposito_programa!$C$2:$E$59,2,FALSE))","v":"Gestión pública local"},{"$f":"IF(ISERROR(VLOOKUP(K236,Proposito_programa!$C$2:$E$59,3,FALSE)),\" \",VLOOKUP(K236,Proposito_programa!$C$2:$E$59,3,FALSE))","v":"Propósito 5: Construir Bogotá - Región con gobierno abierto, transparente y ciudadanía consciente"},2198,1,1070979522,"SERGIO NICOLAS POVEDA LEON\t","Persona Natural",null,null,null,null,9240000,null,null,null,9240000,5390000,"2022-10-25","2022-10-26","2022-12-25",60,null,null,null,null,null,null,"En ejecución",0.58333333333333337]
[220,2022,"FDLANCD-220-2022(79111)\t","https://community.secop.gov.co/Public/Tendering/OpportunityDetail/Index?noticeUID=CO1.NTC.3443152&isFromPublicArea=True&isModal=False","Contratos de prestación de servicios profesionales y de apoyo a la gestión","Contratación directa","Prestación de servicios profesionales y de apoyo a la gestión, o para la ejecución de trabajos artísticos que sólo puedan encomendarse a determinadas personas naturales","Prestar servicios de apoyo a la gestión del fondo de desarrollo local de Antonio Nariño en los asuntos operativos relacionados con la seguridad, la convivencia y el desarrollo de actividad económica en la localidad, con conformidad con el marco normativo aplicable en la materia.","Inversión","Un nuevo contrato social y ambiental para la Bogotá del Siglo XXI",57,{"$f":"IF(ISERROR(VLOOKUP(K237,Proposito_programa!$C$2:$E$59,2,FALSE)),\" \",VLOOKUP(K237,Proposito_programa!$C$2:$E$59,2,FALSE))","v":"Gestión pública local"},{"$f":"IF(ISERROR(VLOOKUP(K237,Proposito_programa!$C$2:$E$59,3,FALSE)),\" \",VLOOKUP(K237,Proposito_programa!$C$2:$E$59,3,FALSE))","v":"Propósito 5: Construir Bogotá - Región con gobierno abierto, transparente y ciudadanía consciente"},2198,1,1013659896,"FELIPE ARANGO MORALES","Persona Natural",null,null,null,null,4920000,null,null,null,4920000,2706000,"2022-10-25","2022-10-28","2022-12-27",60,null,null,null,null,null,null,"En ejecución",0.55000000000000004]
[221,2022,"FDLAN-CD-221-2022(79111)\t","https://community.secop.gov.co/Public/Tendering/OpportunityDetail/Index?noticeUID=CO1.NTC.3444428&isFromPublicArea=True&isModal=False","Contratos de prestación de servicios profesionales y de apoyo a la gestión","Contratación directa","Prestación de servicios profesionales y de apoyo a la gestión, o para la ejecución de trabajos artísticos que sólo puedan encomendarse a determinadas personas naturales","PRESTAR SERVICIOS DE APOYO A LA GESTIÓN DEL FONDO DE DESARROLLO LOCAL DE ANTONIO NARIÑO EN LOS ASUNTOS OPERATIVOS RELACIONADOS CON LA SEGURIDAD, LA CONVIVENCIA Y EL DESARROLLO DE ACTIVIDAD ECONÓMICA EN LA LOCALIDAD, CON CONFORMIDAD CON EL MARCO NORMATIVO APLICABLE EN LA MATERIA.","Inversión","Un nuevo contrato social y ambiental para la Bogotá del Siglo XXI",57,{"$f":"IF(ISERROR(VLOOKUP(K238,Proposito_programa!$C$2:$E$59,2,FALSE)),\" \",VLOOKUP(K238,Proposito_programa!$C$2:$E$59,2,FALSE))","v":"Gestión pública local"},{"$f":"IF(ISERROR(VLOOKUP(K238,Proposito_programa!$C$2:$E$59,3,FALSE)),\" \",VLOOKUP(K238,Proposito_programa!$C$2:$E$59,3,FALSE))","v":"Propósito 5: Construir Bogotá - Región con gobierno abierto, transparente y ciudadanía consciente"},2189,1,1000120198,"AARON SIERRA PARDO","Persona Natural",null,null,null,null,4920000,null,null,null,4920000,2788000,"2022-10-25","2022-10-27","2022-12-26",60,null,null,null,null,null,null,"En ejecución",0.56666666666666665]
[222,2022,"FDLAN-CD-222-2022 (79111)","https://community.secop.gov.co/Public/Tendering/OpportunityDetail/Index?noticeUID=CO1.NTC.3447052&isFromPublicArea=True&isModal=False","Contratos de prestación de servicios profesionales y de apoyo a la gestión","Contratación directa","Prestación de servicios profesionales y de apoyo a la gestión, o para la ejecución de trabajos artísticos que sólo puedan encomendarse a determinadas personas naturales","\tEL CONTRATO QUE SE PRETENDE CELEBRAR, TENDRÁ POR OBJETO PRESTAR SERVICIOS DE APOYO A LA GESTIÓN DEL FONDO DE DESARROLLO LOCAL DE ANTONIO NARIÑO EN LOS ASUNTOS OPERATIVOS RELACIONADOS CON LA SEGURIDAD, LA CONVIVENCIA Y EL DESARROLLO DE ACTIVIDAD ECONÓMICA EN LA LOCALIDAD, CON CONFORMIDAD CON EL MARCO NORMATIVO APLICABLE EN LA MATERIA.","Inversión","Un nuevo contrato social y ambiental para la Bogotá del Siglo XXI",57,{"$f":"IF(ISERROR(VLOOKUP(K239,Proposito_programa!$C$2:$E$59,2,FALSE)),\" \",VLOOKUP(K239,Proposito_programa!$C$2:$E$59,2,FALSE))","v":"Gestión pública local"},{"$f":"IF(ISERROR(VLOOKUP(K239,Proposito_programa!$C$2:$E$59,3,FALSE)),\" \",VLOOKUP(K239,Proposito_programa!$C$2:$E$59,3,FALSE))","v":"Propósito 5: Construir Bogotá - Región con gobierno abierto, transparente y ciudadanía consciente"},2198,1,79370565,"JORGE RAMIRO ORTIZ JARAMILLO","Persona Natural",null,null,null,null,4920000,null,null,null,4920000,2788000,"2022-10-26","2022-10-27","2022-12-26",60,null,null,null,null,null,null,"En ejecución",0.56666666666666665]
[223,2022,"FDLAN-CD-223-2022 (79111)\t","https://community.secop.gov.co/Public/Tendering/OpportunityDetail/Index?noticeUID=CO1.NTC.3449423&isFromPublicArea=True&isModal=False","Contratos de prestación de servicios profesionales y de apoyo a la gestión","Contratación directa","Prestación de servicios profesionales y de apoyo a la gestión, o para la ejecución de trabajos artísticos que sólo puedan encomendarse a determinadas personas naturales","Prestar servicios de apoyo a la gestión del fondo de desarrollo local de Antonio Nariño en los asuntos operativos relacionados con la seguridad, la convivencia y el desarrollo de actividad económica en la localidad, con conformidad con el marco normativo aplicable en la materia","Inversión","Un nuevo contrato social y ambiental para la Bogotá del Siglo XXI",57,{"$f":"IF(ISERROR(VLOOKUP(K240,Proposito_programa!$C$2:$E$59,2,FALSE)),\" \",VLOOKUP(K240,Proposito_programa!$C$2:$E$59,2,FALSE))","v":"Gestión pública local"},{"$f":"IF(ISERROR(VLOOKUP(K240,Proposito_programa!$C$2:$E$59,3,FALSE)),\" \",VLOOKUP(K240,Proposito_programa!$C$2:$E$59,3,FALSE))","v":"Propósito 5: Construir Bogotá - Región con gobierno abierto, transparente y ciudadanía consciente"},2198,1,19341321,"ALVARO AMARIS ROJAS","Persona Natural",null,null,null,null,4920000,null,null,null,4920000,2706000,"2022-10-26","2022-10-28","2022-12-27",60,null,null,null,null,null,null,"En ejecución",0.55000000000000004]
[224,2022,"FDLAN-CD-224-2022 (79111)\t","https://community.secop.gov.co/Public/Tendering/OpportunityDetail/Index?noticeUID=CO1.NTC.3451925&isFromPublicArea=True&isModal=False","Contratos de prestación de servicios profesionales y de apoyo a la gestión","Contratación directa","Prestación de servicios profesionales y de apoyo a la gestión, o para la ejecución de trabajos artísticos que sólo puedan encomendarse a determinadas personas naturales","EL CONTRATO QUE SE PRETENDE CELEBRAR, TENDRÁ POR OBJETO PRESTAR SERVICIOS DE APOYO A LA GESTIÓN DEL FONDO DE DESARROLLO LOCAL DE ANTONIO NARIÑO EN LOS ASUNTOS OPERATIVOS RELACIONADOS CON LA SEGURIDAD, LA CONVIVENCIA Y EL DESARROLLO DE ACTIVIDAD ECONÓMICA EN LA LOCALIDAD, CON CONFORMIDAD CON EL MARCO NORMATIVO APLICABLE EN LA MATERIA.","Inversión","Un nuevo contrato social y ambiental para la Bogotá del Siglo XXI",57,{"$f":"IF(ISERROR(VLOOKUP(K241,Proposito_programa!$C$2:$E$59,2,FALSE)),\" \",VLOOKUP(K241,Proposito_programa!$C$2:$E$59,2,FALSE))","v":"Gestión pública local"},{"$f":"IF(ISERROR(VLOOKUP(K241,Proposito_programa!$C$2:$E$59,3,FALSE)),\" \",VLOOKUP(K241,Proposito_programa!$C$2:$E$59,3,FALSE))","v":"Propósito 5: Construir Bogotá - Región con gobierno abierto, transparente y ciudadanía consciente"},2198,1,1013585301,"NEL JAVIER CARDONA GUZMAN","Persona Natural",null,null,null,null,4920000,null,null,null,4920000,2706000,"2022-10-27","2022-10-28","2022-12-27",60,null,null,null,null,null,null,"En ejecución",0.55000000000000004]
[225,2022,"FDLAN-CD-225-2022 (79111)\t","https://community.secop.gov.co/Public/Tendering/OpportunityDetail/Index?noticeUID=CO1.NTC.3451893&isFromPublicArea=True&isModal=False}","Contratos de prestación de servicios profesionales y de apoyo a la gestión","Contratación directa","Prestación de servicios profesionales y de apoyo a la gestión, o para la ejecución de trabajos artísticos que sólo puedan encomendarse a determinadas personas naturales","Prestar servicios de apoyo a la gestión del fondo de desarrollo local de Antonio Nariño en los asuntos operativos relacionados con la seguridad, la convivencia y el desarrollo de actividad económica en la localidad, con conformidad con el marco normativo aplicable en la materia.\t","Inversión","Un nuevo contrato social y ambiental para la Bogotá del Siglo XXI",57,{"$f":"IF(ISERROR(VLOOKUP(K242,Proposito_programa!$C$2:$E$59,2,FALSE)),\" \",VLOOKUP(K242,Proposito_programa!$C$2:$E$59,2,FALSE))","v":"Gestión pública local"},{"$f":"IF(ISERROR(VLOOKUP(K242,Proposito_programa!$C$2:$E$59,3,FALSE)),\" \",VLOOKUP(K242,Proposito_programa!$C$2:$E$59,3,FALSE))","v":"Propósito 5: Construir Bogotá - Región con gobierno abierto, transparente y ciudadanía consciente"},2198,1,1032430608,"LAURA VIVIANA OROÑEZ FANDIÑO","Persona Natural",null,null,null,null,4920000,null,null,null,4920000,2460000,"2022-10-27","2022-11-01","2022-12-30",60,null,null,null,null,null,null,"En ejecución",0.5]
[226,2022,"FDLAN-CD-226-2022(79243)\t","https://community.secop.gov.co/Public/Tendering/OpportunityDetail/Index?noticeUID=CO1.NTC.3454279&isFromPublicArea=True&isModal=False","Contratos de prestación de servicios profesionales y de apoyo a la gestión","Contratación directa","Prestación de servicios profesionales y de apoyo a la gestión, o para la ejecución de trabajos artísticos que sólo puedan encomendarse a determinadas personas naturales","APOYAR AL ALCALDE LOCAL EN LA FORMULACIÓN, SEGUIMIENTO E IMPLEMENTACIÓN DE LA ESTRATEGIA LOCAL PARA LA TERMINACIÓN JURÍDICA O INACTIVACIÓN DE LAS ACTUACIONES ADMINISTRATIVAS QUE CURSAN EN LA ALCALDÍA LOCAL.","Inversión","Un nuevo contrato social y ambiental para la Bogotá del Siglo XXI",57,{"$f":"IF(ISERROR(VLOOKUP(K243,Proposito_programa!$C$2:$E$59,2,FALSE)),\" \",VLOOKUP(K243,Proposito_programa!$C$2:$E$59,2,FALSE))","v":"Gestión pública local"},{"$f":"IF(ISERROR(VLOOKUP(K243,Proposito_programa!$C$2:$E$59,3,FALSE)),\" \",VLOOKUP(K243,Proposito_programa!$C$2:$E$59,3,FALSE))","v":"Propósito 5: Construir Bogotá - Región con gobierno abierto, transparente y ciudadanía consciente"},2189,1,55250194,"ALMA KARINA DE CASTRO MARIN\t","Persona Natural",null,null,null,null,14106000,null,1,7053000,21159000,7053000,"2022-10-27","2022-11-01","2022-12-30",60,null,null,null,null,null,null,"En ejecución",0.33333333333333331]
[227,2022,"FDLAN-CD-227-2022 (79318)","https://community.secop.gov.co/Public/Tendering/OpportunityDetail/Index?noticeUID=CO1.NTC.3456912&isFromPublicArea=True&isModal=False\n","Contratos de prestación de servicios profesionales y de apoyo a la gestión","Contratación directa","Prestación de servicios profesionales y de apoyo a la gestión, o para la ejecución de trabajos artísticos que sólo puedan encomendarse a determinadas personas naturales","\tPrestar servicios profesionales para apoyar la ejecución, supervisión, seguimiento, cierre y/o liquidación de los procesos contractuales de la localidad de Antonio Nariño.","Inversión","Un nuevo contrato social y ambiental para la Bogotá del Siglo XXI",57,{"$f":"IF(ISERROR(VLOOKUP(K244,Proposito_programa!$C$2:$E$59,2,FALSE)),\" \",VLOOKUP(K244,Proposito_programa!$C$2:$E$59,2,FALSE))","v":"Gestión pública local"},{"$f":"IF(ISERROR(VLOOKUP(K244,Proposito_programa!$C$2:$E$59,3,FALSE)),\" \",VLOOKUP(K244,Proposito_programa!$C$2:$E$59,3,FALSE))","v":"Propósito 5: Construir Bogotá - Región con gobierno abierto, transparente y ciudadanía consciente"},2198,1,1013590697,"YURY ANDREA ALARCON RODRIGUEZ\t","Persona Natural",null,null,null,null,9240000,null,null,null,9240000,4620000,"2022-10-28","2022-11-01","2022-12-31",60,null,null,null,null,null,null,"En ejecución",0.5]
[228,2022,"FDLANCD-228 -2022 (79251)\t","https://community.secop.gov.co/Public/Tendering/OpportunityDetail/Index?noticeUID=CO1.NTC.3458215&isFromPublicArea=True&isModal=False\n","Contratos de prestación de servicios profesionales y de apoyo a la gestión","Contratación directa","Prestación de servicios profesionales y de apoyo a la gestión, o para la ejecución de trabajos artísticos que sólo puedan encomendarse a determinadas personas naturales","\tApoyar las labores de entrega y recibo de las comunicaciones emitidas o recibidas por las Inspecciones de Policía de la Localidad.","Inversión","Un nuevo contrato social y ambiental para la Bogotá del Siglo XXI",57,{"$f":"IF(ISERROR(VLOOKUP(K245,Proposito_programa!$C$2:$E$59,2,FALSE)),\" \",VLOOKUP(K245,Proposito_programa!$C$2:$E$59,2,FALSE))","v":"Gestión pública local"},{"$f":"IF(ISERROR(VLOOKUP(K245,Proposito_programa!$C$2:$E$59,3,FALSE)),\" \",VLOOKUP(K245,Proposito_programa!$C$2:$E$59,3,FALSE))","v":"Propósito 5: Construir Bogotá - Región con gobierno abierto, transparente y ciudadanía consciente"},2189,1,1013646511,"ANGIE PAOLA BAYONA CONTRERAS","Persona Natural",null,null,null,null,3952000,null,null,null,3952000,1976000,"2022-10-28","2022-11-01","2022-12-31",60,null,null,null,null,null,null,"En ejecución",0.5]
[229,2022,"FDLAN-CD-229-2022 (79318)\t","https://community.secop.gov.co/Public/Tendering/OpportunityDetail/Index?noticeUID=CO1.NTC.3458888&isFromPublicArea=True&isModal=False\n","Contratos de prestación de servicios profesionales y de apoyo a la gestión","Contratación directa","Prestación de servicios profesionales y de apoyo a la gestión, o para la ejecución de trabajos artísticos que sólo puedan encomendarse a determinadas personas naturales","\tPrestación de servicios profesionales para apoyar al área gestión del desarrollo, administrativa y financiera en el diligenciamiento de las actuaciones de los documentos técnicos de soporte y fichas de estadística básicas de inversión y elaboración de los documentos soporte necesarios para ejecutar los proyectos de inversión del fondo de desarrollo local de Antonio Nariño","Inversión","Un nuevo contrato social y ambiental para la Bogotá del Siglo XXI",57,{"$f":"IF(ISERROR(VLOOKUP(K246,Proposito_programa!$C$2:$E$59,2,FALSE)),\" \",VLOOKUP(K246,Proposito_programa!$C$2:$E$59,2,FALSE))","v":"Gestión pública local"},{"$f":"IF(ISERROR(VLOOKUP(K246,Proposito_programa!$C$2:$E$59,3,FALSE)),\" \",VLOOKUP(K246,Proposito_programa!$C$2:$E$59,3,FALSE))","v":"Propósito 5: Construir Bogotá - Región con gobierno abierto, transparente y ciudadanía consciente"},2198,1,7570624,"FABIAN ENRIQUE DAZA MORALES","Persona Natural",null,null,null,null,9240000,null,null,null,9240000,4620000,"2022-10-28","2022-11-01","2022-12-31",60,null,null,null,null,null,null,"En ejecución",0.5]
[230,2022,"FDLANCD-230-2022(79324)\t","https://community.secop.gov.co/Public/Tendering/OpportunityDetail/Index?noticeUID=CO1.NTC.3458555&isFromPublicArea=True&isModal=False\n","Contratos de prestación de servicios profesionales y de apoyo a la gestión","Contratación directa","Prestación de servicios profesionales y de apoyo a la gestión, o para la ejecución de trabajos artísticos que sólo puedan encomendarse a determinadas personas naturales","PRESTAR SERVICIOS DE APOYO A LA GESTIÓN AL FONDO DE DESARROLLO LOCAL DE ANTONIO NARIÑO EN EL ACOMPAÑAMIENTO A LAS ACTIVIDADES REALIZADAS DENTRO DE LOS PROCESOS DE PARTICIPACIÓN LOCAL","Inversión","Un nuevo contrato social y ambiental para la Bogotá del Siglo XXI",57,{"$f":"IF(ISERROR(VLOOKUP(K247,Proposito_programa!$C$2:$E$59,2,FALSE)),\" \",VLOOKUP(K247,Proposito_programa!$C$2:$E$59,2,FALSE))","v":"Gestión pública local"},{"$f":"IF(ISERROR(VLOOKUP(K247,Proposito_programa!$C$2:$E$59,3,FALSE)),\" \",VLOOKUP(K247,Proposito_programa!$C$2:$E$59,3,FALSE))","v":"Propósito 5: Construir Bogotá - Región con gobierno abierto, transparente y ciudadanía consciente"},2198,1,1013590912,"JOHN NUMAEL URREGO BELTRAN","Persona Natural",null,null,null,null,4920000,null,null,null,4920000,2460000,"2022-10-28","2022-11-01","2022-12-31",60,null,null,null,null,null,null,"En ejecución",0.5]
[231,2022,"FDLANCD-231-2022(79245)\t","https://community.secop.gov.co/Public/Tendering/OpportunityDetail/Index?noticeUID=CO1.NTC.3459303&isFromPublicArea=True&isModal=False","Contratos de prestación de servicios profesionales y de apoyo a la gestión","Contratación directa","Prestación de servicios profesionales y de apoyo a la gestión, o para la ejecución de trabajos artísticos que sólo puedan encomendarse a determinadas personas naturales","APOYAR ADMINISTRATIVA Y ASISTENCIALMENTE A LAS INSPECCIONES DE POLICÍA DE LA LOCALIDAD\t","Inversión","Un nuevo contrato social y ambiental para la Bogotá del Siglo XXI",57,{"$f":"IF(ISERROR(VLOOKUP(K248,Proposito_programa!$C$2:$E$59,2,FALSE)),\" \",VLOOKUP(K248,Proposito_programa!$C$2:$E$59,2,FALSE))","v":"Gestión pública local"},{"$f":"IF(ISERROR(VLOOKUP(K248,Proposito_programa!$C$2:$E$59,3,FALSE)),\" \",VLOOKUP(K248,Proposito_programa!$C$2:$E$59,3,FALSE))","v":"Propósito 5: Construir Bogotá - Región con gobierno abierto, transparente y ciudadanía consciente"},2189,1,80206518,"\n\tEDWIN HARVEY GUTIERREZ LOZANO\n","Persona Natural",null,null,null,null,7524000,null,null,null,7524000,3762000,"2022-10-28","2022-11-01","2022-12-31",60,null,null,null,null,null,null,"En ejecución",0.5]
[232,2022,"FDLANCD-232-2022(79346)\t","https://community.secop.gov.co/Public/Tendering/OpportunityDetail/Index?noticeUID=CO1.NTC.3459046&isFromPublicArea=True&isModal=False","Contratos de prestación de servicios profesionales y de apoyo a la gestión","Contratación directa","Prestación de servicios profesionales y de apoyo a la gestión, o para la ejecución de trabajos artísticos que sólo puedan encomendarse a determinadas personas naturales","COORDINA, LIDERA Y ASESORA LOS PLANES Y ESTRATEGIAS DE COMUNICACIÓN INTERNA Y EXTERNA PARA LA DIVULGACIÓN DE LOS PROGRAMAS, PROYECTOS Y ACTIVIDADES DE LA ALCALDÍA LOCAL\t","Inversión","Un nuevo contrato social y ambiental para la Bogotá del Siglo XXI",57,{"$f":"IF(ISERROR(VLOOKUP(K249,Proposito_programa!$C$2:$E$59,2,FALSE)),\" \",VLOOKUP(K249,Proposito_programa!$C$2:$E$59,2,FALSE))","v":"Gestión pública local"},{"$f":"IF(ISERROR(VLOOKUP(K249,Proposito_programa!$C$2:$E$59,3,FALSE)),\" \",VLOOKUP(K249,Proposito_programa!$C$2:$E$59,3,FALSE))","v":"Propósito 5: Construir Bogotá - Región con gobierno abierto, transparente y ciudadanía consciente"},2198,1,83161135,"CARLOS ANDRES HIGUITA VARGAS\t","Persona Natural",null,null,null,null,14040000,null,null,null,14040000,7020000,"2022-10-28","2022-11-01","2022-12-31",60,null,null,null,null,null,null,"En ejecución",0.5]
[233,2022,"FDLANCD-233-2022 (79265)\t","https://community.secop.gov.co/Public/Tendering/OpportunityDetail/Index?noticeUID=CO1.NTC.3466117&isFromPublicArea=True&isModal=False\n","Contratos de prestación de servicios profesionales y de apoyo a la gestión","Contratación directa","Prestación de servicios profesionales y de apoyo a la gestión, o para la ejecución de trabajos artísticos que sólo puedan encomendarse a determinadas personas naturales","Prestación de servicios de apoyo a la gestión en las labores asistenciales del área de gestión policiva, para los distintos procedimientos sancionatorios y trámites administrativos relacionados con las acciones de inspección, vigilancia y control de la Alcaldía Local de Antonio Nariño\t","Inversión","Un nuevo contrato social y ambiental para la Bogotá del Siglo XXI",57,{"$f":"IF(ISERROR(VLOOKUP(K250,Proposito_programa!$C$2:$E$59,2,FALSE)),\" \",VLOOKUP(K250,Proposito_programa!$C$2:$E$59,2,FALSE))","v":"Gestión pública local"},{"$f":"IF(ISERROR(VLOOKUP(K250,Proposito_programa!$C$2:$E$59,3,FALSE)),\" \",VLOOKUP(K250,Proposito_programa!$C$2:$E$59,3,FALSE))","v":"Propósito 5: Construir Bogotá - Región con gobierno abierto, transparente y ciudadanía consciente"},2189,1,93399784,"JUAN CARLOS CASALLAS DEVIA\t","Persona Natural",null,null,null,null,4920000,null,null,null,4920000,2460000,"2022-10-31","2022-11-01","2022-12-31",60,null,null,null,null,null,null,"En ejecución",0.5]
[234,2022,"FDLANCD-234-2022 (79350)\t","https://community.secop.gov.co/Public/Tendering/OpportunityDetail/Index?noticeUID=CO1.NTC.3466118&isFromPublicArea=True&isModal=False\n","Contratos de prestación de servicios profesionales y de apoyo a la gestión","Contratación directa","Prestación de servicios profesionales y de apoyo a la gestión, o para la ejecución de trabajos artísticos que sólo puedan encomendarse a determinadas personas naturales","PRESTAR SERVICIOS PROFESIONALES COMO ABOGADO PARA APOYAR LOS DISTINTOS PROCEDIMIENTOS SANCIONATORIOS Y TRÁMITES ADMINISTRATIVOS RELACIONADOS CON LA INSPECCIÓN, VIGILANCIA Y CONTROL DEL ÁREA DE GESTIÓN POLICIVA DEL FONDO DE DESARROLLO LOCAL ANTONIO NARIÑO, CON OCASIÓN A LA INFRACCIÓN Y APLICACIÓN DE NORMAS POLICIVAS EN MATERIA DE PROTECCIÓN AL CONSUMIDOR, CONTROL DE CALIDAD, PRECIOS, PESAS Y MEDIDAS.\t","Inversión","Un nuevo contrato social y ambiental para la Bogotá del Siglo XXI",57,{"$f":"IF(ISERROR(VLOOKUP(K251,Proposito_programa!$C$2:$E$59,2,FALSE)),\" \",VLOOKUP(K251,Proposito_programa!$C$2:$E$59,2,FALSE))","v":"Gestión pública local"},{"$f":"IF(ISERROR(VLOOKUP(K251,Proposito_programa!$C$2:$E$59,3,FALSE)),\" \",VLOOKUP(K251,Proposito_programa!$C$2:$E$59,3,FALSE))","v":"Propósito 5: Construir Bogotá - Región con gobierno abierto, transparente y ciudadanía consciente"},2189,1,1026575400,"GERMAN MENDOZA GALVIS","Persona Natural",null,null,null,null,9240000,null,null,null,9240000,4620000,"2022-10-31","2022-11-01","2022-12-31",60,null,null,null,null,null,null,"En ejecución",0.5]
[235,2022,"FDLANCD-235-2022 (79255)\t","https://community.secop.gov.co/Public/Tendering/OpportunityDetail/Index?noticeUID=CO1.NTC.3499548&isFromPublicArea=True&isModal=False\n","Contratos de prestación de servicios profesionales y de apoyo a la gestión","Contratación directa","Prestación de servicios profesionales y de apoyo a la gestión, o para la ejecución de trabajos artísticos que sólo puedan encomendarse a determinadas personas naturales","Apoyar jurídicamente la ejecución de las acciones requeridas para la depuración de las actuaciones administrativas que cursan en la Alcaldía Local.\t","Inversión","Un nuevo contrato social y ambiental para la Bogotá del Siglo XXI",57,{"$f":"IF(ISERROR(VLOOKUP(K252,Proposito_programa!$C$2:$E$59,2,FALSE)),\" \",VLOOKUP(K252,Proposito_programa!$C$2:$E$59,2,FALSE))","v":"Gestión pública local"},{"$f":"IF(ISERROR(VLOOKUP(K252,Proposito_programa!$C$2:$E$59,3,FALSE)),\" \",VLOOKUP(K252,Proposito_programa!$C$2:$E$59,3,FALSE))","v":"Propósito 5: Construir Bogotá - Región con gobierno abierto, transparente y ciudadanía consciente"},2198,1,1023945133,"FLOR NATALI RUBIO HERNANDEZ\t","Persona Natural",null,null,null,null,8008000,null,null,null,8008000,3388000,"2022-11-08","2022-11-09","2022-12-31",52,null,null,null,null,null,null,"En ejecución",0.42307692307692307]
[236,2022,"FDLANCD-236-2022 (79387)\t","https://community.secop.gov.co/Public/Tendering/OpportunityDetail/Index?noticeUID=CO1.NTC.3472539&isFromPublicArea=True&isModal=False\n","Contratos de prestación de servicios profesionales y de apoyo a la gestión","Contratación directa","Prestación de servicios profesionales y de apoyo a la gestión, o para la ejecución de trabajos artísticos que sólo puedan encomendarse a determinadas personas naturales","Prestar servicios de apoyo a la gestión del fondo de desarrollo local de Antonio Nariño en los asuntos operativos relacionados con la seguridad, la convivencia y el desarrollo de actividad económica\t","Inversión","Un nuevo contrato social y ambiental para la Bogotá del Siglo XXI",57,{"$f":"IF(ISERROR(VLOOKUP(K253,Proposito_programa!$C$2:$E$59,2,FALSE)),\" \",VLOOKUP(K253,Proposito_programa!$C$2:$E$59,2,FALSE))","v":"Gestión pública local"},{"$f":"IF(ISERROR(VLOOKUP(K253,Proposito_programa!$C$2:$E$59,3,FALSE)),\" \",VLOOKUP(K253,Proposito_programa!$C$2:$E$59,3,FALSE))","v":"Propósito 5: Construir Bogotá - Región con gobierno abierto, transparente y ciudadanía consciente"},2189,1,19425371,"LIBARDO RUBEN CUELLAR BURGOS","Persona Natural",null,null,null,null,4920000,null,null,null,4920000,2214000,"2022-11-01","2022-11-04","2022-12-31",59,null,null,null,null,null,null,"En ejecución",0.45]
[237,2022,"FDLANCD-237-2022(79325)\t","https://community.secop.gov.co/Public/Tendering/OpportunityDetail/Index?noticeUID=CO1.NTC.3466262&isFromPublicArea=True&isModal=False","Contratos de prestación de servicios profesionales y de apoyo a la gestión","Contratación directa","Prestación de servicios profesionales y de apoyo a la gestión, o para la ejecución de trabajos artísticos que sólo puedan encomendarse a determinadas personas naturales","APOYAR TÉCNICAMENTE LAS DISTINTAS ETAPAS DE LOS PROCESOS DE COMPETENCIA DE LA ALCALDÍA LOCAL PARA LA DEPURACIÓN DE ACTUACIONES ADMINISTRATIVAS\t","Inversión","Un nuevo contrato social y ambiental para la Bogotá del Siglo XXI",57,{"$f":"IF(ISERROR(VLOOKUP(K254,Proposito_programa!$C$2:$E$59,2,FALSE)),\" \",VLOOKUP(K254,Proposito_programa!$C$2:$E$59,2,FALSE))","v":"Gestión pública local"},{"$f":"IF(ISERROR(VLOOKUP(K254,Proposito_programa!$C$2:$E$59,3,FALSE)),\" \",VLOOKUP(K254,Proposito_programa!$C$2:$E$59,3,FALSE))","v":"Propósito 5: Construir Bogotá - Región con gobierno abierto, transparente y ciudadanía consciente"},2198,1,1074129871,"SANTIAGO NICOLAS MORA GUTIERREZ\t","Persona Natural",null,null,null,null,10800000,null,null,null,10800000,5400000,"2022-10-31","2022-11-01","2022-12-31",60,null,null,null,null,null,null,"En ejecución",0.5]
[238,2022,"FDLANCD-238-2022(79334)\t","https://community.secop.gov.co/Public/Tendering/OpportunityDetail/Index?noticeUID=CO1.NTC.3465715&isFromPublicArea=True&isModal=False","Contratos de prestación de servicios profesionales y de apoyo a la gestión","Contratación directa","Prestación de servicios profesionales y de apoyo a la gestión, o para la ejecución de trabajos artísticos que sólo puedan encomendarse a determinadas personas naturales","APOYAR LA GESTIÓN DOCUMENTAL DE LA ALCALDÍA LOCAL EN LA IMPLEMENTACIÓN DE LOS PROCESOS DE CLASIFICACIÓN, ORDENACIÓN, SELECCIÓN NATURAL, FOLIACIÓN, IDENTIFICACIÓN, LEVANTAMIENTO DE INVENTARIOS, ALMACENAMIENTO Y APLICACIÓN DE PROTOCOLOS DE ELIMINACIÓN Y TRANSFERENCIAS DOCUMENTALES\t","Inversión","Un nuevo contrato social y ambiental para la Bogotá del Siglo XXI",57,{"$f":"IF(ISERROR(VLOOKUP(K255,Proposito_programa!$C$2:$E$59,2,FALSE)),\" \",VLOOKUP(K255,Proposito_programa!$C$2:$E$59,2,FALSE))","v":"Gestión pública local"},{"$f":"IF(ISERROR(VLOOKUP(K255,Proposito_programa!$C$2:$E$59,3,FALSE)),\" \",VLOOKUP(K255,Proposito_programa!$C$2:$E$59,3,FALSE))","v":"Propósito 5: Construir Bogotá - Región con gobierno abierto, transparente y ciudadanía consciente"},2198,1,52015276,"AMPARO RAMIREZ CASTILLO\t","Persona Natural",null,null,null,null,3720000,null,null,null,3720000,1860000,"2022-10-31","2022-10-31","2022-12-31",60,null,null,null,null,null,null,"En ejecución",0.5]
[239,2022,"FDLANCD-239-2022 (79320)\t","https://community.secop.gov.co/Public/Tendering/OpportunityDetail/Index?noticeUID=CO1.NTC.3477070&isFromPublicArea=True&isModal=False\n","Contratos de prestación de servicios profesionales y de apoyo a la gestión","Contratación directa","Prestación de servicios profesionales y de apoyo a la gestión, o para la ejecución de trabajos artísticos que sólo puedan encomendarse a determinadas personas naturales","Prestación de servicios profesionales para apoyar al área gestión del desarrollo, administrativa y financiera en el diligenciamiento de las actuaciones de los documentos técnicos de soporte y fichas de estadística básicas de inversión y elaboración de los documentos soporte necesarios para ejecutar los proyectos de inversión del fondo de desarrollo local de Antonio Nariño\t","Inversión","Un nuevo contrato social y ambiental para la Bogotá del Siglo XXI",57,{"$f":"IF(ISERROR(VLOOKUP(K256,Proposito_programa!$C$2:$E$59,2,FALSE)),\" \",VLOOKUP(K256,Proposito_programa!$C$2:$E$59,2,FALSE))","v":"Gestión pública local"},{"$f":"IF(ISERROR(VLOOKUP(K256,Proposito_programa!$C$2:$E$59,3,FALSE)),\" \",VLOOKUP(K256,Proposito_programa!$C$2:$E$59,3,FALSE))","v":"Propósito 5: Construir Bogotá - Región con gobierno abierto, transparente y ciudadanía consciente"},2198,1,1030536545,"JESSICA LORENA BELLO MUNAR","Persona Natural",null,null,null,null,9240000,null,null,null,9240000,3388000,"2022-11-02","2022-11-09","2022-12-31",58,null,null,null,null,null,null,"En ejecución",0.36666666666666664]
[240,2022,"FDLAN-CD-240-2022 (79386)\t","https://community.secop.gov.co/Public/Tendering/OpportunityDetail/Index?noticeUID=CO1.NTC.3470818&isFromPublicArea=True&isModal=False","Contratos de prestación de servicios profesionales y de apoyo a la gestión","Contratación directa","Prestación de servicios profesionales y de apoyo a la gestión, o para la ejecución de trabajos artísticos que sólo puedan encomendarse a determinadas personas naturales","Servicios profesionales especializados para apoyar al alcalde de la Localidad Antonio Nariño en la implementación de mejoras a nivel medio ambientales y la gestión del riesgo.\t","Inversión","Un nuevo contrato social y ambiental para la Bogotá del Siglo XXI",57,{"$f":"IF(ISERROR(VLOOKUP(K257,Proposito_programa!$C$2:$E$59,2,FALSE)),\" \",VLOOKUP(K257,Proposito_programa!$C$2:$E$59,2,FALSE))","v":"Gestión pública local"},{"$f":"IF(ISERROR(VLOOKUP(K257,Proposito_programa!$C$2:$E$59,3,FALSE)),\" \",VLOOKUP(K257,Proposito_programa!$C$2:$E$59,3,FALSE))","v":"Propósito 5: Construir Bogotá - Región con gobierno abierto, transparente y ciudadanía consciente"},2198,1,1018466952,"MARIA ALEJANDRA MORENO GIRALDO\t","Persona Natural",null,null,null,null,15812000,null,1,4020000,{"$f":"+W257+X257+Z257","v":19832000},7772000,"2022-11-01","2022-11-01","2022-12-31",60,1,15,null,null,null,null,"En ejecución",0.39189189189189189]
[241,2022,"FDLAN-CD-241-2022(79424)\t","https://community.secop.gov.co/Public/Tendering/OpportunityDetail/Index?noticeUID=CO1.NTC.3471619&isFromPublicArea=True&isModal=False","Contratos de prestación de servicios profesionales y de apoyo a la gestión","Contratación directa","Prestación de servicios profesionales y de apoyo a la gestión, o para la ejecución de trabajos artísticos que sólo puedan encomendarse a determinadas personas naturales","PRESTAR SERVICIOS DE APOYO AL FONDO DE DESARROLLO LOCAL DE ANTONIO NARIÑO EN LOS DIFERENTES TRÁMITES REQUERIDOS POR LAS ENTIDADES DISTRITALES Y/O LOCALES EN LOS PROCESOS DE PLANEACIÓN.\t","Inversión","Un nuevo contrato social y ambiental para la Bogotá del Siglo XXI",57,{"$f":"IF(ISERROR(VLOOKUP(K258,Proposito_programa!$C$2:$E$59,2,FALSE)),\" \",VLOOKUP(K258,Proposito_programa!$C$2:$E$59,2,FALSE))","v":"Gestión pública local"},{"$f":"IF(ISERROR(VLOOKUP(K258,Proposito_programa!$C$2:$E$59,3,FALSE)),\" \",VLOOKUP(K258,Proposito_programa!$C$2:$E$59,3,FALSE))","v":"Propósito 5: Construir Bogotá - Región con gobierno abierto, transparente y ciudadanía consciente"},2198,1,52879857,"JUDITH MARCELA RUBIANO SANTANA ","Persona Natural",null,null,null,null,4838000,null,null,null,4838000,2378000,"2022-11-01","2022-11-02","2022-12-31",59,null,null,null,null,null,null,"En ejecución",0.49152542372881358]
[242,2022,"FDLAN-CD-242-2022(79327)\t","https://community.secop.gov.co/Public/Common/GoogleReCaptcha/Index?previousUrl=https%3a%2f%2fcommunity.secop.gov.co%2fPublic%2fTendering%2fOpportunityDetail%2fIndex%3fnoticeUID%3dCO1.NTC.3471845%26isFromPublicArea%3dTrue%26isModal%3dFalse","Contratos de prestación de servicios profesionales y de apoyo a la gestión","Contratación directa","Prestación de servicios profesionales y de apoyo a la gestión, o para la ejecución de trabajos artísticos que sólo puedan encomendarse a determinadas personas naturales","PRESTAR SERVICIOS PROFESIONALES AL FONDO DE DESARROLLO LOCAL DE ANTONIO NARIÑO EN EL APOYO A LOS DIFERENTES TRÁMITES Y GESTIONES CONTRACTUALES ASI COMO EL SEGUIMIENTO, LIQUIDACIÓN, DEPURACIÓN Y CONSOLIDACIÓN DE LAS OBLIGACIONES POR PAGAR VIGENTES.\t","Inversión","Un nuevo contrato social y ambiental para la Bogotá del Siglo XXI",57,{"$f":"IF(ISERROR(VLOOKUP(K259,Proposito_programa!$C$2:$E$59,2,FALSE)),\" \",VLOOKUP(K259,Proposito_programa!$C$2:$E$59,2,FALSE))","v":"Gestión pública local"},{"$f":"IF(ISERROR(VLOOKUP(K259,Proposito_programa!$C$2:$E$59,3,FALSE)),\" \",VLOOKUP(K259,Proposito_programa!$C$2:$E$59,3,FALSE))","v":"Propósito 5: Construir Bogotá - Región con gobierno abierto, transparente y ciudadanía consciente"},2198,1,12491088,"FRANCISCO IVAN FUENTES CALDERON\t","Persona Natural",null,null,null,null,13676200,null,null,null,13676200,6722200,"2022-11-01","2022-11-02","2022-12-31",59,null,null,null,null,null,null,"En ejecución",0.49152542372881358]
[243,2022,"FDLAN-CD-243-2022 (79350)\t","https://community.secop.gov.co/Public/Tendering/OpportunityDetail/Index?noticeUID=CO1.NTC.3477780&isFromPublicArea=True&isModal=False","Contratos de prestación de servicios profesionales y de apoyo a la gestión","Contratación directa","Prestación de servicios profesionales y de apoyo a la gestión, o para la ejecución de trabajos artísticos que sólo puedan encomendarse a determinadas personas naturales","PRESTAR SERVICIOS PROFESIONALES COMO ABOGADO PARA APOYAR LOS DISTINTOS PROCEDIMIENTOS SANCIONATORIOS Y TRÁMITES ADMINISTRATIVOS RELACIONADOS CON LA INSPECCIÓN, VIGILANCIA Y CONTROL DEL ÁREA DE GESTIÓN POLICIVA DEL FONDO DE DESARROLLO LOCAL ANTONIO NARIÑO, CON OCASIÓN A LA INFRACCIÓN Y APLICACIÓN DE NORMAS POLICIVAS EN MATERIA DE PROTECCIÓN AL CONSUMIDOR, CONTROL DE CALIDAD, PRECIOS, PESAS Y MEDIDAS\t","Inversión","Un nuevo contrato social y ambiental para la Bogotá del Siglo XXI",57,{"$f":"IF(ISERROR(VLOOKUP(K260,Proposito_programa!$C$2:$E$59,2,FALSE)),\" \",VLOOKUP(K260,Proposito_programa!$C$2:$E$59,2,FALSE))","v":"Gestión pública local"},{"$f":"IF(ISERROR(VLOOKUP(K260,Proposito_programa!$C$2:$E$59,3,FALSE)),\" \",VLOOKUP(K260,Proposito_programa!$C$2:$E$59,3,FALSE))","v":"Propósito 5: Construir Bogotá - Región con gobierno abierto, transparente y ciudadanía consciente"},2189,1,13702988,"GIOVANNY ALEXANDER CAMACHO GOMEZ\t","Persona Natural",null,null,null,null,8932000,null,null,null,8932000,3834000,"2022-11-02","2022-11-04","2022-12-31",58,null,null,null,null,null,null,"En ejecución",0.42924317062248096]
[244,2022,"FDLAN-CD-244-2022(79649)\t","https://community.secop.gov.co/Public/Tendering/OpportunityDetail/Index?noticeUID=CO1.NTC.3499509&isFromPublicArea=True&isModal=False\n","Contratos de prestación de servicios profesionales y de apoyo a la gestión","Contratación directa","Prestación de servicios profesionales y de apoyo a la gestión, o para la ejecución de trabajos artísticos que sólo puedan encomendarse a determinadas personas naturales","PRESTAR SERVICIOS DE APOYO A LA GESTIÓN DEL FONDO DE DESARROLLO LOCAL DE ANTONIO NARIÑO EN LOS ASUNTOS OPERATIVOS RELACIONADOS CON LA SEGURIDAD, LA CONVIVENCIA Y EL DESARROLLO DE ACTIVIDAD ECONÓMICA EN LA LOCALIDAD, CON CONFORMIDAD CON EL MARCO NORMATIVO APLICABLE EN LA MATERIA.\t","Inversión","Un nuevo contrato social y ambiental para la Bogotá del Siglo XXI",57,{"$f":"IF(ISERROR(VLOOKUP(K261,Proposito_programa!$C$2:$E$59,2,FALSE)),\" \",VLOOKUP(K261,Proposito_programa!$C$2:$E$59,2,FALSE))","v":"Gestión pública local"},{"$f":"IF(ISERROR(VLOOKUP(K261,Proposito_programa!$C$2:$E$59,3,FALSE)),\" \",VLOOKUP(K261,Proposito_programa!$C$2:$E$59,3,FALSE))","v":"Propósito 5: Construir Bogotá - Región con gobierno abierto, transparente y ciudadanía consciente"},2189,1,51876386,"CLAUDIA IOMARA AYALA BELTRAN","Persona Natural",null,null,null,null,4264000,null,null,null,4264000,1804000,"2022-11-08","2022-11-09","2022-12-31",52,null,null,null,null,null,null,"En ejecución",0.42307692307692307]
[245,2022,"FDLAN-CD-245-2022(79318)\t","https://community.secop.gov.co/Public/Tendering/OpportunityDetail/Index?noticeUID=CO1.NTC.3499243&isFromPublicArea=True&isModal=False","Contratos de prestación de servicios profesionales y de apoyo a la gestión","Contratación directa","Prestación de servicios profesionales y de apoyo a la gestión, o para la ejecución de trabajos artísticos que sólo puedan encomendarse a determinadas personas naturales","EL CONTRATO QUE SE PRETENDE CELEBRAR, TENDRÁ POR OBJETO PRESTAR SERVICIOS PROFESIONALES PARA APOYAR LA EJECUCIÓN, SUPERVISIÓN, SEGUIMIENTO, CIERRE Y/O LIQUIDACIÓN DE LOS PROCESOS CONTRACTUALES DE LA LOCALIDAD DE ANTONIO NARIÑO.\t","Inversión","Un nuevo contrato social y ambiental para la Bogotá del Siglo XXI",57,{"$f":"IF(ISERROR(VLOOKUP(K262,Proposito_programa!$C$2:$E$59,2,FALSE)),\" \",VLOOKUP(K262,Proposito_programa!$C$2:$E$59,2,FALSE))","v":"Gestión pública local"},{"$f":"IF(ISERROR(VLOOKUP(K262,Proposito_programa!$C$2:$E$59,3,FALSE)),\" \",VLOOKUP(K262,Proposito_programa!$C$2:$E$59,3,FALSE))","v":"Propósito 5: Construir Bogotá - Región con gobierno abierto, transparente y ciudadanía consciente"},2198,1,1030608546,"JOHAN MAURICIO EPLAEZ BUSTOS\t","Persona Natural",null,null,null,null,6776000,null,null,null,6776000,3388000,"2022-11-08","2022-11-09","2022-12-31",52,null,null,null,null,null,null,"En ejecución",0.5]
[246,2022,"FDLAN-CD-246-2022(79267)\t","https://community.secop.gov.co/Public/Tendering/OpportunityDetail/Index?noticeUID=CO1.NTC.3501642&isFromPublicArea=True&isModal=False\n","Contratos de prestación de servicios profesionales y de apoyo a la gestión","Contratación directa","Prestación de servicios profesionales y de apoyo a la gestión, o para la ejecución de trabajos artísticos que sólo puedan encomendarse a determinadas personas naturales","PRESTAR SERVICIOS PROFESIONALES AL DESPACHO DEL ALCALDE LOCAL EN LA ORIENTACIÓN Y APLICACIÓN DE LA NORMATIVIDAD NACIONAL, DISTRITAL Y LOCAL, LA PROYECCIÓN DE ACTOS ADMINISTRATIVOS, RESPUESTAS A RECLAMACIONES, REQUERIMIENTOS Y DERECHOS DE PETICIÓN.\t","Inversión","Un nuevo contrato social y ambiental para la Bogotá del Siglo XXI",57,{"$f":"IF(ISERROR(VLOOKUP(K263,Proposito_programa!$C$2:$E$59,2,FALSE)),\" \",VLOOKUP(K263,Proposito_programa!$C$2:$E$59,2,FALSE))","v":"Gestión pública local"},{"$f":"IF(ISERROR(VLOOKUP(K263,Proposito_programa!$C$2:$E$59,3,FALSE)),\" \",VLOOKUP(K263,Proposito_programa!$C$2:$E$59,3,FALSE))","v":"Propósito 5: Construir Bogotá - Región con gobierno abierto, transparente y ciudadanía consciente"},2198,1,72267946,"JOSE ENRIQUE LADRON DE GUEVARA ILLERA","Persona Natural",null,null,null,null,9360000,null,null,null,9360000,3960000,"2022-11-08","2022-11-09","2022-12-31",52,null,null,null,null,null,null,"En ejecución",0.42307692307692307]
[247,2022,"FDLAN-CD-247-2022(79330)\t","https://community.secop.gov.co/Public/Tendering/OpportunityDetail/Index?noticeUID=CO1.NTC.3500503&isFromPublicArea=True&isModal=False\n","Contratos de prestación de servicios profesionales y de apoyo a la gestión","Contratación directa","Prestación de servicios profesionales y de apoyo a la gestión, o para la ejecución de trabajos artísticos que sólo puedan encomendarse a determinadas personas naturales","PRESTACIÓN DE SERVICIOS PARA APOYAR LA GESTIÓN Y EJECUCIÓN DE ACTIVIDADES ADMINISTRATIVAS Y OPERATIVAS QUE SE ADELANTAN EN EL ÁREA DE GESTIÓN DEL DESARROLLO, ADMINISTRATIVA Y FINANCIERA DE LA ALCALDÍA LOCAL DE ANTONIO NARIÑO.\t","Inversión","Un nuevo contrato social y ambiental para la Bogotá del Siglo XXI",57,{"$f":"IF(ISERROR(VLOOKUP(K264,Proposito_programa!$C$2:$E$59,2,FALSE)),\" \",VLOOKUP(K264,Proposito_programa!$C$2:$E$59,2,FALSE))","v":"Gestión pública local"},{"$f":"IF(ISERROR(VLOOKUP(K264,Proposito_programa!$C$2:$E$59,3,FALSE)),\" \",VLOOKUP(K264,Proposito_programa!$C$2:$E$59,3,FALSE))","v":"Propósito 5: Construir Bogotá - Región con gobierno abierto, transparente y ciudadanía consciente"},2198,1,79354001,"GUSTAVO DIAZ MARTINEZ","Persona Natural",null,null,null,null,3224000,null,null,null,3224000,1364000,"2022-11-08","2022-11-09","2022-12-31",52,null,null,null,null,null,null,"En ejecución",0.42307692307692307]
[248,2022,"FDLANCD-248-2022 (79418)\t","https://community.secop.gov.co/Public/Tendering/OpportunityDetail/Index?noticeUID=CO1.NTC.3507169&isFromPublicArea=True&isModal=False\n","Contratos de prestación de servicios profesionales y de apoyo a la gestión","Contratación directa","Prestación de servicios profesionales y de apoyo a la gestión, o para la ejecución de trabajos artísticos que sólo puedan encomendarse a determinadas personas naturales","Prestar servicios profesionales a la alcaldía local de Antonio Nariño en la promoción, acompañamiento y articulación a procesos comunitarios y apoyar la realización de las actividades en instancias de participación local\t","Inversión","Un nuevo contrato social y ambiental para la Bogotá del Siglo XXI",57,{"$f":"IF(ISERROR(VLOOKUP(K265,Proposito_programa!$C$2:$E$59,2,FALSE)),\" \",VLOOKUP(K265,Proposito_programa!$C$2:$E$59,2,FALSE))","v":"Gestión pública local"},{"$f":"IF(ISERROR(VLOOKUP(K265,Proposito_programa!$C$2:$E$59,3,FALSE)),\" \",VLOOKUP(K265,Proposito_programa!$C$2:$E$59,3,FALSE))","v":"Propósito 5: Construir Bogotá - Región con gobierno abierto, transparente y ciudadanía consciente"},2198,1,1069754268,"LINA MARIA CORONADO CORONADO","Persona Natural",null,null,null,null,9240000,null,null,null,9240000,0,"2022-11-09","2022-11-15","2022-12-31",51,null,null,null,null,null,null,"En ejecución",0]
[249,2022,"FDLANCD-249-2022 (79649)\t","https://community.secop.gov.co/Public/Tendering/OpportunityDetail/Index?noticeUID=CO1.NTC.3537341&isFromPublicArea=True&isModal=False\n","Contratos de prestación de servicios profesionales y de apoyo a la gestión","Contratación directa","Prestación de servicios profesionales y de apoyo a la gestión, o para la ejecución de trabajos artísticos que sólo puedan encomendarse a determinadas personas naturales","Prestar servicios de apoyo a la gestión del fondo de desarrollo local de Antonio Nariño en los asuntos operativos relacionados con la seguridad, la convivencia y el desarrollo de actividad económica en la localidad, con conformidad con el marco normativo aplicable en la materia.\t","Inversión","Un nuevo contrato social y ambiental para la Bogotá del Siglo XXI",57,{"$f":"IF(ISERROR(VLOOKUP(K266,Proposito_programa!$C$2:$E$59,2,FALSE)),\" \",VLOOKUP(K266,Proposito_programa!$C$2:$E$59,2,FALSE))","v":"Gestión pública local"},{"$f":"IF(ISERROR(VLOOKUP(K266,Proposito_programa!$C$2:$E$59,3,FALSE)),\" \",VLOOKUP(K266,Proposito_programa!$C$2:$E$59,3,FALSE))","v":"Propósito 5: Construir Bogotá - Región con gobierno abierto, transparente y ciudadanía consciente"},2189,1,1000622241,"DENNY MAURICIO ARANGO PEREZ","Persona Natural",null,null,null,null,3690000,null,null,null,3690000,820000,"2022-11-17","2022-11-21","2022-12-31",45,null,null,null,null,null,null,"En ejecución",0.22222222222222221]
[250,2022,"FDLAN-CD-250-2022 (79432)\t","https://community.secop.gov.co/Public/Tendering/OpportunityDetail/Index?noticeUID=CO1.NTC.3506677&isFromPublicArea=True&isModal=False\n","Contratos de prestación de servicios profesionales y de apoyo a la gestión","Contratación directa","Prestación de servicios profesionales y de apoyo a la gestión, o para la ejecución de trabajos artísticos que sólo puedan encomendarse a determinadas personas naturales","EL CONTRATO QUE SE PRETENDE CELEBRAR, TENDRÁ POR OBJETO PRESTACIÓN DE SERVICIOS TÉCNICOS DE APOYO A ACTIVIDADES DE PRENSA PARA FORTALECER LA GENERACIÓN DE CONTENIDOS, PIEZAS DIGITALES, IMPRESAS Y PUBLICITARIAS, ASÍ COMO LA PRODUCCIÓN Y MONTAJE DE EVENTOS.\t","Inversión","Un nuevo contrato social y ambiental para la Bogotá del Siglo XXI",57,{"$f":"IF(ISERROR(VLOOKUP(K267,Proposito_programa!$C$2:$E$59,2,FALSE)),\" \",VLOOKUP(K267,Proposito_programa!$C$2:$E$59,2,FALSE))","v":"Gestión pública local"},{"$f":"IF(ISERROR(VLOOKUP(K267,Proposito_programa!$C$2:$E$59,3,FALSE)),\" \",VLOOKUP(K267,Proposito_programa!$C$2:$E$59,3,FALSE))","v":"Propósito 5: Construir Bogotá - Región con gobierno abierto, transparente y ciudadanía consciente"},2198,1,1152684527,"JULYAN ESTEPHEN PARRA PUERTA","Persona Natural",null,null,null,null,3906000,null,null,null,3906000,1953000,"2022-11-09","2022-11-10","2022-12-31",51,null,null,null,null,null,null,"En ejecución",0.5]
[251,2022,"FDLANCD-228 -2022 (79251)\t","https://community.secop.gov.co/Public/Tendering/OpportunityDetail/Index?noticeUID=CO1.NTC.3458215&isFromPublicArea=True&isModal=False\n","Contratos de prestación de servicios profesionales y de apoyo a la gestión","Contratación directa","Prestación de servicios profesionales y de apoyo a la gestión, o para la ejecución de trabajos artísticos que sólo puedan encomendarse a determinadas personas naturales","Apoyar las labores de entrega y recibo de las comunicaciones emitidas o recibidas por las Inspecciones de Policía de la Localidad.\t","Inversión","Un nuevo contrato social y ambiental para la Bogotá del Siglo XXI",57,{"$f":"IF(ISERROR(VLOOKUP(K268,Proposito_programa!$C$2:$E$59,2,FALSE)),\" \",VLOOKUP(K268,Proposito_programa!$C$2:$E$59,2,FALSE))","v":"Gestión pública local"},{"$f":"IF(ISERROR(VLOOKUP(K268,Proposito_programa!$C$2:$E$59,3,FALSE)),\" \",VLOOKUP(K268,Proposito_programa!$C$2:$E$59,3,FALSE))","v":"Propósito 5: Construir Bogotá - Región con gobierno abierto, transparente y ciudadanía consciente"},2198,1,52523390,"CLAUDIA PATRICIA GARCÍA DUARTE\t","Persona Natural",null,null,null,null,2408000,null,null,null,2408000,728000,"2022-10-28","2022-11-01","2022-12-31",60,null,null,null,null,null,null,"En ejecución",0.30232558139534882]
[252,2022,"FDLAN-CD-252-2022 (79506)","https://community.secop.gov.co/Public/Tendering/OpportunityDetail/Index?noticeUID=CO1.NTC.3515366&isFromPublicArea=True&isModal=False","Contratos de prestación de servicios profesionales y de apoyo a la gestión","Contratación directa","Prestación de servicios profesionales y de apoyo a la gestión, o para la ejecución de trabajos artísticos que sólo puedan encomendarse a determinadas personas naturales","Apoyar y dar soporte técnico al administrador y usuario final de la red de sistemas y tecnología e información de la Alcaldía Local.\t","Inversión","Un nuevo contrato social y ambiental para la Bogotá del Siglo XXI",57,{"$f":"IF(ISERROR(VLOOKUP(K269,Proposito_programa!$C$2:$E$59,2,FALSE)),\" \",VLOOKUP(K269,Proposito_programa!$C$2:$E$59,2,FALSE))","v":"Gestión pública local"},{"$f":"IF(ISERROR(VLOOKUP(K269,Proposito_programa!$C$2:$E$59,3,FALSE)),\" \",VLOOKUP(K269,Proposito_programa!$C$2:$E$59,3,FALSE))","v":"Propósito 5: Construir Bogotá - Región con gobierno abierto, transparente y ciudadanía consciente"},2198,1,1000136904,"YEORGETH SUSANA RUBIANO CRISTIANO","Persona Natural",null,null,null,null,3348000,null,null,null,3348000,1488000,"2022-11-11","2022-11-15","2022-12-31",50,null,null,null,null,null,null,"En ejecución",0.44444444444444442]
[253,2022,"FDLANCD-253-2022 (79245)\t","https://community.secop.gov.co/Public/Tendering/OpportunityDetail/Index?noticeUID=CO1.NTC.3515501&isFromPublicArea=True&isModal=False","Contratos de prestación de servicios profesionales y de apoyo a la gestión","Contratación directa","Prestación de servicios profesionales y de apoyo a la gestión, o para la ejecución de trabajos artísticos que sólo puedan encomendarse a determinadas personas naturales","Apoyar administrativa y asistencialmente a las Inspecciones de Policía de la Localidad.","Inversión","Un nuevo contrato social y ambiental para la Bogotá del Siglo XXI",57,{"$f":"IF(ISERROR(VLOOKUP(K270,Proposito_programa!$C$2:$E$59,2,FALSE)),\" \",VLOOKUP(K270,Proposito_programa!$C$2:$E$59,2,FALSE))","v":"Gestión pública local"},{"$f":"IF(ISERROR(VLOOKUP(K270,Proposito_programa!$C$2:$E$59,3,FALSE)),\" \",VLOOKUP(K270,Proposito_programa!$C$2:$E$59,3,FALSE))","v":"Propósito 5: Construir Bogotá - Región con gobierno abierto, transparente y ciudadanía consciente"},2189,1,52790801,"MONICA YOHANNA PULIDO CHAUTA\t","Persona Natural",null,null,null,null,2884200,null,null,null,2884200,1003200,"2022-11-11","2022-11-15","2022-12-31",46,null,null,null,null,null,null,"En ejecución",0.34782608695652173]
[254,2022,"FDLAN-CD-254-2022 (79245)\t","https://community.secop.gov.co/Public/Tendering/OpportunityDetail/Index?noticeUID=CO1.NTC.3531992&isFromPublicArea=True&isModal=False\n","Contratos de prestación de servicios profesionales y de apoyo a la gestión","Contratación directa","Prestación de servicios profesionales y de apoyo a la gestión, o para la ejecución de trabajos artísticos que sólo puedan encomendarse a determinadas personas naturales","APOYAR ADMINISTRATIVA Y ASISTENCIALMENTE A LAS INSPECCIONES DE POLICÍA DE LA LOCALIDAD.\t","Inversión","Un nuevo contrato social y ambiental para la Bogotá del Siglo XXI",57,{"$f":"IF(ISERROR(VLOOKUP(K271,Proposito_programa!$C$2:$E$59,2,FALSE)),\" \",VLOOKUP(K271,Proposito_programa!$C$2:$E$59,2,FALSE))","v":"Gestión pública local"},{"$f":"IF(ISERROR(VLOOKUP(K271,Proposito_programa!$C$2:$E$59,3,FALSE)),\" \",VLOOKUP(K271,Proposito_programa!$C$2:$E$59,3,FALSE))","v":"Propósito 5: Construir Bogotá - Región con gobierno abierto, transparente y ciudadanía consciente"},2189,1,19387042,"CARLOS ALBERTO PRODIGO HERNANDEZ\t","Persona Natural",null,null,null,null,1630200,null,null,null,1630200,815100,"2022-11-16","2022-01-18","2022-12-31",43,null,null,null,null,null,null,"En ejecución",0.5]
[255,2022,"FDLAN-SAMC-010-2022 (79339)","https://community.secop.gov.co/Public/Tendering/OpportunityDetail/Index?noticeUID=CO1.NTC.3509887&isFromPublicArea=True&isModal=False","Otros","Selección abreviada","Selección abreviada por menor cuantía ","PRESTAR LOS SERVICIOS DE APOYO COMO TÉCNICO ADMINISTRATIVO EN EL ÁREA DE GESTIÓN DE DESARROLLO DEL FONDO DE DESARROLLO LOCAL DE ANTONIO NARIÑO PARA LOS DIFERENTES ASUNTOS CONTRACTUALES QUE ADELANTA LA ENTIDAD\t","Inversión","Un nuevo contrato social y ambiental para la Bogotá del Siglo XXI",27,"Cambio cultural para la gestión de la crisis climática","Propósito 2 : Cambiar Nuestros Hábitos de Vida para Reverdecer a Bogotá y Adaptarnos y Mitigar la Crisis Climática",2204,null,null,null,null,null,null,null,null,34610172,null,null,null,{"$f":"+W272+X272+Z272","v":34610172},0]
[255,2022,"FDLAN-SAMC-010-2022 (79339)","https://community.secop.gov.co/Public/Tendering/OpportunityDetail/Index?noticeUID=CO1.NTC.3509887&isFromPublicArea=True&isModal=False","Otros","Selección abreviada","Selección abreviada por menor cuantía ","PRESTAR LOS SERVICIOS DE APOYO COMO TÉCNICO ADMINISTRATIVO EN EL ÁREA DE GESTIÓN DE DESARROLLO DEL FONDO DE DESARROLLO LOCAL DE ANTONIO NARIÑO PARA LOS DIFERENTES ASUNTOS CONTRACTUALES QUE ADELANTA LA ENTIDAD\t","Inversión","Un nuevo contrato social y ambiental para la Bogotá del Siglo XXI",24,{"$f":"IF(ISERROR(VLOOKUP(K273,Proposito_programa!$C$2:$E$59,2,FALSE)),\" \",VLOOKUP(K273,Proposito_programa!$C$2:$E$59,2,FALSE))","v":"Bogotá región emprendedora e innovadora"},{"$f":"IF(ISERROR(VLOOKUP(K273,Proposito_programa!$C$2:$E$59,3,FALSE)),\" \",VLOOKUP(K273,Proposito_programa!$C$2:$E$59,3,FALSE))","v":"Propósito 1: Hacer un nuevo contrato social para incrementar la inclusión social, productiva y política"},2203,10,901039835,"IMPECOS SAS","Persona Jurídica",null,null,null,null,36431760,null,null,null,36431760,0,"2022-11-29","2023-01-24","2023-03-13",90,null,null,null,null,null,null,"Celebrado o por iniciar",0]
[256,2022,"FDLAN-SAMC-011-2022 (79877)\t","https://community.secop.gov.co/Public/Tendering/OpportunityDetail/Index?noticeUID=CO1.NTC.3554211&isFromPublicArea=True&isModal=False\n","Otros","Selección abreviada","Selección abreviada por menor cuantía ","CONTRATAR LOS SERVICIOS Y ACTIVIDADES PARA LA CELEBRACIÓN DE LA NAVIDAD ARCO IRIS EN LA LOCALIDAD DE ANTONIO NARIÑO.\t","Inversión","Un nuevo contrato social y ambiental para la Bogotá del Siglo XXI",21,{"$f":"IF(ISERROR(VLOOKUP(K274,Proposito_programa!$C$2:$E$59,2,FALSE)),\" \",VLOOKUP(K274,Proposito_programa!$C$2:$E$59,2,FALSE))","v":"Creación y vida cotidiana: Apropiación ciudadana del arte, la cultura y el patrimonio, para la democracia cultural"},{"$f":"IF(ISERROR(VLOOKUP(K274,Proposito_programa!$C$2:$E$59,3,FALSE)),\" \",VLOOKUP(K274,Proposito_programa!$C$2:$E$59,3,FALSE))","v":"Propósito 1: Hacer un nuevo contrato social para incrementar la inclusión social, productiva y política"},2201,5,900360948,"CORPORACION COLECTIVO DIGERATI\t","Persona Jurídica",null,null,null,null,174900000,null,null,null,174900000,0,"2022-12-01","2022-12-07","2023-02-06",60,null,null,null,null,null,null,"En ejecución",0]
[257,2022,"FDLAN-SAMC-013-2022\t","https://community.secop.gov.co/Public/Tendering/OpportunityDetail/Index?noticeUID=CO1.NTC.3606814&isFromPublicArea=True&isModal=False\nhttps://community.secop.gov.co/Public/Tendering/OpportunityDetail/Index?noticeUID=CO1.NTC.3606814&isFromPublicArea=True&isModal=False","Otros","Selección abreviada","Selección abreviada por menor cuantía ","PRESTAR EL SERVICIO DE APOYO LOGISTICO, TECNICO Y OPERATIVO PARA EL FORTALECIMIENTO DE LAS PRACTICAS CULTURALES Y SABRES ANCESTRALES DE LOS PUEBLOS INDIGENAS DE ANTONIO NARIÑO.\t","Inversión","Un nuevo contrato social y ambiental para la Bogotá del Siglo XXI",21,{"$f":"IF(ISERROR(VLOOKUP(K275,Proposito_programa!$C$2:$E$59,2,FALSE)),\" \",VLOOKUP(K275,Proposito_programa!$C$2:$E$59,2,FALSE))","v":"Creación y vida cotidiana: Apropiación ciudadana del arte, la cultura y el patrimonio, para la democracia cultural"},{"$f":"IF(ISERROR(VLOOKUP(K275,Proposito_programa!$C$2:$E$59,3,FALSE)),\" \",VLOOKUP(K275,Proposito_programa!$C$2:$E$59,3,FALSE))","v":"Propósito 1: Hacer un nuevo contrato social para incrementar la inclusión social, productiva y política"},2201,2,900004535,"\nCORPORACION DE SERVICIOS COLOMBIA CORSERVICOL ONG","Persona Jurídica",null,null,null,null,41800000,null,null,null,41800000,0,"2022-12-14","SIN INICIO ","2023-02-15",60,null,null,null,null,null,null,"Celebrado o por iniciar",0]
[258,2022,"FDLAN-CD-258-2022(81797)\t","https://community.secop.gov.co/Public/Tendering/ContractNoticePhases/View?PPI=CO1.PPI.22212015&isFromPublicArea=True&isModal=False\n","Contratos de prestación de servicios profesionales y de apoyo a la gestión","Contratación directa","Prestación de servicios profesionales y de apoyo a la gestión, o para la ejecución de trabajos artísticos que sólo puedan encomendarse a determinadas personas naturales","Prestar los servicios profesionales como abogado en los diversos temas contractuales que requieren el área de gestión de desarrollo del Fondo de Desarrollo Local de Antonio Nariño\t","Inversión","Un nuevo contrato social y ambiental para la Bogotá del Siglo XXI",57,{"$f":"IF(ISERROR(VLOOKUP(K276,Proposito_programa!$C$2:$E$59,2,FALSE)),\" \",VLOOKUP(K276,Proposito_programa!$C$2:$E$59,2,FALSE))","v":"Gestión pública local"},{"$f":"IF(ISERROR(VLOOKUP(K276,Proposito_programa!$C$2:$E$59,3,FALSE)),\" \",VLOOKUP(K276,Proposito_programa!$C$2:$E$59,3,FALSE))","v":"Propósito 5: Construir Bogotá - Región con gobierno abierto, transparente y ciudadanía consciente"},2198,1,1019002889,"EFREY ARMANDO SANABRIA MORENO\t","Persona Natural",null,null,null,null,7600000,null,null,null,7600000,0,"2022-12-20","2022-12-21","2023-01-31",40,null,null,null,null,null,null,"En ejecución",0]
[259,2022,"FDLAN-SASI-003-2022 (80988)\t","https://community.secop.gov.co/Public/Tendering/OpportunityDetail/Index?noticeUID=CO1.NTC.3619804&isFromPublicArea=True&isModal=False\n","Otros","Selección abreviada","Selección abreviada por menor cuantía ","SUMINISTRO DE BIENES PARA LA DOTACIÓN DE LOS JARDINES INFANTILES DE EL FONDO DE DESARROLLO LOCAL DE ANTONIO NARIÑO, A CARGO DE LA SECRETARIA DE INTEGRACIÓN SOCIAL\t","Inversión","Un nuevo contrato social y ambiental para la Bogotá del Siglo XXI",6,{"$f":"IF(ISERROR(VLOOKUP(K277,Proposito_programa!$C$2:$E$59,2,FALSE)),\" \",VLOOKUP(K277,Proposito_programa!$C$2:$E$59,2,FALSE))","v":"Sistema Distrital de Cuidado"},{"$f":"IF(ISERROR(VLOOKUP(K277,Proposito_programa!$C$2:$E$59,3,FALSE)),\" \",VLOOKUP(K277,Proposito_programa!$C$2:$E$59,3,FALSE))","v":"Propósito 1: Hacer un nuevo contrato social para incrementar la inclusión social, productiva y política"},2192,14,900125810,"INVERSIONES RIME S A S\t","Persona Jurídica",null,null,null,null,50000000,null,null,null,50000000,0,"2022-12-20","SIN INICIO ","2023-03-24",90,null,null,null,null,null,null,"Celebrado o por iniciar",{"$f":"IF(ISERROR(AB277/AA277),\"-\",(AB277/AA277))","v":0}]
[260,2022,"FDLAN-CD-260-2022(81099)\t","https://community.secop.gov.co/Public/Tendering/OpportunityDetail/Index?noticeUID=CO1.NTC.3677326&isFromPublicArea=True&isModal=False","Contratos de prestación de servicios profesionales y de apoyo a la gestión","Contratación directa","Prestación de servicios profesionales y de apoyo a la gestión, o para la ejecución de trabajos artísticos que sólo puedan encomendarse a determinadas personas naturales","Prestar servicios de apoyo a la gestión del fondo de desarrollo local de Antonio Nariño en los asuntos operativos relacionados con la seguridad, la convivencia y el desarrollo de actividad económica en la localidad, con conformidad con el marco normativo aplicable en la materia\t","Inversión","Un nuevo contrato social y ambiental para la Bogotá del Siglo XXI",57,{"$f":"IF(ISERROR(VLOOKUP(K278,Proposito_programa!$C$2:$E$59,2,FALSE)),\" \",VLOOKUP(K278,Proposito_programa!$C$2:$E$59,2,FALSE))","v":"Gestión pública local"},{"$f":"IF(ISERROR(VLOOKUP(K278,Proposito_programa!$C$2:$E$59,3,FALSE)),\" \",VLOOKUP(K278,Proposito_programa!$C$2:$E$59,3,FALSE))","v":"Propósito 5: Construir Bogotá - Región con gobierno abierto, transparente y ciudadanía consciente"},2189,1,51678981,"BLANCA IDALY SUAREZ HERNANDEZ","Persona Natural",null,null,null,null,12510000,null,null,null,12510000,0,"2022-12-26","2022-12-27","2023-05-26",150,null,null,null,null,null,null,"En ejecución",0]
[261,2022,"FDLAN-SASI-005-2022(81030)\t","https://community.secop.gov.co/Public/Tendering/OpportunityDetail/Index?noticeUID=CO1.NTC.3628447&isFromPublicArea=True&isModal=False\n","Otros","Selección abreviada","Selección abreviada por menor cuantía ","ADQUISICIÓN DE ELEMENTOS Y ARTÍCULOS DEPORTIVOS PARA LA INICIACIÓN Y FORMACIÓN DEPORTIVA DIRIGIDO A ESCUELAS Y CLUBES DE LA LOCALIDAD DE ANTONIO NARIÑO\t","Inversión","Un nuevo contrato social y ambiental para la Bogotá del Siglo XXI",20,{"$f":"IF(ISERROR(VLOOKUP(K279,Proposito_programa!$C$2:$E$59,2,FALSE)),\" \",VLOOKUP(K279,Proposito_programa!$C$2:$E$59,2,FALSE))","v":"Bogotá, referente en cultura, deporte, recreación y actividad física, con parques para el desarrollo y la salud"},{"$f":"IF(ISERROR(VLOOKUP(K279,Proposito_programa!$C$2:$E$59,3,FALSE)),\" \",VLOOKUP(K279,Proposito_programa!$C$2:$E$59,3,FALSE))","v":"Propósito 1: Hacer un nuevo contrato social para incrementar la inclusión social, productiva y política"},2200,28," 900505401","ESM SOLUTIONS SAS","Persona Jurídica",null,null,null,null,43818539,null,null,null,43818539,0,"2022-12-26","2023-02-10","28/02/2023 ",60,null,null,null,null,null,null,"Celebrado o por iniciar",0]
[262,2022,"FDLAN-CD-262-2022(81099)\t","https://community.secop.gov.co/Public/Tendering/OpportunityDetail/Index?noticeUID=CO1.NTC.3681144&isFromPublicArea=True&isModal=False\n","Contratos de prestación de servicios profesionales y de apoyo a la gestión","Contratación directa","Prestación de servicios profesionales y de apoyo a la gestión, o para la ejecución de trabajos artísticos que sólo puedan encomendarse a determinadas personas naturales","Prestar servicios de apoyo a la gestión del fondo de desarrollo local de Antonio Nariño en los asuntos operativos relacionados con la seguridad, la convivencia y el desarrollo de actividad económica en la localidad, con conformidad con el marco normativo aplicable en la materia\t","Inversión","Un nuevo contrato social y ambiental para la Bogotá del Siglo XXI",57,{"$f":"IF(ISERROR(VLOOKUP(K280,Proposito_programa!$C$2:$E$59,2,FALSE)),\" \",VLOOKUP(K280,Proposito_programa!$C$2:$E$59,2,FALSE))","v":"Gestión pública local"},{"$f":"IF(ISERROR(VLOOKUP(K280,Proposito_programa!$C$2:$E$59,3,FALSE)),\" \",VLOOKUP(K280,Proposito_programa!$C$2:$E$59,3,FALSE))","v":"Propósito 5: Construir Bogotá - Región con gobierno abierto, transparente y ciudadanía consciente"},2189,1,1000120198,"AARON SIERRA PARDO","Persona Natural",null,null,null,null,12510000,null,null,null,{"$f":"+W280+X280+Z280","v":12510000},0,"2022-12-27","2022-12-28","2023-05-27",150,null,null,null,null,null,null,"En ejecución",0]
[263,2022,"FDLAN-CPSP-263-2022\t","https://community.secop.gov.co/Public/Tendering/OpportunityDetail/Index?noticeUID=CO1.NTC.3679150&isFromPublicArea=True&isModal=False\n","Contratos de prestación de servicios profesionales y de apoyo a la gestión","Contratación directa","Prestación de servicios profesionales y de apoyo a la gestión, o para la ejecución de trabajos artísticos que sólo puedan encomendarse a determinadas personas naturales","PRESTAR LOS SERVICIOS PROFESIONALES COMO ABOGADO EN LOS DIVERSOS TEMAS CONTRACTUALES QUE REQUIERA EL ÁREA DE GESTIÓN DE DESARROLLO DEL FONDO DE DESARROLLO LOCAL DE ANTONIO NARIÑO\t","Inversión","Un nuevo contrato social y ambiental para la Bogotá del Siglo XXI",57,{"$f":"IF(ISERROR(VLOOKUP(K281,Proposito_programa!$C$2:$E$59,2,FALSE)),\" \",VLOOKUP(K281,Proposito_programa!$C$2:$E$59,2,FALSE))","v":"Gestión pública local"},{"$f":"IF(ISERROR(VLOOKUP(K281,Proposito_programa!$C$2:$E$59,3,FALSE)),\" \",VLOOKUP(K281,Proposito_programa!$C$2:$E$59,3,FALSE))","v":"Propósito 5: Construir Bogotá - Región con gobierno abierto, transparente y ciudadanía consciente"},2198,1,1015447288,"ADRIANA KATHERIN AVILA TORRES\t","Persona Natural",null,null,null,null,12000000,null,null,null,{"$f":"+W281+X281+Z281","v":12000000},0,"2022-12-27","2022-12-27","2023-02-26",60,null,null,null,null,null,null,"En ejecución",0]
[264,2022,"FDLAN-SASI-004-2022 (81000)\t","https://community.secop.gov.co/Public/Tendering/OpportunityDetail/Index?noticeUID=CO1.NTC.3629433&isFromPublicArea=True&isModal=False\n","Otros","Selección abreviada","Selección abreviada por menor cuantía ","ADQUISICION DE ELEMENTOS AUDIOVISUALES Y DOTACIONALES PARA LA ALCALDIA LOCAL DE ANTONIO NARIÑO EN EL FORTALECIMIENTO A IEDS DE LA LOCALIDAD EN EL MARCO DEL PROYECTO 2196\t","Inversión","Un nuevo contrato social y ambiental para la Bogotá del Siglo XXI",14,{"$f":"IF(ISERROR(VLOOKUP(K282,Proposito_programa!$C$2:$E$59,2,FALSE)),\" \",VLOOKUP(K282,Proposito_programa!$C$2:$E$59,2,FALSE))","v":"Formación integral: más y mejor tiempo en los colegios"},{"$f":"IF(ISERROR(VLOOKUP(K282,Proposito_programa!$C$2:$E$59,3,FALSE)),\" \",VLOOKUP(K282,Proposito_programa!$C$2:$E$59,3,FALSE))","v":"Propósito 1: Hacer un nuevo contrato social para incrementar la inclusión social, productiva y política"},2196,8,830005066,"SECURITY VIDEO EQUIPMENT S.A.S.\t","Persona Jurídica",null,null,null,null,113321760,null,null,null,113321760,0,"2022-12-22","2023-02-13","2023-06-26",180,null,null,null,null,null,null,"Celebrado o por iniciar",0]
[265,2022,"FDLAN-CD-265-2022(81099)\t","https://community.secop.gov.co/Public/Tendering/OpportunityDetail/Index?noticeUID=CO1.NTC.3682805&isFromPublicArea=True&isModal=False\n","Contratos de prestación de servicios profesionales y de apoyo a la gestión","Contratación directa","Prestación de servicios profesionales y de apoyo a la gestión, o para la ejecución de trabajos artísticos que sólo puedan encomendarse a determinadas personas naturales","PRESTAR SERVICIOS DE APOYO A LA GESTIÓN DEL FONDO DE DESARROLLO LOCAL DE ANTONIO NARIÑO EN LOS ASUNTOS OPERATIVOS RELACIONADOS CON LA SEGURIDAD, LA CONVIVENCIA Y EL DESARROLLO DE ACTIVIDAD ECONÓMICA EN LA LOCALIDAD, CON CONFORMIDAD CON EL MARCO NORMATIVO APLICABLE EN LA MATERIA.\t","Inversión","Un nuevo contrato social y ambiental para la Bogotá del Siglo XXI",57,{"$f":"IF(ISERROR(VLOOKUP(K283,Proposito_programa!$C$2:$E$59,2,FALSE)),\" \",VLOOKUP(K283,Proposito_programa!$C$2:$E$59,2,FALSE))","v":"Gestión pública local"},{"$f":"IF(ISERROR(VLOOKUP(K283,Proposito_programa!$C$2:$E$59,3,FALSE)),\" \",VLOOKUP(K283,Proposito_programa!$C$2:$E$59,3,FALSE))","v":"Propósito 5: Construir Bogotá - Región con gobierno abierto, transparente y ciudadanía consciente"},2189,1,1013659896,"FELIPE ARANGO MORALES","Persona Natural",null,null,null,null,12510000,null,null,null,12510000,0,"2022-12-28","2022-12-29","2023-05-28",150,null,null,null,null,null,null,"En ejecución",0]
[267,2022,"FDLAN-SAMC-015-2022-(81273)\t","https://community.secop.gov.co/Public/Tendering/OpportunityDetail/Index?noticeUID=CO1.NTC.3648424&isFromPublicArea=True&isModal=False\n","Otros","Selección abreviada","Selección abreviada por menor cuantía ","PRESTACIÓN DE SERVICIOS PARA DESARROLLAR LOS EVENTOS DE LA PROPUESTA CULTURAL DE EXPO ANTONIO NARIÑO, PARA EL FORTALECIMIENTO DE LA INDUSTRIA CULTURAL Y CREATIVA DE LA LOCALIDAD\t","Inversión","Un nuevo contrato social y ambiental para la Bogotá del Siglo XXI",24,{"$f":"IF(ISERROR(VLOOKUP(K284,Proposito_programa!$C$2:$E$59,2,FALSE)),\" \",VLOOKUP(K284,Proposito_programa!$C$2:$E$59,2,FALSE))","v":"Bogotá región emprendedora e innovadora"},{"$f":"IF(ISERROR(VLOOKUP(K284,Proposito_programa!$C$2:$E$59,3,FALSE)),\" \",VLOOKUP(K284,Proposito_programa!$C$2:$E$59,3,FALSE))","v":"Propósito 1: Hacer un nuevo contrato social para incrementar la inclusión social, productiva y política"},2202,6,900310589,"FUNDACION AYUDANOS ONG\t","Persona Jurídica",null,null,null,null,92921923,null,null,null,92921923,0,"2022-12-28","SIN INICIO ","2023-03-31",90,null,null,null,null,null,null,"Celebrado o por iniciar",0]
[268,2022,"FDLAN-SAMC-014 -2022(79756)\t","https://community.secop.gov.co/Public/Tendering/OpportunityDetail/Index?noticeUID=CO1.NTC.3644407&isFromPublicArea=True&isModal=False\n","Otros","Selección abreviada","Selección abreviada por menor cuantía ","CONTRATAR BAJO LA MODALIDAD DE PRECIOS UNITARIOS FIJOS A MONTO AGOTABLE, LAS OBRAS DE MANTENIMIENTO Y ADECUACION DE LAS ZONAS LOCATIVAS Y SALA DE LACTANCIA DEL FONDO DE DESARROLLO LOCAL DE ANTONIO NARIÑO.\t","Inversión","Un nuevo contrato social y ambiental para la Bogotá del Siglo XXI",57,{"$f":"IF(ISERROR(VLOOKUP(K285,Proposito_programa!$C$2:$E$59,2,FALSE)),\" \",VLOOKUP(K285,Proposito_programa!$C$2:$E$59,2,FALSE))","v":"Gestión pública local"},{"$f":"IF(ISERROR(VLOOKUP(K285,Proposito_programa!$C$2:$E$59,3,FALSE)),\" \",VLOOKUP(K285,Proposito_programa!$C$2:$E$59,3,FALSE))","v":"Propósito 5: Construir Bogotá - Región con gobierno abierto, transparente y ciudadanía consciente"},2198,23,900297404,"QUATTRO PROYECTOS E INVERSIONES SAS\t","Persona Jurídica",null,null,null,null,211158006,null,null,null,211158006,0,"2022-12-28","2023-02-03","2023-03-31",90,null,null,null,null,null,null,"Celebrado o por iniciar",0]
[269,2022,"FDLAN-CD-269-2022(81099)\t","https://community.secop.gov.co/Public/Tendering/OpportunityDetail/Index?noticeUID=CO1.NTC.3684893&isFromPublicArea=True&isModal=False\n","Contratos de prestación de servicios profesionales y de apoyo a la gestión","Contratación directa","Prestación de servicios profesionales y de apoyo a la gestión, o para la ejecución de trabajos artísticos que sólo puedan encomendarse a determinadas personas naturales","PRESTAR SERVICIOS DE APOYO A LA GESTIÓN DEL FONDO DE DESARROLLO LOCAL DE ANTONIO NARIÑO EN LOS ASUNTOS OPERATIVOS RELACIONADOS CON LA SEGURIDAD, LA CONVIVENCIA Y EL DESARROLLO DE ACTIVIDAD ECONÓMICA EN LA LOCALIDAD, CON CONFORMIDAD CON EL MARCO NORMATIVO APLICABLE EN LA MATERIA.\t","Inversión","Un nuevo contrato social y ambiental para la Bogotá del Siglo XXI",57,{"$f":"IF(ISERROR(VLOOKUP(K286,Proposito_programa!$C$2:$E$59,2,FALSE)),\" \",VLOOKUP(K286,Proposito_programa!$C$2:$E$59,2,FALSE))","v":"Gestión pública local"},{"$f":"IF(ISERROR(VLOOKUP(K286,Proposito_programa!$C$2:$E$59,3,FALSE)),\" \",VLOOKUP(K286,Proposito_programa!$C$2:$E$59,3,FALSE))","v":"Propósito 5: Construir Bogotá - Región con gobierno abierto, transparente y ciudadanía consciente"},2189,1,19341321,"ALVARO AMARIS ROJAS\t","Persona Natural",null,null,null,null,12510000,null,null,null,12510000,0,"2022-12-28","2022-12-29","2023-05-28",150,null,null,null,null,null,null,"En ejecución",0]
[270,2022,"FDLAN-CD-270-2022(81099)\t","https://community.secop.gov.co/Public/Tendering/OpportunityDetail/Index?noticeUID=CO1.NTC.3685356&isFromPublicArea=True&isModal=False\n","Contratos de prestación de servicios profesionales y de apoyo a la gestión","Contratación directa","Prestación de servicios profesionales y de apoyo a la gestión, o para la ejecución de trabajos artísticos que sólo puedan encomendarse a determinadas personas naturales","Prestar servicios de apoyo a la gestión del fondo de desarrollo local de Antonio Nariño en los asuntos operativos relacionados con la seguridad, la convivencia y el desarrollo de actividad económica en la localidad, con conformidad con el marco normativo aplicable en la materia\t","Inversión","Un nuevo contrato social y ambiental para la Bogotá del Siglo XXI",57,{"$f":"IF(ISERROR(VLOOKUP(K287,Proposito_programa!$C$2:$E$59,2,FALSE)),\" \",VLOOKUP(K287,Proposito_programa!$C$2:$E$59,2,FALSE))","v":"Gestión pública local"},{"$f":"IF(ISERROR(VLOOKUP(K287,Proposito_programa!$C$2:$E$59,3,FALSE)),\" \",VLOOKUP(K287,Proposito_programa!$C$2:$E$59,3,FALSE))","v":"Propósito 5: Construir Bogotá - Región con gobierno abierto, transparente y ciudadanía consciente"},2189,1,79370565,"JORGE RAMIRO ORTIZ JARAMILLO\t","Persona Natural",null,null,null,null,12510000,null,null,null,12510000,0,"2022-12-28","2022-12-29","2023-05-28",150,null,null,null,null,null,null,"En ejecución",0]
[271,2022,"FDLAN-SAMC-017-2022 (81910)\t","https://community.secop.gov.co/Public/Tendering/OpportunityDetail/Index?noticeUID=CO1.NTC.3658944&isFromPublicArea=True&isModal=False\n","Otros","Selección abreviada","Selección abreviada por menor cuantía ","PRESTAR EL SERVICIO DE APOYO LOGÍSTICO, TÉCNICO Y OPERATIVO PARA LA REALIZACIÓN DE LA CONMEMORACIÓN DE LA SEMANA DE LA AFROCOLOMBIANIDAD\t","Inversión","Un nuevo contrato social y ambiental para la Bogotá del Siglo XXI",21,{"$f":"IF(ISERROR(VLOOKUP(K288,Proposito_programa!$C$2:$E$59,2,FALSE)),\" \",VLOOKUP(K288,Proposito_programa!$C$2:$E$59,2,FALSE))","v":"Creación y vida cotidiana: Apropiación ciudadana del arte, la cultura y el patrimonio, para la democracia cultural"},{"$f":"IF(ISERROR(VLOOKUP(K288,Proposito_programa!$C$2:$E$59,3,FALSE)),\" \",VLOOKUP(K288,Proposito_programa!$C$2:$E$59,3,FALSE))","v":"Propósito 1: Hacer un nuevo contrato social para incrementar la inclusión social, productiva y política"},2201,3,900004535,"CORPORACION DE SERVICIOS COLOMBIA CORSERVICOL ONG\t","Persona Jurídica",null,null,null,null,78215000,null,null,null,78215000,0,"2022-12-29","SIN INICIO ","2023-01-02",30,null,null,null,null,null,null,"Celebrado o por iniciar",0]
[272,2022,"FDLAN-SAMC-025-2022 (83018)\t","https://community.secop.gov.co/Public/Tendering/OpportunityDetail/Index?noticeUID=CO1.NTC.3664467&isFromPublicArea=True&isModal=False","Otros","Selección abreviada","Selección abreviada por menor cuantía ","PRESTACIÓN DE SERVICIOS PARA SENSIBILIZAR Y PREVENIR LA VIOLENCIA DE GÉNERO CONTRA LA MUJER, IDENTIFICANDO EL RIESGO DE FEMINICIDIO EN LA LOCALIDAD DE ANTONIO NARIÑO\t","Inversión","Un nuevo contrato social y ambiental para la Bogotá del Siglo XXI",40,{"$f":"IF(ISERROR(VLOOKUP(K289,Proposito_programa!$C$2:$E$59,2,FALSE)),\" \",VLOOKUP(K289,Proposito_programa!$C$2:$E$59,2,FALSE))","v":"Más mujeres viven una vida libre de violencias, se sienten seguras y acceden con confianza al sistema de justicia"},{"$f":"IF(ISERROR(VLOOKUP(K289,Proposito_programa!$C$2:$E$59,3,FALSE)),\" \",VLOOKUP(K289,Proposito_programa!$C$2:$E$59,3,FALSE))","v":"Propósito 3: Inspirar confianza y legitimidad para vivir sin miedo y ser epicentro de cultura ciudadana, paz y reconciliación"},2197,7,830089058,"FUNDACION DE CIENCIAS Y TECNOLOGÍA GLOBAL\t","Persona Jurídica",null,null,null,null,139058286,null,null,null,139058286,0,"2022-12-29","SIN INICIO ","2023-05-31",150,null,null,null,null,null,null,"Celebrado o por iniciar",0]
[273,2022,"FDLAN-SAMC-016-2022 (81799)\t","https://community.secop.gov.co/Public/Tendering/OpportunityDetail/Index?noticeUID=CO1.NTC.3658762&isFromPublicArea=True&isModal=False\n","Otros","Selección abreviada","Selección abreviada por menor cuantía ","PRESTAR EL SERVICIO DE APOYO LOGISTICO, TECNICO Y OPERATIVO PARA EL RECONOCIMIENTO DE LOS SABRES ANCESTRALES DEL PUEBLO NEGRO, AFROCOLOMBIANO, RAIZAL Y PALENQUERO DE LA LOCALIDAD DE ANTONIO NARIÑO\t","Inversión","Un nuevo contrato social y ambiental para la Bogotá del Siglo XXI",6,{"$f":"IF(ISERROR(VLOOKUP(K290,Proposito_programa!$C$2:$E$59,2,FALSE)),\" \",VLOOKUP(K290,Proposito_programa!$C$2:$E$59,2,FALSE))","v":"Sistema Distrital de Cuidado"},{"$f":"IF(ISERROR(VLOOKUP(K290,Proposito_programa!$C$2:$E$59,3,FALSE)),\" \",VLOOKUP(K290,Proposito_programa!$C$2:$E$59,3,FALSE))","v":"Propósito 1: Hacer un nuevo contrato social para incrementar la inclusión social, productiva y política"},2194,1,900582854,"LOGISTICA Y GESTION DE NEGOCIOS\t","Persona Jurídica",null,null,null,null,38100000,null,null,null,38100000,0,"2022-12-29","SIN INICIO ","2023-03-31",60,null,null,null,null,null,null,"Celebrado o por iniciar",0]
[274,2022,"FDLAN-SAMC-018-2022 (82339)\t","https://community.secop.gov.co/Public/Tendering/OpportunityDetail/Index?noticeUID=CO1.NTC.3657990&isFromPublicArea=True&isModal=False\n","Otros","Selección abreviada","Selección abreviada por menor cuantía ","PRESTAR EL SERVICIO DE APOYO LOGISTICO, TECNICO Y OPERATIVO PARA EL ENCUENTRO EN PRO DEL RECONOCIMIENTO DE LOS SABERES ANCESTRALES DE LOS PUEBLOS INDIGENAS DE LA LOCALIDAD DE ANTONIO NARIÑO\t","Inversión","Un nuevo contrato social y ambiental para la Bogotá del Siglo XXI",6,{"$f":"IF(ISERROR(VLOOKUP(K291,Proposito_programa!$C$2:$E$59,2,FALSE)),\" \",VLOOKUP(K291,Proposito_programa!$C$2:$E$59,2,FALSE))","v":"Sistema Distrital de Cuidado"},{"$f":"IF(ISERROR(VLOOKUP(K291,Proposito_programa!$C$2:$E$59,3,FALSE)),\" \",VLOOKUP(K291,Proposito_programa!$C$2:$E$59,3,FALSE))","v":"Propósito 1: Hacer un nuevo contrato social para incrementar la inclusión social, productiva y política"},2194,2,900270576,"FUNDACION CONSTRUCCION LOCAL\t","Persona Jurídica",null,null,null,null,40532650,null,null,null,40532650,0,"2022-12-29","SIN INICIO ","2023-03-01",60,null,null,null,null,null,null,"Celebrado o por iniciar",0]
[275,2022,"FDLAN SAMC 020-2022 (81318)\t","https://community.secop.gov.co/Public/Tendering/OpportunityDetail/Index?noticeUID=CO1.NTC.3665932&isFromPublicArea=True&isModal=False\n","Otros","Selección abreviada","Selección abreviada por menor cuantía ","PRESTAR LOS SERVICIOS DE APOYO LOGÍSTICO EN LAS ACCIONES DE CUIDADO Y PROTECCIÓN PARA MADRES GESTANTES, NIÑOS Y NIÑAS MIGRANTES DE LA LOCALIDAD DE ANTONIO NARIÑO\t","Inversión","Un nuevo contrato social y ambiental para la Bogotá del Siglo XXI",6,{"$f":"IF(ISERROR(VLOOKUP(K292,Proposito_programa!$C$2:$E$59,2,FALSE)),\" \",VLOOKUP(K292,Proposito_programa!$C$2:$E$59,2,FALSE))","v":"Sistema Distrital de Cuidado"},{"$f":"IF(ISERROR(VLOOKUP(K292,Proposito_programa!$C$2:$E$59,3,FALSE)),\" \",VLOOKUP(K292,Proposito_programa!$C$2:$E$59,3,FALSE))","v":"Propósito 1: Hacer un nuevo contrato social para incrementar la inclusión social, productiva y política"},2194,4,901233617,"COINDERE\t","Persona Jurídica",null,null,null,null,42351073,null,null,null,42351073,0,"2022-12-29","SIN INICIO ","2023-03-30",90,null,null,null,null,null,null,"Celebrado o por iniciar",0]
[276,2022,"FDLAN SAMC 021-2022 (81840)\t","https://community.secop.gov.co/Public/Tendering/OpportunityDetail/Index?noticeUID=CO1.NTC.3666033&isFromPublicArea=True&isModal=False\n","Otros","Selección abreviada","Selección abreviada por menor cuantía ","PRESTACIÓN DE SERVICIOS DE APOYO LOGISTICO PARA EL DESARROLLO DE LAS ACTIVIDADES DE INSCRIPCIÓN, PRESELECCIÓN, SELECCIÓN Y CELEBRACIÓN DEL GRAN FESTIVAL LOCAL DE CULTURA, GRAN SALÓN DE LAS ARTES PLASTICAS ANTONIO NARIÑO, MUYQUITA - FESTIVAL DE FOLKLORE ANTONIO NARIÑO\t","Inversión","Un nuevo contrato social y ambiental para la Bogotá del Siglo XXI",21,{"$f":"IF(ISERROR(VLOOKUP(K293,Proposito_programa!$C$2:$E$59,2,FALSE)),\" \",VLOOKUP(K293,Proposito_programa!$C$2:$E$59,2,FALSE))","v":"Creación y vida cotidiana: Apropiación ciudadana del arte, la cultura y el patrimonio, para la democracia cultural"},{"$f":"IF(ISERROR(VLOOKUP(K293,Proposito_programa!$C$2:$E$59,3,FALSE)),\" \",VLOOKUP(K293,Proposito_programa!$C$2:$E$59,3,FALSE))","v":"Propósito 1: Hacer un nuevo contrato social para incrementar la inclusión social, productiva y política"},2201,2,9006215673,"CONSORCIO PRODUCCION ACTIVIDADES\t","Consorcio","NIT. 900843188- NIT. 830073167","Fundacion G3 - VIENTOS DEL PORVENIR ","Fundacion G3 (50.00%)- VIENTOS DEL PORVENIR (50.00%)",null,113223106,null,null,null,113223106,0,"2022-12-29","SIN INICIO ","2023-03-30",90,null,null,null,null,null,null,"Celebrado o por iniciar",0]
[277,2022,"FDLAN-SASI-006-2022 (81752\t","https://community.secop.gov.co/Public/Tendering/OpportunityDetail/Index?noticeUID=CO1.NTC.3648374&isFromPublicArea=True&isModal=False\n","Otros","Selección abreviada","Selección abreviada por menor cuantía ","ADQUISICIÓN E INSTALACIÓN DE EQUIPOS TECNOLÓGICOS COMO PARTE DE LA DOTACIÓN A ORGANISMOS DE SEGURIDAD DE LA LOCALIDAD ANTONIO NARIÑO EN EL MARCO DE LA IMPLEMENTACIÓN DEL PROGRAMA PLATAFORMA INSTITUCIONAL PARA LA SEGURIDAD Y JUSTICIA.\t","Inversión","Un nuevo contrato social y ambiental para la Bogotá del Siglo XXI",48,{"$f":"IF(ISERROR(VLOOKUP(K294,Proposito_programa!$C$2:$E$59,2,FALSE)),\" \",VLOOKUP(K294,Proposito_programa!$C$2:$E$59,2,FALSE))","v":"Plataforma institucional para la seguridad y justicia"},{"$f":"IF(ISERROR(VLOOKUP(K294,Proposito_programa!$C$2:$E$59,3,FALSE)),\" \",VLOOKUP(K294,Proposito_programa!$C$2:$E$59,3,FALSE))","v":"Propósito 3: Inspirar confianza y legitimidad para vivir sin miedo y ser epicentro de cultura ciudadana, paz y reconciliación"},2185,3,900496013,"CORBAN COMPUTADORES SAS\t","Persona Jurídica",null,null,null,null,225399540,null,null,null,225399540,0,"2022-12-29","SIN INICIO ","2023-02-10",150,null,null,null,null,null,null,"Celebrado o por iniciar",0]
[278,2022,"FDLAN-SAMC-019-2022 (82618)\t","https://community.secop.gov.co/Public/Tendering/OpportunityDetail/Index?noticeUID=CO1.NTC.3662461&isFromPublicArea=True&isModal=False\n","Otros","Selección abreviada","Selección abreviada por menor cuantía ","PRESTACIÓN DE SERVICIOS DE APOYO LOGÍSTICO PARA EL DESARROLLO Y REALIZACIÓN DE LAS ESCUELAS DE FORMACIÓN DEPORTIVA DE LA LOCALIDAD DE ANTONIO NARIÑO","Inversión","Un nuevo contrato social y ambiental para la Bogotá del Siglo XXI",20,{"$f":"IF(ISERROR(VLOOKUP(K295,Proposito_programa!$C$2:$E$59,2,FALSE)),\" \",VLOOKUP(K295,Proposito_programa!$C$2:$E$59,2,FALSE))","v":"Bogotá, referente en cultura, deporte, recreación y actividad física, con parques para el desarrollo y la salud"},{"$f":"IF(ISERROR(VLOOKUP(K295,Proposito_programa!$C$2:$E$59,3,FALSE)),\" \",VLOOKUP(K295,Proposito_programa!$C$2:$E$59,3,FALSE))","v":"Propósito 1: Hacer un nuevo contrato social para incrementar la inclusión social, productiva y política"},2200,13,900360948,"CORPORACION COLECTIVO DIGERATI\t","Persona Jurídica",null,null,null,null,136366838,null,null,null,136366838,0,"2022-12-29","SIN INICIO ","2023-07-03",180,null,null,null,null,null,null,"Celebrado o por iniciar",0]
[279,2022,"FDLAN-SAMC-012-2022\t","https://community.secop.gov.co/Public/Tendering/OpportunityDetail/Index?noticeUID=CO1.NTC.3614447&isFromPublicArea=True&isModal=False","Otros","Selección abreviada","Selección abreviada por menor cuantía ","CONTRATAR BAJO LA MODALIDAD DE PRECIOS UNITARIOS FIJOS A MONTO AGOTABLE, LAS ACTIVIDADES DE MANTENIMIENTO Y CONSERVACIÓN DE PUENTES PEATONALES UBICADOS EN LA LOCALIDAD ANTONIO NARIÑO\t","Inversión","Un nuevo contrato social y ambiental para la Bogotá del Siglo XXI",49,{"$f":"IF(ISERROR(VLOOKUP(K296,Proposito_programa!$C$2:$E$59,2,FALSE)),\" \",VLOOKUP(K296,Proposito_programa!$C$2:$E$59,2,FALSE))","v":"Movilidad segura, sostenible y accesible"},{"$f":"IF(ISERROR(VLOOKUP(K296,Proposito_programa!$C$2:$E$59,3,FALSE)),\" \",VLOOKUP(K296,Proposito_programa!$C$2:$E$59,3,FALSE))","v":"Propósito 4: Hacer de Bogotá Región un modelo de movilidad multimodal, incluyente y sostenible"},2186,1,9011585782,"CONSORCIO MANTENIMIENTO PUENTES\t","Consorcio","NIT. 901503062- NIT. 900940866","ANX INGENIERIA Y SOLUCIONES S.A.S.  Polo Construcciones e ingenieria sas. ","ANX INGENIERIA Y SOLUCIONES S.A.S. (10.00%)- Polo Construcciones e ingenieria sas (90.00%)",null,52693182,null,null,null,52693182,0,"2022-12-19","SIN INICIO ","2023-01-30",30,null,null,null,null,null,null,"Celebrado o por iniciar",0]
[280,2022,"FDLAN-SASI-007-2022 (82343)\t","https://community.secop.gov.co/Public/Tendering/OpportunityDetail/Index?noticeUID=CO1.NTC.3653264&isFromPublicArea=True&isModal=False","Otros","Selección abreviada","Selección abreviada por menor cuantía ","ADQUISICION DE ELEMENTOS DOTACIONALES PARA EL FORTALECIMIENTO DE JUNTAS DE ACCION COMUNAL DE LA LOCALIDAD ANTONIO NARIÑO.\t","Inversión","Un nuevo contrato social y ambiental para la Bogotá del Siglo XXI",55,{"$f":"IF(ISERROR(VLOOKUP(K297,Proposito_programa!$C$2:$E$59,2,FALSE)),\" \",VLOOKUP(K297,Proposito_programa!$C$2:$E$59,2,FALSE))","v":"Fortalecimiento de cultura ciudadana y su institucionalidad"},{"$f":"IF(ISERROR(VLOOKUP(K297,Proposito_programa!$C$2:$E$59,3,FALSE)),\" \",VLOOKUP(K297,Proposito_programa!$C$2:$E$59,3,FALSE))","v":"Propósito 5: Construir Bogotá - Región con gobierno abierto, transparente y ciudadanía consciente"},2190,7,830005066,"SECURITY VIDEO EQUIPMENT S.A.S.\t","Persona Jurídica",null,null,null,null,65469563,null,null,null,65469563,0,"2022-12-29","2023-02-13","2023-02-28",60,null,null,null,null,null,null,"Celebrado o por iniciar",0]
[281,2022,"FDLAN-MC-004-2022(81528)\t","https://community.secop.gov.co/Public/Tendering/OpportunityDetail/Index?noticeUID=CO1.NTC.3666427&isFromPublicArea=True&isModal=False","Otros","Contratación mínima cuantia","No aplica","ADQUISICIÓN DE ELEMENTOS DE DOTACIÓN PARA EL DESARROLLO DE LAS ACTIVIDADES ENMARCADAS EN LOS PROCESOS DE CONCILIACIÓN Y RESOLUCIÓN DE CONFLICTOS A CARGO DE LAS FIGURAS DE CONCILIACIÓN EN EQUIDAD Y JUSTICIA DE PAZ\t","Inversión","Un nuevo contrato social y ambiental para la Bogotá del Siglo XXI",33,{"$f":"IF(ISERROR(VLOOKUP(K298,Proposito_programa!$C$2:$E$59,2,FALSE)),\" \",VLOOKUP(K298,Proposito_programa!$C$2:$E$59,2,FALSE))","v":"Más árboles y más y mejor espacio público"},{"$f":"IF(ISERROR(VLOOKUP(K298,Proposito_programa!$C$2:$E$59,3,FALSE)),\" \",VLOOKUP(K298,Proposito_programa!$C$2:$E$59,3,FALSE))","v":"Propósito 2 : Cambiar Nuestros Hábitos de Vida para Reverdecer a Bogotá y Adaptarnos y Mitigar la Crisis Climática"},2206,3,820005398,"REFORESTADORA PALOS VERDES SAS\t","Persona Jurídica",null,null,null,null,24522000,null,null,null,24522000,0,"2022-12-30","2023-01-24","2023-03-31",90,null,null,null,null,null,null,"Celebrado o por iniciar",0]
[282,2022,"FDLAN-MC-005-2022 (84874)\t","https://community.secop.gov.co/Public/Tendering/OpportunityDetail/Index?noticeUID=CO1.NTC.3667005&isFromPublicArea=True&isModal=False","Otros","Contratación mínima cuantia","No aplica","\"ADQUISICIÓN DE ELEMENTOS DE DOTACIÓN PARA EL DESARROLLO DE LAS ACTIVIDADES ENMARCADAS EN LOS PROCESOS DE CONCILIACIÓN Y RESOLUCIÓN DE CONFLICTOS A CARGO DE LAS FIGURAS DE CONCILIACIÓN EN EQUIDAD Y JUSTICIA DE PAZ\"\t","Inversión","Un nuevo contrato social y ambiental para la Bogotá del Siglo XXI",48,{"$f":"IF(ISERROR(VLOOKUP(K299,Proposito_programa!$C$2:$E$59,2,FALSE)),\" \",VLOOKUP(K299,Proposito_programa!$C$2:$E$59,2,FALSE))","v":"Plataforma institucional para la seguridad y justicia"},{"$f":"IF(ISERROR(VLOOKUP(K299,Proposito_programa!$C$2:$E$59,3,FALSE)),\" \",VLOOKUP(K299,Proposito_programa!$C$2:$E$59,3,FALSE))","v":"Propósito 3: Inspirar confianza y legitimidad para vivir sin miedo y ser epicentro de cultura ciudadana, paz y reconciliación"},2184,6,830016004,"REDCOMPUTO LTDA","Persona Jurídica",null,null,null,null,26537000,null,null,null,26537000,0,"2022-12-30","2022-12-30","2023-02-28",90,null,null,null,null,null,null,"Celebrado o por iniciar",0]
[283,2022,"FDLAN-SAMC-023-2022 (82994)\t","https://community.secop.gov.co/Public/Tendering/OpportunityDetail/Index?noticeUID=CO1.NTC.3665696&isFromPublicArea=True&isModal=False","Otros","Selección abreviada","Selección abreviada por menor cuantía ","PRESTAR LOS SERVICIOS LOGÍSTICO Y ORGANIZACIONAL PARA DESARROLLAR LA SEMANOTA COMERCIAL DE LA LOCALIDAD ANTONIO NARIÑO.\t","Inversión","Un nuevo contrato social y ambiental para la Bogotá del Siglo XXI",6,{"$f":"IF(ISERROR(VLOOKUP(K300,Proposito_programa!$C$2:$E$59,2,FALSE)),\" \",VLOOKUP(K300,Proposito_programa!$C$2:$E$59,2,FALSE))","v":"Sistema Distrital de Cuidado"},{"$f":"IF(ISERROR(VLOOKUP(K300,Proposito_programa!$C$2:$E$59,3,FALSE)),\" \",VLOOKUP(K300,Proposito_programa!$C$2:$E$59,3,FALSE))","v":"Propósito 1: Hacer un nuevo contrato social para incrementar la inclusión social, productiva y política"},2191,9,900572437,"FUNDACION PAIS HUMANO\t","Persona Jurídica",null,null,null,null,163495356,null,null,null,163495356,0,"2022-12-30","SIN INICIO ","2023-02-28",60,null,null,null,null,null,null,"Celebrado o por iniciar",0]
[284,2022,"FDLAN-SAMC-024-2022 (82824)\t","https://community.secop.gov.co/Public/Tendering/OpportunityDetail/Index?noticeUID=CO1.NTC.3665843&isFromPublicArea=True&isModal=False","Otros","Selección abreviada","Selección abreviada por menor cuantía ","PRESTACIÓN DE SERVICIOS DE APOYO LOGÍSTICO PARA LA REALIZACIÓN DE LA FERIA ESCOLAR TEMPORAL DE VENDEDORES INFORMALES DENOMINADA \"FERIA ESCOLAR CENTENARIO\" EN LA LOCALIDAD DE ANTONIO NARIÑO\t","Inversión","Un nuevo contrato social y ambiental para la Bogotá del Siglo XXI",45,{"$f":"IF(ISERROR(VLOOKUP(K301,Proposito_programa!$C$2:$E$59,2,FALSE)),\" \",VLOOKUP(K301,Proposito_programa!$C$2:$E$59,2,FALSE))","v":"Espacio público más seguro y construido colectivamente"},{"$f":"IF(ISERROR(VLOOKUP(K301,Proposito_programa!$C$2:$E$59,3,FALSE)),\" \",VLOOKUP(K301,Proposito_programa!$C$2:$E$59,3,FALSE))","v":"Propósito 3: Inspirar confianza y legitimidad para vivir sin miedo y ser epicentro de cultura ciudadana, paz y reconciliación"},2183,7,900004535,"CORPORACION DE SERVICIOS COLOMBIA CORSERVICOL ONG\t","Persona Jurídica",null,null,null,null,138516109,null,null,null,{"$f":"+W301+X301+Z301","v":138516109},0,"2022-12-30","2023-01-24","2023-02-28",60,null,null,null,null,null,null,"Celebrado o por iniciar",0]
[286,2022,"FDLAN-CD-286-2022(81796)\t","https://community.secop.gov.co/Public/Tendering/OpportunityDetail/Index?noticeUID=CO1.NTC.3690785&isFromPublicArea=True&isModal=False","Contratos de prestación de servicios profesionales y de apoyo a la gestión","Contratación directa","Prestación de servicios profesionales y de apoyo a la gestión, o para la ejecución de trabajos artísticos que sólo puedan encomendarse a determinadas personas naturales","Apoyar jurídicamente a la Junta Administradora Local con el fin de contribuir al adecuado cumplimiento de las atribuciones a su cargo.\t","Inversión","Un nuevo contrato social y ambiental para la Bogotá del Siglo XXI",57,{"$f":"IF(ISERROR(VLOOKUP(K302,Proposito_programa!$C$2:$E$59,2,FALSE)),\" \",VLOOKUP(K302,Proposito_programa!$C$2:$E$59,2,FALSE))","v":"Gestión pública local"},{"$f":"IF(ISERROR(VLOOKUP(K302,Proposito_programa!$C$2:$E$59,3,FALSE)),\" \",VLOOKUP(K302,Proposito_programa!$C$2:$E$59,3,FALSE))","v":"Propósito 5: Construir Bogotá - Región con gobierno abierto, transparente y ciudadanía consciente"},2198,1,1013633783,"YISETH KATHERINE MARTIN GUTIERREZ","Persona Natural",null,null,null,null,9030000,null,null,null,9030000,0,"2022-12-30","2023-01-10","2023-02-28",60,null,null,null,null,null,null,"Celebrado o por iniciar",0]
[287,2022,"FDLAN-CD-287-2022(81656)\t","https://community.secop.gov.co/Public/Tendering/OpportunityDetail/Index?noticeUID=CO1.NTC.3692898&isFromPublicArea=True&isModal=False","Contratos de prestación de servicios profesionales y de apoyo a la gestión","Contratación directa","Prestación de servicios profesionales y de apoyo a la gestión, o para la ejecución de trabajos artísticos que sólo puedan encomendarse a determinadas personas naturales","Prestación de servicios de apoyo para el Fondo de Desarrollo Local de Antonio Nariño para fortalecer el montaje y el buen desarrollo de las actividades culturales y artísticas que brindan a la comunidad en el Teatro Villa Mayor\t","Inversión","Un nuevo contrato social y ambiental para la Bogotá del Siglo XXI",57,{"$f":"IF(ISERROR(VLOOKUP(K303,Proposito_programa!$C$2:$E$59,2,FALSE)),\" \",VLOOKUP(K303,Proposito_programa!$C$2:$E$59,2,FALSE))","v":"Gestión pública local"},{"$f":"IF(ISERROR(VLOOKUP(K303,Proposito_programa!$C$2:$E$59,3,FALSE)),\" \",VLOOKUP(K303,Proposito_programa!$C$2:$E$59,3,FALSE))","v":"Propósito 5: Construir Bogotá - Región con gobierno abierto, transparente y ciudadanía consciente"},2198,1,80050747,"FRANK BORIS EDUARDO MALDONADO OLIVO\t","Persona Natural",null,null,null,null,13950000,null,null,null,13950000,0,"2022-12-30","2023-02-10","2023-06-02",150,null,null,null,null,null,null,"Celebrado o por iniciar",0]
["CIA 001 ",2022,"FDLAN-CIA-001-2022","https://www.contratos.gov.co/consultas/detalleProceso.do?numConstancia=22-22-44788&g-recaptcha-response=03AD1IbLCYp38Gnl4bvQtbhDI_dtdlHjqJtiVg-qrnBe7w9CvgU6a-xXW2B0KsB0HaUq2GCHNQHxGyf6jHxHw8rXYtuBCVUYLuCIAyZfEjtzP10nTniOa8_RlNgnWE-Gbmq9u2bsqqGc7PSdsuWqBtXSZta5eYNMrE4CuAhmH79pOuSDZ-zXsaIDYfbrUQDfxRdcXIXGXl8z-wxY9tewf1W534-M99yCruZIxJN46nyRhr3r6xOaSb4qwpZ6JOdb2n2qSc4OyJ3q9q4g-PtkUchdYi5lif3_9nxy2AJcAuFeJ2yZYquP6Upwbq9GfIcx78NK_LcDgEX5HhgcWk8A0abKpGF6upHidQzFzu4dOwugmY_l1PQJi8dUrAkdcMMq1L0ZRYDfTbSB0ucZnityDEiJcj5EiCHndI1rwXHdSo6-ThTij50XyNlNwJxe9OQWxeerbs0IPpMRcsQJaP-0DYvSSB9O7Hlkaey2taNeG6U8Zjas7t9ICMzDaMBMJl-Xt2_TquxzJkYGRuPCEUfHx3udUKNOvWqzJEOQ","Convenios/Contratos interadministrativos","Contratación directa","Contratos interadministrativos","Aunar esfuerzos técnicos, administrativos y financieros con el fin de desarrollar acciones articuladas entre la SCRD, el IDARTES y los Fondos de Desarrollo Local, orientadas a fomentar procesos de formación, cualificación, fortalecimiento de los agentes culturales territoriales del Distrito Capital, en el marco de la generación y circulación de bienes y servicios culturales, artísticos y patrimoniales, de conformidad con las iniciativas priorizadas y concertadas en la estrategia Distrital \"Presupuestos Participativos\" y/o de las concertaciones con los grupos de interés de las localidades y a las acciones adelantadas en el “Proceso Misional de Fomento”, de acuerdo con los proyectos a ejecutar asociados a las metas de cada localidad en el programa \"Es Cultura Local 2022\"","Inversión","Un nuevo contrato social y ambiental para la Bogotá del Siglo XXI",21,"Creación y vida cotidiana: Apropiación ciudadana del arte, la cultura y el patrimonio, para la democracia cultural","Propósito 1: Hacer un nuevo contrato social para incrementar la inclusión social, productiva y política",2201,1,899999061,"\tSECRETARIA DISTRITAL DE CULTURA, RECREACIÓN Y DEPORTE -SCRD- EL INSTITUTO DISTRITAL DE LAS ARTES","Persona Jurídica",null,null,null,null,200000000,null,null,null,{"$f":"+W304+X304+Z304","v":200000000},200000000,"2022-07-08","2022-07-19",null,408,null,null,null,null,null,null,"En ejecución",1]
["CIA 002",2022,"FDLAN-CIA-002-2022","https://community.secop.gov.co/Public/Tendering/OpportunityDetail/Index?noticeUID=CO1.NTC.3243853&isFromPublicArea=True&isModal=False","Convenios/Contratos interadministrativos","Contratación directa","Contratos interadministrativos","AUNAR ESFUERZOS TÉCNICOS, ADMINISTRATIVOS, JURÍDICOS Y FINANCIEROS ENTRE LA AGENCIA DISTRITAL PARA LA EDUCACIÓN SUPERIOR, LA CIENCIA Y LA TECNOLOGÍA - ATENEA Y EL FONDO DE DESARROLLO LOCAL DE ANTONIO NARIÑO PARA LA IMPLEMENTACIÓN DE UN NUEVO MODELO INCLUSIVO, EFICIENTE Y FLEXIBLE PARA EL ACCESO Y LA PERMANENCIA DE LAS Y LOS JÓVENES EGRESADOS DE INSTITUCIONES DE EDUCACIÓN MEDIA A PROGRAMAS DE EDUCACIÓN SUPERIOR Y POSMEDIA","Inversión","Un nuevo contrato social y ambiental para la Bogotá del Siglo XXI",17,{"$f":"IF(ISERROR(VLOOKUP(K305,Proposito_programa!$C$2:$E$59,2,FALSE)),\" \",VLOOKUP(K305,Proposito_programa!$C$2:$E$59,2,FALSE))","v":"Jóvenes con capacidades: Proyecto de vida para la ciudadanía, la innovación y el trabajo del siglo XXI"},{"$f":"IF(ISERROR(VLOOKUP(K305,Proposito_programa!$C$2:$E$59,3,FALSE)),\" \",VLOOKUP(K305,Proposito_programa!$C$2:$E$59,3,FALSE))","v":"Propósito 1: Hacer un nuevo contrato social para incrementar la inclusión social, productiva y política"},2048,1,901508361,"AGENCIA DISTRITAL PARA LA EDUCACIÓN SUPERIOR, LA CIENCIA Y LA TECNOLOGÍA, ATENEA","Persona Jurídica",null,null,null,null,1286932000,null,null,null,1286932000,1286932000,"2022-09-06","2029-12-31","2029-12-21",2672,null,null,null,null,null,null,"En ejecución",1]
["CIA 003",2022,"FDLAN-CIA-003-2022","https://community.secop.gov.co/Public/Tendering/OpportunityDetail/Index?noticeUID=CO1.NTC.3256074&isFromPublicArea=True&isModal=False","Convenios/Contratos interadministrativos","Contratación directa","Contratos interadministrativos","Aunar esfuerzos, administrativos, técnicos, legales y económicos entre la Subred Integra de Servicios de Salud Centro Oriente y el FDL de Antonio Nariño para el suministro y/o otorgamiento de dispositivos de asistencia personal (DAP), no incluidos en el plan de beneficios salud -POS\", dirigido a las personas con discapacidad de la localidad\", con cargo al rubro O23011601060000002194, denominado \"Acciones de fomento y promoción de las condiciones de salud","Inversión","Un nuevo contrato social y ambiental para la Bogotá del Siglo XXI",6,"Sistema Distrital de Cuidado","Propósito 1: Hacer un nuevo contrato social para incrementar la inclusión social, productiva y política",2194,1,900959051,"SUBRED INTEGRADA DE SERVICIOS DE SALUD CENTRO ORIENTE","Persona Jurídica",null,null,null,null,124803150,null,null,null,124803150,0,"2022-09-09","2022-10-04","2023-05-03",210,null,null,null,null,null,null,"En ejecución",0]
["CIA 004",2022,"FDLAN-CIA-004-2022","https://community.secop.gov.co/Public/Tendering/OpportunityDetail/Index?noticeUID=CO1.NTC.3648230&isFromPublicArea=True&isModal=False","Convenios/Contratos interadministrativos","Contratación directa","Contratos interadministrativos","Prestación de Servicios para realizar una acción pedagógica que fortalezca la implementación de proyectos de cooperación internacional para las mujeres de la Localidad de Antonio Nariño.","Inversión","Un nuevo contrato social y ambiental para la Bogotá del Siglo XXI",40,"Más mujeres viven una vida libre de violencias, se sienten seguras y acceden con confianza al sistema de justicia","Propósito 3: Inspirar confianza y legitimidad para vivir sin miedo y ser epicentro de cultura ciudadana, paz y reconciliación",2197,1,860512780,"UNIVERSIDAD NACIONAL ABIERTA Y A DISTANCIA - UNAD","Persona Jurídica",null,null,null,null,100000000,null,null,null,100000000,0,"2022-12-15","2023-02-14","2023-05-20",150,null,null,null,null,null,null,"En ejecución",0]
[null,2022,"Otros gastos",null,"Otros gastos","Otros","No aplica","Apropiaciones presupuestales de la vigencia 2022 como honorarios de Ediles, servicios públicos, etc., que afecten el rubro de funcionamiento","Funcionamiento","Un nuevo contrato social y ambiental para la Bogotá del Siglo XXI","No aplica","No aplica","No aplica","No aplica","No aplica","No aplica","No aplica","No aplica","No aplica","No aplica","No aplica",null,null,null,null,null,937969357,862285672,null,null,null,null,null,null,null,null,null,null,"Terminado",0.91931113267701348]
["Resolución 03",2022,"Otros gastos",null,"Otros gastos","Otros","No aplica","Ordena el gasto correspondiente al proyecto de inversión 1851 \"Acciones de atención para población vulnerable\", por valor de DOS MIL QUINIENTOS VEINTIDÓS MILLONES QUINIENTOS CINCUENTA Y CINCO MIL PESOS MCTE ($ 2.522.555.000), para el canal de transferencias monetarias y beneficiar en la Localidad de Antonio Nariño, a los hogares  en situación de pobreza o de vulnerabilidad,afectados por la emergenciasocial y económica ocasionada por el COVID -19","Inversión","Un nuevo contrato social y ambiental para la Bogotá del Siglo XXI",1,{"$f":"IF(ISERROR(VLOOKUP(K309,Proposito_programa!$C$2:$E$59,2,FALSE)),\" \",VLOOKUP(K309,Proposito_programa!$C$2:$E$59,2,FALSE))","v":"Subsidios y transferencias para la equidad"},{"$f":"IF(ISERROR(VLOOKUP(K309,Proposito_programa!$C$2:$E$59,3,FALSE)),\" \",VLOOKUP(K309,Proposito_programa!$C$2:$E$59,3,FALSE))","v":"Propósito 1: Hacer un nuevo contrato social para incrementar la inclusión social, productiva y política"},1851,null,8999999,"FONDO DE DESARROLLO LOCAL DE ANTONIO NAR IÑO","Persona Jurídica",null,null,null,null,2522555000,null,null,null,2522555000,2522555000,"2022-01-21","2022-01-21",null,null,null,null,null,null,null,null,"Terminado",1]
["Resolución 08",2022,"Otros gastos",null,"Otros gastos","Otros","No aplica","Pago de ARL contratistas riesgo IV y V vigencia 2022 por Resolución N° 007 de 09 de febrero de 2022, Alcaldía Local de Antonio Nariño, y memorando 20226520001273","Inversión","Un nuevo contrato social y ambiental para la Bogotá del Siglo XXI",57,{"$f":"IF(ISERROR(VLOOKUP(K310,Proposito_programa!$C$2:$E$59,2,FALSE)),\" \",VLOOKUP(K310,Proposito_programa!$C$2:$E$59,2,FALSE))","v":"Gestión pública local"},{"$f":"IF(ISERROR(VLOOKUP(K310,Proposito_programa!$C$2:$E$59,3,FALSE)),\" \",VLOOKUP(K310,Proposito_programa!$C$2:$E$59,3,FALSE))","v":"Propósito 5: Construir Bogotá - Región con gobierno abierto, transparente y ciudadanía consciente"},2189,null,"860011153","POSITIVA COMPAÑIA DE SEGUROS SA","Persona Jurídica",null,null,null,null,{"$f":"584556+2600000","v":3184556},null,null,null,3184556,{"$f":"584556+1828923","v":2413479},"2023-02-14","2023-01-01","2023-02-15",405,null,null,null,null,null,null,"Terminado",0.75786985689684838]
["Resolución 08",2022,"Otros gastos",null,"Otros gastos","Otros","No aplica","Pago de ARL contratistas riesgo IV y V vigencia 2022 por Resolución N° 007 de 09 de febrero de 2022, Alcaldía Local de Antonio Nariño, y memorando 20226520001273","Inversión","Un nuevo contrato social y ambiental para la Bogotá del Siglo XXI",57,{"$f":"IF(ISERROR(VLOOKUP(K311,Proposito_programa!$C$2:$E$59,2,FALSE)),\" \",VLOOKUP(K311,Proposito_programa!$C$2:$E$59,2,FALSE))","v":"Gestión pública local"},{"$f":"IF(ISERROR(VLOOKUP(K311,Proposito_programa!$C$2:$E$59,3,FALSE)),\" \",VLOOKUP(K311,Proposito_programa!$C$2:$E$59,3,FALSE))","v":"Propósito 5: Construir Bogotá - Región con gobierno abierto, transparente y ciudadanía consciente"},2198,null,"860011153","POSITIVA COMPAÑIA DE SEGUROS SA","Persona Jurídica",null,null,null,null,21128921,null,null,null,21128921,21128921,"2023-02-14","2023-01-01","2023-02-15",405,null,null,null,null,null,null,"Terminado",1]
["Resolución 173",2022,"Otros gastos",null,"Otros gastos","Otros","No aplica","Prorrogar desde el 1 de mayo del 2022 hasta el 30 de junio del 2022 la Resolución 173 de 2021 “Por medio de la cual se modifica la Resolución 143 de 2021 en la cual se ordena el gasto y pago correspondiente al Proyecto No. 1851 Acciones de atención para población vulnerable, Componente: Beneficiar 700 personas mayores con apoyo económico tipo C, de la localidad de Antonio Nariño Vigencia 2021\".","Inversión","Un nuevo contrato social y ambiental para la Bogotá del Siglo XXI",1,{"$f":"IF(ISERROR(VLOOKUP(K312,Proposito_programa!$C$2:$E$59,2,FALSE)),\" \",VLOOKUP(K312,Proposito_programa!$C$2:$E$59,2,FALSE))","v":"Subsidios y transferencias para la equidad"},{"$f":"IF(ISERROR(VLOOKUP(K312,Proposito_programa!$C$2:$E$59,3,FALSE)),\" \",VLOOKUP(K312,Proposito_programa!$C$2:$E$59,3,FALSE))","v":"Propósito 1: Hacer un nuevo contrato social para incrementar la inclusión social, productiva y política"},1851,null,"860066942","CAJA DE COMPENSACION FAMILIAR COMPENSAR","Persona Jurídica",null,null,null,null,184400000,null,null,null,184400000,184400000,"2022-12-23","2022-12-23","2023-02-23",60,null,null,null,null,null,null,"Terminado",1]
["Resolución 70",2022,"Otros gastos",null,"Otros gastos","Otros","No aplica","Por medio de la cual se ordena el gasto y pago correspondiente al proyecto N° 1851 \"Acciones de atención para la población vulnerable\" ,componente: beneficiar 700 personas mayores con apoyo económico tipo C de la Localidad de Antonio Nariño vigencia 2022, desde el 1 de julio de 2022 hasta el 31 de marzo del 2023.","Inversión","Un nuevo contrato social y ambiental para la Bogotá del Siglo XXI",1,{"$f":"IF(ISERROR(VLOOKUP(K313,Proposito_programa!$C$2:$E$59,2,FALSE)),\" \",VLOOKUP(K313,Proposito_programa!$C$2:$E$59,2,FALSE))","v":"Subsidios y transferencias para la equidad"},{"$f":"IF(ISERROR(VLOOKUP(K313,Proposito_programa!$C$2:$E$59,3,FALSE)),\" \",VLOOKUP(K313,Proposito_programa!$C$2:$E$59,3,FALSE))","v":"Propósito 1: Hacer un nuevo contrato social para incrementar la inclusión social, productiva y política"},1851,null,"860066942","CAJA DE COMPENSACION FAMILIAR COMPENSAR","Persona Jurídica",null,null,null,null,829800000,null,null,null,829800000,548274904,"2022-07-01","2022-07-01","2023-03-30",270,null,null,null,null,null,null,"En ejecución",0.66073138587611469]
["CCI-004 ",2022,"FDLAN-CCI-004-2022","https://community.secop.gov.co/Public/Tendering/OpportunityDetail/Index?noticeUID=CO1.NTC.3391622&isFromPublicArea=True&isModal=False","Convenios de cooperacion","Régimen especial","Decreto 92 de 2017","Aunar esfuerzos para la cooperación administrativa, técnica y económica, entre el Programa para las Naciones Unidas para el Desarrollo (PNUD) y El Fondo de Desarrollo Local, con el fin de desarrollar La Ruta de Acompañamiento IMPULSAMOS LA ECONOMÍA LOCAL- la cual busca fortalecer iniciativas productivas de emprendimientos y/o MiPymes, a través de formación y la generación de capacidades duras y blandas en los beneficiarios, acompañamiento personalizado y la entrega de recursos de capitalización","Inversión","Un nuevo contrato social y ambiental para la Bogotá del Siglo XXI",6,"Sistema Distrital de Cuidado","Propósito 1: Hacer un nuevo contrato social para incrementar la inclusión social, productiva y política",2191,null,800091076,"PROGRAMA DE LAS NACIONES UNIDAS PARA EL DESARROLLO PNUD","Persona Jurídica",null,null,null,null,290600000,null,null,null,290600000,290600000,"2022-10-12","2022-10-13","2023-07-12",270,null,null,null,null,null,null,"En ejecución",1]
["ORDEN DE COMPRA 101684",2022,"ORDEN DE COMPRA SOLICITUD 175345","https://colombiacompra.coupahost.com/order_headers/101684","Otros","Otros","No aplica","ADQUISICIÓN DE CINTAS COLOR PARA IMPRESIÓN DE TARJETAS E INSUMOS DE TARJETAS PVC DE IMPRESIÓN DE CARNET, PARA EL FONDO DESARROLLO LOCAL ANTONIO NARIÑO (FDLAN).","Inversión","Un nuevo contrato social y ambiental para la Bogotá del Siglo XXI",57,"Gestión pública local","Propósito 5: Construir Bogotá - Región con gobierno abierto, transparente y ciudadanía consciente",2198,null,8300379463,"PANAMERICANA LIBRERÍA Y PAPELERÍA S.A.","Persona Jurídica",null,null,null,null,1800589,null,null,null,1800589,0,"2022-12-09","2022-12-09","2022-12-30",51,null,null,null,null,null,null,"En ejecución",0]
["ORDEN DE COMPRA 98638",2022,"ORDEN DE COMPRA SOLICITUD  170905","https://colombiacompra.coupahost.com/order_headers/98638","Otros","Otros","No aplica","ADQUISICIÓN, COMPRA Y DOTACIÓN DE MOTOCICLETAS DOBLE PROPÓSITO TIPO ENDURO PARA FORTALECER LAS ACCIONES DE SEGURIDAD EN LA LOCALIDAD DE ANTONIO NARIÑO.","Inversión","Un nuevo contrato social y ambiental para la Bogotá del Siglo XXI",48,"Plataforma institucional para la seguridad y justicia","Propósito 3: Inspirar confianza y legitimidad para vivir sin miedo y ser epicentro de cultura ciudadana, paz y reconciliación",2185,null,890301886,"FANALCA S.A ","Persona Jurídica",null,null,null,null,190605546,null,null,null,190605546,0,"2022-11-04","2022-11-04","2023-02-28",120,null,null,null,null,null,null,"En ejecución",0]
["ORDEN DE COMPRA  97566 - 169156",2022,"ORDEN DE COMPRA SOLICITUD  169155","https://colombiacompra.coupahost.com/order_headers/97566","Otros","Otros","No aplica","SUMINISTRO DE MATERIALES DE FERRETERÍA EN GENERAL PARA APOYAR LA ATENCIÓN DEL ESPACIO PUBLICO, DENTRO DE LA ESTRATEGIA DE INTERVENNCION DEL ESPACIO PUBLICO, ?JUNTOS CUIDAMOS BOGOTA","Inversión","Un nuevo contrato social y ambiental para la Bogotá del Siglo XXI",49,"No aplica",{"$f":"IF(ISERROR(VLOOKUP(K317,Proposito_programa!$C$2:$E$59,3,FALSE)),\" \",VLOOKUP(K317,Proposito_programa!$C$2:$E$59,3,FALSE))","v":"Propósito 4: Hacer de Bogotá Región un modelo de movilidad multimodal, incluyente y sostenible"},2186,null,19254921,"NELSON ORLANDO ESPITIA CAMARGO","Persona Natural",null,null,null,null,55945946,null,null,null,{"$f":"+W317+X317+Z317","v":55945946},0,"2022-10-18","2022-10-18","2023-03-31",163,1,90,null,null,null,null,"En ejecución",0]
["ORDEN DE COMPRA 93833",2022,"ORDEN DE COMPRA SOLICITUD  158372","https://colombiacompra.coupahost.com/order_headers/93833","Otros","Otros","No aplica","CONTRATAR EL SUMINISTRO DE COMBUSTIBLES PARA LOS VEHÍCULOS QUE COMPONEN EL PARQUE AUTOMOTOR DE LA ALCALDÍA LOCAL DE ANTONIO NARIÑO Y LOS QUE A CUALQUIER TÍTULO LLEGUE A ADQUIRIR","Funcionamiento","Un nuevo contrato social y ambiental para la Bogotá del Siglo XXI","No aplica","No aplica","No aplica",6103,null,811009788,"DISTRACOM","Persona Jurídica",null,null,null,null,6000000,null,null,null,6000000,3535311,"2022-07-25","2022-07-25","2023-03-25",240,null,null,null,null,null,null,"En ejecución",0.58921849999999998]
["ORDEN DE COMPRA 90866",2022,"ORDEN DE COMPRA SOLICITUD  157069","https://colombiacompra.coupahost.com/order_headers/90866","Otros","Otros","No aplica","ADQUISICIÓN DE EQUIPOS DE IMPRESIÓN DE TARJETAS E INSUMOS","Funcionamiento","Un nuevo contrato social y ambiental para la Bogotá del Siglo XXI","No aplica","No aplica","No aplica",302,null,830037946,"\nPANAMERICANA LIBRERÍA Y PAPELERÍA S.A.","Persona Jurídica",null,null,null,null,7347060,null,null,null,7347060,7347060,"2022-05-31","2022-05-31","2022-07-15",45,null,null,null,null,null,null,"En ejecución",1]
["ORDEN DE COMPRA 90020",2022,"ORDEN DE COMPRA SOLICITUD  157062","https://colombiacompra.coupahost.com/order_headers/90020","Otros","Otros","No aplica","ADQUISICIÓN DE LICENCIAS OFFICE 365 PARA LOS FUNCIONARIOS CONTRATISTAS DEL FONDO DE DESARROLLO LOCAL DE ANTONIO NARIÑO","Funcionamiento","Un nuevo contrato social y ambiental para la Bogotá del Siglo XXI","No aplica","No aplica","No aplica",0,null,901399373,"UNIÓN TEMPORAL DELL EMC","Persona Jurídica",null,null,null,null,49278000,null,null,null,49278000,49278000,"2022-05-17","2022-05-17","2022-07-02",45,null,null,null,null,null,null,"En ejecución",1]
["ORDEN DE COMPRA 86538",2022,"ORDEN DE COMPRA SOLICITUD  151427","https://colombiacompra.coupahost.com/order_headers/86538","Otros","Otros","No aplica","PRESTACIÓN DEL SERVICIO INTEGRAL DE ASEO Y CAFETERÍA PARA LAS SEDES DE LA ALCALDÍA LOCAL DE ANTONIO NARIÑO EN LAS CONDICIONES DEL ACUERDO MARCO DE PRECIOS CCE-972-AMP","Funcionamiento","Un nuevo contrato social y ambiental para la Bogotá del Siglo XXI","No aplica","No aplica","No aplica",0,null,890331277,"\nSERVIESPECIALES S.A.S","Persona Jurídica",null,null,null,null,153531714,null,2,66042644,{"$f":"+W321+X321+Z321","v":219574358},134877758,"2022-03-10","2022-03-10","2023-02-24",344,null,null,null,null,null,null,"En ejecución",0.61426916707642154]
[108,2021,"FDLAN-SAMC-003-2021 ","https://community.secop.gov.co/Public/Tendering/OpportunityDetail/Index?noticeUID=CO1.NTC.1931204&isFromPublicArea=True&isModal=False","Seguro","Selección abreviada","Selección abreviada por menor cuantía ","CONTRATAR LOS SEGUROS QUE AMPAREN LOS INTERESES PATRIMONIALES ACTUALES Y FUTUROS, ASÍ COMO LOS BIENES DE PROPIEDAD DEL FONDO DE DESARROLLO LOCAL DE ANTONIO NARIÑO, QUE ESTÉN BAJO SU RESPONSABILIDAD Y CUSTODIA Y AQUELLOS QUE SEAN ADQUIRIDOS PARA DESARROLLAR LAS FUNCIONES INHERENTES A SU ACTIVIDAD, ASÍ COMO LA EXPEDICIÓN DE UNA PÓLIZA COLECTIVA DE SEGURO DE VIDA Y CUALQUIER OTRA PÓLIZA DE SEGUROS QUE REQUIERA LA ENTIDAD EN EL DESARROLLO DE SU ACTIVIDAD","Funcionamiento","Un nuevo contrato social y ambiental para la Bogotá del Siglo XXI","No aplica","No aplica","No aplica",105,null,"8600024002-2","LA PREVISORA S.A. COMPAÑIA DE SEGUROS","Persona Jurídica",null,null,null,null,64253393,null,1,2965950,33916636,33916636,"2021-03-11","2021-03-11","2021-07-09",246,1,11,null,null,null,null,"Terminado",1]
[103,2021,"FDLAN-SAMC-002-2021(58041) ","https://community.secop.gov.co/Public/Tendering/OpportunityDetail/Index?noticeUID=CO1.NTC.1900267&isFromPublicArea=True&isModal=False","Contratos de prestación de servicios","Selección abreviada","Selección abreviada por menor cuantía ","“Prestación del servicio de vigilancia y seguridad privada para la sede administrativa de la alcaldía local de Antonio Nariño, el teatro villa mayor, el salón comunal de la fragua y todos aquellos bienes muebles o inmuebles de los cuales sea o llegare a ser legalmente responsable”.","Funcionamiento","Un nuevo contrato social y ambiental para la Bogotá del Siglo XXI","No aplica","No aplica","No aplica",501,null,"804.000.353-1","COOPERATIVA DE VIGILANCIA Y SERVICIOS DE BUCARAMANGA CTA- COOVIMAC C.T.A.","Persona Jurídica",null,null,null,null,230316407,null,1,47860562,47860562,47860561,"2021-04-19","2021-04-19","2021-12-18",240,1,49,null,null,null,null,"Terminado",0.99999997910597038]
[136,2021,"FDLAN-MC-003-2021(","https://community.secop.gov.co/Public/Tendering/ContractNoticePhases/View?PPI=CO1.PPI.14236558&isFromPublicArea=True&isModal=False","Contratos de prestación de servicios","Contratación mínima cuantia","No aplica","REALIZAR EL MANTENIMIENTO TÉCNICO, PREVENTIVO Y CORRECTIVO PARA PARA EL ÓPTIMO FUNCIONAMIENTO DEL ASCENSOR QUE SE ENCUENTRA AL SERVICIO DE LA SEDE ADMINISTRATIVA DE LA ALCALDÍA LOCAL DE ANTONIO NARIÑO Y LA COMUNIDAD","Funcionamiento","Un nuevo contrato social y ambiental para la Bogotá del Siglo XXI","No aplica","No aplica","No aplica",611,1,"830146855-9","GRUPO DE ASCENSORES MILENIUM  GRAM LTDA","Persona Jurídica",null,null,null,null,216170725,null,1,2211616,2211616,1830815,"2021-08-04","2021-08-23","2022-08-22",360,null,null,null,null,null,null,"Terminado",0.8278177585982377]
[205,2021,"FDLAN-SAMC-016-2021(63642)","https://community.secop.gov.co/Public/Tendering/OpportunityDetail/Index?noticeUID=CO1.NTC.2466997&isFromPublicArea=True&isModal=False","Contratos de prestación de servicios","Selección abreviada","Selección abreviada por menor cuantía ","CONTRATAR BAJO LA MODALIDAD DE PRECIOS UNITARIOS FIJOS SIN FORMULA DE REAJUSTE Y A MONTO AGOTABLE LAS OBRAS PARA EL MANTENIMIENTO, ADECUACIÓN, REHABILITACIÓN Y RECUPERACIÓN DE PARQUES UBICADOS EN LA LOCALIDAD ANTONIO NARIÑO","Inversión","Un nuevo contrato social y ambiental para la Bogotá del Siglo XXI",33,{"$f":"IF(ISERROR(VLOOKUP(K325,Proposito_programa!$C$2:$E$59,2,FALSE)),\" \",VLOOKUP(K325,Proposito_programa!$C$2:$E$59,2,FALSE))","v":"Más árboles y más y mejor espacio público"},{"$f":"IF(ISERROR(VLOOKUP(K325,Proposito_programa!$C$2:$E$59,3,FALSE)),\" \",VLOOKUP(K325,Proposito_programa!$C$2:$E$59,3,FALSE))","v":"Propósito 2 : Cambiar Nuestros Hábitos de Vida para Reverdecer a Bogotá y Adaptarnos y Mitigar la Crisis Climática"},2207,1,"800011687-9","INCIVIAS SAS","Persona Jurídica",null,null,null,null,43553909,null,null,null,{"$f":"+W325+X325+Z325","v":43553909},22312968,"2021-12-30","2022-02-03","2022-05-02",90,1,25,null,null,null,null,"En ejecución",0.51230689764264326]
["4140000-974-2022",2022,"4140000-974-2022","https://www.contratos.gov.co/consultas/detalleProceso.do?numConstancia=22-22-48486&g-recaptcha-response=03AFY_a8W94vjo0DctkNidkWRFEOK5sd5t-nmveViBBL18YiX-NEGCGqJQV2izdqXQS_Yo4euYAYeABWMF4g3oYPMBKB9XePKB515YoqlUHIRX7_Rc6o1kOEKQH453bycG4kCtyDmCPAEKl6CCo7ltqqCKDG_7Jw54qrcATe_t-EGO_FQv3TeRx-98BpJyNBjsM4XZrmdHfwi30bX_VLAUJQDz3qkrOJQbupw2vmwrn6MjFyR2tUtIHAsUhUdVGGCB7SrHUaLIMsORy3-UGh5Waj9-syaXG9A-P7MqgDWfUkOD4HjpAO-3JIh_HEH0l9MGiFCikIKnzSi-gy6TD9S0Cm3g2CVH-zEk6J0ayxhtgwQDZlKo5mcqYr__XsHsubLq9i8P1OchtKGhh1tWOQLx8l4FVJoxdptOB7UNkmhwzhRIIni8ry7hUxtP6IArEckiIAmwExGCJGCklzWuidF72T9PRBKTEVNKujphqB_kLh7MNAsKHld2XI6KaUwJESA9L85pmKDSKuvlFF0H0qDQmEnvLXRJohwH_Q","Convenios/Contratos interadministrativos","Contratación directa","Contratos interadministrativos","Prestar los servicios de planeación, ejecución y divulgación de las actividades a desarrollarse en el marco de la acción de ciudad NAVIDAD 2022 relacionadas con la generación de los entornos lumínicos y difusión de los actos principales que harán parte de la estrategia comunicacional a cargo de la Oficina Consejería de Comunicaciones de la Secretaría General de la Alcaldía Mayor de Bogotá.","Inversión","Un nuevo contrato social y ambiental para la Bogotá del Siglo XXI",21,"Creación y vida cotidiana: Apropiación ciudadana del arte, la cultura y el patrimonio, para la democracia cultural","Propósito 1: Hacer un nuevo contrato social para incrementar la inclusión social, productiva y política",2201,1,830012587,"CANAL CAPITAL","Persona Jurídica",null,null,null,null,100000000,null,null,null,{"$f":"+W326","v":100000000},0,"2022-10-28","2022-12-01","2023-04-30",150,null,null,null,null,null,null,"En ejecución",0]
["otros",null,"OBLIGACIONES POR PAGAR",null,null,null,null,null,null,null,null,null,null,null,null,null,null,null,null,null,null,null,null,null,null,null,{"$f":"+W327","v":0},null,null,null,null,null,null,null,null,null,null,null,null,"-"]
[66,2022,"FDLAN-SAMC-001-2020","https://community.secop.gov.co/Public/Tendering/OpportunityDetail/Index?noticeUID=CO1.NTC.1179338&isFromPublicArea=True&isModal=False","Contratos de prestación de servicios","Selección abreviada","Selección abreviada por menor cuantía ","“PRESTAR EL SERVICIO DE VIGILANCIA Y SEGURIDAD PRIVADA, PARA LA SEDE DE LA ALCALDIA LOCAL DE ANTONIO NARIÑO Y DE LOS MUEBLES E INMUEBLES QUE HACEN PARTE DE LA ENTIDAD Y DE TODOS AQUELLOS DE LOS CUALES SEA O LLEGARE A SER LEGALMENTE RESPONSABLES”","Funcionamiento","Un nuevo contrato social y ambiental para la Bogotá del Siglo XXI","No aplica","No aplica","No aplica","No aplica",null,891502104,"COMPAÑIA DE VIGILANCIA COVISUR DE COLOMB IA LTDA.","Persona Jurídica",null,null,null,null,7714295,null,2,2476985,{"$f":"W328+Z328","v":10191280},0,"2020-04-03","2020-04-03","2020-12-03",null,null,null,null,null,null,null,null,0]
[103,2021,"FDLAN-SAMC-002-2021(58041) ","https://community.secop.gov.co/Public/Tendering/OpportunityDetail/Index?noticeUID=CO1.NTC.1900267&isFromPublicArea=True&isModal=False","Contratos de prestación de servicios","Selección abreviada","Selección abreviada por menor cuantía ","PRESTACIÓN DEL SERVICIO DE VIGILANCIA Y SEGURIDAD PRIVADA PARA LA SEDE ADMINISTRATIVA DE LA ALCALDÍA LOCAL DE ANTONIO NARIÑO, EL TEATRO VILLA MAYOR, EL SALÓN COMUNAL DE LA FRAGUA Y TODOS AQUELLOS BIENES MUEBLES O INMUEBLES DE LOS CUALES SEA O LLEGARE A SER LEGALMENTE RESPONSABLE","Funcionamiento","Un nuevo contrato social y ambiental para la Bogotá del Siglo XXI","No aplica","No aplica","No aplica","No aplica",null,"804000353","COOPERATIVA DE VIGILANCIA Y SERVICIOS DE BUCARAMANGA C.T.A.","Persona Jurídica",null,null,null,null,65476876,null,null,null,{"$f":"+W329","v":65476876},65476876,"2021-04-16","2021-04-19","2022-03-20",null,null,null,null,null,null,null,null,1]
[132,2020,"FDLAN-MC-002-2020","https://community.secop.gov.co/Public/Tendering/ContractNoticePhases/View?PPI=CO1.PPI.14278057&isFromPublicArea=True&isModal=False","Contratos de prestación de servicios","Contratación mínima cuantia","No aplica","CONTRATAR EL SERVICIO DE OUTSOURCING DE MAQUINAS FOTOCOPIADORAS MULTIFUNCIONALES, INCLUIDO SU MANTENIMIENTO PREVENTIVO Y CORRECTIVO, SOPORTE TÉCNICO, REPUESTOS E INSUMOS REQUERIDOS POR LAS MISMAS Y DISPOSICIÓN FINAL DE LOS MISMOS, PARA SER INSTALADAS EN LAS DIFERENTES DEPENDENCIAS DE LA ALCALDÍA LOCAL DE ANTONIO NARIÑO, DE CONFORMIDAD CON LAS ESPECIFICACIONES TÉCNICAS","Funcionamiento","Un nuevo contrato social y ambiental para la Bogotá del Siglo XXI","No aplica","No aplica","No aplica","No aplica",null,"900455314","NEW COPIERS TECNOLOGY LTDA","Persona Jurídica",null,null,null,null,3769920,null,null,null,3769920,3769920,"2020-07-27","2020-07-28","2021-07-27",null,null,null,null,null,null,null,null,1]
[101,2019,"FDLAN-SAMC-002-2019","https://community.secop.gov.co/Public/Tendering/ContractNoticePhases/View?PPI=CO1.PPI.3218911&isFromPublicArea=True&isModal=False","Contratos de prestación de servicios","Contratación directa","Prestación de servicios profesionales y de apoyo a la gestión, o para la ejecución de trabajos artísticos que sólo puedan encomendarse a determinadas personas naturales","PRESTACIÓN DE SERVICIOS PROFESIONALES PARA APOYAR AL ALCALDE LOCAL EN LA GESTIÓN DE LOS ASUNTOS RELACIONADOS CON SEGURIDAD CIUDADANA, CONVIVENCIA Y PREVENCIÓN DE CONFLICTIVIDADES, VIOLENCIAS Y DELITOS EN LA LOCALIDAD, DE CONFORMIDAD CON EL MARCO NORMATIVO APLICABLE EN LA MATERIA","Funcionamiento","Un nuevo contrato social y ambiental para la Bogotá del Siglo XXI","No aplica","No aplica","No aplica","No aplica",null,"860067378","JM SECURITY LTDA","Persona Jurídica",null,null,null,null,954206,null,null,null,954206,0,"2019-04-10","2019-04-11","2019-12-10",null,null,null,null,null,null,null,null,0]
[36839,2019,"ORDEN DE COMPRA ","https://colombiacompra.coupahost.com/order_headers/36839","Otros","Selección abreviada","Acuerdo marco de precios ","CONTRATAR EL SERVICIO DE ASEO Y CAFETERÍA PARA LA ALCALDÍA LOCAL DE ANTONIO NARIÑO Y EL TEATRO VILLA MAYOR.","Funcionamiento","Un nuevo contrato social y ambiental para la Bogotá del Siglo XXI","No aplica","No aplica","No aplica","No aplica",null,"901030557","UNION TEMPORAL BIOLIMPIEZA","Persona Jurídica",null,null,null,null,4836024,null,null,null,4836024,0,"2019-03-29","2019-03-29","2020-02-11",null,null,null,null,null,null,null,null,0]
[136,2021,"FDLAN-MC-003-2021","https://community.secop.gov.co/Public/Tendering/ContractNoticePhases/View?PPI=CO1.PPI.14236558&isFromPublicArea=True&isModal=False","Contratos de prestación de servicios","Contratación mínima cuantia","No aplica","REALIZAR EL MANTENIMIENTO TÉCNICO, PREVENTIVO Y CORRECTIVO PARA PARA EL ÓPTIMO FUNCIONAMIENTO DEL ASCENSOR QUE SE ENCUENTRA AL SERVICIO DE LA SEDE ADMINISTRATIVA DE LA ALCALDÍA LOCAL DE ANTONIO NARIÑO Y LA COMUNIDAD","Funcionamiento","Un nuevo contrato social y ambiental para la Bogotá del Siglo XXI","No aplica","No aplica","No aplica","No aplica",null,"830146855","GRUPO DE ASCENSORES MILENIUM GRAM SAS","Persona Jurídica",null,null,null,null,7024767,null,null,null,{"$f":"+W333","v":7024767},7024767,"2021-07-30","2021-08-27","2022-08-26",null,null,null,null,null,null,null,null,1]
[153,2021,"FDLAN-MC- 004-2021","https://community.secop.gov.co/Public/Tendering/ContractNoticePhases/View?PPI=CO1.PPI.14843005&isFromPublicArea=True&isModal=False","Contratos de prestación de servicios","Contratación mínima cuantia","No aplica","CONTRATAR EL SERVICIO DE OUTSOURCING DE MAQUINAS FOTOCOPIADORAS MULTIFUNCIONALES, INCLUIDO SU MANTENIMIENTO PREVENTIVO Y CORRECTIVO, SOPORTE TÉCNICO, REPUESTOS E INSUMOS REQUERIDOS POR LAS MISMAS Y DISPOSICIÓN FINAL DE LOS MISMOS, PARA SER INSTALADAS EN LAS DIFERENTES DEPENDENCIAS DE LA ALCALDÍA LOCAL DE ANTONIO NARIÑO, DE CONFORMIDAD CON LAS ESPECIFICACIONES TÉCNICAS","Funcionamiento","Un nuevo contrato social y ambiental para la Bogotá del Siglo XXI","No aplica","No aplica","No aplica","No aplica",null,"830053669","SOLUTION COPY LTDA","Persona Jurídica",null,null,null,null,18920000,null,null,null,18920000,18920000,"2021-09-16","2021-09-20","2022-01-19",null,null,null,null,null,null,null,null,1]
[168,2021,"FDLAN-CD- 168-2021 (62478)","https://community.secop.gov.co/Public/Tendering/ContractNoticePhases/View?PPI=CO1.PPI.15474142&isFromPublicArea=True&isModal=False","Contratos de prestación de servicios","Contratación directa","Prestación de servicios profesionales y de apoyo a la gestión, o para la ejecución de trabajos artísticos que sólo puedan encomendarse a determinadas personas naturales","APOYAR LAS LABORES DE ENTREGA Y RECIBO DE LAS COMUNICACIONES EMITIDAS O RECIBIDAS POR LAS INSPECCIONES DE POLICÍA DE LA LOCALIDAD","Funcionamiento","Un nuevo contrato social y ambiental para la Bogotá del Siglo XXI","No aplica","No aplica","No aplica","No aplica",null,"79469325","EVERARDO  YARA YARA","Persona Natural",null,null,null,null,2270700,null,null,null,2270700,2270700,"2021-10-12","2021-10-12","2021-12-29",null,null,null,null,null,null,null,null,1]
[63369,2021,"ORDEN DE COMPRA ","https://www.colombiacompra.gov.co/tienda-virtual-del-estado-colombiano/ordenes-compra/63369","Contratos de prestación de servicios","Selección abreviada","Acuerdo marco de precios ","PRESTACIÓN DEL SERVICIO INTEGRAL DE ASEO Y CAFETERÍA PARA LAS SEDES DE LA ALCALDÍA LOCAL DE ANTONIO NARIÑO EN LAS CONDICIONES DEL ACUERDO MARCO DE PRECIOS CCE-972-AMP-2019.","Funcionamiento","Un nuevo contrato social y ambiental para la Bogotá del Siglo XXI","No aplica","No aplica","No aplica","No aplica",null,"890331277","SERVIESPECIALES S.A.S","Persona Jurídica",null,null,null,null,55763480,null,null,null,55763480,55247641,"2021-01-18","2021-01-18","2022-03-11",null,null,null,null,null,null,null,null,0.9907495192193887]
["51585",2020,"ORDEN DE COMPRA ","https://www.colombiacompra.gov.co/tienda-virtual-del-estado-colombiano/ordenes-compra/51585","Contratos de prestación de servicios","Selección abreviada","Acuerdo marco de precios ","CONTRATAR EL SUMINISTRO DE COMBUSTIBLE PARA EL PARQUE AUTOMOTOR DEL FONDO DE DESARROLLO LOCAL ANTONIO NARIÑO","Funcionamiento","Un nuevo contrato social y ambiental para la Bogotá del Siglo XXI","No aplica","No aplica","No aplica","No aplica",null,"900459737","GRUPO EDS AUTOGAS S.A.S","Persona Jurídica",null,null,null,null,6999504,null,null,null,{"$f":"+W337","v":6999504},6682956,"2021-07-07","2021-07-07","2022-12-05",null,null,null,null,null,null,null,null,0.95477565267481812]
[210,2021,"FDLAN-MC-008-2021","https://community.secop.gov.co/Public/Tendering/OpportunityDetail/Index?noticeUID=CO1.NTC.2471530&isFromPublicArea=True&isModal=False","Contratos de prestación de servicios","Contratación mínima cuantia","No aplica","CONTRATAR A MONTO AGOTABLE EL SERVICIO DE MANTENIMIENTO TÉCNICO PREVENTIVO Y CORRECTIVO, REPARACION Y SUMINISTRO DE REPUESTOS ORIGINALES PARA LOS TRES VEHICULOS DE PROPIEDAD DEL FONDO DE DESARROLLO LOCAL DE ANTONIO NARIÑO","Funcionamiento","Un nuevo contrato social y ambiental para la Bogotá del Siglo XXI","No aplica","No aplica","No aplica","No aplica",null,"900693270","CAR SCANNERS SAS","Persona Jurídica",null,null,null,null,25438727,null,null,null,25438727,0,"2021-12-30","2022-01-26","2022-12-25",null,null,null,null,null,null,null,null,0]
[217,2021,"FDLAN-MC-09-2021","https://www.secop.gov.co/CO1ContractsManagement/Tendering/ProcurementContractEdit/Update?ProfileName=CCE-10-Minima_Cuantia&PPI=CO1.PPI.16454069&DocUniqueName=ContratoDeCompra&DocTypeName=NextWay.Entities.Marketplace.Tendering.ProcurementContract&ProfileVersion=8&DocUniqueIdentifier=CO1.PCCNTR.3158207&prevCtxUrl=https%3a%2f%2fwww.secop.gov.co%2fCO1ContractsManagement%2fTendering%2fProcurementContractManagement%2fIndex&prevCtxLbl=Contratos+","Suministro","Contratación mínima cuantia","No aplica","CONTRATAR A MONTO AGOTABLE EL SUMINISTRO DE MATERIALES Y ELEMENTOS DE FERRETERIA PARA EL MANTENIMIENTO PREVENTIVO Y CORRECTIVO DE LAS INSTALACIONES DE LA ALCALDIA LOCAL DE ANTONIO NARIÑO Y LOS BIENES INMUEBLES DE PROPIEDAD DEL FONDO DE DESARROLLO LOCAL","Funcionamiento","Un nuevo contrato social y ambiental para la Bogotá del Siglo XXI","No aplica","No aplica","No aplica","No aplica",null,"901044822","GRUPO EMPRESARIAL LCS SAS","Persona Jurídica",null,null,null,null,24034090,null,null,null,24034090,12578424,"2021-12-31","2022-02-17","2022-10-16",null,null,null,null,null,null,null,null,0.52335761412227377]
[218,2021,"FDLAN-MC-010-2021","https://www.secop.gov.co/CO1ContractsManagement/Tendering/ProcurementContractEdit/Update?ProfileName=CCE-10-Minima_Cuantia&PPI=CO1.PPI.16454533&DocUniqueName=ContratoDeCompra&DocTypeName=NextWay.Entities.Marketplace.Tendering.ProcurementContract&ProfileVersion=8&DocUniqueIdentifier=CO1.PCCNTR.3157960&prevCtxUrl=https%3a%2f%2fwww.secop.gov.co%2fCO1ContractsManagement%2fTendering%2fProcurementContractManagement%2fIndex&prevCtxLbl=Contratos+","Suministro","Contratación mínima cuantia","No aplica","SUMINISTRAR A MONTO AGOTABLE LOS ELEMENTOS DE PAPELERIA, OFICINA Y UTILES DE ESCRITORIO REQUERIDOS PARA EL DESARROLLO DE LAS ACTIVIDADES ADMINISTRATIVAS QUE REALICE LA ALCALDIA LOCAL DE ANTONIO NARIÑO, EL TEATRO VILLAMAYOR Y LAS INSPECCIONES DE POLICIA","Funcionamiento","Un nuevo contrato social y ambiental para la Bogotá del Siglo XXI","No aplica","No aplica","No aplica","No aplica",null,"830040054","LA CASA DE SUMINISTROS Y SERVICIOS S.A.S","Persona Jurídica",null,null,null,null,23000000,null,null,null,23000000,17770422,"2021-12-31","2022-02-15","2022-10-14",null,null,null,null,null,null,null,null,0.77262704347826083]
[176,2021,"FDLAN-MC-005-2021","https://community.secop.gov.co/Public/Tendering/OpportunityDetail/Index?noticeUID=CO1.NTC.2380521&isFromPublicArea=True&isModal=False","Suministro","Contratación mínima cuantia","No aplica","SUMINISTRO, INSTALACIÓN, MANTENIMIENTO TÉCNICO, PREVENTIVO Y CORRECTIVO DE LAS MOTOBOMBAS QUE COMPLEMENTAN EL SISTEMA HIDRÁULICO Y SANITARIO AL SERVICIO DE LA SEDE ADMINISTRATIVA DE LA ALCALDÍA LOCAL DE ANTONIO NARIÑO","Funcionamiento","Un nuevo contrato social y ambiental para la Bogotá del Siglo XXI","No aplica","No aplica","No aplica","No aplica",null,"830100604","SERVICIOS ELECTRO INDUSTRIALES HERNANDEZ HERMANOS & CIA. LTDA.","Persona Jurídica",null,null,null,null,10772315,null,null,null,10772315,10772314,"2021-11-23","2021-11-24","2022-01-07",null,null,null,null,null,null,null,null,{"$f":"IF(ISERROR(AB341/AA341),\"-\",(AB341/AA341))","v":0.9999999071694432}]
["No aplica",2022,"No aplica","No aplica","No aplica","No aplica","No aplica","No aplica","Inversión","Un nuevo contrato social y ambiental para la Bogotá del Siglo XXI",43,"Cultura ciudadana para la confianza, la convivencia y la participación desde la vida cotidiana","Propósito 3: Inspirar confianza y legitimidad para vivir sin miedo y ser epicentro de cultura ciudadana, paz y reconciliación",2182,null,"No aplica","No aplica","No aplica",null,null,null,null,0,null,null,null,0,0,null,null,null,null,null,null,null,null,null,null,null,"-"]
["Total",null,null,null,null,null,null,null,null,null,null,null,null,null,null,null,null,null,null,null,null,null,{"$f":"SUM(W14:W342)","v":20747629419},{"$f":"SUM(X14:X307)","v":0},{"$f":"SUM(Y14:Y325)","v":42},{"$f":"SUM(Z14:Z341)","v":1807317005},{"$f":"SUM(AA14:AA342)","v":23013125942},null,null,null,null,null,null,null,null,null,null,null,null,{"$f":"SUM(AN14:AN342)","v":221.12181071055014}]
[" "," "," "," "," "," "," "," "," "," "," "," "," "," "," "," "," "," "," "," "," "," "," "," "," "," "," "," "," "," "," "," "," "," "," "," "," "," "," "," "]
[]
[]
[]
[null,null,null,null,null,null,null,null,null,null,null,null,null,null,null,null,null,null,null,null,null,null,null,null,null,null,{"$f":"SUBTOTAL(9,AA14:AA341)","v":6590069000},{"$f":"SUBTOTAL(9,AB151:AB341)","v":26600000}]

{"sheet":"BOGDATA VS FORMATO ","index":1,"n_rows":106,"n_cols":6,"rows_kept":106,"cut":false,"hidden":true,"merged":[[10,0,33,0],[11,2,11,3],[11,4,11,5],[13,2,13,3],[13,4,13,5],[15,2,15,3],[0,0,0,5],[1,0,1,1],[3,2,3,3],[3,4,3,5],[5,2,5,3],[5,4,5,5],[15,4,15,5],[17,2,17,3],[17,4,17,5],[19,2,19,3],[19,4,19,5],[21,2,21,3],[21,4,21,5],[7,2,7,3],[7,4,7,5],[9,2,9,3],[9,4,9,5],[29,2,29,3],[29,4,29,5],[31,2,31,3],[31,4,31,5],[33,2,33,3],[33,4,33,5],[23,2,23,3],[23,4,23,5],[25,2,25,3],[25,4,25,5],[27,2,27,3],[27,4,27,5],[41,2,41,3],[41,4,41,5],[43,2,43,3],[43,4,43,5],[45,2,45,3],[45,4,45,5],[35,2,35,3],[35,4,35,5],[37,2,37,3],[37,4,37,5],[39,2,39,3],[39,4,39,5],[53,2,53,3],[53,4,53,5],[55,2,55,3],[55,4,55,5],[57,2,57,3],[57,4,57,5],[47,2,47,3],[47,4,47,5],[49,2,49,3],[49,4,49,5],[51,2,51,3],[51,4,51,5],[65,2,65,3],[65,4,65,5],[67,2,67,3],[67,4,67,5],[69,2,69,3],[69,4,69,5],[59,2,59,3],[59,4,59,5],[61,2,61,3],[61,4,61,5],[63,2,63,3],[63,4,63,5],[77,2,77,3],[77,4,77,5],[79,2,79,3],[79,4,79,5],[81,2,81,3],[81,4,81,5],[71,2,71,3],[71,4,71,5],[73,2,73,3],[73,4,73,5],[75,2,75,3],[75,4,75,5],[89,2,89,3],[89,4,89,5],[91,2,91,3],[91,4,91,5],[93,2,93,3],[93,4,93,5],[83,2,83,3],[83,4,83,5],[85,2,85,3],[85,4,85,5],[87,2,87,3],[87,4,87,5],[101,2,101,3],[101,4,101,5],[103,2,103,3],[103,4,103,5],[105,2,105,3],[105,4,105,5],[95,2,95,3],[95,4,95,5],[97,2,97,3],[97,4,97,5],[99,2,99,3],[99,4,99,5]]}
["BOGDATA- CUADRO ANALISIS -  Antonio Nariño "]
[null,null,"COMPROMISOS ACUMULADOS BOGDATA","VALOR FINAL","ACUMULADO GIROS BOGDATA","GIROS"]
[null,"FUNCIONAMIENTO",1967641061,1341972545,1646879979,1177692457]
[null,"DIFERENCIAS",{"$f":"+C3-D3","v":625668516},null,{"$f":"+E3-F3","v":469187522}]
[null,"INVERSION (Comprometido)",21045484881,18281310325,10251824148,8420924257]
[null,"DIFERENCIAS",{"$f":"C5-D5","v":2764174556},null,{"$f":"E5-F5","v":1830899891}]
[null,"Un nuevo contrato social y ambiental para la Bogotá del Siglo XXI",21045484881,18281310325,10251824148,8420924257]
[null,"DIFERENCIAS",{"$f":"C7-D7","v":2764174556},null,{"$f":"E7-F7","v":1830899891}]
[null,"Propósito 1 - Hacer un nuevo contrato social con igualdad de oportunidades para la inclusión social, productiva y política",8230001109,7583468130,5807723876,4064451876]
[null,"DIFERENCIAS",{"$f":"C9-D9","v":646532979},null,{"$f":"E9-F9","v":1743272000}]
[null,"Subsidios y transferencias para la equidad - Programa 1 ",3633115000,3633115000,3343685904,3343685904]
[null,"DIFERENCIAS",{"$f":"C11-D11","v":0},null,{"$f":"+E11-F11","v":0}]
[null,"Proyecto 1851 ",3633115000,3633115000,3343685904,3343685904]
[null,"DIFERENCIAS",{"$f":"+C13-D13","v":0},null,{"$f":"+E13-F13","v":0}]
[null,"Sistema Distrital del Cuidado - Programa 6 ",1151539201,769932143,523478369,260344740]
[null,"DIFERENCIAS",{"$f":"+C15-D15","v":381607058},null,{"$f":"+E15-F15","v":263133629}]
[null,"Proyecto 2191 ",625047356,345607356,429018000,149578000]
[null,"DIFERENCIAS",{"$f":"+C17-D17","v":279440000},null,{"$f":"+E17-F17","v":279440000}]
[null,"Proyecto 2192",75584000,75584000,22714000,22714000]
[null,"DIFERENCIAS",{"$f":"+C19-D19","v":0},null,{"$f":"+E19-F19","v":0}]
[null,"Proyecto 2193 ",55440000,55440000,55440000,55440000]
[null,"DIFERENCIAS",{"$f":"+C21-D21","v":0},null,{"$f":"+E21-F21","v":0}]
[null,"Proyecto 2194 ",395467845,293300787,16306369,32612740]
[null,"DIFERENCIAS",{"$f":"+C23-D23","v":102167058},null,{"$f":"+E23-F23","v":-16306371}]
[null,"Educación inicial: Bases sólidas para la vida - Programa 12",219810614,219810614,0,0]
[null,"DIFERENCIAS",{"$f":"+C25-D25","v":0},null,{"$f":"+E25-F25","v":0}]
[null,"Proyecto 1864",219810614,219810614,0,0]
[null,"DIFERENCIAS",{"$f":"+C27-D27","v":0},null,{"$f":"+E27-F27","v":0}]
[null,"Formación integral: más y mejor tiempo en los colegios - Programa 14 ",113321760,113321759,0,0]
[null,"DIFERENCIAS",{"$f":"+C29-D29","v":1},null,{"$f":"+E29-F29","v":0}]
[null,"Proyecto 2196 ",113321760,113321759,0,0]
[null,"DIFERENCIAS",{"$f":"+C31-D31","v":1},null,{"$f":"+E31-F31","v":0}]
[null,"Jóvenes con capacidades: Proyecto de vida para la ciudadanía, la innovación y el trabajo del siglo XXI - Proyecto 17 ",1481196000,1481196000,1403408000,116476000]
[null,"DIFERENCIAS",{"$f":"+C33-D33","v":0},null,{"$f":"+E33-F33","v":1286932000}]
[null,"Proyecto 2048",1397152000,1397152000,1388648000,101716000]
[null,"DIFERENCIAS",{"$f":"+C35-D35","v":0},null,{"$f":"+E35-F35","v":1286932000}]
[null,"Proyecto 2199 ",84044000,84044000,14760000,14760000]
[null,"DIFERENCIAS",{"$f":"+C37-D37","v":0},null,{"$f":"+E37-F37","v":0}]
[null," Bogotá, referente en cultura, deporte, recreación y actividad física, con parques para el desarrollo y la salud - Programa 20",367180655,367180655,103327300,103327300]
[null,"DIFERENCIAS",{"$f":"+C39-D39","v":0},null,{"$f":"+E39-F39","v":0}]
[null,"Proyecto 2200 ",367180655,367180655,103327300,103327300]
[null,"DIFERENCIAS",{"$f":"+C41-D41","v":0},null,{"$f":"+E41-F41","v":0}]
[null,"Creación y vida cotidiana: Apropiación ciudadana del arte, la cultura y el patrimonio, para la democracia cultural - Programa 21",1107228104,807228104,412897932,212897932]
[null,"DIFERENCIAS",{"$f":"+C43-D43","v":300000000},null,{"$f":"+E43-F43","v":200000000}]
[null,"Proyecto 2201",1107228104,807228104,412897932,212897932]
[null,"DIFERENCIAS",{"$f":"+C45-D45","v":300000000},null,{"$f":"+E45-F45","v":200000000}]
[null,"Bogotá región emprendedora e innovadora - Programa 24",133973683,191683855,4620000,27720000]
[null,"DIFERENCIAS",{"$f":"+C47-D47","v":-57710172},null,{"$f":"+E47-F47","v":-23100000}]
[null,"Proyecto 2202",92921923,92921923,0,0]
[null,"DIFERENCIAS",{"$f":"+C49-D49","v":0},null,{"$f":"+E49-F49","v":0}]
[null,"Proyecto 2203 ",41051760,98761932,4620000,27720000]
[null,"DIFERENCIAS",{"$f":"+C51-D51","v":-57710172},null,{"$f":"+E51-F51","v":-23100000}]
[null,"Propósito 2 - Cambiar nuestros hábitos de vida para reverdecer a Bogotá y adaptarnos y mitigar la crisis climática",936683056,781731410,322220322,302952354]
[null,"DIFERENCIAS",{"$f":"+C53-D53","v":154951646},null,{"$f":"+E53-F53","v":19267968}]
[null,"Más árboles y más y mejor espacio público - Programa 33",675738884,564637410,185058968,175031000]
[null,"DIFERENCIAS",{"$f":"+C55-D55","v":111101474},null,{"$f":"+E55-F55","v":10027968}]
[null,"Proyecto 2206 ",55784000,24522000,26642000,12782000]
[null,"DIFERENCIAS",{"$f":"+C57-D57","v":31262000},null,{"$f":"+E57-F57","v":13860000}]
[null,"Proyecto 2207",619954884,540115410,158416968,162249000]
[null,"DIFERENCIAS",{"$f":"+C59-D59","v":79839474},null,{"$f":"+E59-F59","v":-3832032}]
[null,"Bogotá protectora de los animales - Programa 34",130764000,130764000,78061354,78061354]
[null,"DIFERENCIAS",{"$f":"+C61-D61","v":0},null,{"$f":"+E61-F61","v":0}]
[null,"Proyecto 2209",130764000,130764000,78061354,78061354]
[null,"DIFERENCIAS",{"$f":"+C63-D63","v":0},null,{"$f":"+E63-F63","v":0}]
[null,"Ecoeficiencia, reciclaje, manejo de residuos e inclusión de la población recicladora - Programa 38 ",47750000,86330000,11280000,49860000]
[null,"DIFERENCIAS",{"$f":"+C65-D65","v":-38580000},null,{"$f":"+E65-F65","v":-38580000}]
[null,"Proyecto 2210 ",47750000,86330000,11280000,49860000]
[null,"DIFERENCIAS",{"$f":"+C67-D67","v":-38580000},null,{"$f":"+E67-F67","v":-38580000}]
[null,"Propósito 3 - Inspirar confianza y legitimidad para vivir sin miedo y ser epicentro de cultura ciudadana, paz y reconciliación",985776481,662770935,144856000,114436000]
[null,"DIFERENCIAS",{"$f":"+C69-D69","v":323005546},null,{"$f":"+E69-F69","v":30420000}]
[null,"Bogotá territorio de paz y atención integral a las víctimas del conflicto armado - Programa 39 ",55440000,55440000,55440000,55440000]
[null,"DIFERENCIAS",{"$f":"+C71-D71","v":0},null,{"$f":"+E71-F71","v":0}]
[null,"Proyecto 2165 ",55440000,55440000,55440000,55440000]
[null,"DIFERENCIAS",{"$f":"+C73-D73","v":0},null,{"$f":"+E73-F73","v":0}]
[null,"Más mujeres viven una vida libre de violencias, se sienten seguras y acceden con confianza al sistema de justicia - Programa 40 ",298458286,166058286,51840000,21420000]
[null,"DIFERENCIAS",{"$f":"+C75-D75","v":132400000},null,{"$f":"+E75-F75","v":30420000}]
[null,"Proyecto 2197 ",298458286,166058286,51840000,21420000]
[null,"DIFERENCIAS",{"$f":"+C77-D77","v":132400000},null,{"$f":"+E77-F77","v":30420000}]
[null,"Espacio público más seguro y construido colectivamente - Programa 45 ",189336109,189336109,37576000,37576000]
[null,"DIFERENCIAS",{"$f":"+C79-D79","v":0},null,{"$f":"+E79-F79","v":0}]
[null,"Proyecto 2183 ",189336109,189336109,37576000,37576000]
[null,"DIFERENCIAS",{"$f":"+C81-D81","v":0},null,{"$f":"+E81-F81","v":0}]
[null,"Plataforma institucional para la seguridad y justicia - Programa 48 ",442542086,251936540,0,0]
[null,"DIFERENCIAS",{"$f":"+C83-D83","v":190605546},null,{"$f":"+E83-F83","v":0}]
[null,"Proyecto 2184",26537000,26537000,0,0]
[null,"DIFERENCIAS",{"$f":"+C85-D85","v":0},null,{"$f":"+E85-F85","v":0}]
[null,"Proyecto 2185 ",416005086,225399540,0,0]
[null,"DIFERENCIAS",{"$f":"+C87-D87","v":190605546},null,{"$f":"+E87-F87","v":0}]
[null,"Propósito 4 -Hacer de Bogotá Región un modelo de movilidad multimodal, incluyente y sostenible.",6590069000,4928209405,566416000,653592000]
[null,"DIFERENCIAS",{"$f":"+C89-D89","v":1661859595},null,{"$f":"+E89-F89","v":-87176000}]
[null,"Movilidad segura, sostenible y accesible - programa 49 ",6590069000,4928209405,566416000,653592000]
[null,"DIFERENCIAS",{"$f":"+C91-D91","v":1661859595},null,{"$f":"+E91-F91","v":-87176000}]
[null,"Proyecto 2186 ",6590069000,4928209405,566416000,653592000]
[null,"DIFERENCIAS",{"$f":"+C93-D93","v":1661859595},null,{"$f":"+E93-F93","v":-87176000}]
[null,"Propósito 5 - Construir Bogotá Región con gobierno abierto, transparente y ciudadanía consciente",4302955235,4125130445,3410607950,3285492027]
[null,"DIFERENCIAS",{"$f":"+C95-D95","v":177824790},null,{"$f":"+E95-F95","v":125115923}]
[null,"Fortalecimiento de Cultura Ciudadana y su institucionalidad - Programa 55 ",467345563,439625562,342253050,319923050]
[null,"DIFERENCIAS",{"$f":"+C97-D97","v":27720001},null,{"$f":"+E97-F97","v":22330000}]
[null,"Proyecto 2190 ",467345563,439625562,342253050,319923050]
[null,"DIFERENCIAS",{"$f":"+C99-D99","v":27720001},null,{"$f":"+E99-F99","v":22330000}]
[null,"Gestión Pública Local - Programa 57 ",3835609672,3685504883,3068354900,2965568977]
[null,"DIFERENCIAS",{"$f":"+C101-D101","v":150104789},null,{"$f":"+E101-F101","v":102785923}]
[null,"Proyecto 2189 ",736161956,618380756,562274679,467420756]
[null,"DIFERENCIAS",{"$f":"+C103-D103","v":117781200},null,{"$f":"+E103-F103","v":94853923}]
[null,"Poryecto 2198 ",3099447716,3067124127,2506080221,2498148221]
[null,"DIFERENCIAS",{"$f":"+C105-D105","v":32323589},null,{"$f":"+E105-F105","v":7932000}]

{"sheet":"BOGDATA VS FORMATO R3","index":2,"n_rows":122,"n_cols":6,"rows_kept":122,"cut":false,"hidden":false,"merged":[[0,0,0,5],[1,0,1,1],[3,2,3,3],[3,4,3,5],[5,2,5,3],[5,4,5,5],[7,2,7,3],[7,4,7,5],[9,2,9,3],[9,4,9,5],[10,0,37,0],[11,2,11,3],[11,4,11,5],[13,2,13,3],[13,4,13,5],[15,2,15,3],[23,2,23,3],[23,4,23,5],[25,2,25,3],[25,4,25,5],[27,2,27,3],[27,4,27,5],[15,4,15,5],[17,2,17,3],[17,4,17,5],[19,2,19,3],[19,4,19,5],[21,2,21,3],[21,4,21,5],[35,2,35,3],[35,4,35,5],[37,2,37,3],[37,4,37,5],[39,2,39,3],[39,4,39,5],[29,2,29,3],[29,4,29,5],[31,2,31,3],[31,4,31,5],[33,2,33,3],[33,4,33,5],[47,2,47,3],[47,4,47,5],[49,2,49,3],[49,4,49,5],[51,2,51,3],[51,4,51,5],[41,2,41,3],[41,4,41,5],[43,2,43,3],[43,4,43,5],[45,2,45,3],[45,4,45,5],[59,2,59,3],[59,4,59,5],[61,2,61,3],[61,4,61,5],[63,2,63,3],[63,4,63,5],[53,2,53,3],[53,4,53,5],[55,2,55,3],[55,4,55,5],[57,2,57,3],[57,4,57,5],[71,2,71,3],[71,4,71,5],[73,2,73,3],[73,4,73,5],[75,2,75,3],[75,4,75,5],[65,2,65,3],[65,4,65,5],[67,2,67,3],[67,4,67,5],[69,2,69,3],[69,4,69,5],[83,2,83,3],[83,4,83,5],[85,2,85,3],[85,4,85,5],[87,2,87,3],[87,4,87,5],[77,2,77,3],[77,4,77,5],[79,2,79,3],[79,4,79,5],[81,2,81,3],[81,4,81,5],[95,2,95,3],[95,4,95,5],[97,2,97,3],[97,4,97,5],[99,2,99,3],[99,4,99,5],[89,2,89,3],[89,4,89,5],[91,2,91,3],[91,4,91,5],[93,2,93,3],[93,4,93,5],[107,2,107,3],[107,4,107,5],[109,2,109,3],[109,4,109,5],[111,2,111,3],[111,4,111,5],[101,2,101,3],[101,4,101,5],[103,2,103,3],[103,4,103,5],[105,2,105,3],[105,4,105,5],[119,2,119,3],[119,4,119,5],[121,2,121,3],[121,4,121,5],[113,2,113,3],[113,4,113,5],[115,2,115,3],[115,4,115,5],[117,2,117,3],[117,4,117,5]]}
["BOGDATA- CUADRO ANALISIS -  Antonio Nariño "]
[null,null,"COMPROMISOS ACUMULADOS BOGDATA","VALOR FINAL","ACUMULADO GIROS BOGDATA","GIROS"]
[null,"FUNCIONAMIENTO",1967641061,1967641061,1646879979,1646879979]
[null,"DIFERENCIAS",{"$f":"+C3-D3","v":0},null,{"$f":"+E3-F3","v":0}]
[null,"INVERSION (Comprometido)",21045484881,21045484881,10251824148,10251824148]
[null,"DIFERENCIAS",{"$f":"C5-D5","v":0},null,{"$f":"E5-F5","v":0}]
[null,"Un nuevo contrato social y ambiental para la Bogotá del Siglo XXI",21045484881,21045484881,10251824148,10251824148]
[null,"DIFERENCIAS",{"$f":"C7-D7","v":0},null,{"$f":"E7-F7","v":0}]
[null,"Propósito 1 - Hacer un nuevo contrato social con igualdad de oportunidades para la inclusión social, productiva y política",8230001109,8230001109,5807723876,5327465876]
[null,"DIFERENCIAS",{"$f":"C9-D9","v":0},null,{"$f":"E9-F9","v":480258000}]
[null,"Subsidios y transferencias para la equidad - Programa 1 ",3633115000,3633115000,3343685904,3343685904]
[null,"DIFERENCIAS",{"$f":"C11-D11","v":0},null,{"$f":"+E11-F11","v":0}]
[null,"Proyecto 1851 ",3633115000,3633115000,3343685904,3343685904]
[null,"DIFERENCIAS",{"$f":"+C13-D13","v":0},null,{"$f":"+E13-F13","v":0}]
[null,"Sistema Distrital del Cuidado - Programa 6 ",1151539201,1151539201,523478369,350678369]
[null,"DIFERENCIAS",{"$f":"+C15-D15","v":0},null,{"$f":"+E15-F15","v":172800000}]
[null,"Proyecto 2191 ",625047356,625047356,429018000,429018000]
[null,"DIFERENCIAS",{"$f":"+C17-D17","v":0},null,{"$f":"+E17-F17","v":0}]
[null,"Proyecto 2192",75584000,75584000,22714000,22714000]
[null,"DIFERENCIAS",{"$f":"+C19-D19","v":0},null,{"$f":"+E19-F19","v":0}]
[null,"Proyecto 2193 ",55440000,55440000,55440000,55440000]
[null,"DIFERENCIAS",{"$f":"+C21-D21","v":0},null,{"$f":"+E21-F21","v":0}]
[null,"Proyecto 2194 ",395467845,395467845,16306369,16306369]
[null,"DIFERENCIAS",{"$f":"+C23-D23","v":0},null,{"$f":"+E23-F23","v":0}]
[null,"Prevención y atención de maternidad temprana- Programa 8 ",22636092,22636092,16306371,16306371]
[null,"DIFERENCIAS",{"$f":"+C25-D25","v":0},null,{"$f":"+E25-F25","v":0}]
[null,"Proyecto 2195",22636092,22636092,16306371,16306371]
[null,"DIFERENCIAS",{"$f":"+C27-D27","v":0},null,{"$f":"+E27-F27","v":0}]
[null,"Educación inicial: Bases sólidas para la vida - Programa 12",219810614,219810614,0,0]
[null,"DIFERENCIAS",{"$f":"+C29-D29","v":0},null,{"$f":"+E29-F29","v":0}]
[null,"Proyecto 1864",219810614,219810614,0,0]
[null,"DIFERENCIAS",{"$f":"+C31-D31","v":0},null,{"$f":"+E31-F31","v":0}]
[null,"Formación integral: más y mejor tiempo en los colegios - Programa 14 ",113321760,113321760,0,0]
[null,"DIFERENCIAS",{"$f":"+C33-D33","v":0},null,{"$f":"+E33-F33","v":0}]
[null,"Proyecto 2196 ",113321760,113321760,0,0]
[null,"DIFERENCIAS",{"$f":"+C35-D35","v":0},null,{"$f":"+E35-F35","v":0}]
[null,"Jóvenes con capacidades: Proyecto de vida para la ciudadanía, la innovación y el trabajo del siglo XXI - Programa 17 ",1481196000,1481196000,1403408000,1403408000]
[null,"DIFERENCIAS",{"$f":"+C37-D37","v":0},null,{"$f":"+E37-F37","v":0}]
[null,"Proyecto 2048",1397152000,1397152000,1388648000,1388648000]
[null,"DIFERENCIAS",{"$f":"+C39-D39","v":0},null,{"$f":"+E39-F39","v":0}]
[null,"Proyecto 2199 ",84044000,84044000,14760000,14760000]
[null,"DIFERENCIAS",{"$f":"+C41-D41","v":0},null,{"$f":"+E41-F41","v":0}]
[null," Bogotá, referente en cultura, deporte, recreación y actividad física, con parques para el desarrollo y la salud - Programa 20",367180655,367180655,103327300,103327300]
[null,"DIFERENCIAS",{"$f":"+C43-D43","v":0},null,{"$f":"+E43-F43","v":0}]
[null,"Proyecto 2200 ",367180655,367180655,103327300,103327300]
[null,"DIFERENCIAS",{"$f":"+C45-D45","v":0},null,{"$f":"+E45-F45","v":0}]
[null,"Creación y vida cotidiana: Apropiación ciudadana del arte, la cultura y el patrimonio, para la democracia cultural - Programa 21",1107228104,1107228104,412897932,412897932]
[null,"DIFERENCIAS",{"$f":"+C47-D47","v":0},null,{"$f":"+E47-F47","v":0}]
[null,"Proyecto 2201",1107228104,1107228104,412897932,412897932]
[null,"DIFERENCIAS",{"$f":"+C49-D49","v":0},null,{"$f":"+E49-F49","v":0}]
[null,"Bogotá región emprendedora e innovadora - Programa 24",133973683,133973683,4620000,4620000]
[null,"DIFERENCIAS",{"$f":"+C51-D51","v":0},null,{"$f":"+E51-F51","v":0}]
[null,"Proyecto 2202",92921923,92921923,0,0]
[null,"DIFERENCIAS",{"$f":"+C53-D53","v":0},null,{"$f":"+E53-F53","v":0}]
[null,"Proyecto 2203 ",41051760,41051760,4620000,4620000]
[null,"DIFERENCIAS",{"$f":"+C55-D55","v":0},null,{"$f":"+E55-F55","v":0}]
[null,"Propósito 2 - Cambiar nuestros hábitos de vida para reverdecer a Bogotá y adaptarnos y mitigar la crisis climática",936683056,936683056,322220322,150320322]
[null,"DIFERENCIAS",{"$f":"+C57-D57","v":0},null,{"$f":"+E57-F57","v":171900000}]
[null,"Programa 27 - Cambio cultural para la gestión de la crisis climática",39230172,39230172,4620000,4620000]
[null,"DIFERENCIAS",{"$f":"+C59-D59","v":0},null,{"$f":"+E59-F59","v":0}]
[null,"Proyecto 2204",39230172,39230172,4620000,4620000]
[null,"DIFERENCIAS",{"$f":"+C61-D61","v":0},null,{"$f":"+E61-F61","v":0}]
[null,"Programa 30 - Eficiencia en la atención de emergencias",43200000,43200000,43200000,43200000]
[null,"DIFERENCIAS",{"$f":"+C63-D63","v":0},null,{"$f":"+E63-F63","v":0}]
[null,"Proyecto 2205",43200000,43200000,43200000,43200000]
[null,"DIFERENCIAS",{"$f":"+C65-D65","v":0},null,{"$f":"+E65-F65","v":0}]
[null,"Más árboles y más y mejor espacio público - Programa 33",675738884,675738884,185058968,99978968]
[null,"DIFERENCIAS",{"$f":"+C67-D67","v":0},null,{"$f":"+E67-F67","v":85080000}]
[null,"Proyecto 2206 ",55784000,55784000,26642000,26642000]
[null,"DIFERENCIAS",{"$f":"+C69-D69","v":0},null,{"$f":"+E69-F69","v":0}]
[null,"Proyecto 2207",619954884,619954884,158416968,87196968]
[null,"DIFERENCIAS",{"$f":"+C71-D71","v":0},null,{"$f":"+E71-F71","v":71220000}]
[null,"Bogotá protectora de los animales - Programa 34",130764000,130764000,78061354,78061354]
[null,"DIFERENCIAS",{"$f":"+C73-D73","v":0},null,{"$f":"+E73-F73","v":0}]
[null,"Proyecto 2209",130764000,130764000,78061354,78061354]
[null,"DIFERENCIAS",{"$f":"+C75-D75","v":0},null,{"$f":"+E75-F75","v":0}]
[null,"Ecoeficiencia, reciclaje, manejo de residuos e inclusión de la población recicladora - Programa 38 ",47750000,47750000,11280000,11280000]
[null,"DIFERENCIAS",{"$f":"+C77-D77","v":0},null,{"$f":"+E77-F77","v":0}]
[null,"Proyecto 2210 ",47750000,47750000,11280000,11280000]
[null,"DIFERENCIAS",{"$f":"+C79-D79","v":0},null,{"$f":"+E79-F79","v":0}]
[null,"Propósito 3 - Inspirar confianza y legitimidad para vivir sin miedo y ser epicentro de cultura ciudadana, paz y reconciliación",985776481,985776481,144856000,40824000]
[null,"DIFERENCIAS",{"$f":"+C81-D81","v":0},null,{"$f":"+E81-F81","v":104032000}]
[null,"Bogotá territorio de paz y atención integral a las víctimas del conflicto armado - Programa 39 ",55440000,55440000,55440000,55440000]
[null,"DIFERENCIAS",{"$f":"+C83-D83","v":0},null,{"$f":"+E83-F83","v":0}]
[null,"Proyecto 2165 ",55440000,55440000,55440000,55440000]
[null,"DIFERENCIAS",{"$f":"+C85-D85","v":0},null,{"$f":"+E85-F85","v":0}]
[null,"Más mujeres viven una vida libre de violencias, se sienten seguras y acceden con confianza al sistema de justicia - Programa 40 ",298458286,298458286,51840000,21420000]
[null,"DIFERENCIAS",{"$f":"+C87-D87","v":0},null,{"$f":"+E87-F87","v":30420000}]
[null,"Proyecto 2197 ",298458286,298458286,51840000,21420000]
[null,"DIFERENCIAS",{"$f":"+C89-D89","v":0},null,{"$f":"+E89-F89","v":30420000}]
[null,"Cultura ciudadana para la confianza, la convivencia y la participación desde la vida cotidiana - Programa 43",0,0,0,0]
[null,"DIFERENCIAS",{"$f":"+C91-D91","v":0},null,{"$f":"+E91-F91","v":0}]
[null,"Proyecto 2182",0,0,0,0]
[null,"DIFERENCIAS",{"$f":"+C93-D93","v":0},null,{"$f":"+E93-F93","v":0}]
[null,"Espacio público más seguro y construido colectivamente - Programa 45 ",189336109,189336109,37576000,37576000]
[null,"DIFERENCIAS",{"$f":"+C95-D95","v":0},null,{"$f":"+E95-F95","v":0}]
[null,"Proyecto 2183 ",189336109,189336109,37576000,37576000]
[null,"DIFERENCIAS",{"$f":"+C97-D97","v":0},null,{"$f":"+E97-F97","v":0}]
[null,"Plataforma institucional para la seguridad y justicia - Programa 48 ",442542086,442542086,0,0]
[null,"DIFERENCIAS",{"$f":"+C99-D99","v":0},null,{"$f":"+E99-F99","v":0}]
[null,"Proyecto 2184",26537000,26537000,0,0]
[null,"DIFERENCIAS",{"$f":"+C101-D101","v":0},null,{"$f":"+E101-F101","v":0}]
[null,"Proyecto 2185 ",416005086,416005086,0,0]
[null,"DIFERENCIAS",{"$f":"+C103-D103","v":0},null,{"$f":"+E103-F103","v":0}]
[null,"Propósito 4 -Hacer de Bogotá Región un modelo de movilidad multimodal, incluyente y sostenible.",6590069000,6534123054,566416000,26600000]
[null,"DIFERENCIAS",{"$f":"+C105-D105","v":55945946},null,{"$f":"+E105-F105","v":539816000}]
[null,"Movilidad segura, sostenible y accesible - programa 49 ",6590069000,6534123054,566416000,668496000]
[null,"DIFERENCIAS",{"$f":"+C107-D107","v":55945946},null,{"$f":"+E107-F107","v":-102080000}]
[null,"Proyecto 2186 ",6590069000,6534123054,566416000,668496000]
[null,"DIFERENCIAS",{"$f":"+C109-D109","v":55945946},null,{"$f":"+E109-F109","v":-102080000}]
[null,"Propósito 5 - Construir Bogotá Región con gobierno abierto, transparente y ciudadanía consciente",4302955235,4302955235,3410607950,707066550]
[null,"DIFERENCIAS",{"$f":"+C111-D111","v":0},null,{"$f":"+E111-F111","v":2703541400}]
[null,"Fortalecimiento de Cultura Ciudadana y su institucionalidad - Programa 55 ",467345563,467345563,342253050,158205050]
[null,"DIFERENCIAS",{"$f":"+C113-D113","v":0},null,{"$f":"+E113-F113","v":184048000}]
[null,"Proyecto 2190 ",467345563,467345563,342253050,158205050]
[null,"DIFERENCIAS",{"$f":"+C115-D115","v":0},null,{"$f":"+E115-F115","v":184048000}]
[null,"Gestión Pública Local - Programa 57 ",3835609672,3835609672,3068354900,548861500]
[null,"DIFERENCIAS",{"$f":"+C117-D117","v":0},null,{"$f":"+E117-F117","v":2519493400}]
[null,"Proyecto 2189 ",736161956,736161956,562274679,117586779]
[null,"DIFERENCIAS",{"$f":"+C119-D119","v":0},null,{"$f":"+E119-F119","v":444687900}]
[null,"Poryecto 2198 ",3099447716,3099447716,2506080221,431274721]
[null,"DIFERENCIAS",{"$f":"+C121-D121","v":0},null,{"$f":"+E121-F121","v":2074805500}]

{"sheet":"BOGDATA","index":3,"n_rows":175,"n_cols":20,"rows_kept":175,"cut":false,"hidden":false,"merged":[]}
["ENTIDAD","FECHA DE CORTE","CODIGO","NOMBRE","APROPIACION INICIAL","MODIFICACIONES MES","MODIFICACIONES ACUMULADAS","APROPIACION VIGENTE","SUSPENSION APROPIACION","APROPIACION DISPONIBLE","TOTAL COMPROMISOS MES","TOTAL COMPROMISOS ACUMULADO","% EJEC PRESUP","AMORTIZACION GIROS MES","AMORTIZACION GIROS ACUMULADOS","PORCENTAJE EJECUCION AUTORIZADO GIRO","AREA FUNCIONAL","NOMBRE AREA FUNCIONAL","SECTOR","NOMBRE SECTOR"]
[15,"2022-12-31","O2","GASTOS",37689245000,0,-2448945642,35240299358,0,35240299358,3935970919,33971975536,96,2673454314,18430308949,52.3,"0004-016","FDL-LOCALIDADES",16,"LOCALIDADES"]
[15,"2022-12-31","O21","Funcionamiento",2183172000,0,-114151306,2069020694,0,2069020694,157982208,1967641061,95,211327028,1646879979,79.599999999999994,"0004-016","FDL-LOCALIDADES",16,"LOCALIDADES"]
[15,"2022-12-31","O211","Gastos de personal",682000000,6299951,6299951,688299951,0,688299951,0,681999997,99,57358329,630941619,91.67,"0004-016","FDL-LOCALIDADES",16,"LOCALIDADES"]
[15,"2022-12-31","O21101","Planta de personal permanente",682000000,6299951,6299951,688299951,0,688299951,0,681999997,99,57358329,630941619,91.67,"0004-016","FDL-LOCALIDADES",16,"LOCALIDADES"]
[15,"2022-12-31","O2110103","Remuneraciones no constitutivas de factor salarial",682000000,6299951,6299951,688299951,0,688299951,0,681999997,99,57358329,630941619,91.67,"0004-016","FDL-LOCALIDADES",16,"LOCALIDADES"]
[15,"2022-12-31","O2110103007","Honorarios Ediles",682000000,6299951,6299951,688299951,0,688299951,0,681999997,99,57358329,630941619,91.67,"0004-016","FDL-LOCALIDADES",16,"LOCALIDADES"]
[15,"2022-12-31","O212","Adquisición de bienes y servicios",1116172000,-6299951,2669410,1118841410,0,1118841410,157770208,1026189175,92,144108943,815424340,72.88,"0004-016","FDL-LOCALIDADES",16,"LOCALIDADES"]
[15,"2022-12-31","O21201","Adquisición de activos no financieros",40000000,0,0,40000000,0,40000000,0,7347060,18,0,7347060,18.37,"0004-016","FDL-LOCALIDADES",16,"LOCALIDADES"]
[15,"2022-12-31","O2120101","Activos fijos",40000000,0,0,40000000,0,40000000,0,7347060,18,0,7347060,18.37,"0004-016","FDL-LOCALIDADES",16,"LOCALIDADES"]
[15,"2022-12-31","O2120101003","Maquinaria y equipo",40000000,0,0,40000000,0,40000000,0,7347060,18,0,7347060,18.37,"0004-016","FDL-LOCALIDADES",16,"LOCALIDADES"]
[15,"2022-12-31","O212010100303","Maquinaria de oficina, contabilidad e informática",40000000,0,0,40000000,0,40000000,0,7347060,18,0,7347060,18.37,"0004-016","FDL-LOCALIDADES",16,"LOCALIDADES"]
[15,"2022-12-31","O21201010030302","Maquinaria de informática y sus partes, piezas y accesorios",40000000,0,0,40000000,0,40000000,0,7347060,18,0,7347060,18.37,"0004-016","FDL-LOCALIDADES",16,"LOCALIDADES"]
[15,"2022-12-31","O21202","Adquisiciones diferentes de activos",1076172000,-6299951,2669410,1078841410,0,1078841410,157770208,1018842115,94,144108943,808077280,74.900000000000006,"0004-016","FDL-LOCALIDADES",16,"LOCALIDADES"]
[15,"2022-12-31","O2120201","Materiales y suministros",33172000,3000000,-14000000,19172000,0,19172000,0,6000000,31,3535311,3535311,18.440000000000001,"0004-016","FDL-LOCALIDADES",16,"LOCALIDADES"]
[15,"2022-12-31","O2120201003","Otros bienes transportables (excepto productos metálicos, maquinaria y equipo)",33172000,3000000,-14000000,19172000,0,19172000,0,6000000,31,3535311,3535311,18.440000000000001,"0004-016","FDL-LOCALIDADES",16,"LOCALIDADES"]
[15,"2022-12-31","O212020100303","Productos de hornos de coque"]
[15,"2022-12-31","O2120201003033331101","Gasolina motor corriente",3000000,1500000,1500000,4500000,0,4500000,0,3000000,67,2988814,2988814,66.42,"0004-016","FDL-LOCALIDADES",16,"LOCALIDADES"]
[15,"2022-12-31","O2120201003033336103","Diésel oil ACPM (fuel gas gasoil marine gas)",3000000,1500000,1500000,4500000,0,4500000,0,3000000,67,546497,546497,12.14,"0004-016","FDL-LOCALIDADES",16,"LOCALIDADES"]
[15,"2022-12-31","O212020100305","Otros productos químicos"]
[15,"2022-12-31","O2120201003053544203","Mezclas químicas para extintores",1500000,0,0,1500000,0,1500000,0,0,0,0,0,0,"0004-016","FDL-LOCALIDADES",16,"LOCALIDADES"]
[15,"2022-12-31","O212020100308","Muebles"]
[15,"2022-12-31","O2120201003083899998","Artículos n.c.p. para escritorio y oficina",15672000,0,-7000000,8672000,0,8672000,0,0,0,0,0,0,"0004-016","FDL-LOCALIDADES",16,"LOCALIDADES"]
[15,"2022-12-31","O2120202","Adquisición de servicios",1043000000,-9299951,16669410,1059669410,0,1059669410,157770208,1012842115,96,140573632,804541969,75.92,"0004-016","FDL-LOCALIDADES",16,"LOCALIDADES"]
[15,"2022-12-31","O2120202006","Servicios de alojamiento"]
[15,"2022-12-31","O212020200603","Alojamiento"]
[15,"2022-12-31","O21202020060363399","Otros servicios de suministro de comidas",44000000,0,0,44000000,0,44000000,44000000,44000000,100,0,0,0,"0004-016","FDL-LOCALIDADES",16,"LOCALIDADES"]
[15,"2022-12-31","O212020200608","Servicios postales y de mensajería",5000000,-5000000,-5000000,0,0,0,0,0,0,0,0,0,"0004-016","FDL-LOCALIDADES",16,"LOCALIDADES"]
[15,"2022-12-31","O21202020060868021","Servicios locales de mensajería nacional",5000000,-5000000,-5000000,0,0,0,0,0,0,0,0,0,"0004-016","FDL-LOCALIDADES",16,"LOCALIDADES"]
[15,"2022-12-31","O2120202007","Servicios financieros y servicios conexos, servicios inmobiliarios y servicios de leasing",178000000,13041201,13041201,191041201,0,191041201,13447834,189061502,99,7170100,169484769,88.72,"0004-016","FDL-LOCALIDADES",16,"LOCALIDADES"]
[15,"2022-12-31","O212020200701","Servicios financieros y servicios conexos",178000000,13041201,13041201,191041201,0,191041201,13447834,189061502,99,7170100,169484769,88.72,"0004-016","FDL-LOCALIDADES",16,"LOCALIDADES"]
[15,"2022-12-31","O21202020070103","Servicios de seguros y pensiones (excepto los servicios de reaseguro y de seguridad social de afiliación obligatoria)",178000000,13041201,13041201,191041201,0,191041201,13447834,189061502,99,7170100,169484769,88.72,"0004-016","FDL-LOCALIDADES",16,"LOCALIDADES"]
[15,"2022-12-31","O2120202007010301","Servicios de seguros de vida (excepto los servicios de reaseguro)",9000000,700000,700000,9700000,0,9700000,2147834,9700000,100,0,7552166,77.86,"0004-016","FDL-LOCALIDADES",16,"LOCALIDADES"]
[15,"2022-12-31","O212020200701030102","Ediles",0,700000,9700000,9700000,0,9700000,2147834,9700000,100,0,7552166,77.86,"0004-016","FDL-LOCALIDADES",16,"LOCALIDADES"]
[15,"2022-12-31","O21202020070103010271311","Servicios de seguros de vida individual",0,700000,9700000,9700000,0,9700000,2147834,9700000,100,0,7552166,77.86,"0004-016","FDL-LOCALIDADES",16,"LOCALIDADES"]
[15,"2022-12-31","O2120202007010304","Servicios de seguros de salud y de accidentes",87625000,1041201,1041201,88666201,0,88666201,0,87409720,99,7170100,81280821,91.67,"0004-016","FDL-LOCALIDADES",16,"LOCALIDADES"]
[15,"2022-12-31","O212020200701030471347","Servicio de seguro obligatorio de accidentes de tránsito (SOAT)",2625000,0,0,2625000,0,2625000,0,2409721,92,0,2409721,91.8,"0004-016","FDL-LOCALIDADES",16,"LOCALIDADES"]
[15,"2022-12-31","O212020200701030471349","Otros servicios de seguros de salud n.c.p.",85000000,1041201,1041201,86041201,0,86041201,0,84999999,99,7170100,78871100,91.67,"0004-016","FDL-LOCALIDADES",16,"LOCALIDADES"]
[15,"2022-12-31","O2120202007010305","Otros servicios de seguros distintos a los seguros de vida (excepto los servicios de reaseguro)",81375000,11300000,11300000,92675000,0,92675000,11300000,91951782,99,0,80651782,87.03,"0004-016","FDL-LOCALIDADES",16,"LOCALIDADES"]
[15,"2022-12-31","O212020200701030571351","Servicios de seguros de vehículos automotores",9000000,1800000,1800000,10800000,0,10800000,1800000,10078895,93,0,8278895,76.66,"0004-016","FDL-LOCALIDADES",16,"LOCALIDADES"]
[15,"2022-12-31","O212020200701030571354","Servicios de seguros contra incendio, terremoto o sustracción",33056000,5000000,5000000,38056000,0,38056000,5000000,38056000,100,0,33056000,86.86,"0004-016","FDL-LOCALIDADES",16,"LOCALIDADES"]
[15,"2022-12-31","O212020200701030571355","Servicios de seguros generales de responsabilidad civil",39319000,4500000,4500000,43819000,0,43819000,4500000,43816887,100,0,39316887,89.73,"0004-016","FDL-LOCALIDADES",16,"LOCALIDADES"]
[15,"2022-12-31","O2120202008","Servicios prestados a las empresas y servicios de producción",787000000,-17341152,-8371791,778628209,0,778628209,90241932,750780613,96,133044922,619755395,79.599999999999994,"0004-016","FDL-LOCALIDADES",16,"LOCALIDADES"]
[15,"2022-12-31","O212020200803","Servicios profesionales, científicos y técnicos (excepto los servicios de investigación, urbanismo, jurídicos y de contabilidad)",64000000,-14722000,-14722000,49278000,0,49278000,0,49278000,100,49278000,49278000,100,"0004-016","FDL-LOCALIDADES",16,"LOCALIDADES"]
[15,"2022-12-31","O21202020080383143","Software originales",60000000,-10722000,-10722000,49278000,0,49278000,0,49278000,100,49278000,49278000,100,"0004-016","FDL-LOCALIDADES",16,"LOCALIDADES"]
[15,"2022-12-31","O21202020080383151","Servicios de alojamiento de sitios web (hosting)",4000000,-4000000,-4000000,0,0,0,0,0,0,0,0,0,"0004-016","FDL-LOCALIDADES",16,"LOCALIDADES"]
[15,"2022-12-31","O212020200804","Servicios de telecomunicaciones, transmisión y suministro de información",35000000,0,7000000,42000000,0,42000000,5649432,42000000,100,2329200,38679768,92.09,"0004-016","FDL-LOCALIDADES",16,"LOCALIDADES"]
[15,"2022-12-31","O21202020080484120","Servicios de telefonía fija (acceso)",35000000,0,7000000,42000000,0,42000000,5649432,42000000,100,2329200,38679768,92.09,"0004-016","FDL-LOCALIDADES",16,"LOCALIDADES"]
[15,"2022-12-31","O212020200805","Servicios de soporte",564000000,5500000,5500000,569500000,0,569500000,72788899,557321636,98,70423687,431475432,75.760000000000005,"0004-016","FDL-LOCALIDADES",16,"LOCALIDADES"]
[15,"2022-12-31","O21202020080585250","Servicios de protección (guardas de seguridad)",360000000,0,0,360000000,0,360000000,43460282,355802105,99,52928927,280604074,77.95,"0004-016","FDL-LOCALIDADES",16,"LOCALIDADES"]
[15,"2022-12-31","O21202020080585330","Servicios de limpieza general",176000000,0,0,176000000,0,176000000,22042644,175574358,100,17494760,134877758,76.64,"0004-016","FDL-LOCALIDADES",16,"LOCALIDADES"]
[15,"2022-12-31","O21202020080585951","Servicios de copia y reproducción",28000000,5500000,5500000,33500000,0,33500000,7285973,25945173,77,0,15993600,47.74,"0004-016","FDL-LOCALIDADES",16,"LOCALIDADES"]
[15,"2022-12-31","O212020200806","Servicios de apoyo y de operación para la agricultura, la caza, la silvicultura, la pesca, la minería y los servicios públicos",87000000,0,12969361,99969361,0,99969361,11803601,99969361,100,10325620,98491380,98.52,"0004-016","FDL-LOCALIDADES",16,"LOCALIDADES"]
[15,"2022-12-31","O21202020080686312","Servicios de distribución de electricidad (a comisión o por contrato)",70000000,0,29969361,99969361,0,99969361,11803601,99969361,100,10325620,98491380,98.52,"0004-016","FDL-LOCALIDADES",16,"LOCALIDADES"]
[15,"2022-12-31","O212020200807","Servicios de mantenimiento, reparación e instalación (excepto servicios de construcción)",37000000,-8119152,-19119152,17880848,0,17880848,0,2211616,12,688415,1830815,10.24,"0004-016","FDL-LOCALIDADES",16,"LOCALIDADES"]
[15,"2022-12-31","O2120202008078714102","Servicio de mantenimiento y reparación de vehículos automóviles",28000000,-8119152,-19119152,8880848,0,8880848,0,0,0,0,0,0,"0004-016","FDL-LOCALIDADES",16,"LOCALIDADES"]
[15,"2022-12-31","O2120202008078715701","Servicio de mantenimiento y reparación de ascensores",9000000,0,0,9000000,0,9000000,0,2211616,25,688415,1830815,20.34,"0004-016","FDL-LOCALIDADES",16,"LOCALIDADES"]
[15,"2022-12-31","O2120202009","Servicios para la comunidad, sociales y personales",29000000,0,17000000,46000000,0,46000000,10080442,29000000,63,358610,15301805,33.26,"0004-016","FDL-LOCALIDADES",16,"LOCALIDADES"]
[15,"2022-12-31","O212020200904","Servicios de alcantarillado, recolección, tratamiento y disposición de desechos y otros servicios de saneamiento ambiental",29000000,0,17000000,46000000,0,46000000,10080442,29000000,63,358610,15301805,33.26,"0004-016","FDL-LOCALIDADES",16,"LOCALIDADES"]
[15,"2022-12-31","O21202020090494110","Servicios de alcantarillado y tratamiento de aguas residuales",17000000,0,13000000,30000000,0,30000000,9856878,17000000,57,358610,7501732,25.01,"0004-016","FDL-LOCALIDADES",16,"LOCALIDADES"]
[15,"2022-12-31","O21202020090494239","Servicios generales de recolección de otros desechos",12000000,0,4000000,16000000,0,16000000,223564,12000000,75,0,7800073,48.75,"0004-016","FDL-LOCALIDADES",16,"LOCALIDADES"]
[15,"2022-12-31","O2190","Obligaciones por Pagar Funcionamiento",385000000,0,-123120667,261879333,0,261879333,212000,259451889,99,9859756,200514020,76.569999999999993,"0004-016","FDL-LOCALIDADES",16,"LOCALIDADES"]
[15,"2022-12-31","O219001","Obligaciones por Pagar Funcionamiento Vigencia Anterior",358156000,0,-107183326,250972674,0,250972674,0,250972674,100,9859756,200514020,79.89,"0004-016","FDL-LOCALIDADES",16,"LOCALIDADES"]
[15,"2022-12-31","O219002","Obligaciones por Pagar Funcionamiento Otras Vigencias",26844000,0,-15937341,10906659,0,10906659,212000,8479215,78,0,0,0,"0004-016","FDL-LOCALIDADES",16,"LOCALIDADES"]
[15,"2022-12-31","O23","INVERSION",35506073000,0,-2334794336,33171278664,0,33171278664,3777988711,32004334475,96,2462127286,16783428970,50.6,"0004-016","FDL-LOCALIDADES",16,"LOCALIDADES"]
[15,"2022-12-31","O2301","DIRECTA",20577561000,0,1567618753,22145179753,0,22145179753,3777988711,21045484881,95,911829450,10251824148,46.29,"0004-016","FDL-LOCALIDADES",16,"LOCALIDADES"]
[15,"2022-12-31","O230116","Un Nuevo Contrato Social y Ambiental para la Bogotá del Siglo XXI",20577561000,0,1567618753,22145179753,0,22145179753,3777988711,21045484881,95,911829450,10251824148,46.29,"0004-016","FDL-LOCALIDADES",16,"LOCALIDADES"]
[15,"2022-12-31","O23011601","Hacer un nuevo contrato social con igualdad de oportunidades para la inclusión social, productiva y política",9539810000,0,-570521806,8969288194,0,8969288194,1172387405,8230001109,92,222380978,5807723876,64.75,"0004-016","FDL-LOCALIDADES",16,"LOCALIDADES"]
[15,"2022-12-31","O2301160101","Subsidios y transferencias para la equidad",3910555000,0,-277440000,3633115000,0,3633115000,0,3633115000,100,104653157,3343685904,92.03,"0004-016","FDL-LOCALIDADES",16,"LOCALIDADES"]
[15,"2022-12-31","O23011601010000001851","Acciones de atención para población vulnerable",3910555000,0,-277440000,3633115000,0,3633115000,0,3633115000,100,104653157,3343685904,92.03,"0004-016","FDL-LOCALIDADES",16,"LOCALIDADES"]
[15,"2022-12-31","O2301160106","Sistema Distrital del Cuidado",1786000000,0,-41764273,1744235727,0,1744235727,336099079,1151539201,66,27466444,523478369,30.01,"0004-016","FDL-LOCALIDADES",16,"LOCALIDADES"]
[15,"2022-12-31","O23011601060000002191","Acciones integrales para la productividad y el emprendimiento",980000000,0,0,980000000,0,980000000,165115356,625047356,64,18018000,429018000,43.78,"0004-016","FDL-LOCALIDADES",16,"LOCALIDADES"]
[15,"2022-12-31","O23011601060000002192","Acciones de atención a primera infancia y prevención de violencias",150000000,0,0,150000000,0,150000000,50000000,75584000,50,2460000,22714000,15.14,"0004-016","FDL-LOCALIDADES",16,"LOCALIDADES"]
[15,"2022-12-31","O23011601060000002193","Acciones para las personas cuidadoras",130000000,0,0,130000000,0,130000000,0,55440000,43,0,55440000,42.65,"0004-016","FDL-LOCALIDADES",16,"LOCALIDADES"]
[15,"2022-12-31","O23011601060000002194","Acciones de fomento y promoción de las condiciones de salud",526000000,0,-41764273,484235727,0,484235727,120983723,395467845,82,6988444,16306369,3.37,"0004-016","FDL-LOCALIDADES",16,"LOCALIDADES"]
[15,"2022-12-31","O2301160108","Prevención y atención de maternidad temprana",25000000,0,-2363908,22636092,0,22636092,0,22636092,100,6988445,16306371,72.040000000000006,"0004-016","FDL-LOCALIDADES",16,"LOCALIDADES"]
[15,"2022-12-31","O23011601080000002195","Acciones de prevención del embarazo adolecentes",25000000,0,-2363908,22636092,0,22636092,0,22636092,100,6988445,16306371,72.040000000000006,"0004-016","FDL-LOCALIDADES",16,"LOCALIDADES"]
[15,"2022-12-31","O2301160112","Educación inicial: Bases sólidas para la vida",287277000,0,-67466386,219810614,0,219810614,0,219810614,100,0,0,0,"0004-016","FDL-LOCALIDADES",16,"LOCALIDADES"]
[15,"2022-12-31","O23011601120000001864","Acciones para la primera infancia",287277000,0,-67466386,219810614,0,219810614,0,219810614,100,0,0,0,"0004-016","FDL-LOCALIDADES",16,"LOCALIDADES"]
[15,"2022-12-31","O2301160114","Formación integral: más y mejor tiempo en los colegios",160000000,0,0,160000000,0,160000000,113321760,113321760,71,0,0,0,"0004-016","FDL-LOCALIDADES",16,"LOCALIDADES"]
[15,"2022-12-31","O23011601140000002196","Dotaciones a instituciones educativas",160000000,0,0,160000000,0,160000000,113321760,113321760,71,0,0,0,"0004-016","FDL-LOCALIDADES",16,"LOCALIDADES"]
[15,"2022-12-31","O2301160117","Jóvenes con capacidades: Proyecto de vida para la ciudadanía, la innovación y el trabajo del siglo XXI",1518000000,0,-6497263,1511502737,0,1511502737,0,1481196000,98,10020000,1403408000,92.85,"0004-016","FDL-LOCALIDADES",16,"LOCALIDADES"]
[15,"2022-12-31","O23011601170000002048","Acciones de promoción para la educación superior",1398000000,0,0,1398000000,0,1398000000,0,1397152000,100,10020000,1388648000,99.33,"0004-016","FDL-LOCALIDADES",16,"LOCALIDADES"]
[15,"2022-12-31","O23011601170000002199","Acciones de fomento a la juventud",120000000,0,-6497263,113502737,0,113502737,0,84044000,74,0,14760000,13,"0004-016","FDL-LOCALIDADES",16,"LOCALIDADES"]
[15,"2022-12-31","O2301160120","Bogotá, referente en cultura, deporte, recreación y actividad física, con parques para el desarrollo y la salud",708239000,0,-331112700,377126300,0,377126300,182594777,367180655,97,10563000,103327300,27.4,"0004-016","FDL-LOCALIDADES",16,"LOCALIDADES"]
[15,"2022-12-31","O23011601200000002200","Acciones de fomento y promoción de actividades en el campo deportivo",708239000,0,-331112700,377126300,0,377126300,182594777,367180655,97,10563000,103327300,27.4,"0004-016","FDL-LOCALIDADES",16,"LOCALIDADES"]
[15,"2022-12-31","O2301160121","Creación y vida cotidiana: Apropiación ciudadana del arte, la cultura y el patrimonio, para la democracia cultural",1002239000,0,156122724,1158361724,0,1158361724,411018106,1107228104,96,62689932,412897932,35.64,"0004-016","FDL-LOCALIDADES",16,"LOCALIDADES"]
[15,"2022-12-31","O23011601210000002201","Acciones de fomento y promoción de actividades artísticas, interculturales, culturales y/o patrimoniales.",1002239000,0,156122724,1158361724,0,1158361724,411018106,1107228104,96,62689932,412897932,35.64,"0004-016","FDL-LOCALIDADES",16,"LOCALIDADES"]
[15,"2022-12-31","O2301160124","Bogotá región emprendedora e innovadora",142500000,0,0,142500000,0,142500000,129353683,133973683,94,0,4620000,3.24,"0004-016","FDL-LOCALIDADES",16,"LOCALIDADES"]
[15,"2022-12-31","O23011601240000002202","Acciones de fortalecimiento a industrias culturales y creativas de la localidad",100000000,0,0,100000000,0,100000000,92921923,92921923,93,0,0,0,"0004-016","FDL-LOCALIDADES",16,"LOCALIDADES"]
[15,"2022-12-31","O23011601240000002203","Acciones que promueven la agricultura urbana",42500000,0,0,42500000,0,42500000,36431760,41051760,97,0,4620000,10.87,"0004-016","FDL-LOCALIDADES",16,"LOCALIDADES"]
[15,"2022-12-31","O23011602","Cambiar nuestros hábitos de vida para reverdecer a Bogotá y adaptarnos y mitigar la crisis climática",987500000,0,0,987500000,0,987500000,67294172,936683056,95,83754322,322220322,32.630000000000003,"0004-016","FDL-LOCALIDADES",16,"LOCALIDADES"]
[15,"2022-12-31","O2301160227","Cambio cultural para la gestión de la crisis climática",42500000,0,0,42500000,0,42500000,34610172,39230172,92,0,4620000,10.87,"0004-016","FDL-LOCALIDADES",16,"LOCALIDADES"]
[15,"2022-12-31","O23011602270000002204","Acciones de educación ambiental y eco-urbanismo",42500000,0,0,42500000,0,42500000,34610172,39230172,92,0,4620000,10.87,"0004-016","FDL-LOCALIDADES",16,"LOCALIDADES"]
[15,"2022-12-31","O2301160230","Eficiencia en la atención de emergencias",76500000,0,0,76500000,0,76500000,0,43200000,56,0,43200000,56.47,"0004-016","FDL-LOCALIDADES",16,"LOCALIDADES"]
[15,"2022-12-31","O23011602300000002205","Acciones de mitigación del riesgo y fortalecimiento de capacidades de reacción.",76500000,0,0,76500000,0,76500000,0,43200000,56,0,43200000,56.47,"0004-016","FDL-LOCALIDADES",16,"LOCALIDADES"]
[15,"2022-12-31","O2301160233","Más árboles y más y mejor espacio público",684750000,0,0,684750000,0,684750000,28064000,675738884,99,42652968,185058968,27.03,"0004-016","FDL-LOCALIDADES",16,"LOCALIDADES"]
[15,"2022-12-31","O23011602330000002206","Acciones ambientales para reverdecer la localidad",64750000,0,0,64750000,0,64750000,28064000,55784000,86,4620000,26642000,41.15,"0004-016","FDL-LOCALIDADES",16,"LOCALIDADES"]
[15,"2022-12-31","O23011602330000002207","Acciones de mejoramiento y embellecimiento de parques",620000000,0,0,620000000,0,620000000,0,619954884,100,38032968,158416968,25.55,"0004-016","FDL-LOCALIDADES",16,"LOCALIDADES"]
[15,"2022-12-31","O2301160234","Bogotá protectora de los animales",136000000,0,0,136000000,0,136000000,4620000,130764000,96,41101354,78061354,57.4,"0004-016","FDL-LOCALIDADES",16,"LOCALIDADES"]
[15,"2022-12-31","O23011602340000002209","Acciones de atención y bienestar animal",136000000,0,0,136000000,0,136000000,4620000,130764000,96,41101354,78061354,57.4,"0004-016","FDL-LOCALIDADES",16,"LOCALIDADES"]
[15,"2022-12-31","O2301160238","Ecoeficiencia, reciclaje, manejo de residuos e inclusión de la población recicladora",47750000,0,0,47750000,0,47750000,0,47750000,100,0,11280000,23.62,"0004-016","FDL-LOCALIDADES",16,"LOCALIDADES"]
[15,"2022-12-31","O23011602380000002210","Acciones que fomentan el cambio de hábitos y mejoramiento de las condiciones ambientales",47750000,0,0,47750000,0,47750000,0,47750000,100,0,11280000,23.62,"0004-016","FDL-LOCALIDADES",16,"LOCALIDADES"]
[15,"2022-12-31","O23011603","Inspirar confianza y legitimidad para vivir sin miedo y ser epicentro de cultura ciudadana, paz y reconciliación",1202000000,0,0,1202000000,0,1202000000,629510935,985776481,82,10020000,144856000,12.05,"0004-016","FDL-LOCALIDADES",16,"LOCALIDADES"]
[15,"2022-12-31","O2301160339","Bogotá territorio de paz y atención integral a las víctimas del conflicto armado",100000000,0,0,100000000,0,100000000,0,55440000,55,0,55440000,55.44,"0004-016","FDL-LOCALIDADES",16,"LOCALIDADES"]
[15,"2022-12-31","O23011603390000002165","Acciones para la construcción de memoria, verdad, reparación, víctimas, paz y reconciliación",100000000,0,0,100000000,0,100000000,0,55440000,55,0,55440000,55.44,"0004-016","FDL-LOCALIDADES",16,"LOCALIDADES"]
[15,"2022-12-31","O2301160340","Más mujeres viven una vida libre de violencias, se sienten seguras y acceden con confianza al sistema de justicia",300000000,0,0,300000000,0,300000000,239058286,298458286,99,5400000,51840000,17.28,"0004-016","FDL-LOCALIDADES",16,"LOCALIDADES"]
[15,"2022-12-31","O23011603400000002197","Acciones para el desarrollo de capacidades y el fomento de los derechos de las mujeres",300000000,0,0,300000000,0,300000000,239058286,298458286,99,5400000,51840000,17.28,"0004-016","FDL-LOCALIDADES",16,"LOCALIDADES"]
[15,"2022-12-31","O2301160343","Cultura ciudadana para la confianza, la convivencia y la participación desde la vida cotidiana",22000000,0,0,22000000,0,22000000,0,0,0,0,0,0,"0004-016","FDL-LOCALIDADES",16,"LOCALIDADES"]
[15,"2022-12-31","O23011603430000002182","Acciones de promoción para la convivencia ciudadana",22000000,0,0,22000000,0,22000000,0,0,0,0,0,0,"0004-016","FDL-LOCALIDADES",16,"LOCALIDADES"]
[15,"2022-12-31","O2301160345","Espacio público más seguro y construido colectivamente",300000000,0,0,300000000,0,300000000,138516109,189336109,63,4620000,37576000,12.53,"0004-016","FDL-LOCALIDADES",16,"LOCALIDADES"]
[15,"2022-12-31","O23011603450000002183","Acciones para establecer acuerdos ciudadanos",300000000,0,0,300000000,0,300000000,138516109,189336109,63,4620000,37576000,12.53,"0004-016","FDL-LOCALIDADES",16,"LOCALIDADES"]
[15,"2022-12-31","O2301160348","Plataforma institucional para la seguridad y justicia",480000000,0,0,480000000,0,480000000,251936540,442542086,92,0,0,0,"0004-016","FDL-LOCALIDADES",16,"LOCALIDADES"]
[15,"2022-12-31","O23011603480000002184","Acciones de acceso a la justicia",50000000,0,0,50000000,0,50000000,26537000,26537000,53,0,0,0,"0004-016","FDL-LOCALIDADES",16,"LOCALIDADES"]
[15,"2022-12-31","O23011603480000002185","Dotaciones de seguridad",430000000,0,0,430000000,0,430000000,225399540,416005086,97,0,0,0,"0004-016","FDL-LOCALIDADES",16,"LOCALIDADES"]
[15,"2022-12-31","O23011604","Hacer de Bogotá Región un modelo de movilidad multimodal, incluyente y sostenible",5327830000,0,1267291146,6595121146,0,6595121146,1439456941,6590069000,100,67440000,566416000,8.59,"0004-016","FDL-LOCALIDADES",16,"LOCALIDADES"]
[15,"2022-12-31","O2301160449","Movilidad segura, sostenible y accesible",5327830000,0,1267291146,6595121146,0,6595121146,1439456941,6590069000,100,67440000,566416000,8.59,"0004-016","FDL-LOCALIDADES",16,"LOCALIDADES"]
[15,"2022-12-31","O23011604490000002186","Acciones de mejoramiento de la malla vial y el espacio público",5327830000,0,1267291146,6595121146,0,6595121146,1439456941,6590069000,100,67440000,566416000,8.59,"0004-016","FDL-LOCALIDADES",16,"LOCALIDADES"]
[15,"2022-12-31","O23011605","Construir Bogotá Región con gobierno abierto, transparente y ciudadanía consciente",3520421000,0,870849413,4391270413,0,4391270413,469339258,4302955235,98,528234150,3410607950,77.67,"0004-016","FDL-LOCALIDADES",16,"LOCALIDADES"]
[15,"2022-12-31","O2301160555","Fortalecimiento de Cultura Ciudadana y su institucionalidad",500000000,0,21000000,521000000,0,521000000,65469563,467345563,90,143849050,342253050,65.69,"0004-016","FDL-LOCALIDADES",16,"LOCALIDADES"]
[15,"2022-12-31","O23011605550000002190","Acciones de fomento y fortalecimiento de procesos participativos",500000000,0,21000000,521000000,0,521000000,65469563,467345563,90,143849050,342253050,65.69,"0004-016","FDL-LOCALIDADES",16,"LOCALIDADES"]
[15,"2022-12-31","O2301160557","Gestión Pública Local",3020421000,0,849849413,3870270413,0,3870270413,403869695,3835609672,99,384385100,3068354900,79.28,"0004-016","FDL-LOCALIDADES",16,"LOCALIDADES"]
[15,"2022-12-31","O23011605570000002189","Acciones inspección, vigilancia y control",463942000,0,299163030,763105030,0,763105030,79457100,736161956,96,99538223,562274679,73.680000000000007,"0004-016","FDL-LOCALIDADES",16,"LOCALIDADES"]
[15,"2022-12-31","O23011605570000002198","Acciones para el fortalecimiento institucional",2556479000,0,550686383,3107165383,0,3107165383,324412595,3099447716,100,284846877,2506080221,80.650000000000006,"0004-016","FDL-LOCALIDADES",16,"LOCALIDADES"]
[15,"2022-12-31","O2306","OBLIGACIONES POR PAGAR",14928512000,0,-3902413089,11026098911,0,11026098911,0,10958849594,99,1550297836,6531604822,59.24,"0004-016","FDL-LOCALIDADES",16,"LOCALIDADES"]
[15,"2022-12-31","O230616","Un Nuevo Contrato Social y Ambiental para la Bogotá del Siglo XXI",4657732000,0,-667352286,3990379714,0,3990379714,0,3958482637,99,813998706,2762480255,69.23,"0004-016","FDL-LOCALIDADES",16,"LOCALIDADES"]
[15,"2022-12-31","O23061601","Hacer un nuevo contrato social con igualdad de oportunidades para la inclusión social, productiva y política",1884619000,0,-400388452,1484230548,0,1484230548,0,1484230548,100,97309800,1148456877,77.38,"0004-016","FDL-LOCALIDADES",16,"LOCALIDADES"]
[15,"2022-12-31","O2306160101","Subsidios y transferencias para la equidad",477510000,0,-99666738,377843262,0,377843262,0,377843262,100,0,377843262,100,"0004-016","FDL-LOCALIDADES",16,"LOCALIDADES"]
[15,"2022-12-31","O23061601010000001851","Acciones de atención para población vulnerable",477510000,0,-99666738,377843262,0,377843262,0,377843262,100,0,377843262,100,"0004-016","FDL-LOCALIDADES",16,"LOCALIDADES"]
[15,"2022-12-31","O2306160106","Sistema Distrital del Cuidado",531633000,0,-48040089,483592911,0,483592911,0,483592911,100,0,265152322,54.83,"0004-016","FDL-LOCALIDADES",16,"LOCALIDADES"]
[15,"2022-12-31","O23061601060000002191","Acciones integrales para la productividad y el emprendimiento",181140000,0,-24832125,156307875,0,156307875,0,156307875,100,0,132231675,84.6,"0004-016","FDL-LOCALIDADES",16,"LOCALIDADES"]
[15,"2022-12-31","O23061601060000002192","Acciones de atención a primera infancia y prevención de violencias",134960000,0,-7398791,127561209,0,127561209,0,127561209,100,0,125595447,98.46,"0004-016","FDL-LOCALIDADES",16,"LOCALIDADES"]
[15,"2022-12-31","O23061601060000002193","Acciones para las personas cuidadoras",143895000,0,-10262300,133632700,0,133632700,0,133632700,100,0,1163200,0.87,"0004-016","FDL-LOCALIDADES",16,"LOCALIDADES"]
[15,"2022-12-31","O23061601060000002194","Acciones de fomento y promoción de las condiciones de salud",71638000,0,-5546873,66091127,0,66091127,0,66091127,100,0,6162000,9.32,"0004-016","FDL-LOCALIDADES",16,"LOCALIDADES"]
[15,"2022-12-31","O2306160114","Formación integral: más y mejor tiempo en los colegios",114000000,0,-4310560,109689440,0,109689440,0,109689440,100,0,109689440,100,"0004-016","FDL-LOCALIDADES",16,"LOCALIDADES"]
[15,"2022-12-31","O23061601140000002196","Dotaciones a instituciones educativas",114000000,0,-4310560,109689440,0,109689440,0,109689440,100,0,109689440,100,"0004-016","FDL-LOCALIDADES",16,"LOCALIDADES"]
[15,"2022-12-31","O2306160117","Jóvenes con capacidades: Proyecto de vida para la ciudadanía, la innovación y el trabajo del siglo XXI",110376000,0,-99328000,11048000,0,11048000,0,11048000,100,0,11048000,100,"0004-016","FDL-LOCALIDADES",16,"LOCALIDADES"]
[15,"2022-12-31","O23061601170000002048","Acciones de promoción para la educación superior",8570000,0,-1000,8569000,0,8569000,0,8569000,100,0,8569000,100,"0004-016","FDL-LOCALIDADES",16,"LOCALIDADES"]
[15,"2022-12-31","O23061601170000002199","Acciones de fomento a la juventud",101806000,0,-99327000,2479000,0,2479000,0,2479000,100,0,2479000,100,"0004-016","FDL-LOCALIDADES",16,"LOCALIDADES"]
[15,"2022-12-31","O2306160120","Bogotá, referente en cultura, deporte, recreación y actividad física, con parques para el desarrollo y la salud",304575000,0,-59209100,245365900,0,245365900,0,245365900,100,97309800,148744901,60.62,"0004-016","FDL-LOCALIDADES",16,"LOCALIDADES"]
[15,"2022-12-31","O23061601200000002200","Acciones de fomento y promoción de actividades en el campo deportivo",304575000,0,-59209100,245365900,0,245365900,0,245365900,100,97309800,148744901,60.62,"0004-016","FDL-LOCALIDADES",16,"LOCALIDADES"]
[15,"2022-12-31","O2306160121","Creación y vida cotidiana: Apropiación ciudadana del arte, la cultura y el patrimonio, para la democracia cultural",310740000,0,-89835365,220904635,0,220904635,0,220904635,100,0,200192552,90.62,"0004-016","FDL-LOCALIDADES",16,"LOCALIDADES"]
[15,"2022-12-31","O23061601210000002201","Acciones de fomento y promoción de actividades artísticas, interculturales, culturales y/o patrimoniales.",310740000,0,-89835365,220904635,0,220904635,0,220904635,100,0,200192552,90.62,"0004-016","FDL-LOCALIDADES",16,"LOCALIDADES"]
[15,"2022-12-31","O2306160124","Bogotá región emprendedora e innovadora",35785000,0,1400,35786400,0,35786400,0,35786400,100,0,35786400,100,"0004-016","FDL-LOCALIDADES",16,"LOCALIDADES"]
[15,"2022-12-31","O23061601240000002203","Acciones que promueven la agricultura urbana",35785000,0,1400,35786400,0,35786400,0,35786400,100,0,35786400,100,"0004-016","FDL-LOCALIDADES",16,"LOCALIDADES"]
[15,"2022-12-31","O23061602","Cambiar nuestros hábitos de vida para reverdecer a Bogotá y adaptarnos y mitigar la crisis climática",420554000,0,-55093427,365460573,0,365460573,0,365460573,100,158436909,365406573,99.99,"0004-016","FDL-LOCALIDADES",16,"LOCALIDADES"]
[15,"2022-12-31","O2306160227","Cambio cultural para la gestión de la crisis climática",87276000,0,-39971519,47304481,0,47304481,0,47304481,100,0,47304481,100,"0004-016","FDL-LOCALIDADES",16,"LOCALIDADES"]
[15,"2022-12-31","O23061602270000002204","Acciones de educación ambiental y eco-urbanismo",87276000,0,-39971519,47304481,0,47304481,0,47304481,100,0,47304481,100,"0004-016","FDL-LOCALIDADES",16,"LOCALIDADES"]
[15,"2022-12-31","O2306160230","Eficiencia en la atención de emergencias",12502000,0,-2619028,9882972,0,9882972,0,9882972,100,0,9882972,100,"0004-016","FDL-LOCALIDADES",16,"LOCALIDADES"]
[15,"2022-12-31","O23061602300000002205","Acciones de mitigación del riesgo y fortalecimiento de capacidades de reacción.",12502000,0,-2619028,9882972,0,9882972,0,9882972,100,0,9882972,100,"0004-016","FDL-LOCALIDADES",16,"LOCALIDADES"]
[15,"2022-12-31","O2306160233","Más árboles y más y mejor espacio público",201944000,0,-700,201943300,0,201943300,0,201943300,100,118173753,201943300,100,"0004-016","FDL-LOCALIDADES",16,"LOCALIDADES"]
[15,"2022-12-31","O23061602330000002206","Acciones ambientales para reverdecer la localidad",25000000,0,0,25000000,0,25000000,0,25000000,100,0,25000000,100,"0004-016","FDL-LOCALIDADES",16,"LOCALIDADES"]
[15,"2022-12-31","O23061602330000002207","Acciones de mejoramiento y embellecimiento de parques",176944000,0,-700,176943300,0,176943300,0,176943300,100,118173753,176943300,100,"0004-016","FDL-LOCALIDADES",16,"LOCALIDADES"]
[15,"2022-12-31","O2306160234","Bogotá protectora de los animales",102260000,0,-400,102259600,0,102259600,0,102259600,100,40263156,102205600,99.95,"0004-016","FDL-LOCALIDADES",16,"LOCALIDADES"]
[15,"2022-12-31","O23061602340000002209","Acciones de atención y bienestar animal",102260000,0,-400,102259600,0,102259600,0,102259600,100,40263156,102205600,99.95,"0004-016","FDL-LOCALIDADES",16,"LOCALIDADES"]
[15,"2022-12-31","O2306160238","Ecoeficiencia, reciclaje, manejo de residuos e inclusión de la población recicladora",16572000,0,-12501780,4070220,0,4070220,0,4070220,100,0,4070220,100,"0004-016","FDL-LOCALIDADES",16,"LOCALIDADES"]
[15,"2022-12-31","O23061602380000002210","Acciones que fomentan el cambio de hábitos y mejoramiento de las condiciones ambientales",16572000,0,-12501780,4070220,0,4070220,0,4070220,100,0,4070220,100,"0004-016","FDL-LOCALIDADES",16,"LOCALIDADES"]
[15,"2022-12-31","O23061603","Inspirar confianza y legitimidad para vivir sin miedo y ser epicentro de cultura ciudadana, paz y reconciliación",282517000,0,-32110017,250406983,0,250406983,0,250174983,100,0,134279911,53.62,"0004-016","FDL-LOCALIDADES",16,"LOCALIDADES"]
[15,"2022-12-31","O2306160339","Bogotá territorio de paz y atención integral a las víctimas del conflicto armado",95000000,0,-1150006,93849994,0,93849994,0,93849994,100,0,0,0,"0004-016","FDL-LOCALIDADES",16,"LOCALIDADES"]
[15,"2022-12-31","O23061603390000002165","Acciones para la construcción de memoria, verdad, reparación, víctimas, paz y reconciliación",95000000,0,-1150006,93849994,0,93849994,0,93849994,100,0,0,0,"0004-016","FDL-LOCALIDADES",16,"LOCALIDADES"]
[15,"2022-12-31","O2306160340","Más mujeres viven una vida libre de violencias, se sienten seguras y acceden con confianza al sistema de justicia",168814000,0,-15542411,153271589,0,153271589,0,153271589,100,0,131226511,85.62,"0004-016","FDL-LOCALIDADES",16,"LOCALIDADES"]
[15,"2022-12-31","O23061603400000002197","Acciones para el desarrollo de capacidades y el fomento de los derechos de las mujeres",168814000,0,-15542411,153271589,0,153271589,0,153271589,100,0,131226511,85.62,"0004-016","FDL-LOCALIDADES",16,"LOCALIDADES"]
[15,"2022-12-31","O2306160345","Espacio público más seguro y construido colectivamente",18703000,0,-15417600,3285400,0,3285400,0,3053400,93,0,3053400,92.94,"0004-016","FDL-LOCALIDADES",16,"LOCALIDADES"]
[15,"2022-12-31","O23061603450000002183","Acciones para establecer acuerdos ciudadanos",18703000,0,-15417600,3285400,0,3285400,0,3053400,93,0,3053400,92.94,"0004-016","FDL-LOCALIDADES",16,"LOCALIDADES"]
[15,"2022-12-31","O23061604","Hacer de Bogotá Región un modelo de movilidad multimodal, incluyente y sostenible",1459243000,0,-6949862,1452293138,0,1452293138,0,1452293138,100,556987797,728242299,50.14,"0004-016","FDL-LOCALIDADES",16,"LOCALIDADES"]
[15,"2022-12-31","O2306160449","Movilidad segura, sostenible y accesible",1459243000,0,-6949862,1452293138,0,1452293138,0,1452293138,100,556987797,728242299,50.14,"0004-016","FDL-LOCALIDADES",16,"LOCALIDADES"]
[15,"2022-12-31","O23061604490000002186","Acciones de mejoramiento de la malla vial y el espacio público",1459243000,0,-6949862,1452293138,0,1452293138,0,1452293138,100,556987797,728242299,50.14,"0004-016","FDL-LOCALIDADES",16,"LOCALIDADES"]
[15,"2022-12-31","O23061605","Construir Bogotá Región con gobierno abierto, transparente y ciudadanía consciente",610799000,0,-172810528,437988472,0,437988472,0,406323395,93,1264200,386094595,88.15,"0004-016","FDL-LOCALIDADES",16,"LOCALIDADES"]
[15,"2022-12-31","O2306160555","Fortalecimiento de Cultura Ciudadana y su institucionalidad",147439000,0,-27265300,120173700,0,120173700,0,116996023,97,0,113948023,94.82,"0004-016","FDL-LOCALIDADES",16,"LOCALIDADES"]
[15,"2022-12-31","O23061605550000002190","Acciones de fomento y fortalecimiento de procesos participativos",147439000,0,-27265300,120173700,0,120173700,0,116996023,97,0,113948023,94.82,"0004-016","FDL-LOCALIDADES",16,"LOCALIDADES"]
[15,"2022-12-31","O2306160557","Gestión Pública Local",463360000,0,-145545228,317814772,0,317814772,0,289327372,91,1264200,272146572,85.63,"0004-016","FDL-LOCALIDADES",16,"LOCALIDADES"]
[15,"2022-12-31","O23061605570000002189","Acciones inspección, vigilancia y control",174148000,0,-73835668,100312332,0,100312332,0,76514132,76,828000,75972332,75.739999999999995,"0004-016","FDL-LOCALIDADES",16,"LOCALIDADES"]
[15,"2022-12-31","O23061605570000002198","Acciones para el fortalecimiento institucional",289212000,0,-71709560,217502440,0,217502440,0,212813240,98,436200,196174240,90.19,"0004-016","FDL-LOCALIDADES",16,"LOCALIDADES"]
[15,"2022-12-31","O230690","Obligaciones por pagar Inversión vigencias anteriores",10270780000,0,-3235060803,7035719197,0,7035719197,0,7000366957,100,736299130,3769124567,53.57,"0004-016","FDL-LOCALIDADES",16,"LOCALIDADES"]
[15,"2022-12-31","O4","Disponibilidad final",0,0,0,0,0,0,0,0,0,0,0,0,"0004-016","FDL-LOCALIDADES",16,"LOCALIDADES"]

{"sheet":"BOGDATA VS FORMATO R2","index":4,"n_rows":114,"n_cols":6,"rows_kept":114,"cut":false,"hidden":true,"merged":[[0,0,0,5],[1,0,1,1],[3,2,3,3],[3,4,3,5],[5,2,5,3],[5,4,5,5],[7,2,7,3],[7,4,7,5],[9,2,9,3],[9,4,9,5],[10,0,33,0],[11,2,11,3],[11,4,11,5],[13,2,13,3],[13,4,13,5],[15,2,15,3],[23,2,23,3],[23,4,23,5],[25,2,25,3],[25,4,25,5],[27,2,27,3],[27,4,27,5],[15,4,15,5],[17,2,17,3],[17,4,17,5],[19,2,19,3],[19,4,19,5],[21,2,21,3],[21,4,21,5],[35,2,35,3],[35,4,35,5],[37,2,37,3],[37,4,37,5],[39,2,39,3],[39,4,39,5],[29,2,29,3],[29,4,29,5],[31,2,31,3],[31,4,31,5],[33,2,33,3],[33,4,33,5],[47,2,47,3],[47,4,47,5],[49,2,49,3],[49,4,49,5],[51,2,51,3],[51,4,51,5],[41,2,41,3],[41,4,41,5],[43,2,43,3],[43,4,43,5],[45,2,45,3],[45,4,45,5],[59,2,59,3],[59,4,59,5],[61,2,61,3],[61,4,61,5],[63,2,63,3],[63,4,63,5],[53,2,53,3],[53,4,53,5],[55,2,55,3],[55,4,55,5],[57,2,57,3],[57,4,57,5],[71,2,71,3],[71,4,71,5],[73,2,73,3],[73,4,73,5],[75,2,75,3],[75,4,75,5],[65,2,65,3],[65,4,65,5],[67,2,67,3],[67,4,67,5],[69,2,69,3],[69,4,69,5],[83,2,83,3],[83,4,83,5],[85,2,85,3],[85,4,85,5],[87,2,87,3],[87,4,87,5],[77,2,77,3],[77,4,77,5],[79,2,79,3],[79,4,79,5],[81,2,81,3],[81,4,81,5],[95,2,95,3],[95,4,95,5],[97,2,97,3],[97,4,97,5],[99,2,99,3],[99,4,99,5],[89,2,89,3],[89,4,89,5],[91,2,91,3],[91,4,91,5],[93,2,93,3],[93,4,93,5],[113,2,113,3],[113,4,113,5],[107,2,107,3],[107,4,107,5],[109,2,109,3],[109,4,109,5],[111,2,111,3],[111,4,111,5],[101,2,101,3],[101,4,101,5],[103,2,103,3],[103,4,103,5],[105,2,105,3],[105,4,105,5]]}
["BOGDATA- CUADRO ANALISIS -  Antonio Nariño "]
[null,null,"COMPROMISOS ACUMULADOS BOGDATA","VALOR FINAL","ACUMULADO GIROS BOGDATA","GIROS"]
[null,"FUNCIONAMIENTO",1967641061,1708189172,1646879979,1446365959]
[null,"DIFERENCIAS",{"$f":"+C3-D3","v":259451889},null,{"$f":"+E3-F3","v":200514020}]
[null,"INVERSION (Comprometido)",21045484881,21045484881,10251824148,10251824148]
[null,"DIFERENCIAS",{"$f":"C5-D5","v":0},null,{"$f":"E5-F5","v":0}]
[null,"Un nuevo contrato social y ambiental para la Bogotá del Siglo XXI",21045484881,21045484881,10251824148,10251824148]
[null,"DIFERENCIAS",{"$f":"C7-D7","v":0},null,{"$f":"E7-F7","v":0}]
[null,"Propósito 1 - Hacer un nuevo contrato social con igualdad de oportunidades para la inclusión social, productiva y política",8230001109,8241161109,5807723876,5818883876]
[null,"DIFERENCIAS",{"$f":"C9-D9","v":-11160000},null,{"$f":"E9-F9","v":-11160000}]
[null,"Subsidios y transferencias para la equidad - Programa 1 ",3633115000,3633115000,3343685904,3343685904]
[null,"DIFERENCIAS",{"$f":"C11-D11","v":0},null,{"$f":"+E11-F11","v":0}]
[null,"Proyecto 1851 ",3633115000,3633115000,3343685904,3343685904]
[null,"DIFERENCIAS",{"$f":"+C13-D13","v":0},null,{"$f":"+E13-F13","v":0}]
[null,"Sistema Distrital del Cuidado - Programa 6 ",1151539201,1185335293,523478369,550944740]
[null,"DIFERENCIAS",{"$f":"+C15-D15","v":-33796092},null,{"$f":"+E15-F15","v":-27466371}]
[null,"Proyecto 2191 ",625047356,625047356,429018000,429018000]
[null,"DIFERENCIAS",{"$f":"+C17-D17","v":0},null,{"$f":"+E17-F17","v":0}]
[null,"Proyecto 2192",75584000,75584000,22714000,22714000]
[null,"DIFERENCIAS",{"$f":"+C19-D19","v":0},null,{"$f":"+E19-F19","v":0}]
[null,"Proyecto 2193 ",55440000,55440000,55440000,55440000]
[null,"DIFERENCIAS",{"$f":"+C21-D21","v":0},null,{"$f":"+E21-F21","v":0}]
[null,"Proyecto 2194 ",395467845,395467845,16306369,16306369]
[null,"DIFERENCIAS",{"$f":"+C23-D23","v":0},null,{"$f":"+E23-F23","v":0}]
[null,"Educación inicial: Bases sólidas para la vida - Programa 12",219810614,219810614,0,0]
[null,"DIFERENCIAS",{"$f":"+C25-D25","v":0},null,{"$f":"+E25-F25","v":0}]
[null,"Proyecto 1864",219810614,219810614,0,0]
[null,"DIFERENCIAS",{"$f":"+C27-D27","v":0},null,{"$f":"+E27-F27","v":0}]
[null,"Formación integral: más y mejor tiempo en los colegios - Programa 14 ",113321760,113321760,0,0]
[null,"DIFERENCIAS",{"$f":"+C29-D29","v":0},null,{"$f":"+E29-F29","v":0}]
[null,"Proyecto 2196 ",113321760,113321760,0,0]
[null,"DIFERENCIAS",{"$f":"+C31-D31","v":0},null,{"$f":"+E31-F31","v":0}]
[null,"Jóvenes con capacidades: Proyecto de vida para la ciudadanía, la innovación y el trabajo del siglo XXI - Programa 17 ",1481196000,1481196000,1403408000,1403408000]
[null,"DIFERENCIAS",{"$f":"+C33-D33","v":0},null,{"$f":"+E33-F33","v":0}]
[null,"Proyecto 2048",1397152000,1397152000,1388648000,1388648000]
[null,"DIFERENCIAS",{"$f":"+C35-D35","v":0},null,{"$f":"+E35-F35","v":0}]
[null,"Proyecto 2199 ",84044000,84044000,14760000,14760000]
[null,"DIFERENCIAS",{"$f":"+C37-D37","v":0},null,{"$f":"+E37-F37","v":0}]
[null," Bogotá, referente en cultura, deporte, recreación y actividad física, con parques para el desarrollo y la salud - Programa 20",367180655,367180655,103327300,103327300]
[null,"DIFERENCIAS",{"$f":"+C39-D39","v":0},null,{"$f":"+E39-F39","v":0}]
[null,"Proyecto 2200 ",367180655,367180655,103327300,103327300]
[null,"DIFERENCIAS",{"$f":"+C41-D41","v":0},null,{"$f":"+E41-F41","v":0}]
[null,"Creación y vida cotidiana: Apropiación ciudadana del arte, la cultura y el patrimonio, para la democracia cultural - Programa 21",1107228104,1107228104,412897932,412897932]
[null,"DIFERENCIAS",{"$f":"+C43-D43","v":0},null,{"$f":"+E43-F43","v":0}]
[null,"Proyecto 2201",1107228104,1107228104,412897932,412897932]
[null,"DIFERENCIAS",{"$f":"+C45-D45","v":0},null,{"$f":"+E45-F45","v":0}]
[null,"Bogotá región emprendedora e innovadora - Programa 24",133973683,133973683,4620000,4620000]
[null,"DIFERENCIAS",{"$f":"+C47-D47","v":0},null,{"$f":"+E47-F47","v":0}]
[null,"Proyecto 2202",92921923,92921923,0,0]
[null,"DIFERENCIAS",{"$f":"+C49-D49","v":0},null,{"$f":"+E49-F49","v":0}]
[null,"Proyecto 2203 ",41051760,41051760,4620000,4620000]
[null,"DIFERENCIAS",{"$f":"+C51-D51","v":0},null,{"$f":"+E51-F51","v":0}]
[null,"Propósito 2 - Cambiar nuestros hábitos de vida para reverdecer a Bogotá y adaptarnos y mitigar la crisis climática",936683056,899419491,322220322,348365322]
[null,"DIFERENCIAS",{"$f":"+C53-D53","v":37263565},null,{"$f":"+E53-F53","v":-26145000}]
[null,"Programa 27 - Cambio cultural para la gestión de la crisis climática",39230172,39230172,4620000,4620000]
[null,"DIFERENCIAS",{"$f":"+C55-D55","v":0},null,{"$f":"+E55-F55","v":0}]
[null,"Proyecto 2204",39230172,39230172,4620000,4620000]
[null,"DIFERENCIAS",{"$f":"+C57-D57","v":0},null,{"$f":"+E57-F57","v":0}]
[null,"Programa 30 - Eficiencia en la atención de emergencias",43200000,43200000,43200000,43200000]
[null,"DIFERENCIAS",{"$f":"+C59-D59","v":0},null,{"$f":"+E59-F59","v":0}]
[null,"Proyecto 2205",43200000,43200000,43200000,43200000]
[null,"DIFERENCIAS",{"$f":"+C61-D61","v":0},null,{"$f":"+E61-F61","v":0}]
[null,"Más árboles y más y mejor espacio público - Programa 33",675738884,638475319,185058968,211203968]
[null,"DIFERENCIAS",{"$f":"+C63-D63","v":37263565},null,{"$f":"+E63-F63","v":-26145000}]
[null,"Proyecto 2206 ",55784000,55784000,26642000,26642000]
[null,"DIFERENCIAS",{"$f":"+C65-D65","v":0},null,{"$f":"+E65-F65","v":0}]
[null,"Proyecto 2207",619954884,554665319,158416968,158416968]
[null,"DIFERENCIAS",{"$f":"+C67-D67","v":65289565},null,{"$f":"+E67-F67","v":0}]
[null,"Bogotá protectora de los animales - Programa 34",130764000,130764000,78061354,78061354]
[null,"DIFERENCIAS",{"$f":"+C69-D69","v":0},null,{"$f":"+E69-F69","v":0}]
[null,"Proyecto 2209",130764000,130764000,78061354,78061354]
[null,"DIFERENCIAS",{"$f":"+C71-D71","v":0},null,{"$f":"+E71-F71","v":0}]
[null,"Ecoeficiencia, reciclaje, manejo de residuos e inclusión de la población recicladora - Programa 38 ",47750000,47750000,11280000,11280000]
[null,"DIFERENCIAS",{"$f":"+C73-D73","v":0},null,{"$f":"+E73-F73","v":0}]
[null,"Proyecto 2210 ",47750000,47750000,11280000,11280000]
[null,"DIFERENCIAS",{"$f":"+C75-D75","v":0},null,{"$f":"+E75-F75","v":0}]
[null,"Propósito 3 - Inspirar confianza y legitimidad para vivir sin miedo y ser epicentro de cultura ciudadana, paz y reconciliación",985776481,953376481,144856000,114436000]
[null,"DIFERENCIAS",{"$f":"+C77-D77","v":32400000},null,{"$f":"+E77-F77","v":30420000}]
[null,"Bogotá territorio de paz y atención integral a las víctimas del conflicto armado - Programa 39 ",55440000,55440000,55440000,55440000]
[null,"DIFERENCIAS",{"$f":"+C79-D79","v":0},null,{"$f":"+E79-F79","v":0}]
[null,"Proyecto 2165 ",55440000,55440000,55440000,55440000]
[null,"DIFERENCIAS",{"$f":"+C81-D81","v":0},null,{"$f":"+E81-F81","v":0}]
[null,"Más mujeres viven una vida libre de violencias, se sienten seguras y acceden con confianza al sistema de justicia - Programa 40 ",298458286,266058286,51840000,21420000]
[null,"DIFERENCIAS",{"$f":"+C83-D83","v":32400000},null,{"$f":"+E83-F83","v":30420000}]
[null,"Proyecto 2197 ",298458286,266058286,51840000,21420000]
[null,"DIFERENCIAS",{"$f":"+C85-D85","v":32400000},null,{"$f":"+E85-F85","v":30420000}]
[null,"Espacio público más seguro y construido colectivamente - Programa 45 ",189336109,189336109,37576000,37576000]
[null,"DIFERENCIAS",{"$f":"+C87-D87","v":0},null,{"$f":"+E87-F87","v":0}]
[null,"Proyecto 2183 ",189336109,189336109,37576000,37576000]
[null,"DIFERENCIAS",{"$f":"+C89-D89","v":0},null,{"$f":"+E89-F89","v":0}]
[null,"Plataforma institucional para la seguridad y justicia - Programa 48 ",442542086,442542086,0,0]
[null,"DIFERENCIAS",{"$f":"+C91-D91","v":0},null,{"$f":"+E91-F91","v":0}]
[null,"Proyecto 2184",26537000,26537000,0,0]
[null,"DIFERENCIAS",{"$f":"+C93-D93","v":0},null,{"$f":"+E93-F93","v":0}]
[null,"Proyecto 2185 ",416005086,416005086,0,0]
[null,"DIFERENCIAS",{"$f":"+C95-D95","v":0},null,{"$f":"+E95-F95","v":0}]
[null,"Propósito 4 -Hacer de Bogotá Región un modelo de movilidad multimodal, incluyente y sostenible.",6590069000,6711092619,566416000,668496000]
[null,"DIFERENCIAS",{"$f":"+C97-D97","v":-121023619},null,{"$f":"+E97-F97","v":-102080000}]
[null,"Movilidad segura, sostenible y accesible - programa 49 ",6590069000,6711092619,566416000,668496000]
[null,"DIFERENCIAS",{"$f":"+C99-D99","v":-121023619},null,{"$f":"+E99-F99","v":-102080000}]
[null,"Proyecto 2186 ",6590069000,6534123054,566416000,566416000]
[null,"DIFERENCIAS",{"$f":"+C101-D101","v":55945946},null,{"$f":"+E101-F101","v":0}]
[null,"Propósito 5 - Construir Bogotá Región con gobierno abierto, transparente y ciudadanía consciente",4302955235,4184489235,3410607950,3301642950]
[null,"DIFERENCIAS",{"$f":"+C103-D103","v":118466000},null,{"$f":"+E103-F103","v":108965000}]
[null,"Fortalecimiento de Cultura Ciudadana y su institucionalidad - Programa 55 ",467345563,439625563,342253050,319923050]
[null,"DIFERENCIAS",{"$f":"+C105-D105","v":27720000},null,{"$f":"+E105-F105","v":22330000}]
[null,"Proyecto 2190 ",467345563,439625563,342253050,319923050]
[null,"DIFERENCIAS",{"$f":"+C107-D107","v":27720000},null,{"$f":"+E107-F107","v":22330000}]
[null,"Gestión Pública Local - Programa 57 ",3835609672,3744863672,3068354900,2981719900]
[null,"DIFERENCIAS",{"$f":"+C109-D109","v":90746000},null,{"$f":"+E109-F109","v":86635000}]
[null,"Proyecto 2189 ",736161956,724875956,562274679,552869679]
[null,"DIFERENCIAS",{"$f":"+C111-D111","v":11286000},null,{"$f":"+E111-F111","v":9405000}]
[null,"Poryecto 2198 ",3099447716,2959867716,2506080221,2376100221]
[null,"DIFERENCIAS",{"$f":"+C113-D113","v":139580000},null,{"$f":"+E113-F113","v":129980000}]

{"sheet":"WP REVISIÓN ","index":5,"n_rows":43,"n_cols":6,"rows_kept":43,"cut":false,"hidden":false,"merged":[[14,5,15,5],[8,5,11,5],[0,0,0,4],[5,0,7,0],[5,1,7,1],[5,2,7,2],[5,4,7,4],[8,0,11,0],[8,1,11,1],[8,2,11,2],[8,4,11,4],[12,0,13,0],[12,1,13,1],[12,2,13,2],[12,4,13,4],[14,0,15,0],[14,1,15,1],[14,2,15,2],[14,4,15,4],[16,0,19,0],[16,1,19,1],[16,2,18,2],[16,4,18,4],[25,2,27,2],[25,4,27,4],[21,0,27,0],[21,1,27,1],[23,2,24,2],[23,4,24,4],[28,0,29,0],[28,1,29,1],[28,2,29,2],[28,4,29,4],[32,0,34,0],[32,1,34,1],[32,2,34,2],[32,4,34,4]]}
["REVISIÓN DE LA INFORMACIÓN DILIGENCIADA \nFORMATO COMO CONTRATA BOGOTÁ I SEMESTRE 2022"]
["Parte","Sección","Ítem ","Pruebas a realizar","Antonio Nariño "]
["B",1,"Número del contrato","Verifique que no haya celdas en blanco, excepto para la fila de “otros gastos”.","Verificar la fila 305, ya que no se evidencia el numero del contrato ","No tiene número de contrato ya que pertenece a otros gastos "]
["B",3,"Número de proceso en el SECOP","Verifique que (i) no haya celdas en blanco, excepto para la fila de “otros gastos” ","El contrato 266 no contiene la información. Verificar el numero del proceso en el SECOP de los contratos \nResolución 03 Resolución 08 Resolución 08 Resolución 173 Resolución 70\n ","corregido "]
[null,null,"Link proceso SECOP",null,"Los contratos 207 266 285 no tienen el link del SECOP ","Estos tres números de contrato se omiten en atención a que no fuerón utilizados "]
["B",4,"Tipo de contrato ","Verifique que no haya celdas en blanco.","El contrato 266 no contiene la información "]
[null,null,null,"Verifique que se hayan seleccionado las opciones de la lista desplegable a través del filtro.",null,"El número de contrato se omite en atención a que no fue utilizado"]
[null,null,null,"Filtre la tipología “Otros” y verifique que esta opción se haya seleccionado solo para los tipos de contratos que no se encuentren en la lista desplegable, en caso de duda frente a la tipología, consulte el objeto contractual o el documento de estudios previos del SECOP con el link del proceso de la SECCIÓN 3."]
["B",5,"Modalidad de selección ","Verifique que no haya celdas en blanco, excepto para la fila de otros gastos.","El contrato 266 no contiene la información ","El número de contrato se omite en atención a que no fue utilizado"]
[null,null,null,"Verifique que solo se hayan seleccionado las opciones de la lista desplegable."]
[null,null,null,"Si la Entidad no se rige por el Estatuto General de Contratación Pública (Ley 80 de 1993 y normas complementarias), verifique que todos los contratos y adiciones se encuentren seleccionados con la modalidad de Régimen especial. "]
[null,null,null,"Filtre una a una las modalidades de selección y verifique que tengan coherencia con la tipología consignada en la SECCIÓN 4. Tipo de contrato y el objeto del contrato. En caso de duda revise el objeto contractual o consulte el documento de estudios previos del SECOP con el link del proceso de selección de la SECCIÓN 3. Link proceso SECOP y verifique la información."]
["B",6,"Procedimiento o causal ","Verifique que solo se hayan seleccionado las opciones de la lista desplegable.","El contrato 266 y 285 no contiene la información ","El número de contrato se omite en atención a que no fue utilizado\n\n\n"]
[null,null,null,"Con un filtro en la columna de la SECCIÓN 5. MODALIDAD DE SELECCIÓN escoja las modalidades de Selección abreviada y Contratación directa y verifique que no haya celdas en blanco en la columna de la SECCIÓN 6. Procedimiento o causal."]
["B",7,"Objeto ","Verifique que no haya celdas en blanco ","El contrato 266 y 285 no contiene la información \n\n\"","Los números de contrato 266 y 285 se omiten en atención a que no fuerón utilizados"]
[null,null,null,"Verifique que para las adiciones y vigencias futuras se diligencie el objeto del contrato no que corresponde a una adición o vigencia futura, esta información es importante para revisar que la modalidad y la tipología contractual se encuentran adecuadamente diligenciados."]
["B",8,"Afectación ","Verifique que no haya celdas en blanco","El contrato 266, 285 y 207  no contiene la información. Los contratos CIA 003 y CIA 004 no esta diligenciado con las lista desplegable, la opcion solo puede ser funcionamiento o inversión  ","Los números de contrato 266 y 285 se omiten en atención a que no fuerón utilizados,\nse realizan las otras correciones "]
[null,null,null,"Verifique que solo se hayan seleccionado las opciones de la lista desplegable."]
[null,null,null,"Verifique que haya diligenciado correctamente la clasificación de cuentas del presupuesto de gastos de manera que, al filtrar por cada rubro, guarda coincidencia con el total del compromiso acumulado con el reporte de BOGDATA con corte a 31 de diciembre de 2022."]
[null,null,"Número Programa","Con un filtro en la columna de la SECCIÓN 8 Afectación seleccione el rubro de Inversión y verifique que no haya celdas en blanco en la columna de la SECCIÓN 8 Número programa, respecto a los otros rubros verifique que las celdas se encuentran blanco","El contrato 266 no contiene la información.              El contrato CIA 001 no contiene esta infromación          Verificar las diferencias encontradas con Bogdata  ","El número de contrato 266 se omite en atención a que no fue utilizado,\nse realizan las otras correciones"]
["B",9,"Número de proyecto ","Con un filtro en la columna de la SECCIÓN 8 Afectación seleccione el rubro de Inversión y verifique que no haya celdas en blanco en la columna de la SECCIÓN 9 Número de proyecto, respecto a los otros rubros verifique que las celdas se encuentran blanco","El contrato 266 no contiene la información. Verificar las diferencias encontradas con Bogdata  El contrato CIA 001 no contiene esta infromación ","El número de contrato 266 se omite en atención a que no fue utilizado,\nse realizan las otras correciones"]
[null,null,"Nombre del contratista","Verifique que el nombre del contratista, para los contratos, adiciones y vigencias futuras este en mayúscula sostenida, sin comas, tildes, puntos ni caracteres especiales. en caso de que se trate de “otros gastos” no debe diligenciarse y la celda debe quedar en blanco.","verificar los contratos 90 176 178 191 192 195 196 198 199 200 205 206  210 215 218 219 220 224 230 234 239 241 246 247 248 249 262 265 266 285 286 CIA 003, esta información debe estar en  mayúscula sostenida, sin comas, tildes, puntos ni caracteres especiales.","corregido "]
[null,null,"Naturaleza Jurídica","Verifique que se hayan seleccionado las opciones de la lista desplegable.","Verificar la celda 305, la selección debe ser de la  lista desplegable","ok"]
[null,null,"Número  de Identificación del integrante del Consorcio o U.T.\n(Cédula o NIT sin puntos, comas ni caracteres especiales y sin digito de verificación)","Con un filtro de la columna SECCIÓN 11. Naturaleza Jurídica seleccione las opciones de Unión temporal y Consorcio y verifique que en la columna de la SECCIÓN 11. Número de identificación del integrante del consorcio o U.T (Unión Temporal) se haya diligenciado la información de los integrantes y que no haya campos vacíos, respeto a las demás opciones de naturaleza jurídica verifique que las celdas se encuentren en blanco. ","los contratos 170 180 214 276 279 no tiene diligenciado el numero de identificación del consorcio ","OK"]
[null,null,null,"Verifique que el número de identificación del contratista si es NIT haya sido consignado sin el dígito de verificación."]
[null,null,"Nombre del Integrante del Consorcio o U.T. y Tipo societario\n (Según el caso: nombres y apellidos o razón social y tipo societario)","Verifique que la información se haya diligenciado en mayúsculas sostenidas. ","los contratos 170 180 214 276 279 no tiene diligenciado el numero de identificación del consorcio "]
[null,null,null,"Verifique que y el tipo societario de acuerdo a las instrucciones"]
[null,null,null,"Verifique que la columna no se encuentran comas, tildes, puntos ni caracteres especiales.",null,"OK "]
["C",13,"Valor inicial del contrato ","Verifique que no haya celdas en blanco","Los contratos 135 266 285 no tienen diligenciado el valor inicial "]
[null,null,null,"Filtre en la SECCIÓN 19 Fecha de suscripción las fechas con años anteriores a 2022 para identificar las ADICIONES y verifique que se haya incluido el valor cero (0) en esta columna.\n",null,"Los números de contrato 266 y 285 se omiten en atención a que no fuerón utilizados,\ny el 135 no es un contrato por valor 0 "]
["C",15,"Número de adiciones","Verifique que el número de adicciones se haya diligenciado tanto para los contratos como para los contratos de otras vigencias pasadas que tengan adiciones en 2022.","verificar la información de los contratos 55 y 56 ","ok"]
["C",16,"Valor total de adiciones ","En los contratos celebrados y adicionados en el 2022, verifique se haya diligenciado la información tanto del Valor inicial de la SECCIÓN 13 Valor inicial del contrato como de la SECCIÓN 16 Valor total\nadiciones.","verificar la información de los contratos 55 y 56 ya que aparece una fecha ","ok"]
["C",17,"Valor Final ","Verifique que automáticamente se calcule el valor final del contrato para los contratos suscritos en 2022 y que la columna se encuentra formulada.","Verificar con BOGDATA "]
[null,null,null,"Verifique que para los contratos los contratos en donde se incluyeron filas adicionales para incluir información, solo aparezca la información del valor final en la primera fila."]
[null,null,null,"La sumatoria del valor final para los contratos de Inversión y de funcionamiento, deberán coincidir con el valor del rubro registrado en los ENCABEZADOS 4.Presupuesto Comprometido de Inversión Directa según BOGDATA y con el 6. Presupuesto Comprometido funcionamiento según BOGDATA, respectivamente. A la vez, estos valores deben coincidir con los informes de ejecución presupuestal del BOGDATA. Si los valores no coinciden debe especificarse al final del formato en qué está representada la diferencia Otros gastos (discriminando los conceptos por Programa y Proyecto de inversión, si es el caso), con sus respectivos valores. "]
["C",18,"Giros (Valor en pesos)","La información que se registre en esta base de datos debe coincidir con los reportes en BOGDATA y adicionalmente con SECOP. Es así que la sumatoria del valor final de los contratos y adiciones, por eje/pilar/propósito, programa y proyecto registrada por la Entidad, debe coincidir con la ejecución presupuestal de la Entidad, reporte de BOGDATA con corte a 31 de diciembre de 2022, es decir, se debe verificar su coincidencia por rubro con el total del compromiso acumulado; igualmente respecto al valor acumulado de los giros.","Verificar con BOGDATA "]
["D",19,"Fecha de suscripción (DD/MM/AAAA)","Verifique que la fecha de suscripción se encuentre consignada para todos los contratos y\nadiciones. y el formato de la fecha sea (DD/MM/AAAA)","Los contratos 207 266 285 Resolución 03 Resolución 08 Resolución 08 Resolución 173 Resolución 70 no tienen diligenciado fecha de suscripción ","Estos tres números de contrato 207,266,285 se omiten en atención a que no fuerón utilizados "]
["D",20,"Fecha de inicio (DD/MM/AAAA)","Verifique que la fecha de suscripción se encuentre consignada para todos los contratos y el formato de la fecha sea (DD/MM/AAAA)","Los contratos 207 216 255 257 259 260 261 264 266 267 268 271 272 273 274 275 276 277 278 279 280 281 283 284 285 286 287 CIA 002 CIA 004  Resolución 03 Resolución 08 Resolución 08 Resolución 173 Resolución 70, no tiene diligenciado la fecha de inicio ","Estos tres números de contrato 207,266,285 se omiten en atención a que no fuerón utilizados "]
["D",21,"Fecha de terminación (DD/MM/AAAA)","Verifique que la fecha de suscripción se encuentre consignada para todos los contratos y el formato de la fecha sea (DD/MM/AAAA)","Los contratos 207 266 285 CIA 001  CIA 002 CIA 003 CIA 004  Resolución 03 Resolución 08 Resolución 08 Resolución 173 Resolución 70, no tienen diligenciado la fecha de terminación","Estos tres números de contrato 207,266,285 se omiten en atención a que no fuerón utilizados "]
["D",22,"Plazo en días","Verifique que no haya celdas en blanco, excepto para la fila de OTROS GASTOS.","Verificar la información de los contratos 207 264 266 285 CIA 001  CIA 002 CIA 004","Estos tres números de contrato 207,266,285 se omiten en atención a que no fuerón utilizados "]
["E",26,"Nombre cesionario","Verifique el nombre de la persona natural o jurídica del cesionario. Si hay más de una cesión no incluya más filas y relacione la información del último cesionario.","Los contratos 11, 90 y 193 deben tener el nombre del cesionario en mayuscula sostenida ","ok"]
["F",29,"Estado ","Verifique que solo se hayan seleccionado las opciones de la lista desplegable.","Verificar la información de la celda 305 ","ok"]
["G ",30,"% Avance y/o Cumplimiento","Verifique la relación entre el valor de los giros y el valor final del contrato, este porcentaje no debe ser superior al 100%. Si el porcentaje de avance no coincide, se debe hacer la observación para se  revisen los valores que se registraron en las secciones de INFORMACIÓN FINANCIERA del contrato.","El porcentaje no debe ser superior al 100%, verificar la información de los contratos 42 121 131 135 266 285","ok"]

{"sheet":"Proposito_programa","index":6,"n_rows":59,"n_cols":5,"rows_kept":59,"cut":false,"hidden":false,"merged":[]}
[]
[null,"PDD","No. Programa","Programa","Propósito"]
["Acuerdo 761 2020","Un Nuevo Contrato Social y Ambiental para la Bogotá del Siglo XXI",1,"Subsidios y transferencias para la equidad","Propósito 1: Hacer un nuevo contrato social para incrementar la inclusión social, productiva y política"]
["Pag. 51","Un Nuevo Contrato Social y Ambiental para la Bogotá del Siglo XXI",{"$f":"+C3+1","v":2},"Igualdad de oportunidades y desarrollo de capacidades para las mujeres","Propósito 1: Hacer un nuevo contrato social para incrementar la inclusión social, productiva y política"]
[null,"Un Nuevo Contrato Social y Ambiental para la Bogotá del Siglo XXI",{"$f":"+C4+1","v":3},"Movilidad social integral","Propósito 1: Hacer un nuevo contrato social para incrementar la inclusión social, productiva y política"]
[null,"Un Nuevo Contrato Social y Ambiental para la Bogotá del Siglo XXI",4,"Prevención de la exclusión por razones étnicas, religiosas, sociales, políticas y de orientación sexual","Propósito 1: Hacer un nuevo contrato social para incrementar la inclusión social, productiva y política"]
[null,"Un Nuevo Contrato Social y Ambiental para la Bogotá del Siglo XXI",5,"Promoción de la igualdad, el desarrollo de capacidades y el reconocimiento de las mujeres","Propósito 1: Hacer un nuevo contrato social para incrementar la inclusión social, productiva y política"]
[null,"Un Nuevo Contrato Social y Ambiental para la Bogotá del Siglo XXI",6,"Sistema Distrital de Cuidado","Propósito 1: Hacer un nuevo contrato social para incrementar la inclusión social, productiva y política"]
[null,"Un Nuevo Contrato Social y Ambiental para la Bogotá del Siglo XXI",7,"Mejora de la gestión de instituciones de salud","Propósito 1: Hacer un nuevo contrato social para incrementar la inclusión social, productiva y política"]
[null,"Un Nuevo Contrato Social y Ambiental para la Bogotá del Siglo XXI",8,"Prevención y atención de maternidad temprana","Propósito 1: Hacer un nuevo contrato social para incrementar la inclusión social, productiva y política"]
[null,"Un Nuevo Contrato Social y Ambiental para la Bogotá del Siglo XXI",9,"Prevención y cambios para mejorar la salud de la población","Propósito 1: Hacer un nuevo contrato social para incrementar la inclusión social, productiva y política"]
[null,"Un Nuevo Contrato Social y Ambiental para la Bogotá del Siglo XXI",10,"Salud para la vida y el bienestar","Propósito 1: Hacer un nuevo contrato social para incrementar la inclusión social, productiva y política"]
[null,"Un Nuevo Contrato Social y Ambiental para la Bogotá del Siglo XXI",11,"Salud y bienestar para niñas y niños","Propósito 1: Hacer un nuevo contrato social para incrementar la inclusión social, productiva y política"]
[null,"Un Nuevo Contrato Social y Ambiental para la Bogotá del Siglo XXI",12,"Educación inicial: Bases sólidas para la vida.","Propósito 1: Hacer un nuevo contrato social para incrementar la inclusión social, productiva y política"]
[null,"Un Nuevo Contrato Social y Ambiental para la Bogotá del Siglo XXI",13,"Educación para todos y todas: acceso y permanencia con equidad y énfasis en educación rural","Propósito 1: Hacer un nuevo contrato social para incrementar la inclusión social, productiva y política"]
[null,"Un Nuevo Contrato Social y Ambiental para la Bogotá del Siglo XXI",14,"Formación integral: más y mejor tiempo en los colegios","Propósito 1: Hacer un nuevo contrato social para incrementar la inclusión social, productiva y política"]
[null,"Un Nuevo Contrato Social y Ambiental para la Bogotá del Siglo XXI",15,"Plan Distrital de Lectura, Escritura y Oralidad: \"Leer para la vida\"","Propósito 1: Hacer un nuevo contrato social para incrementar la inclusión social, productiva y política"]
[null,"Un Nuevo Contrato Social y Ambiental para la Bogotá del Siglo XXI",16,"Transformación pedagógica y mejoramiento de la gestión educativa. Es con los maestros y maestras.","Propósito 1: Hacer un nuevo contrato social para incrementar la inclusión social, productiva y política"]
[null,"Un Nuevo Contrato Social y Ambiental para la Bogotá del Siglo XXI",17,"Jóvenes con capacidades: Proyecto de vida para la ciudadanía, la innovación y el trabajo del siglo XXI","Propósito 1: Hacer un nuevo contrato social para incrementar la inclusión social, productiva y política"]
[null,"Un Nuevo Contrato Social y Ambiental para la Bogotá del Siglo XXI",18,"Cierre de brechas para la inclusión productiva urbano rural","Propósito 1: Hacer un nuevo contrato social para incrementar la inclusión social, productiva y política"]
[null,"Un Nuevo Contrato Social y Ambiental para la Bogotá del Siglo XXI",19,"Vivienda y entornos dignos en el territorio urbano y rural","Propósito 1: Hacer un nuevo contrato social para incrementar la inclusión social, productiva y política"]
[null,"Un Nuevo Contrato Social y Ambiental para la Bogotá del Siglo XXI",20,"Bogotá, referente en cultura, deporte, recreación y actividad física, con parques para el desarrollo y la salud","Propósito 1: Hacer un nuevo contrato social para incrementar la inclusión social, productiva y política"]
[null,"Un Nuevo Contrato Social y Ambiental para la Bogotá del Siglo XXI",21,"Creación y vida cotidiana: Apropiación ciudadana del arte, la cultura y el patrimonio, para la democracia cultural","Propósito 1: Hacer un nuevo contrato social para incrementar la inclusión social, productiva y política"]
[null,"Un Nuevo Contrato Social y Ambiental para la Bogotá del Siglo XXI",22,"Transformación cultural para la conciencia ambiental y el cuidado de la fauna doméstica","Propósito 1: Hacer un nuevo contrato social para incrementar la inclusión social, productiva y política"]
[null,"Un Nuevo Contrato Social y Ambiental para la Bogotá del Siglo XXI",23,"Bogotá rural","Propósito 1: Hacer un nuevo contrato social para incrementar la inclusión social, productiva y política"]
[null,"Un Nuevo Contrato Social y Ambiental para la Bogotá del Siglo XXI",24,"Bogotá región emprendedora e innovadora","Propósito 1: Hacer un nuevo contrato social para incrementar la inclusión social, productiva y política"]
[null,"Un Nuevo Contrato Social y Ambiental para la Bogotá del Siglo XXI",25,"Bogotá región productiva y competitiva","Propósito 1: Hacer un nuevo contrato social para incrementar la inclusión social, productiva y política"]
[null,"Un Nuevo Contrato Social y Ambiental para la Bogotá del Siglo XXI",26,"Bogotá - región, el mejor destino para visitar","Propósito 1: Hacer un nuevo contrato social para incrementar la inclusión social, productiva y política"]
[null,"Un Nuevo Contrato Social y Ambiental para la Bogotá del Siglo XXI",27,"Cambio cultural para la gestión de la crisis climática","Propósito 2 : Cambiar Nuestros Hábitos de Vida para Reverdecer a Bogotá y Adaptarnos y Mitigar la Crisis Climática"]
[null,"Un Nuevo Contrato Social y Ambiental para la Bogotá del Siglo XXI",{"$f":"+C29+1","v":28},"Bogotá protectora de sus recursos naturales","Propósito 2 : Cambiar Nuestros Hábitos de Vida para Reverdecer a Bogotá y Adaptarnos y Mitigar la Crisis Climática"]
[null,"Un Nuevo Contrato Social y Ambiental para la Bogotá del Siglo XXI",{"$f":"+C30+1","v":29},"Asentamientos y entornos protectores","Propósito 2 : Cambiar Nuestros Hábitos de Vida para Reverdecer a Bogotá y Adaptarnos y Mitigar la Crisis Climática"]
[null,"Un Nuevo Contrato Social y Ambiental para la Bogotá del Siglo XXI",30,"Eficiencia en la atención de emergencias","Propósito 2 : Cambiar Nuestros Hábitos de Vida para Reverdecer a Bogotá y Adaptarnos y Mitigar la Crisis Climática"]
[null,"Un Nuevo Contrato Social y Ambiental para la Bogotá del Siglo XXI",31," Protección y valoración del patrimonio tangible e intangible en Bogotá y la región","Propósito 2 : Cambiar Nuestros Hábitos de Vida para Reverdecer a Bogotá y Adaptarnos y Mitigar la Crisis Climática"]
[null,"Un Nuevo Contrato Social y Ambiental para la Bogotá del Siglo XXI",32,"Revitalización urbana para la competitividad","Propósito 2 : Cambiar Nuestros Hábitos de Vida para Reverdecer a Bogotá y Adaptarnos y Mitigar la Crisis Climática"]
[null,"Un Nuevo Contrato Social y Ambiental para la Bogotá del Siglo XXI",33,"Más árboles y más y mejor espacio público","Propósito 2 : Cambiar Nuestros Hábitos de Vida para Reverdecer a Bogotá y Adaptarnos y Mitigar la Crisis Climática"]
[null,"Un Nuevo Contrato Social y Ambiental para la Bogotá del Siglo XXI",34,"Bogotá protectora de los animales","Propósito 2 : Cambiar Nuestros Hábitos de Vida para Reverdecer a Bogotá y Adaptarnos y Mitigar la Crisis Climática"]
[null,"Un Nuevo Contrato Social y Ambiental para la Bogotá del Siglo XXI",35,"Manejo y prevención de contaminación","Propósito 2 : Cambiar Nuestros Hábitos de Vida para Reverdecer a Bogotá y Adaptarnos y Mitigar la Crisis Climática"]
[null,"Un Nuevo Contrato Social y Ambiental para la Bogotá del Siglo XXI",36,"Manejo y saneamiento de los cuerpos de agua","Propósito 2 : Cambiar Nuestros Hábitos de Vida para Reverdecer a Bogotá y Adaptarnos y Mitigar la Crisis Climática"]
[null,"Un Nuevo Contrato Social y Ambiental para la Bogotá del Siglo XXI",37,"Provisión y mejoramiento de servicios públicos","Propósito 2 : Cambiar Nuestros Hábitos de Vida para Reverdecer a Bogotá y Adaptarnos y Mitigar la Crisis Climática"]
[null,"Un Nuevo Contrato Social y Ambiental para la Bogotá del Siglo XXI",38,"Ecoeficiencia, reciclaje, manejo de residuos e inclusión de la población recicladora","Propósito 2 : Cambiar Nuestros Hábitos de Vida para Reverdecer a Bogotá y Adaptarnos y Mitigar la Crisis Climática"]
[null,"Un Nuevo Contrato Social y Ambiental para la Bogotá del Siglo XXI",39,"Bogotá territorio de paz y atención integral a las víctimas del conflicto armado","Propósito 3: Inspirar confianza y legitimidad para vivir sin miedo y ser epicentro de cultura ciudadana, paz y reconciliación"]
[null,"Un Nuevo Contrato Social y Ambiental para la Bogotá del Siglo XXI",{"$f":"+C41+1","v":40},"Más mujeres viven una vida libre de violencias, se sienten seguras y acceden con confianza al sistema de justicia","Propósito 3: Inspirar confianza y legitimidad para vivir sin miedo y ser epicentro de cultura ciudadana, paz y reconciliación"]
[null,"Un Nuevo Contrato Social y Ambiental para la Bogotá del Siglo XXI",{"$f":"+C42+1","v":41},"Sin machismo ni violencias contra las mujeres, las niñas y los niños","Propósito 3: Inspirar confianza y legitimidad para vivir sin miedo y ser epicentro de cultura ciudadana, paz y reconciliación"]
[null,"Un Nuevo Contrato Social y Ambiental para la Bogotá del Siglo XXI",42,"Conciencia y cultura ciudadana para la seguridad, la convivencia y la construcción de confianza","Propósito 3: Inspirar confianza y legitimidad para vivir sin miedo y ser epicentro de cultura ciudadana, paz y reconciliación"]
[null,"Un Nuevo Contrato Social y Ambiental para la Bogotá del Siglo XXI",43,"Cultura ciudadana para la confianza, la convivencia y la participación desde la vida cotidiana","Propósito 3: Inspirar confianza y legitimidad para vivir sin miedo y ser epicentro de cultura ciudadana, paz y reconciliación"]
[null,"Un Nuevo Contrato Social y Ambiental para la Bogotá del Siglo XXI",44,"Autoconciencia, respeto y cuidado en el espacio público","Propósito 3: Inspirar confianza y legitimidad para vivir sin miedo y ser epicentro de cultura ciudadana, paz y reconciliación"]
[null,"Un Nuevo Contrato Social y Ambiental para la Bogotá del Siglo XXI",45,"Espacio público más seguro y construido colectivamente","Propósito 3: Inspirar confianza y legitimidad para vivir sin miedo y ser epicentro de cultura ciudadana, paz y reconciliación"]
[null,"Un Nuevo Contrato Social y Ambiental para la Bogotá del Siglo XXI",46,"Atención a jóvenes y adultos infractores con impacto en su proyecto de vida","Propósito 3: Inspirar confianza y legitimidad para vivir sin miedo y ser epicentro de cultura ciudadana, paz y reconciliación"]
[null,"Un Nuevo Contrato Social y Ambiental para la Bogotá del Siglo XXI",47,"Calidad de Vida y Derechos de la Población privada de la libertad","Propósito 3: Inspirar confianza y legitimidad para vivir sin miedo y ser epicentro de cultura ciudadana, paz y reconciliación"]
[null,"Un Nuevo Contrato Social y Ambiental para la Bogotá del Siglo XXI",48,"Plataforma institucional para la seguridad y justicia","Propósito 3: Inspirar confianza y legitimidad para vivir sin miedo y ser epicentro de cultura ciudadana, paz y reconciliación"]
[null,"Un Nuevo Contrato Social y Ambiental para la Bogotá del Siglo XXI",49,"Movilidad segura, sostenible y accesible","Propósito 4: Hacer de Bogotá Región un modelo de movilidad multimodal, incluyente y sostenible"]
[null,"Un Nuevo Contrato Social y Ambiental para la Bogotá del Siglo XXI",{"$f":"+C51+1","v":50},"Red de metros","Propósito 4: Hacer de Bogotá Región un modelo de movilidad multimodal, incluyente y sostenible"]
[null,"Un Nuevo Contrato Social y Ambiental para la Bogotá del Siglo XXI",51,"Gobierno Abierto","Propósito 5: Construir Bogotá - Región con gobierno abierto, transparente y ciudadanía consciente"]
[null,"Un Nuevo Contrato Social y Ambiental para la Bogotá del Siglo XXI",{"$f":"+C53+1","v":52},"Integración regional, distrital y local","Propósito 5: Construir Bogotá - Región con gobierno abierto, transparente y ciudadanía consciente"]
[null,"Un Nuevo Contrato Social y Ambiental para la Bogotá del Siglo XXI",{"$f":"+C54+1","v":53},"Información para la toma de decisiones","Propósito 5: Construir Bogotá - Región con gobierno abierto, transparente y ciudadanía consciente"]
[null,"Un Nuevo Contrato Social y Ambiental para la Bogotá del Siglo XXI",54,"Transformación digital y gestión de TIC para un territorio inteligente","Propósito 5: Construir Bogotá - Región con gobierno abierto, transparente y ciudadanía consciente"]
[null,"Un Nuevo Contrato Social y Ambiental para la Bogotá del Siglo XXI",55,"Fortalecimiento de cultura ciudadana y su institucionalidad","Propósito 5: Construir Bogotá - Región con gobierno abierto, transparente y ciudadanía consciente"]
[null,"Un Nuevo Contrato Social y Ambiental para la Bogotá del Siglo XXI",56,"Gestión pública efectiva","Propósito 5: Construir Bogotá - Región con gobierno abierto, transparente y ciudadanía consciente"]
[null,"Un Nuevo Contrato Social y Ambiental para la Bogotá del Siglo XXI",57,"Gestión pública local","Propósito 5: Construir Bogotá - Región con gobierno abierto, transparente y ciudadanía consciente"]

{"sheet":"Tipo","index":7,"n_rows":67,"n_cols":5,"rows_kept":67,"cut":false,"hidden":true,"merged":[]}
[null,null,"Modalidad de Selección","afectacion","Naturaleza Jurídica"]
[1,null,"Concurso de méritos","Funcionamiento","Persona Natural"]
[2,null,"Contratación directa","Inversión","Persona Jurídica"]
[3,null,"Contratación mínima cuantia","Operación","Unión Temporal"]
[4,null,"Selección abreviada",null,"Consorcio"]
[5,null,"Licitación pública",null,"Sociedad con objeto único"]
[6,null,"Otros",null,"Persona jurídica extranjera"]
[7,null,"Régimen especial",null,"Sin ánimo de lucro"]
[8,null,null,null,"Cabildo indígena"]
[9,null,null,null,"Consejo comunitario de las comunidades negras"]
[10,null,"Selección abreviada",null,"Organizaciones de segundo nivel"]
[11,null,"Subasta inversa ",null,"Formas o expresiones organizativas, afrocolombianas, raizales y palenqueras"]
[12,null,"Bolsas de productos",null,"Organizaciones de base de comunidades negras "]
[13,null,"Acuerdo marco de precios ",null,"Asociaciones de autoridades tradicionales indígenas"]
[14,null,"Selección abreviada por menor cuantía "]
[15]
[16,null,"contratacion directa"]
[17,null,"Urgencia manifiesta"]
[18,null,"Contratación de empréstitos"]
[19,null,"Contratos interadministrativos"]
[20,null,"Contratación de bienes y servicios en el sector Defensa "]
[null,"SECTOR","Contratos para el desarrollo de actividades científicas y tecnológicas"]
[1,"Gestión Pública","Contratos de encargo fiduciario que celebren las entidades territoriales cuando inician el Acuerdo de Reestructuración de Pasivos"]
[{"$f":"+A23+1","v":2},"Gobierno","Cuando no exista pluralidad de oferentes en el mercado"]
[{"$f":"+A24+1","v":3},"Hacienda","Prestación de servicios profesionales y de apoyo a la gestión, o para la ejecución de trabajos artísticos que sólo puedan encomendarse a determinadas personas naturales"]
[4,"Planeación","El arrendamiento o adquisición de inmuebles"]
[5,"Desarrollo Económico, Industria y Turismo","Contratación de bienes y servicios de la Dirección Nacional de Inteligencia (DNI)"]
[6,"Educación"]
[7,"Salud"]
[8,"Integración Social","Decreto 92 de 2017"]
[9,"Cultura, Recreación y Deporte","No aplica"]
[10,"Ambiente"]
[11,"Movilidad","SECOP I"]
[12,"Hábitat","SECOP II"]
[13,"Mujeres"]
[14,"Seguridad, Convivencia y Justicia","Bogotá Mejor para Todos"]
[15,"Gestión Juridíca","Un Nuevo Contrato Social y Ambiental para la Bogotá del Siglo XXI"]
[16,"descentralizado territorialmente"]
[]
[null,"16 - AL","Estado"]
[null,null,"Celebrado o por iniciar"]
[null,"Plan de desarrollo distrital","En ejecución"]
[null,"Un nuevo contrato social y ambiental para la Bogotá del Siglo XXI","Terminado"]
[null,null,"Liquidado"]
[]
[null,"Tipo"]
[null,"Obra pública"]
[null,"Consultoría"]
[null,"Interventoría"]
[null,"Contratos de prestación de servicios"]
[null,"Contratos de prestación de servicios profesionales y de apoyo a la gestión"]
[null,"Compraventa de bienes muebles"]
[null,"Compraventa de bienes inmuebles"]
[null,"Arrendamiento de bienes muebles"]
[null,"Arrendamiento de bienes inmuebles"]
[null,"Seguro"]
[null,"Suministro"]
[null,"Empréstitos"]
[null,"Fiducia mercantil o encargo fiduciario"]
[null,"Concesión "]
[null,"Convenios de cooperacion"]
[null,"Convenios/Contratos interadministrativos"]
[null,"Convenios de apoyo o convenios de asociación "]
[null,"Convenios solidarios"]
[null,"Asociaciones Público Privadas"]
[null,"Otros"]
[null,"Otros gastos"]