{"text_format":"1","workbook":"xlsx","n_sheets":3,"sheets":["1. INFORMACION ACUMULADA","Proposito_programa","Tipo"],"not_rendered":{"charts":0,"images":1,"macros":1,"external_links":0,"defined_names":14,"comments":0,"pivot_tables":0},"unopened":[],"bounds":{"document_bytes":16777216,"sheet_cells":100000,"rows_first":2000,"rows_last":500,"rows_between":2000,"halvings":0,"cell_chars":16384,"cell_head_chars":4096},"cells_cut":0,"cells_raw":0,"read":"whole","date_system":"1900"}

{"sheet":"1. INFORMACION ACUMULADA","index":0,"n_rows":517,"n_cols":44,"rows_kept":517,"cut":false,"hidden":false,"merged":[[6,36,6,43],[7,36,7,43],[8,36,8,43],[9,36,9,43],[1,0,1,42],[2,0,2,42],[4,0,4,3],[4,8,4,10],[5,0,5,3],[5,8,5,10],[5,34,5,35],[5,36,5,43],[6,0,6,3],[6,8,6,10],[6,34,6,35],[7,34,7,35],[11,2,11,3],[11,8,11,12],[11,15,11,20],[10,0,10,20],[8,34,8,35],[9,34,9,35],[10,28,10,33],[10,21,10,27],[10,34,10,41]]}
[]
["VEEDURIA DISTRITAL - INFORMACIÓN GESTION CONTRACTUAL"]
["DEL 1 DE ENERO AL 31 DE DICIEMBRE DE 2022"]
[]
["1. Entidad",null,null,null,null,null,null,"2. Sector"]
["3. Presupuesto Disponible Inversión Directa PREDIS (BOGDATA)",null,null,null,null,null,null,"5. Presupuesto Disponible Funcionamiento PREDIS (BOGDATA)",null,null,null,null,null,null,null,null,null,null,null,null,null,null,null,null,null,null,null,null,null,null,null,null,null,null,"7. Nombre de quien diligencia el formato"]
["4. Presupuesto Comprometido de Inversión Directa según PREDIS (BOGDATA)",null,null,null,null,null,null,"6. Presupuesto Comprometido Funcionamiento según PREDIS (BOGDATA)",null,null,null,null,null,null,null,null,null,null,null,null,null,null,null,null,null,null,null,null,null,null,null,null,null,null,"Cargo"]
[null,null,null,null,null,null,null,null,null,null,null,null,null,null,null,null,null,null,null,null,null,null,null,null,null,null,null,null,null,null,null,null,null,null,"Dependencia"]
[null,null,null,null,null,null,null,null,null,null,null,null,null,null,null,null,null,null,null,null,null,null,null,null,null,null,null,null,null,null,null,null,null,null,"Teléfono"]
[null,null,null,null,null,null,null,null,null,null,null,null,null,null,null,null,null,null,null,null,null,null,null,null,null,null,null,null,null,null,null,null,null,null,"Correo Electrónico"]
["1- INFORMACION GENERAL",null,null,null,null,null,null,null,null,null,null,null,null,null,null,null,null,null,null,null,null,"2- INFORMACION FINANCIERA",null,null,null,null,null,null,"3 - PLAZOS ",null,null,null,null,null,"4. CESION",null,null,null,null,null,null,null,"5. ESTADO","6. %  Avance y/o cumplimiento"]
[1,2,3,null,4,5,6,7,8,null,null,null,null,9,10,null,null,null,null,null,null,12,13,14,15,16,17,18,19,20,21,22,23,24,25,26,27,28,29,30,31,32,33,34]
["Número Contrato","Año","Número de proceso contractual \nSECOP","Link proceso SECOP","Tipo de contrato ","Modalidad de Selección","Procedimiento o causal","Objeto","Afectación","Plan de Desarrollo Distrital","Número Programa","Equivalencia número de programa","Propósito","Número Proyecto","Número de proponentes","Número  de Identificación del contratista\n(Cédula o NIT sin puntos, comas ni caracteres especiales y sin digito de verificación)","Nombre del contratista\n  (según el caso: nombres y apellidos o Razón social y Tipo societario)","Naturaleza Jurídica","Número  de Identificación del integrante del Consorcio o U.T.\n(Cédula o NIT sin puntos, comas ni caracteres especiales y sin digito de verificación)","Nombre del Integrante del Consorcio o U.T. y Tipo societario\n (Según el caso: nombres y apellidos o razón social y tipo societario)","% Participación (indicar solo el numero del porcentaje, sin caracteres especiales)","Vigencias futuras","Valor Inicial del contrato","Valor total reducciones \n(En valor negativo)","Número de adiciones","Valor total de adiciones ","Valor Final ","Giros (Valor en pesos)","Fecha de suscripción (DD/MM/AAAA)","Fecha de inicio (DD/MM/AAAA)","Fecha de terminación (DD/MM/AAAA)","Plazo en días","Número de prórrogas","Prorroga en días","Número  de Identificación del cesionario\n(NIT sin digito de verificación)","Nombre cesionario 1","Fecha cesión\n(DD/MM/AAAA)","Valor cesión","Número  de Identificación del cesionario\n(NIT sin digito de verificación)","Nombre cesionario 2","Fecha cesión\n(DD/MM/AAAA)","Valor cesión","Estado","% Avance y/o Cumplimiento"]
[1,2022,"FDLF-CD-001-2022\t","https://community.secop.gov.co/Public/Tendering/OpportunityDetail/Index?noticeUID=CO1.NTC.2647248&isFromPublicArea=True&isModal=False","Contratos de prestación de servicios profesionales y de apoyo a la gestión","Contratación directa","Prestación de servicios profesionales y de apoyo a la gestión, o para la ejecución de trabajos artísticos que sólo puedan encomendarse a determinadas personas naturales","PRESTAR SERVICIOS PROFESIONALES ESPECIALIZADOS PARA APOYAR LA FORMULACIÓN, SEGUIMIENTO Y SUPERVISIÓN DE LOS PROCESOS DE INVERSIÓN ORIENTADOS A LOS TEMAS DE EDUCACIÓN\t","Inversión","Un nuevo contrato social y ambiental para la Bogotá del Siglo XXI",null,{"$f":"IF(ISERROR(VLOOKUP(K14,#REF!,2,FALSE)),\" \",VLOOKUP(K14,#REF!,2,FALSE))","v":" "},{"$f":"IF(ISERROR(VLOOKUP(K14,#REF!,3,FALSE)),\" \",VLOOKUP(K14,#REF!,3,FALSE))","v":" "},null,1,"103xxx52","BRANDON RENE BARRIENTOS MARTINEZ","Persona Natural",null,null,null,"N/A",77583000,0,null,null,{"$f":"+W14+X14+Z14","v":77583000},71940600,"2022-01-24","2022-01-25","2022-12-24","11 MESES",null,null,null,null,null,null,null,null,null,null,"Terminado",{"$f":"IF(ISERROR(AB14/AA14),\"-\",(AB14/AA14))","v":0.92727272727272725}]
[2,2022,"FDLF-CD-002-2022\t","https://community.secop.gov.co/Public/Tendering/OpportunityDetail/Index?noticeUID=CO1.NTC.2589858&isFromPublicArea=True&isModal=False","Contratos de prestación de servicios profesionales y de apoyo a la gestión","Contratación directa","Prestación de servicios profesionales y de apoyo a la gestión, o para la ejecución de trabajos artísticos que sólo puedan encomendarse a determinadas personas naturales","Prestar los servicios técnicos para apoyar los procesos de gestión administrativa y contractual al Fondo de Desarrollo Local de Fontibón\t","Inversión",null,null,{"$f":"IF(ISERROR(VLOOKUP(K15,#REF!,2,FALSE)),\" \",VLOOKUP(K15,#REF!,2,FALSE))","v":" "},{"$f":"IF(ISERROR(VLOOKUP(K15,#REF!,3,FALSE)),\" \",VLOOKUP(K15,#REF!,3,FALSE))","v":" "},null,1,"101xxx71","JUAN DAVID MONTOYA RAMIREZ","Persona Natural",null,null,null,"N/A",27398000,0,null,null,27398000,27398000,"2022-01-18","2022-01-20","2022-08-19","7 MESES",null,null,null,null,null,null,null,null,null,null,"Terminado",1]
[3,2022,"FDLF-CD-003-2022\t","https://community.secop.gov.co/Public/Tendering/OpportunityDetail/Index?noticeUID=CO1.NTC.2588362&isFromPublicArea=True&isModal=False","Contratos de prestación de servicios profesionales y de apoyo a la gestión","Contratación directa","Prestación de servicios profesionales y de apoyo a la gestión, o para la ejecución de trabajos artísticos que sólo puedan encomendarse a determinadas personas naturales","Prestar servicios profesionales para apoyar jurídicamente los diferentes procesos que requiera adelantar la Alcaldía Local de Fontibón desde las etapas precontractual y contractual, de acuerdo con el plan de adquisiciones y al plan de contratación.\t","Inversión",null,null,{"$f":"IF(ISERROR(VLOOKUP(K16,#REF!,2,FALSE)),\" \",VLOOKUP(K16,#REF!,2,FALSE))","v":" "},{"$f":"IF(ISERROR(VLOOKUP(K16,#REF!,3,FALSE)),\" \",VLOOKUP(K16,#REF!,3,FALSE))","v":" "},null,1,"111xxx55","YULIS PAOLA BRITO GUERRA","Persona Natural",null,null,null,"N/A",74800000,0,null,null,74800000,63693333,"2022-01-18","2022-01-20","2022-12-19","11 MESES",null,null,null,null,null,null,null,null,null,null,"Terminado",0.85151514705882358]
[4,2022,"FDLF-CD-004-2022\t","https://community.secop.gov.co/Public/Tendering/OpportunityDetail/Index?noticeUID=CO1.NTC.2741745&isFromPublicArea=True&isModal=False","Contratos de prestación de servicios profesionales y de apoyo a la gestión","Contratación directa","Prestación de servicios profesionales y de apoyo a la gestión, o para la ejecución de trabajos artísticos que sólo puedan encomendarse a determinadas personas naturales","PRESTAR SERVICIOS DE APOYO OPERATIVO A LA ALCALDÍA LOCAL DE FONTIBÓN EN EL MARCO DEL PROYECTO DE INVERSIÒN No 1766\t","Inversión",null,null,{"$f":"IF(ISERROR(VLOOKUP(K17,#REF!,2,FALSE)),\" \",VLOOKUP(K17,#REF!,2,FALSE))","v":" "},{"$f":"IF(ISERROR(VLOOKUP(K17,#REF!,3,FALSE)),\" \",VLOOKUP(K17,#REF!,3,FALSE))","v":" "},null,1,"397xxx23","ADRIANA ANGELICA TOVAR ECHEVERRY","Persona Natural",null,null,null,"N/A",17500000,0,1,8750000,26250000,25000000,"2022-01-28","2022-02-01","2022-12-15","7 MESES",1,105,null,null,null,null,null,null,null,null,"Terminado",0.95238095238095233]
[5,2022,"FDLF-CD-005-2022\t","https://community.secop.gov.co/Public/Tendering/OpportunityDetail/Index?noticeUID=CO1.NTC.2602949&isFromPublicArea=True&isModal=False","Contratos de prestación de servicios profesionales y de apoyo a la gestión","Contratación directa","Prestación de servicios profesionales y de apoyo a la gestión, o para la ejecución de trabajos artísticos que sólo puedan encomendarse a determinadas personas naturales","PRESTAR SERVICIOS PROFESIONALES PARA APOYAR LA GESTIÓN DE PROCESOS, PROCEDIMIENTOS Y TRÁMITES DE CARÁCTER PRESUPUESTAL\t","Inversión",null,null,{"$f":"IF(ISERROR(VLOOKUP(K18,#REF!,2,FALSE)),\" \",VLOOKUP(K18,#REF!,2,FALSE))","v":" "},{"$f":"IF(ISERROR(VLOOKUP(K18,#REF!,3,FALSE)),\" \",VLOOKUP(K18,#REF!,3,FALSE))","v":" "},null,1,"114xxx32","OSCAR GIOVANNY CONTRERAS NOVOA","Persona Natural",null,null,null,"N/A",37100000,0,1,18550000,55650000,54766667,"2022-01-19","2022-01-21","2022-12-05","7 MESES",1,105,null,null,null,null,null,null,null,null,"Terminado",0.98412699011680149]
[6,2022,"FDLF-CD-006-2022\t","https://community.secop.gov.co/Public/Tendering/OpportunityDetail/Index?noticeUID=CO1.NTC.2593512&isFromPublicArea=True&isModal=False","Contratos de prestación de servicios profesionales y de apoyo a la gestión","Contratación directa","Prestación de servicios profesionales y de apoyo a la gestión, o para la ejecución de trabajos artísticos que sólo puedan encomendarse a determinadas personas naturales","PRESTAR SERVICIOS PROFESIONALES PARA APOYAR LAS ACTIVIDADES DE RE-ACTIVACIÓN ECONÓMICA DESARROLLADAS POR LA ALCALDÍA LOCAL DE FONTIBÓN.\t","Inversión",null,null,{"$f":"IF(ISERROR(VLOOKUP(K19,#REF!,2,FALSE)),\" \",VLOOKUP(K19,#REF!,2,FALSE))","v":" "},{"$f":"IF(ISERROR(VLOOKUP(K19,#REF!,3,FALSE)),\" \",VLOOKUP(K19,#REF!,3,FALSE))","v":" "},null,1,"106xxx58","KAREN JULIETH AYALA CARDENAS","Persona Natural",null,null,null,"N/A",55000000,0,null,null,55000000,50166667,"2022-01-18","2022-01-24","2022-12-29","11 MESES",null,null,null,null,null,null,null,null,null,null,"Terminado",0.91212121818181813]
[7,2022,"FDLF-CD-007-2022","https://community.secop.gov.co/Public/Tendering/OpportunityDetail/Index?noticeUID=CO1.NTC.2588726&isFromPublicArea=True&isModal=False","Contratos de prestación de servicios profesionales y de apoyo a la gestión","Contratación directa","Prestación de servicios profesionales y de apoyo a la gestión, o para la ejecución de trabajos artísticos que sólo puedan encomendarse a determinadas personas naturales","Prestar servicios profesionales para apoyar jurídicamente los diferentes procesos que requiera adelantar la Alcaldía Local de Fontibón desde las etapas precontractual y contractual, de acuerdo con el plan de adquisiciones y al plan de contratación.\t","Inversión",null,null,{"$f":"IF(ISERROR(VLOOKUP(K20,#REF!,2,FALSE)),\" \",VLOOKUP(K20,#REF!,2,FALSE))","v":" "},{"$f":"IF(ISERROR(VLOOKUP(K20,#REF!,3,FALSE)),\" \",VLOOKUP(K20,#REF!,3,FALSE))","v":" "},null,1,"136xxx14","OTTO GABRIEL FORERO VANEGAS","Persona Natural",null,null,null,"N/A",74800000,0,null,null,74800000,48960000,"2022-01-19","2022-01-19","2022-08-24","11 MESES",null,null,null,null,null,null,null,null,null,null,"Terminado",0.65454545454545454]
{"$rows_left_out":498}
{"sheet":"Proposito_programa","index":1,"n_rows":59,"n_cols":5,"rows_kept":59,"cut":false,"hidden":false,"merged":[]}
[]
[null,"PDD","No. Programa","Programa","Propósito"]
["Acuerdo 761 2020","Un Nuevo Contrato Social y Ambiental para la Bogotá del Siglo XXI",1,"Subsidios y transferencias para la equidad","Propósito 1: Hacer un nuevo contrato social para incrementar la inclusión social, productiva y política"]
["Pag. 51","Un Nuevo Contrato Social y Ambiental para la Bogotá del Siglo XXI",{"$f":"+C3+1","v":2},"Igualdad de oportunidades y desarrollo de capacidades para las mujeres","Propósito 1: Hacer un nuevo contrato social para incrementar la inclusión social, productiva y política"]
[null,"Un Nuevo Contrato Social y Ambiental para la Bogotá del Siglo XXI",{"$f":"+C4+1","v":3},"Movilidad social integral","Propósito 1: Hacer un nuevo contrato social para incrementar la inclusión social, productiva y política"]
[null,"Un Nuevo Contrato Social y Ambiental para la Bogotá del Siglo XXI",4,"Prevención de la exclusión por razones étnicas, religiosas, sociales, políticas y de orientación sexual","Propósito 1: Hacer un nuevo contrato social para incrementar la inclusión social, productiva y política"]
[null,"Un Nuevo Contrato Social y Ambiental para la Bogotá del Siglo XXI",5,"Promoción de la igualdad, el desarrollo de capacidades y el reconocimiento de las mujeres","Propósito 1: Hacer un nuevo contrato social para incrementar la inclusión social, productiva y política"]
[null,"Un Nuevo Contrato Social y Ambiental para la Bogotá del Siglo XXI",6,"Sistema Distrital de Cuidado","Propósito 1: Hacer un nuevo contrato social para incrementar la inclusión social, productiva y política"]
[null,"Un Nuevo Contrato Social y Ambiental para la Bogotá del Siglo XXI",7,"Mejora de la gestión de instituciones de salud","Propósito 1: Hacer un nuevo contrato social para incrementar la inclusión social, productiva y política"]
[null,"Un Nuevo Contrato Social y Ambiental para la Bogotá del Siglo XXI",8,"Prevención y atención de maternidad temprana","Propósito 1: Hacer un nuevo contrato social para incrementar la inclusión social, productiva y política"]
[null,"Un Nuevo Contrato Social y Ambiental para la Bogotá del Siglo XXI",9,"Prevención y cambios para mejorar la salud de la población","Propósito 1: Hacer un nuevo contrato social para incrementar la inclusión social, productiva y política"]
[null,"Un Nuevo Contrato Social y Ambiental para la Bogotá del Siglo XXI",10,"Salud para la vida y el bienestar","Propósito 1: Hacer un nuevo contrato social para incrementar la inclusión social, productiva y política"]
[null,"Un Nuevo Contrato Social y Ambiental para la Bogotá del Siglo XXI",11,"Salud y bienestar para niñas y niños","Propósito 1: Hacer un nuevo contrato social para incrementar la inclusión social, productiva y política"]
[null,"Un Nuevo Contrato Social y Ambiental para la Bogotá del Siglo XXI",12,"Educación inicial: Bases sólidas para la vida.","Propósito 1: Hacer un nuevo contrato social para incrementar la inclusión social, productiva y política"]
[null,"Un Nuevo Contrato Social y Ambiental para la Bogotá del Siglo XXI",13,"Educación para todos y todas: acceso y permanencia con equidad y énfasis en educación rural","Propósito 1: Hacer un nuevo contrato social para incrementar la inclusión social, productiva y política"]
[null,"Un Nuevo Contrato Social y Ambiental para la Bogotá del Siglo XXI",14,"Formación integral: más y mejor tiempo en los colegios","Propósito 1: Hacer un nuevo contrato social para incrementar la inclusión social, productiva y política"]
[null,"Un Nuevo Contrato Social y Ambiental para la Bogotá del Siglo XXI",15,"Plan Distrital de Lectura, Escritura y Oralidad: \"Leer para la vida\"","Propósito 1: Hacer un nuevo contrato social para incrementar la inclusión social, productiva y política"]
[null,"Un Nuevo Contrato Social y Ambiental para la Bogotá del Siglo XXI",16,"Transformación pedagógica y mejoramiento de la gestión educativa. Es con los maestros y maestras.","Propósito 1: Hacer un nuevo contrato social para incrementar la inclusión social, productiva y política"]
[null,"Un Nuevo Contrato Social y Ambiental para la Bogotá del Siglo XXI",17,"Jóvenes con capacidades: Proyecto de vida para la ciudadanía, la innovación y el trabajo del siglo XXI","Propósito 1: Hacer un nuevo contrato social para incrementar la inclusión social, productiva y política"]
[null,"Un Nuevo Contrato Social y Ambiental para la Bogotá del Siglo XXI",18,"Cierre de brechas para la inclusión productiva urbano rural","Propósito 1: Hacer un nuevo contrato social para incrementar la inclusión social, productiva y política"]
{"$rows_left_out":40}
{"sheet":"Tipo","index":2,"n_rows":67,"n_cols":5,"rows_kept":67,"cut":false,"hidden":true,"merged":[]}
[null,null,"Modalidad de Selección","afectacion","Naturaleza Jurídica"]
[1,null,"Concurso de méritos","Funcionamiento","Persona Natural"]
[2,null,"Contratación directa","Inversión","Persona Jurídica"]
[3,null,"Contratación mínima cuantia","Operación","Unión Temporal"]
[4,null,"Selección abreviada",null,"Consorcio"]
[5,null,"Licitación pública",null,"Sociedad con objeto único"]
[6,null,"Otros",null,"Persona jurídica extranjera"]
[7,null,"Régimen especial",null,"Sin ánimo de lucro"]
[8,null,null,null,"Cabildo indígena"]
[9,null,null,null,"Consejo comunitario de las comunidades negras"]
[10,null,"Selección abreviada",null,"Organizaciones de segundo nivel"]
[11,null,"Subasta inversa ",null,"Formas o expresiones organizativas, afrocolombianas, raizales y palenqueras"]
[12,null,"Bolsas de productos",null,"Organizaciones de base de comunidades negras "]
[13,null,"Acuerdo marco de precios ",null,"Asociaciones de autoridades tradicionales indígenas"]
[14,null,"Selección abreviada por menor cuantía "]
[15]
[16,null,"contratacion directa"]
[17,null,"Urgencia manifiesta"]
[18,null,"Contratación de empréstitos"]
[19,null,"Contratos interadministrativos"]
{"$rows_left_out":47}