{"text_format":"1","workbook":"xlsx","n_sheets":4,"sheets":["Formato a Dici 31 de 2017","Instructivo","Equivalencia BH-BMPT","Tipo "],"not_rendered":{"charts":0,"images":0,"macros":1,"external_links":1,"defined_names":8,"comments":0,"pivot_tables":0},"unopened":[],"bounds":{"document_bytes":16777216,"sheet_cells":100000,"rows_first":2000,"rows_last":500,"rows_between":2000,"halvings":0,"cell_chars":16384,"cell_head_chars":4096},"cells_cut":0,"cells_raw":0,"read":"whole","date_system":"1900"}

{"sheet":"Formato a Dici 31 de 2017","index":0,"n_rows":157,"n_cols":38,"rows_kept":157,"cut":false,"hidden":false,"merged":[[5,0,5,3],[3,9,3,10],[9,26,9,30],[11,30,12,30],[11,29,12,29],[5,9,5,10],[5,21,5,31],[6,0,6,13],[6,21,6,31],[7,0,7,3],[7,5,7,7],[7,9,8,13],[7,21,7,31],[8,0,8,3],[8,5,8,7],[8,21,8,31],[1,0,1,31],[2,0,2,31],[3,0,3,3],[3,12,3,13],[4,0,4,3],[4,9,4,10],[4,21,4,31],[3,20,3,31],[11,2,12,2],[11,3,12,3],[11,9,11,11],[11,0,12,0],[11,28,12,28],[11,5,12,5],[11,7,12,7],[11,12,11,13],[11,14,12,14],[11,16,12,16],[11,18,12,18],[11,19,12,19],[11,20,12,20],[9,0,9,13],[9,14,9,20],[9,21,9,25],[10,12,10,13],[10,3,10,4],[10,8,10,10],[10,26,10,30],[11,31,12,31],[11,21,12,21],[11,22,12,22],[11,23,12,23],[11,24,12,24],[11,27,12,27]]}
[",,,,,,,,,,,,,,,,,,,,,,,,,,"]
["VEEDURIA DISTRITAL - RENDICION DE CUENTAS DE LA GESTION CONTRACTUAL EN EL DISTRITO CAPITAL (Acuerdo 380 de 2009)"]
["INFORMACION GENERAL DE CONTRATACION ENTIDADES DISTRITALES -  ENERO 1 A DICIEMBRE 31 DE 2017"]
["1, Entidad:",null,null,null,"ALCALDIALOCAL DE TEUSAQUILLO ",null,null,"2, Sector:",null,null,null,null,null,null,null,null,null,null,null,null,"9, Nombre de quien diligencia el formato:"]
["3, Presupuesto Disponible Inversión directa PREDIS:",null,null,null,12508477746,null,null,"5, Presupuesto Disponible Funcionamiento PREDIS:",1372000000,null,null,null,null,null,null,null,null,null,null,null,"JOSE  ANTONIO ","ZAWADZKY GONZALEZ "]
["4, Presupuesto comprometido de inversión según PREDIS :",null,null,null,12200908650,null,null,"6, Presupuesto comprometido funcionamiento según PREDIS",1205149231,null,null,null,null,null,null,null,null,null,null,null,"Cargo:","Profesional universitario "]
[null,null,null,null,null,null,null,null,null,null,null,null,null,null,null,null,null,null,null,null,"Dependencia","Alcaldia Local de Teusaquillo "]
["7, Presupuesto Disponible Operación (Regimen Privado):",null,null,null,0,null,null,null,null,null,null,null,null,null,null,null,null,null,null,null,"Teléfono: ",28700094]
["8, Presupuesto comprometido operación mediante contratos:",null,null,null,0,null,null,null,null,null,null,null,null,null,null,null,null,null,null,null,"Correo Electrónico","jose.zawadzky@gobiernobogota.gov.co "]
["1- INFORMACION GENERAL",null,null,null,null,null,null,null,null,null,null,null,null,null,"2- INFORMACION FINANCIERA",null,null,null,null,null,null,"3 - PLAZOS ",null,null,null,null,"4 - ESTADO ",null,null,null,null,"5. %  Avance y/o cumplimiento"]
[1,2,3,4,null,5,6,7,8,null,null,9,10,null,11,12,13,14,15,16,17,18,19,20,21,22,23,null,null,null,null,24]
["Número Contrato",null,"Número de proceso SECOP","Tipo de Contrato        ",null,"Modalidad de Selección",null,"Objeto",null,"Presupuesto",null,null,"Contratista",null,"Valor Inicial del contrato",null,"Valor total reducciones (En valor negativo)",null,"Valor total de adiciones ","Valor Final ","Giros\n(Valor en pesos)","Fecha de suscripción (DD/MM/AAAA)","Fecha de inicio (DD/MM/AAAA)","Fecha de terminación (DD/MM/AAAA)","Plazo en días","Prórroga",null,"Celebrado o por iniciar","En Ejecución","Terminado","Liquidado","% Avance y/o Cumplimiento"]
[null,"Año",null,null,"Equivalencia Tipo de contrato ",null,"Procedimiento o causal",null,"Afectación ","Número Programa","Equivalencia número de programa","Número Proyecto","Número  de Identificación\ndel contratista","Nombre del contratista",null,"Número de reducciones en valor",null,"Número de adiciones en valor",null,null,null,null,null,null,null,"Prorroga en días","Anulado"]
[1,2017,"CPS 001 2017",5,{"$f":"IF(D14=1,'[1]Tipo '!$B$2,IF(D14=2,'[1]Tipo '!$B$3,IF(D14=3,'[1]Tipo '!$B$4,IF(D14=4,'[1]Tipo '!$B$5,IF(D14=5,'[1]Tipo '!$B$6,IF(D14=6,'[1]Tipo '!$B$7,IF(D14=7,'[1]Tipo '!$B$8,IF(D14=8,'[1]Tipo '!$B$9,IF(D14=9,'[1]Tipo '!$B$10,IF(D14=10,'[1]Tipo '!$B$11,IF(D14=11,'[1]Tipo '!$B$12,IF(D14=12,'[1]Tipo '!$B$13,IF(D14=13,'[1]Tipo '!$B$14,IF(D14=14,'[1]Tipo '!$B$15,IF(D14=15,'[1]Tipo '!$B$16,IF(D14=16,'[1]Tipo '!$B$17,IF(D14=17,'[1]Tipo '!$B$18,IF(D14=18,'[1]Tipo '!$B$19,IF(D14=19,'[1]Tipo '!$B$20,\"No ha seleccionado un tipo de contrato válido\")))))))))))))))))))","v":"CONTRATOS DE PRESTACIÓN DE SERVICIOS PROFESIONALES Y DE APOYO A LA GESTIÓN"},"CONTRATACIÓN DIRECTA","Prestación de servicios profesionales y de apoyo a la gestión, o para la ejecución de trabajos artísticos que sólo puedan encomendarse a determinadas personas naturales;","El contrato que se pretende celebrar, tendrá por objeto ¿Prestar servicios profesionales al Área de Gestión Jurídica y Policiva relacionados con Establecimientos de Comercio ley 232 de 1995 y Espacio Público, a través de visitas y gestión de conceptos técnicos con el objetivo de evacuar como mínimo el 30% de dichas visitas de acuerdo a lo establecido en los estudios previos.¿","INVERSIÓN",45,{"$f":"IF(J14=1,'[1]Equivalencia BH-BMPT'!$D$2,IF(J14=2,'[1]Equivalencia BH-BMPT'!$D$3,IF(J14=3,'[1]Equivalencia BH-BMPT'!$D$4,IF(J14=4,'[1]Equivalencia BH-BMPT'!$D$5,IF(J14=5,'[1]Equivalencia BH-BMPT'!$D$6,IF(J14=6,'[1]Equivalencia BH-BMPT'!$D$7,IF(J14=7,'[1]Equivalencia BH-BMPT'!$D$8,IF(J14=8,'[1]Equivalencia BH-BMPT'!$D$9,IF(J14=9,'[1]Equivalencia BH-BMPT'!$D$10,IF(J14=10,'[1]Equivalencia BH-BMPT'!$D$11,IF(J14=11,'[1]Equivalencia BH-BMPT'!$D$12,IF(J14=12,'[1]Equivalencia BH-BMPT'!$D$13,IF(J14=13,'[1]Equivalencia BH-BMPT'!$D$14,IF(J14=14,'[1]Equivalencia BH-BMPT'!$D$15,IF(J14=15,'[1]Equivalencia BH-BMPT'!$D$16,IF(J14=16,'[1]Equivalencia BH-BMPT'!$D$17,IF(J14=17,'[1]Equivalencia BH-BMPT'!$D$18,IF(J14=18,'[1]Equivalencia BH-BMPT'!$D$19,IF(J14=19,'[1]Equivalencia BH-BMPT'!$D$20,IF(J14=20,'[1]Equivalencia BH-BMPT'!$D$21,IF(J14=21,'[1]Equivalencia BH-BMPT'!$D$22,IF(J14=22,'[1]Equivalencia BH-BMPT'!$D$23,IF(J14=23,'[1]Equivalencia BH-BMPT'!#REF!,IF(J14=24,'[1]Equivalencia BH-BMPT'!$D$25,IF(J14=25,'[1]Equivalencia BH-BMPT'!$D$26,IF(J14=26,'[1]Equivalencia BH-BMPT'!$D$27,IF(J14=27,'[1]Equivalencia BH-BMPT'!$D$28,IF(J14=28,'[1]Equivalencia BH-BMPT'!$D$29,IF(J14=29,'[1]Equivalencia BH-BMPT'!$D$30,IF(J14=30,'[1]Equivalencia BH-BMPT'!$D$31,IF(J14=31,'[1]Equivalencia BH-BMPT'!$D$32,IF(J14=32,'[1]Equivalencia BH-BMPT'!$D$33,IF(J14=33,'[1]Equivalencia BH-BMPT'!$D$34,IF(J14=34,'[1]Equivalencia BH-BMPT'!$D$35,IF(J14=35,'[1]Equivalencia BH-BMPT'!$D$36,IF(J14=36,'[1]Equivalencia BH-BMPT'!$D$37,IF(J14=37,'[1]Equivalencia BH-BMPT'!$D$38,IF(J14=38,'[1]Equivalencia BH-BMPT'!#REF!,IF(J14=39,'[1]Equivalencia BH-BMPT'!$D$40,IF(J14=40,'[1]Equivalencia BH-BMPT'!$D$41,IF(J14=41,'[1]Equivalencia BH-BMPT'!$D$42,IF(J14=42,'[1]Equivalencia BH-BMPT'!$D$43,IF(J14=43,'[1]Equivalencia BH-BMPT'!$D$44,IF(J14=44,'[1]Equivalencia BH-BMPT'!$D$45,IF(J14=45,'[1]Equivalencia BH-BMPT'!$D$46,\"No ha seleccionado un número de programa\")))))))))))))))))))))))))))))))))))))))))))))","v":"Gobernanza e influencia local, regional e internacional"},1329,52530406,"CATHERINNE  HURTADO SANCHEZ",17200000,null,null,null,0,{"$f":"+O14+S14","v":17200000},17200000,"2017-02-01","2017-02-01","2017-05-30",330,0,null,null,null,null,"X",1]
[1,2016,null,16,{"$f":"IF(D15=1,'[1]Tipo '!$B$2,IF(D15=2,'[1]Tipo '!$B$3,IF(D15=3,'[1]Tipo '!$B$4,IF(D15=4,'[1]Tipo '!$B$5,IF(D15=5,'[1]Tipo '!$B$6,IF(D15=6,'[1]Tipo '!$B$7,IF(D15=7,'[1]Tipo '!$B$8,IF(D15=8,'[1]Tipo '!$B$9,IF(D15=9,'[1]Tipo '!$B$10,IF(D15=10,'[1]Tipo '!$B$11,IF(D15=11,'[1]Tipo '!$B$12,IF(D15=12,'[1]Tipo '!$B$13,IF(D15=13,'[1]Tipo '!$B$14,IF(D15=14,'[1]Tipo '!$B$15,IF(D15=15,'[1]Tipo '!$B$16,IF(D15=16,'[1]Tipo '!$B$17,IF(D15=17,'[1]Tipo '!$B$18,IF(D15=18,'[1]Tipo '!$B$19,IF(D15=19,'[1]Tipo '!$B$20,\"No ha seleccionado un tipo de contrato válido\")))))))))))))))))))","v":"CONTRATOS INTERADMINISTRATIVOS"},"CONTRATACIÓN DIRECTA","Contratos interadministrativos","Aunar esfuerzos operativos, administrativos y financieros para realizar actividades de intervención física, social y mantenimiento de los puntos críticos de la localidad de Teusaquillo.","INVERSIÓN",45,{"$f":"IF(J15=1,'[1]Equivalencia BH-BMPT'!$D$2,IF(J15=2,'[1]Equivalencia BH-BMPT'!$D$3,IF(J15=3,'[1]Equivalencia BH-BMPT'!$D$4,IF(J15=4,'[1]Equivalencia BH-BMPT'!$D$5,IF(J15=5,'[1]Equivalencia BH-BMPT'!$D$6,IF(J15=6,'[1]Equivalencia BH-BMPT'!$D$7,IF(J15=7,'[1]Equivalencia BH-BMPT'!$D$8,IF(J15=8,'[1]Equivalencia BH-BMPT'!$D$9,IF(J15=9,'[1]Equivalencia BH-BMPT'!$D$10,IF(J15=10,'[1]Equivalencia BH-BMPT'!$D$11,IF(J15=11,'[1]Equivalencia BH-BMPT'!$D$12,IF(J15=12,'[1]Equivalencia BH-BMPT'!$D$13,IF(J15=13,'[1]Equivalencia BH-BMPT'!$D$14,IF(J15=14,'[1]Equivalencia BH-BMPT'!$D$15,IF(J15=15,'[1]Equivalencia BH-BMPT'!$D$16,IF(J15=16,'[1]Equivalencia BH-BMPT'!$D$17,IF(J15=17,'[1]Equivalencia BH-BMPT'!$D$18,IF(J15=18,'[1]Equivalencia BH-BMPT'!$D$19,IF(J15=19,'[1]Equivalencia BH-BMPT'!$D$20,IF(J15=20,'[1]Equivalencia BH-BMPT'!$D$21,IF(J15=21,'[1]Equivalencia BH-BMPT'!$D$22,IF(J15=22,'[1]Equivalencia BH-BMPT'!$D$23,IF(J15=23,'[1]Equivalencia BH-BMPT'!#REF!,IF(J15=24,'[1]Equivalencia BH-BMPT'!$D$25,IF(J15=25,'[1]Equivalencia BH-BMPT'!$D$26,IF(J15=26,'[1]Equivalencia BH-BMPT'!$D$27,IF(J15=27,'[1]Equivalencia BH-BMPT'!$D$28,IF(J15=28,'[1]Equivalencia BH-BMPT'!$D$29,IF(J15=29,'[1]Equivalencia BH-BMPT'!$D$30,IF(J15=30,'[1]Equivalencia BH-BMPT'!$D$31,IF(J15=31,'[1]Equivalencia BH-BMPT'!$D$32,IF(J15=32,'[1]Equivalencia BH-BMPT'!$D$33,IF(J15=33,'[1]Equivalencia BH-BMPT'!$D$34,IF(J15=34,'[1]Equivalencia BH-BMPT'!$D$35,IF(J15=35,'[1]Equivalencia BH-BMPT'!$D$36,IF(J15=36,'[1]Equivalencia BH-BMPT'!$D$37,IF(J15=37,'[1]Equivalencia BH-BMPT'!$D$38,IF(J15=38,'[1]Equivalencia BH-BMPT'!#REF!,IF(J15=39,'[1]Equivalencia BH-BMPT'!$D$40,IF(J15=40,'[1]Equivalencia BH-BMPT'!$D$41,IF(J15=41,'[1]Equivalencia BH-BMPT'!$D$42,IF(J15=42,'[1]Equivalencia BH-BMPT'!$D$43,IF(J15=43,'[1]Equivalencia BH-BMPT'!$D$44,IF(J15=44,'[1]Equivalencia BH-BMPT'!$D$45,IF(J15=45,'[1]Equivalencia BH-BMPT'!$D$46,\"No ha seleccionado un número de programa\")))))))))))))))))))))))))))))))))))))))))))))","v":"Gobernanza e influencia local, regional e internacional"},1329,830128286,"AGUAS DE BOGOTA S A ESP",56500000,null,null,null,0,{"$f":"+O15+S15","v":56500000},0,"2017-11-09","2017-12-01","2018-06-30",210,0,null,null,"X",null,null,0]
[2,2017,null,16,{"$f":"IF(D16=1,'[1]Tipo '!$B$2,IF(D16=2,'[1]Tipo '!$B$3,IF(D16=3,'[1]Tipo '!$B$4,IF(D16=4,'[1]Tipo '!$B$5,IF(D16=5,'[1]Tipo '!$B$6,IF(D16=6,'[1]Tipo '!$B$7,IF(D16=7,'[1]Tipo '!$B$8,IF(D16=8,'[1]Tipo '!$B$9,IF(D16=9,'[1]Tipo '!$B$10,IF(D16=10,'[1]Tipo '!$B$11,IF(D16=11,'[1]Tipo '!$B$12,IF(D16=12,'[1]Tipo '!$B$13,IF(D16=13,'[1]Tipo '!$B$14,IF(D16=14,'[1]Tipo '!$B$15,IF(D16=15,'[1]Tipo '!$B$16,IF(D16=16,'[1]Tipo '!$B$17,IF(D16=17,'[1]Tipo '!$B$18,IF(D16=18,'[1]Tipo '!$B$19,IF(D16=19,'[1]Tipo '!$B$20,\"No ha seleccionado un tipo de contrato válido\")))))))))))))))))))","v":"CONTRATOS INTERADMINISTRATIVOS"},"CONTRATACIÓN DIRECTA","Contratos interadministrativos","Aunar Esfuerzos Técnicos Administrativos y financieros para desarrollar acciones de Atención integral a personas en condición de discapacidad, a través del otorgamientos de ayudas técnicas y actividades complementaria para la familia y sus cuidadores.","INVERSIÓN",3,{"$f":"IF(J16=1,'[1]Equivalencia BH-BMPT'!$D$2,IF(J16=2,'[1]Equivalencia BH-BMPT'!$D$3,IF(J16=3,'[1]Equivalencia BH-BMPT'!$D$4,IF(J16=4,'[1]Equivalencia BH-BMPT'!$D$5,IF(J16=5,'[1]Equivalencia BH-BMPT'!$D$6,IF(J16=6,'[1]Equivalencia BH-BMPT'!$D$7,IF(J16=7,'[1]Equivalencia BH-BMPT'!$D$8,IF(J16=8,'[1]Equivalencia BH-BMPT'!$D$9,IF(J16=9,'[1]Equivalencia BH-BMPT'!$D$10,IF(J16=10,'[1]Equivalencia BH-BMPT'!$D$11,IF(J16=11,'[1]Equivalencia BH-BMPT'!$D$12,IF(J16=12,'[1]Equivalencia BH-BMPT'!$D$13,IF(J16=13,'[1]Equivalencia BH-BMPT'!$D$14,IF(J16=14,'[1]Equivalencia BH-BMPT'!$D$15,IF(J16=15,'[1]Equivalencia BH-BMPT'!$D$16,IF(J16=16,'[1]Equivalencia BH-BMPT'!$D$17,IF(J16=17,'[1]Equivalencia BH-BMPT'!$D$18,IF(J16=18,'[1]Equivalencia BH-BMPT'!$D$19,IF(J16=19,'[1]Equivalencia BH-BMPT'!$D$20,IF(J16=20,'[1]Equivalencia BH-BMPT'!$D$21,IF(J16=21,'[1]Equivalencia BH-BMPT'!$D$22,IF(J16=22,'[1]Equivalencia BH-BMPT'!$D$23,IF(J16=23,'[1]Equivalencia BH-BMPT'!#REF!,IF(J16=24,'[1]Equivalencia BH-BMPT'!$D$25,IF(J16=25,'[1]Equivalencia BH-BMPT'!$D$26,IF(J16=26,'[1]Equivalencia BH-BMPT'!$D$27,IF(J16=27,'[1]Equivalencia BH-BMPT'!$D$28,IF(J16=28,'[1]Equivalencia BH-BMPT'!$D$29,IF(J16=29,'[1]Equivalencia BH-BMPT'!$D$30,IF(J16=30,'[1]Equivalencia BH-BMPT'!$D$31,IF(J16=31,'[1]Equivalencia BH-BMPT'!$D$32,IF(J16=32,'[1]Equivalencia BH-BMPT'!$D$33,IF(J16=33,'[1]Equivalencia BH-BMPT'!$D$34,IF(J16=34,'[1]Equivalencia BH-BMPT'!$D$35,IF(J16=35,'[1]Equivalencia BH-BMPT'!$D$36,IF(J16=36,'[1]Equivalencia BH-BMPT'!$D$37,IF(J16=37,'[1]Equivalencia BH-BMPT'!$D$38,IF(J16=38,'[1]Equivalencia BH-BMPT'!#REF!,IF(J16=39,'[1]Equivalencia BH-BMPT'!$D$40,IF(J16=40,'[1]Equivalencia BH-BMPT'!$D$41,IF(J16=41,'[1]Equivalencia BH-BMPT'!$D$42,IF(J16=42,'[1]Equivalencia BH-BMPT'!$D$43,IF(J16=43,'[1]Equivalencia BH-BMPT'!$D$44,IF(J16=44,'[1]Equivalencia BH-BMPT'!$D$45,IF(J16=45,'[1]Equivalencia BH-BMPT'!$D$46,\"No ha seleccionado un número de programa\")))))))))))))))))))))))))))))))))))))))))))))","v":"Igualdad y autonomía para una Bogotá incluyente"},1354,900971006,"SUBRED INTEGRADA DE SERVICIOS DE SALUD NORTE ESE",106720000,null,null,null,0,106720000,0,"2017-11-10","2017-11-10",null,null,0,null,null,"X",null,null,0]
[2,2016,"CPS 02 2017 ",5,{"$f":"IF(D17=1,'[1]Tipo '!$B$2,IF(D17=2,'[1]Tipo '!$B$3,IF(D17=3,'[1]Tipo '!$B$4,IF(D17=4,'[1]Tipo '!$B$5,IF(D17=5,'[1]Tipo '!$B$6,IF(D17=6,'[1]Tipo '!$B$7,IF(D17=7,'[1]Tipo '!$B$8,IF(D17=8,'[1]Tipo '!$B$9,IF(D17=9,'[1]Tipo '!$B$10,IF(D17=10,'[1]Tipo '!$B$11,IF(D17=11,'[1]Tipo '!$B$12,IF(D17=12,'[1]Tipo '!$B$13,IF(D17=13,'[1]Tipo '!$B$14,IF(D17=14,'[1]Tipo '!$B$15,IF(D17=15,'[1]Tipo '!$B$16,IF(D17=16,'[1]Tipo '!$B$17,IF(D17=17,'[1]Tipo '!$B$18,IF(D17=18,'[1]Tipo '!$B$19,IF(D17=19,'[1]Tipo '!$B$20,\"No ha seleccionado un tipo de contrato válido\")))))))))))))))))))","v":"CONTRATOS DE PRESTACIÓN DE SERVICIOS PROFESIONALES Y DE APOYO A LA GESTIÓN"},"CONTRATACIÓN DIRECTA","Prestación de servicios profesionales y de apoyo a la gestión, o para la ejecución de trabajos artísticos que sólo puedan encomendarse a determinadas personas naturales;","EL CONTRATO QUE SE PRETENDE CELEBRAR TENDRA POR OBJETO: EL CONTRATISTA SE OBLIGA A PRESTAR SUS SERVICIOS ESPECIALIZADOS COMO ABOGADO DEL ESPACHO DEL ALCALDE LOCAL DE TEUSAQUILLO.","INVERSIÓN",45,{"$f":"IF(J17=1,'[1]Equivalencia BH-BMPT'!$D$2,IF(J17=2,'[1]Equivalencia BH-BMPT'!$D$3,IF(J17=3,'[1]Equivalencia BH-BMPT'!$D$4,IF(J17=4,'[1]Equivalencia BH-BMPT'!$D$5,IF(J17=5,'[1]Equivalencia BH-BMPT'!$D$6,IF(J17=6,'[1]Equivalencia BH-BMPT'!$D$7,IF(J17=7,'[1]Equivalencia BH-BMPT'!$D$8,IF(J17=8,'[1]Equivalencia BH-BMPT'!$D$9,IF(J17=9,'[1]Equivalencia BH-BMPT'!$D$10,IF(J17=10,'[1]Equivalencia BH-BMPT'!$D$11,IF(J17=11,'[1]Equivalencia BH-BMPT'!$D$12,IF(J17=12,'[1]Equivalencia BH-BMPT'!$D$13,IF(J17=13,'[1]Equivalencia BH-BMPT'!$D$14,IF(J17=14,'[1]Equivalencia BH-BMPT'!$D$15,IF(J17=15,'[1]Equivalencia BH-BMPT'!$D$16,IF(J17=16,'[1]Equivalencia BH-BMPT'!$D$17,IF(J17=17,'[1]Equivalencia BH-BMPT'!$D$18,IF(J17=18,'[1]Equivalencia BH-BMPT'!$D$19,IF(J17=19,'[1]Equivalencia BH-BMPT'!$D$20,IF(J17=20,'[1]Equivalencia BH-BMPT'!$D$21,IF(J17=21,'[1]Equivalencia BH-BMPT'!$D$22,IF(J17=22,'[1]Equivalencia BH-BMPT'!$D$23,IF(J17=23,'[1]Equivalencia BH-BMPT'!#REF!,IF(J17=24,'[1]Equivalencia BH-BMPT'!$D$25,IF(J17=25,'[1]Equivalencia BH-BMPT'!$D$26,IF(J17=26,'[1]Equivalencia BH-BMPT'!$D$27,IF(J17=27,'[1]Equivalencia BH-BMPT'!$D$28,IF(J17=28,'[1]Equivalencia BH-BMPT'!$D$29,IF(J17=29,'[1]Equivalencia BH-BMPT'!$D$30,IF(J17=30,'[1]Equivalencia BH-BMPT'!$D$31,IF(J17=31,'[1]Equivalencia BH-BMPT'!$D$32,IF(J17=32,'[1]Equivalencia BH-BMPT'!$D$33,IF(J17=33,'[1]Equivalencia BH-BMPT'!$D$34,IF(J17=34,'[1]Equivalencia BH-BMPT'!$D$35,IF(J17=35,'[1]Equivalencia BH-BMPT'!$D$36,IF(J17=36,'[1]Equivalencia BH-BMPT'!$D$37,IF(J17=37,'[1]Equivalencia BH-BMPT'!$D$38,IF(J17=38,'[1]Equivalencia BH-BMPT'!#REF!,IF(J17=39,'[1]Equivalencia BH-BMPT'!$D$40,IF(J17=40,'[1]Equivalencia BH-BMPT'!$D$41,IF(J17=41,'[1]Equivalencia BH-BMPT'!$D$42,IF(J17=42,'[1]Equivalencia BH-BMPT'!$D$43,IF(J17=43,'[1]Equivalencia BH-BMPT'!$D$44,IF(J17=44,'[1]Equivalencia BH-BMPT'!$D$45,IF(J17=45,'[1]Equivalencia BH-BMPT'!$D$46,\"No ha seleccionado un número de programa\")))))))))))))))))))))))))))))))))))))))))))))","v":"Gobernanza e influencia local, regional e internacional"},1329,79692076,"FABIO ALBERTO ALZATE CARREÑO",56800000,null,null,null,0,56800000,56800000,"2017-02-10","2017-02-10","2017-10-09",240,0,null,null,null,null,"X",1]
[3,2017,null,16,{"$f":"IF(D18=1,'[1]Tipo '!$B$2,IF(D18=2,'[1]Tipo '!$B$3,IF(D18=3,'[1]Tipo '!$B$4,IF(D18=4,'[1]Tipo '!$B$5,IF(D18=5,'[1]Tipo '!$B$6,IF(D18=6,'[1]Tipo '!$B$7,IF(D18=7,'[1]Tipo '!$B$8,IF(D18=8,'[1]Tipo '!$B$9,IF(D18=9,'[1]Tipo '!$B$10,IF(D18=10,'[1]Tipo '!$B$11,IF(D18=11,'[1]Tipo '!$B$12,IF(D18=12,'[1]Tipo '!$B$13,IF(D18=13,'[1]Tipo '!$B$14,IF(D18=14,'[1]Tipo '!$B$15,IF(D18=15,'[1]Tipo '!$B$16,IF(D18=16,'[1]Tipo '!$B$17,IF(D18=17,'[1]Tipo '!$B$18,IF(D18=18,'[1]Tipo '!$B$19,IF(D18=19,'[1]Tipo '!$B$20,\"No ha seleccionado un tipo de contrato válido\")))))))))))))))))))","v":"CONTRATOS INTERADMINISTRATIVOS"},"CONTRATACIÓN DIRECTA","Contratos interadministrativos","OBJETO: El convenio interadministrativo de cofinanciación, que se pretende celebrar, tendrá por objeto ¿¿Aunar esfuerzos institucionales, técnicos, económicos y administrativos con el fin de realizar actividades de mantenimiento al arbolado joven, así como el Manejo Integral de Plagas y Enfermedades ¿MIPE en el arbolado adulto, en los lugares que sean designados por el comité técnico¿, en el marco de la ejecución del Proyecto No. 1330   denominado: ¿Teusaquillo Mejor Para el Ambiente¿.","INVERSIÓN",38,"Recuperación y manejo de la Estructura Ecológica Principal",1330,860030197,"JARDIN BOTANICO JOSE CELESTINO MUTIS",97500000,null,null,null,0,97500000,0,"2017-11-10",null,null,180,0,null,"X",null,null,null,0]
[3,2017,"CPS 03 2017",5,{"$f":"IF(D19=1,'[1]Tipo '!$B$2,IF(D19=2,'[1]Tipo '!$B$3,IF(D19=3,'[1]Tipo '!$B$4,IF(D19=4,'[1]Tipo '!$B$5,IF(D19=5,'[1]Tipo '!$B$6,IF(D19=6,'[1]Tipo '!$B$7,IF(D19=7,'[1]Tipo '!$B$8,IF(D19=8,'[1]Tipo '!$B$9,IF(D19=9,'[1]Tipo '!$B$10,IF(D19=10,'[1]Tipo '!$B$11,IF(D19=11,'[1]Tipo '!$B$12,IF(D19=12,'[1]Tipo '!$B$13,IF(D19=13,'[1]Tipo '!$B$14,IF(D19=14,'[1]Tipo '!$B$15,IF(D19=15,'[1]Tipo '!$B$16,IF(D19=16,'[1]Tipo '!$B$17,IF(D19=17,'[1]Tipo '!$B$18,IF(D19=18,'[1]Tipo '!$B$19,IF(D19=19,'[1]Tipo '!$B$20,\"No ha seleccionado un tipo de contrato válido\")))))))))))))))))))","v":"CONTRATOS DE PRESTACIÓN DE SERVICIOS PROFESIONALES Y DE APOYO A LA GESTIÓN"},"CONTRATACIÓN DIRECTA","Prestación de servicios profesionales y de apoyo a la gestión, o para la ejecución de trabajos artísticos que sólo puedan encomendarse a determinadas personas naturales;","El contrato que se pretende celebrar, tendrá por objeto ¿EL CONTRATISTA SE OBLIGA PARA CON EL FONDO LOCAL DE TEUSAQUILLO A PRESTAR SUS SERVICIOS PROFESIONALES ESPECIALIZADOS  AL AREA DE GESTION DE DESARROLLO LOCAL","INVERSIÓN",45,{"$f":"IF(J19=1,'[1]Equivalencia BH-BMPT'!$D$2,IF(J19=2,'[1]Equivalencia BH-BMPT'!$D$3,IF(J19=3,'[1]Equivalencia BH-BMPT'!$D$4,IF(J19=4,'[1]Equivalencia BH-BMPT'!$D$5,IF(J19=5,'[1]Equivalencia BH-BMPT'!$D$6,IF(J19=6,'[1]Equivalencia BH-BMPT'!$D$7,IF(J19=7,'[1]Equivalencia BH-BMPT'!$D$8,IF(J19=8,'[1]Equivalencia BH-BMPT'!$D$9,IF(J19=9,'[1]Equivalencia BH-BMPT'!$D$10,IF(J19=10,'[1]Equivalencia BH-BMPT'!$D$11,IF(J19=11,'[1]Equivalencia BH-BMPT'!$D$12,IF(J19=12,'[1]Equivalencia BH-BMPT'!$D$13,IF(J19=13,'[1]Equivalencia BH-BMPT'!$D$14,IF(J19=14,'[1]Equivalencia BH-BMPT'!$D$15,IF(J19=15,'[1]Equivalencia BH-BMPT'!$D$16,IF(J19=16,'[1]Equivalencia BH-BMPT'!$D$17,IF(J19=17,'[1]Equivalencia BH-BMPT'!$D$18,IF(J19=18,'[1]Equivalencia BH-BMPT'!$D$19,IF(J19=19,'[1]Equivalencia BH-BMPT'!$D$20,IF(J19=20,'[1]Equivalencia BH-BMPT'!$D$21,IF(J19=21,'[1]Equivalencia BH-BMPT'!$D$22,IF(J19=22,'[1]Equivalencia BH-BMPT'!$D$23,IF(J19=23,'[1]Equivalencia BH-BMPT'!#REF!,IF(J19=24,'[1]Equivalencia BH-BMPT'!$D$25,IF(J19=25,'[1]Equivalencia BH-BMPT'!$D$26,IF(J19=26,'[1]Equivalencia BH-BMPT'!$D$27,IF(J19=27,'[1]Equivalencia BH-BMPT'!$D$28,IF(J19=28,'[1]Equivalencia BH-BMPT'!$D$29,IF(J19=29,'[1]Equivalencia BH-BMPT'!$D$30,IF(J19=30,'[1]Equivalencia BH-BMPT'!$D$31,IF(J19=31,'[1]Equivalencia BH-BMPT'!$D$32,IF(J19=32,'[1]Equivalencia BH-BMPT'!$D$33,IF(J19=33,'[1]Equivalencia BH-BMPT'!$D$34,IF(J19=34,'[1]Equivalencia BH-BMPT'!$D$35,IF(J19=35,'[1]Equivalencia BH-BMPT'!$D$36,IF(J19=36,'[1]Equivalencia BH-BMPT'!$D$37,IF(J19=37,'[1]Equivalencia BH-BMPT'!$D$38,IF(J19=38,'[1]Equivalencia BH-BMPT'!#REF!,IF(J19=39,'[1]Equivalencia BH-BMPT'!$D$40,IF(J19=40,'[1]Equivalencia BH-BMPT'!$D$41,IF(J19=41,'[1]Equivalencia BH-BMPT'!$D$42,IF(J19=42,'[1]Equivalencia BH-BMPT'!$D$43,IF(J19=43,'[1]Equivalencia BH-BMPT'!$D$44,IF(J19=44,'[1]Equivalencia BH-BMPT'!$D$45,IF(J19=45,'[1]Equivalencia BH-BMPT'!$D$46,\"No ha seleccionado un número de programa\")))))))))))))))))))))))))))))))))))))))))))))","v":"Gobernanza e influencia local, regional e internacional"},1329,52879389,"ROSA VIVIANA CUBILLOS MEDRANO",56800000,null,null,null,0,56800000,56800000,"2017-02-10","2017-02-10","2017-10-09",240,0,null,null,null,null,"X",1]
[4,2017,"CPS 04 2017 ",5,{"$f":"IF(D20=1,'[1]Tipo '!$B$2,IF(D20=2,'[1]Tipo '!$B$3,IF(D20=3,'[1]Tipo '!$B$4,IF(D20=4,'[1]Tipo '!$B$5,IF(D20=5,'[1]Tipo '!$B$6,IF(D20=6,'[1]Tipo '!$B$7,IF(D20=7,'[1]Tipo '!$B$8,IF(D20=8,'[1]Tipo '!$B$9,IF(D20=9,'[1]Tipo '!$B$10,IF(D20=10,'[1]Tipo '!$B$11,IF(D20=11,'[1]Tipo '!$B$12,IF(D20=12,'[1]Tipo '!$B$13,IF(D20=13,'[1]Tipo '!$B$14,IF(D20=14,'[1]Tipo '!$B$15,IF(D20=15,'[1]Tipo '!$B$16,IF(D20=16,'[1]Tipo '!$B$17,IF(D20=17,'[1]Tipo '!$B$18,IF(D20=18,'[1]Tipo '!$B$19,IF(D20=19,'[1]Tipo '!$B$20,\"No ha seleccionado un tipo de contrato válido\")))))))))))))))))))","v":"CONTRATOS DE PRESTACIÓN DE SERVICIOS PROFESIONALES Y DE APOYO A LA GESTIÓN"},"CONTRATACIÓN DIRECTA","Prestación de servicios profesionales y de apoyo a la gestión, o para la ejecución de trabajos artísticos que sólo puedan encomendarse a determinadas personas naturales;","El contrato que se pretende celebrar, tendrá por objeto: ¿El contratista se obliga para con la Alcaldía Local De Teusaquillo a prestar sus servicios en el despacho del Alcalde Local, realizando la recepción, tratamiento, procesamiento y conservación del archivo oficial del despacho y las actividades operativas ¿","INVERSIÓN",45,{"$f":"IF(J20=1,'[1]Equivalencia BH-BMPT'!$D$2,IF(J20=2,'[1]Equivalencia BH-BMPT'!$D$3,IF(J20=3,'[1]Equivalencia BH-BMPT'!$D$4,IF(J20=4,'[1]Equivalencia BH-BMPT'!$D$5,IF(J20=5,'[1]Equivalencia BH-BMPT'!$D$6,IF(J20=6,'[1]Equivalencia BH-BMPT'!$D$7,IF(J20=7,'[1]Equivalencia BH-BMPT'!$D$8,IF(J20=8,'[1]Equivalencia BH-BMPT'!$D$9,IF(J20=9,'[1]Equivalencia BH-BMPT'!$D$10,IF(J20=10,'[1]Equivalencia BH-BMPT'!$D$11,IF(J20=11,'[1]Equivalencia BH-BMPT'!$D$12,IF(J20=12,'[1]Equivalencia BH-BMPT'!$D$13,IF(J20=13,'[1]Equivalencia BH-BMPT'!$D$14,IF(J20=14,'[1]Equivalencia BH-BMPT'!$D$15,IF(J20=15,'[1]Equivalencia BH-BMPT'!$D$16,IF(J20=16,'[1]Equivalencia BH-BMPT'!$D$17,IF(J20=17,'[1]Equivalencia BH-BMPT'!$D$18,IF(J20=18,'[1]Equivalencia BH-BMPT'!$D$19,IF(J20=19,'[1]Equivalencia BH-BMPT'!$D$20,IF(J20=20,'[1]Equivalencia BH-BMPT'!$D$21,IF(J20=21,'[1]Equivalencia BH-BMPT'!$D$22,IF(J20=22,'[1]Equivalencia BH-BMPT'!$D$23,IF(J20=23,'[1]Equivalencia BH-BMPT'!#REF!,IF(J20=24,'[1]Equivalencia BH-BMPT'!$D$25,IF(J20=25,'[1]Equivalencia BH-BMPT'!$D$26,IF(J20=26,'[1]Equivalencia BH-BMPT'!$D$27,IF(J20=27,'[1]Equivalencia BH-BMPT'!$D$28,IF(J20=28,'[1]Equivalencia BH-BMPT'!$D$29,IF(J20=29,'[1]Equivalencia BH-BMPT'!$D$30,IF(J20=30,'[1]Equivalencia BH-BMPT'!$D$31,IF(J20=31,'[1]Equivalencia BH-BMPT'!$D$32,IF(J20=32,'[1]Equivalencia BH-BMPT'!$D$33,IF(J20=33,'[1]Equivalencia BH-BMPT'!$D$34,IF(J20=34,'[1]Equivalencia BH-BMPT'!$D$35,IF(J20=35,'[1]Equivalencia BH-BMPT'!$D$36,IF(J20=36,'[1]Equivalencia BH-BMPT'!$D$37,IF(J20=37,'[1]Equivalencia BH-BMPT'!$D$38,IF(J20=38,'[1]Equivalencia BH-BMPT'!#REF!,IF(J20=39,'[1]Equivalencia BH-BMPT'!$D$40,IF(J20=40,'[1]Equivalencia BH-BMPT'!$D$41,IF(J20=41,'[1]Equivalencia BH-BMPT'!$D$42,IF(J20=42,'[1]Equivalencia BH-BMPT'!$D$43,IF(J20=43,'[1]Equivalencia BH-BMPT'!$D$44,IF(J20=44,'[1]Equivalencia BH-BMPT'!$D$45,IF(J20=45,'[1]Equivalencia BH-BMPT'!$D$46,\"No ha seleccionado un número de programa\")))))))))))))))))))))))))))))))))))))))))))))","v":"Gobernanza e influencia local, regional e internacional"},1329,52437503,"OMAIRA  ALARCON SALCEDO",24800000,null,null,null,9506667,34306667,31516667,"2017-02-10","2017-02-10","2018-01-10",240,92,null,null,"X",null,null,0.91867469958536052]
[5,2017,null,4,{"$f":"IF(D21=1,'[1]Tipo '!$B$2,IF(D21=2,'[1]Tipo '!$B$3,IF(D21=3,'[1]Tipo '!$B$4,IF(D21=4,'[1]Tipo '!$B$5,IF(D21=5,'[1]Tipo '!$B$6,IF(D21=6,'[1]Tipo '!$B$7,IF(D21=7,'[1]Tipo '!$B$8,IF(D21=8,'[1]Tipo '!$B$9,IF(D21=9,'[1]Tipo '!$B$10,IF(D21=10,'[1]Tipo '!$B$11,IF(D21=11,'[1]Tipo '!$B$12,IF(D21=12,'[1]Tipo '!$B$13,IF(D21=13,'[1]Tipo '!$B$14,IF(D21=14,'[1]Tipo '!$B$15,IF(D21=15,'[1]Tipo '!$B$16,IF(D21=16,'[1]Tipo '!$B$17,IF(D21=17,'[1]Tipo '!$B$18,IF(D21=18,'[1]Tipo '!$B$19,IF(D21=19,'[1]Tipo '!$B$20,\"No ha seleccionado un tipo de contrato válido\")))))))))))))))))))","v":"CONTRATOS DE PRESTACIÓN DE SERVICIOS"},"LICITACIÓN PÚBLICA","No aplica","Adición y Prorroga CPS-005-2016 Prestar el servicio de vigilancia y seguridad privada en la modalidad de vigilancia fija con arma y medios tecnológicos para las instalaciones donde funcionan las sedes de la Alcaldía Local De Teusaquillo, y la Junta Administradora Local de Teusaquillo así como de las personas que se encuentren en el interior de las instalaciones de los bienes muebles de propiedad de la Alcaldía y todos aquellos bienes de los que legalmente sea o llegare a ser responsable, durante la ejecución del contrato, de acuerdo a los presentes estudios previos","FUNCIONAMIENTO",null,{"$f":"IF(J21=1,'[1]Equivalencia BH-BMPT'!$D$2,IF(J21=2,'[1]Equivalencia BH-BMPT'!$D$3,IF(J21=3,'[1]Equivalencia BH-BMPT'!$D$4,IF(J21=4,'[1]Equivalencia BH-BMPT'!$D$5,IF(J21=5,'[1]Equivalencia BH-BMPT'!$D$6,IF(J21=6,'[1]Equivalencia BH-BMPT'!$D$7,IF(J21=7,'[1]Equivalencia BH-BMPT'!$D$8,IF(J21=8,'[1]Equivalencia BH-BMPT'!$D$9,IF(J21=9,'[1]Equivalencia BH-BMPT'!$D$10,IF(J21=10,'[1]Equivalencia BH-BMPT'!$D$11,IF(J21=11,'[1]Equivalencia BH-BMPT'!$D$12,IF(J21=12,'[1]Equivalencia BH-BMPT'!$D$13,IF(J21=13,'[1]Equivalencia BH-BMPT'!$D$14,IF(J21=14,'[1]Equivalencia BH-BMPT'!$D$15,IF(J21=15,'[1]Equivalencia BH-BMPT'!$D$16,IF(J21=16,'[1]Equivalencia BH-BMPT'!$D$17,IF(J21=17,'[1]Equivalencia BH-BMPT'!$D$18,IF(J21=18,'[1]Equivalencia BH-BMPT'!$D$19,IF(J21=19,'[1]Equivalencia BH-BMPT'!$D$20,IF(J21=20,'[1]Equivalencia BH-BMPT'!$D$21,IF(J21=21,'[1]Equivalencia BH-BMPT'!$D$22,IF(J21=22,'[1]Equivalencia BH-BMPT'!$D$23,IF(J21=23,'[1]Equivalencia BH-BMPT'!#REF!,IF(J21=24,'[1]Equivalencia BH-BMPT'!$D$25,IF(J21=25,'[1]Equivalencia BH-BMPT'!$D$26,IF(J21=26,'[1]Equivalencia BH-BMPT'!$D$27,IF(J21=27,'[1]Equivalencia BH-BMPT'!$D$28,IF(J21=28,'[1]Equivalencia BH-BMPT'!$D$29,IF(J21=29,'[1]Equivalencia BH-BMPT'!$D$30,IF(J21=30,'[1]Equivalencia BH-BMPT'!$D$31,IF(J21=31,'[1]Equivalencia BH-BMPT'!$D$32,IF(J21=32,'[1]Equivalencia BH-BMPT'!$D$33,IF(J21=33,'[1]Equivalencia BH-BMPT'!$D$34,IF(J21=34,'[1]Equivalencia BH-BMPT'!$D$35,IF(J21=35,'[1]Equivalencia BH-BMPT'!$D$36,IF(J21=36,'[1]Equivalencia BH-BMPT'!$D$37,IF(J21=37,'[1]Equivalencia BH-BMPT'!$D$38,IF(J21=38,'[1]Equivalencia BH-BMPT'!#REF!,IF(J21=39,'[1]Equivalencia BH-BMPT'!$D$40,IF(J21=40,'[1]Equivalencia BH-BMPT'!$D$41,IF(J21=41,'[1]Equivalencia BH-BMPT'!$D$42,IF(J21=42,'[1]Equivalencia BH-BMPT'!$D$43,IF(J21=43,'[1]Equivalencia BH-BMPT'!$D$44,IF(J21=44,'[1]Equivalencia BH-BMPT'!$D$45,IF(J21=45,'[1]Equivalencia BH-BMPT'!$D$46,\"No ha seleccionado un número de programa\")))))))))))))))))))))))))))))))))))))))))))))","v":"No ha seleccionado un número de programa"},null,860518504,"COMPANIA DE SEGURIDAD NACIONAL COMSENAL LTDA",null,null,null,null,44554044,44554044,44554044,"2016-04-28","2016-05-15","2017-07-12",300,{"$f":"90+28","v":118},null,null,null,null,"X",1]
[5,2017,"CPS 05  2017 ",5,{"$f":"IF(D22=1,'[1]Tipo '!$B$2,IF(D22=2,'[1]Tipo '!$B$3,IF(D22=3,'[1]Tipo '!$B$4,IF(D22=4,'[1]Tipo '!$B$5,IF(D22=5,'[1]Tipo '!$B$6,IF(D22=6,'[1]Tipo '!$B$7,IF(D22=7,'[1]Tipo '!$B$8,IF(D22=8,'[1]Tipo '!$B$9,IF(D22=9,'[1]Tipo '!$B$10,IF(D22=10,'[1]Tipo '!$B$11,IF(D22=11,'[1]Tipo '!$B$12,IF(D22=12,'[1]Tipo '!$B$13,IF(D22=13,'[1]Tipo '!$B$14,IF(D22=14,'[1]Tipo '!$B$15,IF(D22=15,'[1]Tipo '!$B$16,IF(D22=16,'[1]Tipo '!$B$17,IF(D22=17,'[1]Tipo '!$B$18,IF(D22=18,'[1]Tipo '!$B$19,IF(D22=19,'[1]Tipo '!$B$20,\"No ha seleccionado un tipo de contrato válido\")))))))))))))))))))","v":"CONTRATOS DE PRESTACIÓN DE SERVICIOS PROFESIONALES Y DE APOYO A LA GESTIÓN"},"CONTRATACIÓN DIRECTA","Prestación de servicios profesionales y de apoyo a la gestión, o para la ejecución de trabajos artísticos que sólo puedan encomendarse a determinadas personas naturales;","El contrato que se pretende celebrar, tendrá por objeto ¿Prestación de servicios profesionales como abogado al Área de Gestión de Desarrollo Local para adelantar trámites precontractuales y contractuales  en el marco de los proyectos previstos en el Plan de Desarrollo Local ¿Teusaquillo Mejor para Todos 2017-2020¿.","INVERSIÓN",45,{"$f":"IF(J22=1,'[1]Equivalencia BH-BMPT'!$D$2,IF(J22=2,'[1]Equivalencia BH-BMPT'!$D$3,IF(J22=3,'[1]Equivalencia BH-BMPT'!$D$4,IF(J22=4,'[1]Equivalencia BH-BMPT'!$D$5,IF(J22=5,'[1]Equivalencia BH-BMPT'!$D$6,IF(J22=6,'[1]Equivalencia BH-BMPT'!$D$7,IF(J22=7,'[1]Equivalencia BH-BMPT'!$D$8,IF(J22=8,'[1]Equivalencia BH-BMPT'!$D$9,IF(J22=9,'[1]Equivalencia BH-BMPT'!$D$10,IF(J22=10,'[1]Equivalencia BH-BMPT'!$D$11,IF(J22=11,'[1]Equivalencia BH-BMPT'!$D$12,IF(J22=12,'[1]Equivalencia BH-BMPT'!$D$13,IF(J22=13,'[1]Equivalencia BH-BMPT'!$D$14,IF(J22=14,'[1]Equivalencia BH-BMPT'!$D$15,IF(J22=15,'[1]Equivalencia BH-BMPT'!$D$16,IF(J22=16,'[1]Equivalencia BH-BMPT'!$D$17,IF(J22=17,'[1]Equivalencia BH-BMPT'!$D$18,IF(J22=18,'[1]Equivalencia BH-BMPT'!$D$19,IF(J22=19,'[1]Equivalencia BH-BMPT'!$D$20,IF(J22=20,'[1]Equivalencia BH-BMPT'!$D$21,IF(J22=21,'[1]Equivalencia BH-BMPT'!$D$22,IF(J22=22,'[1]Equivalencia BH-BMPT'!$D$23,IF(J22=23,'[1]Equivalencia BH-BMPT'!#REF!,IF(J22=24,'[1]Equivalencia BH-BMPT'!$D$25,IF(J22=25,'[1]Equivalencia BH-BMPT'!$D$26,IF(J22=26,'[1]Equivalencia BH-BMPT'!$D$27,IF(J22=27,'[1]Equivalencia BH-BMPT'!$D$28,IF(J22=28,'[1]Equivalencia BH-BMPT'!$D$29,IF(J22=29,'[1]Equivalencia BH-BMPT'!$D$30,IF(J22=30,'[1]Equivalencia BH-BMPT'!$D$31,IF(J22=31,'[1]Equivalencia BH-BMPT'!$D$32,IF(J22=32,'[1]Equivalencia BH-BMPT'!$D$33,IF(J22=33,'[1]Equivalencia BH-BMPT'!$D$34,IF(J22=34,'[1]Equivalencia BH-BMPT'!$D$35,IF(J22=35,'[1]Equivalencia BH-BMPT'!$D$36,IF(J22=36,'[1]Equivalencia BH-BMPT'!$D$37,IF(J22=37,'[1]Equivalencia BH-BMPT'!$D$38,IF(J22=38,'[1]Equivalencia BH-BMPT'!#REF!,IF(J22=39,'[1]Equivalencia BH-BMPT'!$D$40,IF(J22=40,'[1]Equivalencia BH-BMPT'!$D$41,IF(J22=41,'[1]Equivalencia BH-BMPT'!$D$42,IF(J22=42,'[1]Equivalencia BH-BMPT'!$D$43,IF(J22=43,'[1]Equivalencia BH-BMPT'!$D$44,IF(J22=44,'[1]Equivalencia BH-BMPT'!$D$45,IF(J22=45,'[1]Equivalencia BH-BMPT'!$D$46,\"No ha seleccionado un número de programa\")))))))))))))))))))))))))))))))))))))))))))))","v":"Gobernanza e influencia local, regional e internacional"},1329,53166511,"ANGELA JOHANNA FRANCO CHAVES",44000000,null,null,null,0,44000000,44000000,"2017-02-10","2017-02-10","2017-10-09",240,0,null,null,null,null,"X",1]
[6,2017,null,10,{"$f":"IF(D23=1,'[1]Tipo '!$B$2,IF(D23=2,'[1]Tipo '!$B$3,IF(D23=3,'[1]Tipo '!$B$4,IF(D23=4,'[1]Tipo '!$B$5,IF(D23=5,'[1]Tipo '!$B$6,IF(D23=6,'[1]Tipo '!$B$7,IF(D23=7,'[1]Tipo '!$B$8,IF(D23=8,'[1]Tipo '!$B$9,IF(D23=9,'[1]Tipo '!$B$10,IF(D23=10,'[1]Tipo '!$B$11,IF(D23=11,'[1]Tipo '!$B$12,IF(D23=12,'[1]Tipo '!$B$13,IF(D23=13,'[1]Tipo '!$B$14,IF(D23=14,'[1]Tipo '!$B$15,IF(D23=15,'[1]Tipo '!$B$16,IF(D23=16,'[1]Tipo '!$B$17,IF(D23=17,'[1]Tipo '!$B$18,IF(D23=18,'[1]Tipo '!$B$19,IF(D23=19,'[1]Tipo '!$B$20,\"No ha seleccionado un tipo de contrato válido\")))))))))))))))))))","v":"SEGUROS"},"Selección abreviada ","Selección abreviada por menor cuantía ","Adicionar el contrato 006 DEL 2016 cuyo objeto es ¿Adquirir la póliza de vida grupo de  ediles de la Localidad  de Teusaquillo, con compañías de seguros generales y/o de vida legalmente constituidas en Colombia, de acuerdo a los presentes estudios previos y pliego de condiciones¿","FUNCIONAMIENTO",null,{"$f":"IF(J23=1,'[1]Equivalencia BH-BMPT'!$D$2,IF(J23=2,'[1]Equivalencia BH-BMPT'!$D$3,IF(J23=3,'[1]Equivalencia BH-BMPT'!$D$4,IF(J23=4,'[1]Equivalencia BH-BMPT'!$D$5,IF(J23=5,'[1]Equivalencia BH-BMPT'!$D$6,IF(J23=6,'[1]Equivalencia BH-BMPT'!$D$7,IF(J23=7,'[1]Equivalencia BH-BMPT'!$D$8,IF(J23=8,'[1]Equivalencia BH-BMPT'!$D$9,IF(J23=9,'[1]Equivalencia BH-BMPT'!$D$10,IF(J23=10,'[1]Equivalencia BH-BMPT'!$D$11,IF(J23=11,'[1]Equivalencia BH-BMPT'!$D$12,IF(J23=12,'[1]Equivalencia BH-BMPT'!$D$13,IF(J23=13,'[1]Equivalencia BH-BMPT'!$D$14,IF(J23=14,'[1]Equivalencia BH-BMPT'!$D$15,IF(J23=15,'[1]Equivalencia BH-BMPT'!$D$16,IF(J23=16,'[1]Equivalencia BH-BMPT'!$D$17,IF(J23=17,'[1]Equivalencia BH-BMPT'!$D$18,IF(J23=18,'[1]Equivalencia BH-BMPT'!$D$19,IF(J23=19,'[1]Equivalencia BH-BMPT'!$D$20,IF(J23=20,'[1]Equivalencia BH-BMPT'!$D$21,IF(J23=21,'[1]Equivalencia BH-BMPT'!$D$22,IF(J23=22,'[1]Equivalencia BH-BMPT'!$D$23,IF(J23=23,'[1]Equivalencia BH-BMPT'!#REF!,IF(J23=24,'[1]Equivalencia BH-BMPT'!$D$25,IF(J23=25,'[1]Equivalencia BH-BMPT'!$D$26,IF(J23=26,'[1]Equivalencia BH-BMPT'!$D$27,IF(J23=27,'[1]Equivalencia BH-BMPT'!$D$28,IF(J23=28,'[1]Equivalencia BH-BMPT'!$D$29,IF(J23=29,'[1]Equivalencia BH-BMPT'!$D$30,IF(J23=30,'[1]Equivalencia BH-BMPT'!$D$31,IF(J23=31,'[1]Equivalencia BH-BMPT'!$D$32,IF(J23=32,'[1]Equivalencia BH-BMPT'!$D$33,IF(J23=33,'[1]Equivalencia BH-BMPT'!$D$34,IF(J23=34,'[1]Equivalencia BH-BMPT'!$D$35,IF(J23=35,'[1]Equivalencia BH-BMPT'!$D$36,IF(J23=36,'[1]Equivalencia BH-BMPT'!$D$37,IF(J23=37,'[1]Equivalencia BH-BMPT'!$D$38,IF(J23=38,'[1]Equivalencia BH-BMPT'!#REF!,IF(J23=39,'[1]Equivalencia BH-BMPT'!$D$40,IF(J23=40,'[1]Equivalencia BH-BMPT'!$D$41,IF(J23=41,'[1]Equivalencia BH-BMPT'!$D$42,IF(J23=42,'[1]Equivalencia BH-BMPT'!$D$43,IF(J23=43,'[1]Equivalencia BH-BMPT'!$D$44,IF(J23=44,'[1]Equivalencia BH-BMPT'!$D$45,IF(J23=45,'[1]Equivalencia BH-BMPT'!$D$46,\"No ha seleccionado un número de programa\")))))))))))))))))))))))))))))))))))))))))))))","v":"No ha seleccionado un número de programa"},null,860002400,"LA PREVISORA S A COMPAÑIA DE SEGUROS",null,null,null,null,3497233,3497233,3497233,"2016-05-16","2016-05-17","2017-08-11",365,87,null,null,null,"X",null,1]
[6,2017,"CPS 06  2017 ",5,{"$f":"IF(D24=1,'[1]Tipo '!$B$2,IF(D24=2,'[1]Tipo '!$B$3,IF(D24=3,'[1]Tipo '!$B$4,IF(D24=4,'[1]Tipo '!$B$5,IF(D24=5,'[1]Tipo '!$B$6,IF(D24=6,'[1]Tipo '!$B$7,IF(D24=7,'[1]Tipo '!$B$8,IF(D24=8,'[1]Tipo '!$B$9,IF(D24=9,'[1]Tipo '!$B$10,IF(D24=10,'[1]Tipo '!$B$11,IF(D24=11,'[1]Tipo '!$B$12,IF(D24=12,'[1]Tipo '!$B$13,IF(D24=13,'[1]Tipo '!$B$14,IF(D24=14,'[1]Tipo '!$B$15,IF(D24=15,'[1]Tipo '!$B$16,IF(D24=16,'[1]Tipo '!$B$17,IF(D24=17,'[1]Tipo '!$B$18,IF(D24=18,'[1]Tipo '!$B$19,IF(D24=19,'[1]Tipo '!$B$20,\"No ha seleccionado un tipo de contrato válido\")))))))))))))))))))","v":"CONTRATOS DE PRESTACIÓN DE SERVICIOS PROFESIONALES Y DE APOYO A LA GESTIÓN"},"CONTRATACIÓN DIRECTA","Prestación de servicios profesionales y de apoyo a la gestión, o para la ejecución de trabajos artísticos que sólo puedan encomendarse a determinadas personas naturales;","El contrato que se pretende celebrar, tendrá por objeto ¿El contratista se obliga para con el Fondo a prestar sus servicios de apoyo en la conducción de los vehículos de propiedad del Fondo de Desarrollo Local de Teusaquillo incluido el vehículo asignado al despacho del Alcalde Local¿.","INVERSIÓN",45,{"$f":"IF(J24=1,'[1]Equivalencia BH-BMPT'!$D$2,IF(J24=2,'[1]Equivalencia BH-BMPT'!$D$3,IF(J24=3,'[1]Equivalencia BH-BMPT'!$D$4,IF(J24=4,'[1]Equivalencia BH-BMPT'!$D$5,IF(J24=5,'[1]Equivalencia BH-BMPT'!$D$6,IF(J24=6,'[1]Equivalencia BH-BMPT'!$D$7,IF(J24=7,'[1]Equivalencia BH-BMPT'!$D$8,IF(J24=8,'[1]Equivalencia BH-BMPT'!$D$9,IF(J24=9,'[1]Equivalencia BH-BMPT'!$D$10,IF(J24=10,'[1]Equivalencia BH-BMPT'!$D$11,IF(J24=11,'[1]Equivalencia BH-BMPT'!$D$12,IF(J24=12,'[1]Equivalencia BH-BMPT'!$D$13,IF(J24=13,'[1]Equivalencia BH-BMPT'!$D$14,IF(J24=14,'[1]Equivalencia BH-BMPT'!$D$15,IF(J24=15,'[1]Equivalencia BH-BMPT'!$D$16,IF(J24=16,'[1]Equivalencia BH-BMPT'!$D$17,IF(J24=17,'[1]Equivalencia BH-BMPT'!$D$18,IF(J24=18,'[1]Equivalencia BH-BMPT'!$D$19,IF(J24=19,'[1]Equivalencia BH-BMPT'!$D$20,IF(J24=20,'[1]Equivalencia BH-BMPT'!$D$21,IF(J24=21,'[1]Equivalencia BH-BMPT'!$D$22,IF(J24=22,'[1]Equivalencia BH-BMPT'!$D$23,IF(J24=23,'[1]Equivalencia BH-BMPT'!#REF!,IF(J24=24,'[1]Equivalencia BH-BMPT'!$D$25,IF(J24=25,'[1]Equivalencia BH-BMPT'!$D$26,IF(J24=26,'[1]Equivalencia BH-BMPT'!$D$27,IF(J24=27,'[1]Equivalencia BH-BMPT'!$D$28,IF(J24=28,'[1]Equivalencia BH-BMPT'!$D$29,IF(J24=29,'[1]Equivalencia BH-BMPT'!$D$30,IF(J24=30,'[1]Equivalencia BH-BMPT'!$D$31,IF(J24=31,'[1]Equivalencia BH-BMPT'!$D$32,IF(J24=32,'[1]Equivalencia BH-BMPT'!$D$33,IF(J24=33,'[1]Equivalencia BH-BMPT'!$D$34,IF(J24=34,'[1]Equivalencia BH-BMPT'!$D$35,IF(J24=35,'[1]Equivalencia BH-BMPT'!$D$36,IF(J24=36,'[1]Equivalencia BH-BMPT'!$D$37,IF(J24=37,'[1]Equivalencia BH-BMPT'!$D$38,IF(J24=38,'[1]Equivalencia BH-BMPT'!#REF!,IF(J24=39,'[1]Equivalencia BH-BMPT'!$D$40,IF(J24=40,'[1]Equivalencia BH-BMPT'!$D$41,IF(J24=41,'[1]Equivalencia BH-BMPT'!$D$42,IF(J24=42,'[1]Equivalencia BH-BMPT'!$D$43,IF(J24=43,'[1]Equivalencia BH-BMPT'!$D$44,IF(J24=44,'[1]Equivalencia BH-BMPT'!$D$45,IF(J24=45,'[1]Equivalencia BH-BMPT'!$D$46,\"No ha seleccionado un número de programa\")))))))))))))))))))))))))))))))))))))))))))))","v":"Gobernanza e influencia local, regional e internacional"},1329,53102450,"DIANA MARIA ANGULO PRADO",16800000,null,null,null,5600000,22400000,16800000,"2017-02-10","2017-02-10","2017-12-29",240,80,null,null,null,"X",null,1]
[7,2017,"CPS 07  2017 ",5,{"$f":"IF(D25=1,'[1]Tipo '!$B$2,IF(D25=2,'[1]Tipo '!$B$3,IF(D25=3,'[1]Tipo '!$B$4,IF(D25=4,'[1]Tipo '!$B$5,IF(D25=5,'[1]Tipo '!$B$6,IF(D25=6,'[1]Tipo '!$B$7,IF(D25=7,'[1]Tipo '!$B$8,IF(D25=8,'[1]Tipo '!$B$9,IF(D25=9,'[1]Tipo '!$B$10,IF(D25=10,'[1]Tipo '!$B$11,IF(D25=11,'[1]Tipo '!$B$12,IF(D25=12,'[1]Tipo '!$B$13,IF(D25=13,'[1]Tipo '!$B$14,IF(D25=14,'[1]Tipo '!$B$15,IF(D25=15,'[1]Tipo '!$B$16,IF(D25=16,'[1]Tipo '!$B$17,IF(D25=17,'[1]Tipo '!$B$18,IF(D25=18,'[1]Tipo '!$B$19,IF(D25=19,'[1]Tipo '!$B$20,\"No ha seleccionado un tipo de contrato válido\")))))))))))))))))))","v":"CONTRATOS DE PRESTACIÓN DE SERVICIOS PROFESIONALES Y DE APOYO A LA GESTIÓN"},"CONTRATACIÓN DIRECTA","Prestación de servicios profesionales y de apoyo a la gestión, o para la ejecución de trabajos artísticos que sólo puedan encomendarse a determinadas personas naturales;","El contrato que se pretende celebrar, tendrá por objeto ¿Prestación de servicios profesionales como abogado para apoyar los asuntos legales y contractuales del Área de Gestión de Desarrollo Local¿.","INVERSIÓN",45,{"$f":"IF(J25=1,'[1]Equivalencia BH-BMPT'!$D$2,IF(J25=2,'[1]Equivalencia BH-BMPT'!$D$3,IF(J25=3,'[1]Equivalencia BH-BMPT'!$D$4,IF(J25=4,'[1]Equivalencia BH-BMPT'!$D$5,IF(J25=5,'[1]Equivalencia BH-BMPT'!$D$6,IF(J25=6,'[1]Equivalencia BH-BMPT'!$D$7,IF(J25=7,'[1]Equivalencia BH-BMPT'!$D$8,IF(J25=8,'[1]Equivalencia BH-BMPT'!$D$9,IF(J25=9,'[1]Equivalencia BH-BMPT'!$D$10,IF(J25=10,'[1]Equivalencia BH-BMPT'!$D$11,IF(J25=11,'[1]Equivalencia BH-BMPT'!$D$12,IF(J25=12,'[1]Equivalencia BH-BMPT'!$D$13,IF(J25=13,'[1]Equivalencia BH-BMPT'!$D$14,IF(J25=14,'[1]Equivalencia BH-BMPT'!$D$15,IF(J25=15,'[1]Equivalencia BH-BMPT'!$D$16,IF(J25=16,'[1]Equivalencia BH-BMPT'!$D$17,IF(J25=17,'[1]Equivalencia BH-BMPT'!$D$18,IF(J25=18,'[1]Equivalencia BH-BMPT'!$D$19,IF(J25=19,'[1]Equivalencia BH-BMPT'!$D$20,IF(J25=20,'[1]Equivalencia BH-BMPT'!$D$21,IF(J25=21,'[1]Equivalencia BH-BMPT'!$D$22,IF(J25=22,'[1]Equivalencia BH-BMPT'!$D$23,IF(J25=23,'[1]Equivalencia BH-BMPT'!#REF!,IF(J25=24,'[1]Equivalencia BH-BMPT'!$D$25,IF(J25=25,'[1]Equivalencia BH-BMPT'!$D$26,IF(J25=26,'[1]Equivalencia BH-BMPT'!$D$27,IF(J25=27,'[1]Equivalencia BH-BMPT'!$D$28,IF(J25=28,'[1]Equivalencia BH-BMPT'!$D$29,IF(J25=29,'[1]Equivalencia BH-BMPT'!$D$30,IF(J25=30,'[1]Equivalencia BH-BMPT'!$D$31,IF(J25=31,'[1]Equivalencia BH-BMPT'!$D$32,IF(J25=32,'[1]Equivalencia BH-BMPT'!$D$33,IF(J25=33,'[1]Equivalencia BH-BMPT'!$D$34,IF(J25=34,'[1]Equivalencia BH-BMPT'!$D$35,IF(J25=35,'[1]Equivalencia BH-BMPT'!$D$36,IF(J25=36,'[1]Equivalencia BH-BMPT'!$D$37,IF(J25=37,'[1]Equivalencia BH-BMPT'!$D$38,IF(J25=38,'[1]Equivalencia BH-BMPT'!#REF!,IF(J25=39,'[1]Equivalencia BH-BMPT'!$D$40,IF(J25=40,'[1]Equivalencia BH-BMPT'!$D$41,IF(J25=41,'[1]Equivalencia BH-BMPT'!$D$42,IF(J25=42,'[1]Equivalencia BH-BMPT'!$D$43,IF(J25=43,'[1]Equivalencia BH-BMPT'!$D$44,IF(J25=44,'[1]Equivalencia BH-BMPT'!$D$45,IF(J25=45,'[1]Equivalencia BH-BMPT'!$D$46,\"No ha seleccionado un número de programa\")))))))))))))))))))))))))))))))))))))))))))))","v":"Gobernanza e influencia local, regional e internacional"},1329,1014213880,"LINA MARCELA FLOREZ CARDENAS",32459552,null,null,null,12442827,44902379,41250681,"2017-02-10","2017-02-10","2018-01-10",240,92,null,null,"X",null,null,0.91867473213390316]
[8,2017,"CPS 08 2017 ",5,{"$f":"IF(D26=1,'[1]Tipo '!$B$2,IF(D26=2,'[1]Tipo '!$B$3,IF(D26=3,'[1]Tipo '!$B$4,IF(D26=4,'[1]Tipo '!$B$5,IF(D26=5,'[1]Tipo '!$B$6,IF(D26=6,'[1]Tipo '!$B$7,IF(D26=7,'[1]Tipo '!$B$8,IF(D26=8,'[1]Tipo '!$B$9,IF(D26=9,'[1]Tipo '!$B$10,IF(D26=10,'[1]Tipo '!$B$11,IF(D26=11,'[1]Tipo '!$B$12,IF(D26=12,'[1]Tipo '!$B$13,IF(D26=13,'[1]Tipo '!$B$14,IF(D26=14,'[1]Tipo '!$B$15,IF(D26=15,'[1]Tipo '!$B$16,IF(D26=16,'[1]Tipo '!$B$17,IF(D26=17,'[1]Tipo '!$B$18,IF(D26=18,'[1]Tipo '!$B$19,IF(D26=19,'[1]Tipo '!$B$20,\"No ha seleccionado un tipo de contrato válido\")))))))))))))))))))","v":"CONTRATOS DE PRESTACIÓN DE SERVICIOS PROFESIONALES Y DE APOYO A LA GESTIÓN"},"CONTRATACIÓN DIRECTA","Prestación de servicios profesionales y de apoyo a la gestión, o para la ejecución de trabajos artísticos que sólo puedan encomendarse a determinadas personas naturales;","El contrato que se pretende celebrar, tendrá por objeto ¿Prestación de servicios profesionales como abogado al Área de Gestión de Desarrollo Local para adelantar trámites precontractuales y contractuales  en el marco de los proyectos previstos en el Plan de Desarrollo Local ¿Teusaquillo Mejor para Todos 2017-2020¿.","INVERSIÓN",45,{"$f":"IF(J26=1,'[1]Equivalencia BH-BMPT'!$D$2,IF(J26=2,'[1]Equivalencia BH-BMPT'!$D$3,IF(J26=3,'[1]Equivalencia BH-BMPT'!$D$4,IF(J26=4,'[1]Equivalencia BH-BMPT'!$D$5,IF(J26=5,'[1]Equivalencia BH-BMPT'!$D$6,IF(J26=6,'[1]Equivalencia BH-BMPT'!$D$7,IF(J26=7,'[1]Equivalencia BH-BMPT'!$D$8,IF(J26=8,'[1]Equivalencia BH-BMPT'!$D$9,IF(J26=9,'[1]Equivalencia BH-BMPT'!$D$10,IF(J26=10,'[1]Equivalencia BH-BMPT'!$D$11,IF(J26=11,'[1]Equivalencia BH-BMPT'!$D$12,IF(J26=12,'[1]Equivalencia BH-BMPT'!$D$13,IF(J26=13,'[1]Equivalencia BH-BMPT'!$D$14,IF(J26=14,'[1]Equivalencia BH-BMPT'!$D$15,IF(J26=15,'[1]Equivalencia BH-BMPT'!$D$16,IF(J26=16,'[1]Equivalencia BH-BMPT'!$D$17,IF(J26=17,'[1]Equivalencia BH-BMPT'!$D$18,IF(J26=18,'[1]Equivalencia BH-BMPT'!$D$19,IF(J26=19,'[1]Equivalencia BH-BMPT'!$D$20,IF(J26=20,'[1]Equivalencia BH-BMPT'!$D$21,IF(J26=21,'[1]Equivalencia BH-BMPT'!$D$22,IF(J26=22,'[1]Equivalencia BH-BMPT'!$D$23,IF(J26=23,'[1]Equivalencia BH-BMPT'!#REF!,IF(J26=24,'[1]Equivalencia BH-BMPT'!$D$25,IF(J26=25,'[1]Equivalencia BH-BMPT'!$D$26,IF(J26=26,'[1]Equivalencia BH-BMPT'!$D$27,IF(J26=27,'[1]Equivalencia BH-BMPT'!$D$28,IF(J26=28,'[1]Equivalencia BH-BMPT'!$D$29,IF(J26=29,'[1]Equivalencia BH-BMPT'!$D$30,IF(J26=30,'[1]Equivalencia BH-BMPT'!$D$31,IF(J26=31,'[1]Equivalencia BH-BMPT'!$D$32,IF(J26=32,'[1]Equivalencia BH-BMPT'!$D$33,IF(J26=33,'[1]Equivalencia BH-BMPT'!$D$34,IF(J26=34,'[1]Equivalencia BH-BMPT'!$D$35,IF(J26=35,'[1]Equivalencia BH-BMPT'!$D$36,IF(J26=36,'[1]Equivalencia BH-BMPT'!$D$37,IF(J26=37,'[1]Equivalencia BH-BMPT'!$D$38,IF(J26=38,'[1]Equivalencia BH-BMPT'!#REF!,IF(J26=39,'[1]Equivalencia BH-BMPT'!$D$40,IF(J26=40,'[1]Equivalencia BH-BMPT'!$D$41,IF(J26=41,'[1]Equivalencia BH-BMPT'!$D$42,IF(J26=42,'[1]Equivalencia BH-BMPT'!$D$43,IF(J26=43,'[1]Equivalencia BH-BMPT'!$D$44,IF(J26=44,'[1]Equivalencia BH-BMPT'!$D$45,IF(J26=45,'[1]Equivalencia BH-BMPT'!$D$46,\"No ha seleccionado un número de programa\")))))))))))))))))))))))))))))))))))))))))))))","v":"Gobernanza e influencia local, regional e internacional"},1329,52430619,"CLARA LILIANA MEJIA ORTIZ",44000000,null,null,null,16866666,60866666,55916666,"2017-02-10","2017-02-10","2018-01-10",240,92,null,null,"X",null,null,0.91867469790443257]
[9,2017,"CPS 009 17 ",5,{"$f":"IF(D27=1,'[1]Tipo '!$B$2,IF(D27=2,'[1]Tipo '!$B$3,IF(D27=3,'[1]Tipo '!$B$4,IF(D27=4,'[1]Tipo '!$B$5,IF(D27=5,'[1]Tipo '!$B$6,IF(D27=6,'[1]Tipo '!$B$7,IF(D27=7,'[1]Tipo '!$B$8,IF(D27=8,'[1]Tipo '!$B$9,IF(D27=9,'[1]Tipo '!$B$10,IF(D27=10,'[1]Tipo '!$B$11,IF(D27=11,'[1]Tipo '!$B$12,IF(D27=12,'[1]Tipo '!$B$13,IF(D27=13,'[1]Tipo '!$B$14,IF(D27=14,'[1]Tipo '!$B$15,IF(D27=15,'[1]Tipo '!$B$16,IF(D27=16,'[1]Tipo '!$B$17,IF(D27=17,'[1]Tipo '!$B$18,IF(D27=18,'[1]Tipo '!$B$19,IF(D27=19,'[1]Tipo '!$B$20,\"No ha seleccionado un tipo de contrato válido\")))))))))))))))))))","v":"CONTRATOS DE PRESTACIÓN DE SERVICIOS PROFESIONALES Y DE APOYO A LA GESTIÓN"},"CONTRATACIÓN DIRECTA","Prestación de servicios profesionales y de apoyo a la gestión, o para la ejecución de trabajos artísticos que sólo puedan encomendarse a determinadas personas naturales;","El contrato que se pretende celebrar, tendrá por objeto¿La Prestación de servicios profesionales como abogado al Área de Gestión de Desarrollo Local,  para coadyuvar el proceso de depuración de obligaciones por pagar y el trámite e impulso a la liquidación de contratos suscritos con cargo a los recursos del Fondo de Desarrollo Local.¿","INVERSIÓN",45,{"$f":"IF(J27=1,'[1]Equivalencia BH-BMPT'!$D$2,IF(J27=2,'[1]Equivalencia BH-BMPT'!$D$3,IF(J27=3,'[1]Equivalencia BH-BMPT'!$D$4,IF(J27=4,'[1]Equivalencia BH-BMPT'!$D$5,IF(J27=5,'[1]Equivalencia BH-BMPT'!$D$6,IF(J27=6,'[1]Equivalencia BH-BMPT'!$D$7,IF(J27=7,'[1]Equivalencia BH-BMPT'!$D$8,IF(J27=8,'[1]Equivalencia BH-BMPT'!$D$9,IF(J27=9,'[1]Equivalencia BH-BMPT'!$D$10,IF(J27=10,'[1]Equivalencia BH-BMPT'!$D$11,IF(J27=11,'[1]Equivalencia BH-BMPT'!$D$12,IF(J27=12,'[1]Equivalencia BH-BMPT'!$D$13,IF(J27=13,'[1]Equivalencia BH-BMPT'!$D$14,IF(J27=14,'[1]Equivalencia BH-BMPT'!$D$15,IF(J27=15,'[1]Equivalencia BH-BMPT'!$D$16,IF(J27=16,'[1]Equivalencia BH-BMPT'!$D$17,IF(J27=17,'[1]Equivalencia BH-BMPT'!$D$18,IF(J27=18,'[1]Equivalencia BH-BMPT'!$D$19,IF(J27=19,'[1]Equivalencia BH-BMPT'!$D$20,IF(J27=20,'[1]Equivalencia BH-BMPT'!$D$21,IF(J27=21,'[1]Equivalencia BH-BMPT'!$D$22,IF(J27=22,'[1]Equivalencia BH-BMPT'!$D$23,IF(J27=23,'[1]Equivalencia BH-BMPT'!#REF!,IF(J27=24,'[1]Equivalencia BH-BMPT'!$D$25,IF(J27=25,'[1]Equivalencia BH-BMPT'!$D$26,IF(J27=26,'[1]Equivalencia BH-BMPT'!$D$27,IF(J27=27,'[1]Equivalencia BH-BMPT'!$D$28,IF(J27=28,'[1]Equivalencia BH-BMPT'!$D$29,IF(J27=29,'[1]Equivalencia BH-BMPT'!$D$30,IF(J27=30,'[1]Equivalencia BH-BMPT'!$D$31,IF(J27=31,'[1]Equivalencia BH-BMPT'!$D$32,IF(J27=32,'[1]Equivalencia BH-BMPT'!$D$33,IF(J27=33,'[1]Equivalencia BH-BMPT'!$D$34,IF(J27=34,'[1]Equivalencia BH-BMPT'!$D$35,IF(J27=35,'[1]Equivalencia BH-BMPT'!$D$36,IF(J27=36,'[1]Equivalencia BH-BMPT'!$D$37,IF(J27=37,'[1]Equivalencia BH-BMPT'!$D$38,IF(J27=38,'[1]Equivalencia BH-BMPT'!#REF!,IF(J27=39,'[1]Equivalencia BH-BMPT'!$D$40,IF(J27=40,'[1]Equivalencia BH-BMPT'!$D$41,IF(J27=41,'[1]Equivalencia BH-BMPT'!$D$42,IF(J27=42,'[1]Equivalencia BH-BMPT'!$D$43,IF(J27=43,'[1]Equivalencia BH-BMPT'!$D$44,IF(J27=44,'[1]Equivalencia BH-BMPT'!$D$45,IF(J27=45,'[1]Equivalencia BH-BMPT'!$D$46,\"No ha seleccionado un número de programa\")))))))))))))))))))))))))))))))))))))))))))))","v":"Gobernanza e influencia local, regional e internacional"},1329,79235519,"GUSTAVO HERNANDO JIMENEZ SANDOVAL",44000000,null,null,null,0,44000000,44000000,"2017-02-10","2017-02-10","2017-10-09",240,0,null,null,null,null,"X",1]
[10,2017,"CPS 010 2017 ",5,{"$f":"IF(D28=1,'[1]Tipo '!$B$2,IF(D28=2,'[1]Tipo '!$B$3,IF(D28=3,'[1]Tipo '!$B$4,IF(D28=4,'[1]Tipo '!$B$5,IF(D28=5,'[1]Tipo '!$B$6,IF(D28=6,'[1]Tipo '!$B$7,IF(D28=7,'[1]Tipo '!$B$8,IF(D28=8,'[1]Tipo '!$B$9,IF(D28=9,'[1]Tipo '!$B$10,IF(D28=10,'[1]Tipo '!$B$11,IF(D28=11,'[1]Tipo '!$B$12,IF(D28=12,'[1]Tipo '!$B$13,IF(D28=13,'[1]Tipo '!$B$14,IF(D28=14,'[1]Tipo '!$B$15,IF(D28=15,'[1]Tipo '!$B$16,IF(D28=16,'[1]Tipo '!$B$17,IF(D28=17,'[1]Tipo '!$B$18,IF(D28=18,'[1]Tipo '!$B$19,IF(D28=19,'[1]Tipo '!$B$20,\"No ha seleccionado un tipo de contrato válido\")))))))))))))))))))","v":"CONTRATOS DE PRESTACIÓN DE SERVICIOS PROFESIONALES Y DE APOYO A LA GESTIÓN"},"CONTRATACIÓN DIRECTA","Prestación de servicios profesionales y de apoyo a la gestión, o para la ejecución de trabajos artísticos que sólo puedan encomendarse a determinadas personas naturales;","El contrato que se pretende celebrar, tendrá por objeto ¿EL CONTRATISTA SE OBLIGA PARA CON EL FONDO A PRESTAR SUS SERVICIOS TÉCNICOS DE APOYO EN EL AREA DE  GESTION DE DESARROLLO LOCAL-PLANEACION","INVERSIÓN",45,{"$f":"IF(J28=1,'[1]Equivalencia BH-BMPT'!$D$2,IF(J28=2,'[1]Equivalencia BH-BMPT'!$D$3,IF(J28=3,'[1]Equivalencia BH-BMPT'!$D$4,IF(J28=4,'[1]Equivalencia BH-BMPT'!$D$5,IF(J28=5,'[1]Equivalencia BH-BMPT'!$D$6,IF(J28=6,'[1]Equivalencia BH-BMPT'!$D$7,IF(J28=7,'[1]Equivalencia BH-BMPT'!$D$8,IF(J28=8,'[1]Equivalencia BH-BMPT'!$D$9,IF(J28=9,'[1]Equivalencia BH-BMPT'!$D$10,IF(J28=10,'[1]Equivalencia BH-BMPT'!$D$11,IF(J28=11,'[1]Equivalencia BH-BMPT'!$D$12,IF(J28=12,'[1]Equivalencia BH-BMPT'!$D$13,IF(J28=13,'[1]Equivalencia BH-BMPT'!$D$14,IF(J28=14,'[1]Equivalencia BH-BMPT'!$D$15,IF(J28=15,'[1]Equivalencia BH-BMPT'!$D$16,IF(J28=16,'[1]Equivalencia BH-BMPT'!$D$17,IF(J28=17,'[1]Equivalencia BH-BMPT'!$D$18,IF(J28=18,'[1]Equivalencia BH-BMPT'!$D$19,IF(J28=19,'[1]Equivalencia BH-BMPT'!$D$20,IF(J28=20,'[1]Equivalencia BH-BMPT'!$D$21,IF(J28=21,'[1]Equivalencia BH-BMPT'!$D$22,IF(J28=22,'[1]Equivalencia BH-BMPT'!$D$23,IF(J28=23,'[1]Equivalencia BH-BMPT'!#REF!,IF(J28=24,'[1]Equivalencia BH-BMPT'!$D$25,IF(J28=25,'[1]Equivalencia BH-BMPT'!$D$26,IF(J28=26,'[1]Equivalencia BH-BMPT'!$D$27,IF(J28=27,'[1]Equivalencia BH-BMPT'!$D$28,IF(J28=28,'[1]Equivalencia BH-BMPT'!$D$29,IF(J28=29,'[1]Equivalencia BH-BMPT'!$D$30,IF(J28=30,'[1]Equivalencia BH-BMPT'!$D$31,IF(J28=31,'[1]Equivalencia BH-BMPT'!$D$32,IF(J28=32,'[1]Equivalencia BH-BMPT'!$D$33,IF(J28=33,'[1]Equivalencia BH-BMPT'!$D$34,IF(J28=34,'[1]Equivalencia BH-BMPT'!$D$35,IF(J28=35,'[1]Equivalencia BH-BMPT'!$D$36,IF(J28=36,'[1]Equivalencia BH-BMPT'!$D$37,IF(J28=37,'[1]Equivalencia BH-BMPT'!$D$38,IF(J28=38,'[1]Equivalencia BH-BMPT'!#REF!,IF(J28=39,'[1]Equivalencia BH-BMPT'!$D$40,IF(J28=40,'[1]Equivalencia BH-BMPT'!$D$41,IF(J28=41,'[1]Equivalencia BH-BMPT'!$D$42,IF(J28=42,'[1]Equivalencia BH-BMPT'!$D$43,IF(J28=43,'[1]Equivalencia BH-BMPT'!$D$44,IF(J28=44,'[1]Equivalencia BH-BMPT'!$D$45,IF(J28=45,'[1]Equivalencia BH-BMPT'!$D$46,\"No ha seleccionado un número de programa\")))))))))))))))))))))))))))))))))))))))))))))","v":"Gobernanza e influencia local, regional e internacional"},1329,51907536,"GLORIA MATILDE SANTANA CASALLAS",21600000,null,null,null,8280000,29880000,27450000,"2017-02-10","2017-02-10","2018-01-10",240,92,null,null,"X",null,null,0.91867469879518071]
[11,2017,"CPS 011 2017 ",5,{"$f":"IF(D29=1,'[1]Tipo '!$B$2,IF(D29=2,'[1]Tipo '!$B$3,IF(D29=3,'[1]Tipo '!$B$4,IF(D29=4,'[1]Tipo '!$B$5,IF(D29=5,'[1]Tipo '!$B$6,IF(D29=6,'[1]Tipo '!$B$7,IF(D29=7,'[1]Tipo '!$B$8,IF(D29=8,'[1]Tipo '!$B$9,IF(D29=9,'[1]Tipo '!$B$10,IF(D29=10,'[1]Tipo '!$B$11,IF(D29=11,'[1]Tipo '!$B$12,IF(D29=12,'[1]Tipo '!$B$13,IF(D29=13,'[1]Tipo '!$B$14,IF(D29=14,'[1]Tipo '!$B$15,IF(D29=15,'[1]Tipo '!$B$16,IF(D29=16,'[1]Tipo '!$B$17,IF(D29=17,'[1]Tipo '!$B$18,IF(D29=18,'[1]Tipo '!$B$19,IF(D29=19,'[1]Tipo '!$B$20,\"No ha seleccionado un tipo de contrato válido\")))))))))))))))))))","v":"CONTRATOS DE PRESTACIÓN DE SERVICIOS PROFESIONALES Y DE APOYO A LA GESTIÓN"},"CONTRATACIÓN DIRECTA","Prestación de servicios profesionales y de apoyo a la gestión, o para la ejecución de trabajos artísticos que sólo puedan encomendarse a determinadas personas naturales;","El contrato que se pretende celebrar, tendrá por objeto: ¿El contratista se obliga para con la Fondo de Desarrollo Local de Teusaquillo a prestar sus servicios profesionales en el area de Gestion de Desarrollo Local, para realizar la formulación y apoyo a la supervisión de los proyectos de inversión que le sean asignados y a los contratos derivados de dichas formulaciones, asi como el apoyo a los temas de Seguridad y Convivencia¿.","INVERSIÓN",45,{"$f":"IF(J29=1,'[1]Equivalencia BH-BMPT'!$D$2,IF(J29=2,'[1]Equivalencia BH-BMPT'!$D$3,IF(J29=3,'[1]Equivalencia BH-BMPT'!$D$4,IF(J29=4,'[1]Equivalencia BH-BMPT'!$D$5,IF(J29=5,'[1]Equivalencia BH-BMPT'!$D$6,IF(J29=6,'[1]Equivalencia BH-BMPT'!$D$7,IF(J29=7,'[1]Equivalencia BH-BMPT'!$D$8,IF(J29=8,'[1]Equivalencia BH-BMPT'!$D$9,IF(J29=9,'[1]Equivalencia BH-BMPT'!$D$10,IF(J29=10,'[1]Equivalencia BH-BMPT'!$D$11,IF(J29=11,'[1]Equivalencia BH-BMPT'!$D$12,IF(J29=12,'[1]Equivalencia BH-BMPT'!$D$13,IF(J29=13,'[1]Equivalencia BH-BMPT'!$D$14,IF(J29=14,'[1]Equivalencia BH-BMPT'!$D$15,IF(J29=15,'[1]Equivalencia BH-BMPT'!$D$16,IF(J29=16,'[1]Equivalencia BH-BMPT'!$D$17,IF(J29=17,'[1]Equivalencia BH-BMPT'!$D$18,IF(J29=18,'[1]Equivalencia BH-BMPT'!$D$19,IF(J29=19,'[1]Equivalencia BH-BMPT'!$D$20,IF(J29=20,'[1]Equivalencia BH-BMPT'!$D$21,IF(J29=21,'[1]Equivalencia BH-BMPT'!$D$22,IF(J29=22,'[1]Equivalencia BH-BMPT'!$D$23,IF(J29=23,'[1]Equivalencia BH-BMPT'!#REF!,IF(J29=24,'[1]Equivalencia BH-BMPT'!$D$25,IF(J29=25,'[1]Equivalencia BH-BMPT'!$D$26,IF(J29=26,'[1]Equivalencia BH-BMPT'!$D$27,IF(J29=27,'[1]Equivalencia BH-BMPT'!$D$28,IF(J29=28,'[1]Equivalencia BH-BMPT'!$D$29,IF(J29=29,'[1]Equivalencia BH-BMPT'!$D$30,IF(J29=30,'[1]Equivalencia BH-BMPT'!$D$31,IF(J29=31,'[1]Equivalencia BH-BMPT'!$D$32,IF(J29=32,'[1]Equivalencia BH-BMPT'!$D$33,IF(J29=33,'[1]Equivalencia BH-BMPT'!$D$34,IF(J29=34,'[1]Equivalencia BH-BMPT'!$D$35,IF(J29=35,'[1]Equivalencia BH-BMPT'!$D$36,IF(J29=36,'[1]Equivalencia BH-BMPT'!$D$37,IF(J29=37,'[1]Equivalencia BH-BMPT'!$D$38,IF(J29=38,'[1]Equivalencia BH-BMPT'!#REF!,IF(J29=39,'[1]Equivalencia BH-BMPT'!$D$40,IF(J29=40,'[1]Equivalencia BH-BMPT'!$D$41,IF(J29=41,'[1]Equivalencia BH-BMPT'!$D$42,IF(J29=42,'[1]Equivalencia BH-BMPT'!$D$43,IF(J29=43,'[1]Equivalencia BH-BMPT'!$D$44,IF(J29=44,'[1]Equivalencia BH-BMPT'!$D$45,IF(J29=45,'[1]Equivalencia BH-BMPT'!$D$46,\"No ha seleccionado un número de programa\")))))))))))))))))))))))))))))))))))))))))))))","v":"Gobernanza e influencia local, regional e internacional"},1329,1070586930,"JUAN CAMILO BOHORQUEZ ARAGON",44000000,null,null,null,14666666,58666666,55916667,"2017-02-10","2017-02-10","2017-12-29",240,80,null,null,null,"X",null,0.95312501651278425]
[12,2017,"CPS012  2017 ",5,{"$f":"IF(D30=1,'[1]Tipo '!$B$2,IF(D30=2,'[1]Tipo '!$B$3,IF(D30=3,'[1]Tipo '!$B$4,IF(D30=4,'[1]Tipo '!$B$5,IF(D30=5,'[1]Tipo '!$B$6,IF(D30=6,'[1]Tipo '!$B$7,IF(D30=7,'[1]Tipo '!$B$8,IF(D30=8,'[1]Tipo '!$B$9,IF(D30=9,'[1]Tipo '!$B$10,IF(D30=10,'[1]Tipo '!$B$11,IF(D30=11,'[1]Tipo '!$B$12,IF(D30=12,'[1]Tipo '!$B$13,IF(D30=13,'[1]Tipo '!$B$14,IF(D30=14,'[1]Tipo '!$B$15,IF(D30=15,'[1]Tipo '!$B$16,IF(D30=16,'[1]Tipo '!$B$17,IF(D30=17,'[1]Tipo '!$B$18,IF(D30=18,'[1]Tipo '!$B$19,IF(D30=19,'[1]Tipo '!$B$20,\"No ha seleccionado un tipo de contrato válido\")))))))))))))))))))","v":"CONTRATOS DE PRESTACIÓN DE SERVICIOS PROFESIONALES Y DE APOYO A LA GESTIÓN"},"CONTRATACIÓN DIRECTA","Prestación de servicios profesionales y de apoyo a la gestión, o para la ejecución de trabajos artísticos que sólo puedan encomendarse a determinadas personas naturales;","El contrato que se pretende celebrar, tendrá por objeto¿Prestación de servicios profesionales al Área de Gestión Policiva de la Alcaldía Local de Teusaquillo, con el fin de realizar las actividades concernientes a los trámites relacionados con los Planes de Mejoramiento, Acciones Constitucionales y legales, así como sustanciar los actos administrativos consistentes en permisos y/o conceptos para la realización de eventos de carácter masivo y/o aglomeraciones que se realicen en la localidad¿.","INVERSIÓN",45,{"$f":"IF(J30=1,'[1]Equivalencia BH-BMPT'!$D$2,IF(J30=2,'[1]Equivalencia BH-BMPT'!$D$3,IF(J30=3,'[1]Equivalencia BH-BMPT'!$D$4,IF(J30=4,'[1]Equivalencia BH-BMPT'!$D$5,IF(J30=5,'[1]Equivalencia BH-BMPT'!$D$6,IF(J30=6,'[1]Equivalencia BH-BMPT'!$D$7,IF(J30=7,'[1]Equivalencia BH-BMPT'!$D$8,IF(J30=8,'[1]Equivalencia BH-BMPT'!$D$9,IF(J30=9,'[1]Equivalencia BH-BMPT'!$D$10,IF(J30=10,'[1]Equivalencia BH-BMPT'!$D$11,IF(J30=11,'[1]Equivalencia BH-BMPT'!$D$12,IF(J30=12,'[1]Equivalencia BH-BMPT'!$D$13,IF(J30=13,'[1]Equivalencia BH-BMPT'!$D$14,IF(J30=14,'[1]Equivalencia BH-BMPT'!$D$15,IF(J30=15,'[1]Equivalencia BH-BMPT'!$D$16,IF(J30=16,'[1]Equivalencia BH-BMPT'!$D$17,IF(J30=17,'[1]Equivalencia BH-BMPT'!$D$18,IF(J30=18,'[1]Equivalencia BH-BMPT'!$D$19,IF(J30=19,'[1]Equivalencia BH-BMPT'!$D$20,IF(J30=20,'[1]Equivalencia BH-BMPT'!$D$21,IF(J30=21,'[1]Equivalencia BH-BMPT'!$D$22,IF(J30=22,'[1]Equivalencia BH-BMPT'!$D$23,IF(J30=23,'[1]Equivalencia BH-BMPT'!#REF!,IF(J30=24,'[1]Equivalencia BH-BMPT'!$D$25,IF(J30=25,'[1]Equivalencia BH-BMPT'!$D$26,IF(J30=26,'[1]Equivalencia BH-BMPT'!$D$27,IF(J30=27,'[1]Equivalencia BH-BMPT'!$D$28,IF(J30=28,'[1]Equivalencia BH-BMPT'!$D$29,IF(J30=29,'[1]Equivalencia BH-BMPT'!$D$30,IF(J30=30,'[1]Equivalencia BH-BMPT'!$D$31,IF(J30=31,'[1]Equivalencia BH-BMPT'!$D$32,IF(J30=32,'[1]Equivalencia BH-BMPT'!$D$33,IF(J30=33,'[1]Equivalencia BH-BMPT'!$D$34,IF(J30=34,'[1]Equivalencia BH-BMPT'!$D$35,IF(J30=35,'[1]Equivalencia BH-BMPT'!$D$36,IF(J30=36,'[1]Equivalencia BH-BMPT'!$D$37,IF(J30=37,'[1]Equivalencia BH-BMPT'!$D$38,IF(J30=38,'[1]Equivalencia BH-BMPT'!#REF!,IF(J30=39,'[1]Equivalencia BH-BMPT'!$D$40,IF(J30=40,'[1]Equivalencia BH-BMPT'!$D$41,IF(J30=41,'[1]Equivalencia BH-BMPT'!$D$42,IF(J30=42,'[1]Equivalencia BH-BMPT'!$D$43,IF(J30=43,'[1]Equivalencia BH-BMPT'!$D$44,IF(J30=44,'[1]Equivalencia BH-BMPT'!$D$45,IF(J30=45,'[1]Equivalencia BH-BMPT'!$D$46,\"No ha seleccionado un número de programa\")))))))))))))))))))))))))))))))))))))))))))))","v":"Gobernanza e influencia local, regional e internacional"},1329,12240699,"LUIS ALFREDO PERDOMO BERMEO",37600000,null,null,null,0,37600000,37600000,"2017-02-10","2017-02-10","2017-10-09",240,0,null,null,null,null,"X",1]
[13,2017,"CPS 013 2017 ",5,{"$f":"IF(D31=1,'[1]Tipo '!$B$2,IF(D31=2,'[1]Tipo '!$B$3,IF(D31=3,'[1]Tipo '!$B$4,IF(D31=4,'[1]Tipo '!$B$5,IF(D31=5,'[1]Tipo '!$B$6,IF(D31=6,'[1]Tipo '!$B$7,IF(D31=7,'[1]Tipo '!$B$8,IF(D31=8,'[1]Tipo '!$B$9,IF(D31=9,'[1]Tipo '!$B$10,IF(D31=10,'[1]Tipo '!$B$11,IF(D31=11,'[1]Tipo '!$B$12,IF(D31=12,'[1]Tipo '!$B$13,IF(D31=13,'[1]Tipo '!$B$14,IF(D31=14,'[1]Tipo '!$B$15,IF(D31=15,'[1]Tipo '!$B$16,IF(D31=16,'[1]Tipo '!$B$17,IF(D31=17,'[1]Tipo '!$B$18,IF(D31=18,'[1]Tipo '!$B$19,IF(D31=19,'[1]Tipo '!$B$20,\"No ha seleccionado un tipo de contrato válido\")))))))))))))))))))","v":"CONTRATOS DE PRESTACIÓN DE SERVICIOS PROFESIONALES Y DE APOYO A LA GESTIÓN"},"CONTRATACIÓN DIRECTA","Prestación de servicios profesionales y de apoyo a la gestión, o para la ejecución de trabajos artísticos que sólo puedan encomendarse a determinadas personas naturales;","El contrato que se pretende celebrar, tendrá por objeto¿¿Prestación de servicios profesionales al Área de Gestión Policiva de la Alcaldía Local de Teusaquillo, en la gestión y trámite de solicitudes para la realización de eventos que generan aglomeraciones de público en la localidad y asistencia a los mismos, así como, efectuar las actividades relacionadas con los temas de prevención, mitigación y atención de emergencias en la localidad¿.","INVERSIÓN",45,{"$f":"IF(J31=1,'[1]Equivalencia BH-BMPT'!$D$2,IF(J31=2,'[1]Equivalencia BH-BMPT'!$D$3,IF(J31=3,'[1]Equivalencia BH-BMPT'!$D$4,IF(J31=4,'[1]Equivalencia BH-BMPT'!$D$5,IF(J31=5,'[1]Equivalencia BH-BMPT'!$D$6,IF(J31=6,'[1]Equivalencia BH-BMPT'!$D$7,IF(J31=7,'[1]Equivalencia BH-BMPT'!$D$8,IF(J31=8,'[1]Equivalencia BH-BMPT'!$D$9,IF(J31=9,'[1]Equivalencia BH-BMPT'!$D$10,IF(J31=10,'[1]Equivalencia BH-BMPT'!$D$11,IF(J31=11,'[1]Equivalencia BH-BMPT'!$D$12,IF(J31=12,'[1]Equivalencia BH-BMPT'!$D$13,IF(J31=13,'[1]Equivalencia BH-BMPT'!$D$14,IF(J31=14,'[1]Equivalencia BH-BMPT'!$D$15,IF(J31=15,'[1]Equivalencia BH-BMPT'!$D$16,IF(J31=16,'[1]Equivalencia BH-BMPT'!$D$17,IF(J31=17,'[1]Equivalencia BH-BMPT'!$D$18,IF(J31=18,'[1]Equivalencia BH-BMPT'!$D$19,IF(J31=19,'[1]Equivalencia BH-BMPT'!$D$20,IF(J31=20,'[1]Equivalencia BH-BMPT'!$D$21,IF(J31=21,'[1]Equivalencia BH-BMPT'!$D$22,IF(J31=22,'[1]Equivalencia BH-BMPT'!$D$23,IF(J31=23,'[1]Equivalencia BH-BMPT'!#REF!,IF(J31=24,'[1]Equivalencia BH-BMPT'!$D$25,IF(J31=25,'[1]Equivalencia BH-BMPT'!$D$26,IF(J31=26,'[1]Equivalencia BH-BMPT'!$D$27,IF(J31=27,'[1]Equivalencia BH-BMPT'!$D$28,IF(J31=28,'[1]Equivalencia BH-BMPT'!$D$29,IF(J31=29,'[1]Equivalencia BH-BMPT'!$D$30,IF(J31=30,'[1]Equivalencia BH-BMPT'!$D$31,IF(J31=31,'[1]Equivalencia BH-BMPT'!$D$32,IF(J31=32,'[1]Equivalencia BH-BMPT'!$D$33,IF(J31=33,'[1]Equivalencia BH-BMPT'!$D$34,IF(J31=34,'[1]Equivalencia BH-BMPT'!$D$35,IF(J31=35,'[1]Equivalencia BH-BMPT'!$D$36,IF(J31=36,'[1]Equivalencia BH-BMPT'!$D$37,IF(J31=37,'[1]Equivalencia BH-BMPT'!$D$38,IF(J31=38,'[1]Equivalencia BH-BMPT'!#REF!,IF(J31=39,'[1]Equivalencia BH-BMPT'!$D$40,IF(J31=40,'[1]Equivalencia BH-BMPT'!$D$41,IF(J31=41,'[1]Equivalencia BH-BMPT'!$D$42,IF(J31=42,'[1]Equivalencia BH-BMPT'!$D$43,IF(J31=43,'[1]Equivalencia BH-BMPT'!$D$44,IF(J31=44,'[1]Equivalencia BH-BMPT'!$D$45,IF(J31=45,'[1]Equivalencia BH-BMPT'!$D$46,\"No ha seleccionado un número de programa\")))))))))))))))))))))))))))))))))))))))))))))","v":"Gobernanza e influencia local, regional e internacional"},1329,1066178962,"HUGO ALBERTO MERCADO TIRADO",33600000,null,null,null,11200000,44800000,42700000,"2017-02-10","2017-02-10","2017-12-29",240,80,null,null,null,"X",null,0.953125]
[14,2017,"CPS 014 2017 ",5,{"$f":"IF(D32=1,'[1]Tipo '!$B$2,IF(D32=2,'[1]Tipo '!$B$3,IF(D32=3,'[1]Tipo '!$B$4,IF(D32=4,'[1]Tipo '!$B$5,IF(D32=5,'[1]Tipo '!$B$6,IF(D32=6,'[1]Tipo '!$B$7,IF(D32=7,'[1]Tipo '!$B$8,IF(D32=8,'[1]Tipo '!$B$9,IF(D32=9,'[1]Tipo '!$B$10,IF(D32=10,'[1]Tipo '!$B$11,IF(D32=11,'[1]Tipo '!$B$12,IF(D32=12,'[1]Tipo '!$B$13,IF(D32=13,'[1]Tipo '!$B$14,IF(D32=14,'[1]Tipo '!$B$15,IF(D32=15,'[1]Tipo '!$B$16,IF(D32=16,'[1]Tipo '!$B$17,IF(D32=17,'[1]Tipo '!$B$18,IF(D32=18,'[1]Tipo '!$B$19,IF(D32=19,'[1]Tipo '!$B$20,\"No ha seleccionado un tipo de contrato válido\")))))))))))))))))))","v":"CONTRATOS DE PRESTACIÓN DE SERVICIOS PROFESIONALES Y DE APOYO A LA GESTIÓN"},"CONTRATACIÓN DIRECTA","Prestación de servicios profesionales y de apoyo a la gestión, o para la ejecución de trabajos artísticos que sólo puedan encomendarse a determinadas personas naturales;","El contrato que se pretende celebrar, tendrá por objeto ¿El contratista  se obliga para con el Fondo de Desarrollo Local de Teusaquillo a prestar sus servicios profesionales para realizar todas las actividades inherentes a la formulación y el seguimiento de todos los proyectos  y contratos de infraestructura que le sean asignados en el marco del plan de desarrollo local 2017-2020","INVERSIÓN",18,{"$f":"IF(J32=1,'[1]Equivalencia BH-BMPT'!$D$2,IF(J32=2,'[1]Equivalencia BH-BMPT'!$D$3,IF(J32=3,'[1]Equivalencia BH-BMPT'!$D$4,IF(J32=4,'[1]Equivalencia BH-BMPT'!$D$5,IF(J32=5,'[1]Equivalencia BH-BMPT'!$D$6,IF(J32=6,'[1]Equivalencia BH-BMPT'!$D$7,IF(J32=7,'[1]Equivalencia BH-BMPT'!$D$8,IF(J32=8,'[1]Equivalencia BH-BMPT'!$D$9,IF(J32=9,'[1]Equivalencia BH-BMPT'!$D$10,IF(J32=10,'[1]Equivalencia BH-BMPT'!$D$11,IF(J32=11,'[1]Equivalencia BH-BMPT'!$D$12,IF(J32=12,'[1]Equivalencia BH-BMPT'!$D$13,IF(J32=13,'[1]Equivalencia BH-BMPT'!$D$14,IF(J32=14,'[1]Equivalencia BH-BMPT'!$D$15,IF(J32=15,'[1]Equivalencia BH-BMPT'!$D$16,IF(J32=16,'[1]Equivalencia BH-BMPT'!$D$17,IF(J32=17,'[1]Equivalencia BH-BMPT'!$D$18,IF(J32=18,'[1]Equivalencia BH-BMPT'!$D$19,IF(J32=19,'[1]Equivalencia BH-BMPT'!$D$20,IF(J32=20,'[1]Equivalencia BH-BMPT'!$D$21,IF(J32=21,'[1]Equivalencia BH-BMPT'!$D$22,IF(J32=22,'[1]Equivalencia BH-BMPT'!$D$23,IF(J32=23,'[1]Equivalencia BH-BMPT'!#REF!,IF(J32=24,'[1]Equivalencia BH-BMPT'!$D$25,IF(J32=25,'[1]Equivalencia BH-BMPT'!$D$26,IF(J32=26,'[1]Equivalencia BH-BMPT'!$D$27,IF(J32=27,'[1]Equivalencia BH-BMPT'!$D$28,IF(J32=28,'[1]Equivalencia BH-BMPT'!$D$29,IF(J32=29,'[1]Equivalencia BH-BMPT'!$D$30,IF(J32=30,'[1]Equivalencia BH-BMPT'!$D$31,IF(J32=31,'[1]Equivalencia BH-BMPT'!$D$32,IF(J32=32,'[1]Equivalencia BH-BMPT'!$D$33,IF(J32=33,'[1]Equivalencia BH-BMPT'!$D$34,IF(J32=34,'[1]Equivalencia BH-BMPT'!$D$35,IF(J32=35,'[1]Equivalencia BH-BMPT'!$D$36,IF(J32=36,'[1]Equivalencia BH-BMPT'!$D$37,IF(J32=37,'[1]Equivalencia BH-BMPT'!$D$38,IF(J32=38,'[1]Equivalencia BH-BMPT'!#REF!,IF(J32=39,'[1]Equivalencia BH-BMPT'!$D$40,IF(J32=40,'[1]Equivalencia BH-BMPT'!$D$41,IF(J32=41,'[1]Equivalencia BH-BMPT'!$D$42,IF(J32=42,'[1]Equivalencia BH-BMPT'!$D$43,IF(J32=43,'[1]Equivalencia BH-BMPT'!$D$44,IF(J32=44,'[1]Equivalencia BH-BMPT'!$D$45,IF(J32=45,'[1]Equivalencia BH-BMPT'!$D$46,\"No ha seleccionado un número de programa\")))))))))))))))))))))))))))))))))))))))))))))","v":"Mejor movilidad para todos"},1338,51604977,"JACQUELINE  FRIEDE VILLAROEL",64400000,null,null,null,0,64400000,61000000,"2017-02-10","2017-02-10","2017-12-31",322,0,null,null,null,"X",null,0.94720496894409933]
[15,2017,"CPS015 2017 ",5,{"$f":"IF(D33=1,'[1]Tipo '!$B$2,IF(D33=2,'[1]Tipo '!$B$3,IF(D33=3,'[1]Tipo '!$B$4,IF(D33=4,'[1]Tipo '!$B$5,IF(D33=5,'[1]Tipo '!$B$6,IF(D33=6,'[1]Tipo '!$B$7,IF(D33=7,'[1]Tipo '!$B$8,IF(D33=8,'[1]Tipo '!$B$9,IF(D33=9,'[1]Tipo '!$B$10,IF(D33=10,'[1]Tipo '!$B$11,IF(D33=11,'[1]Tipo '!$B$12,IF(D33=12,'[1]Tipo '!$B$13,IF(D33=13,'[1]Tipo '!$B$14,IF(D33=14,'[1]Tipo '!$B$15,IF(D33=15,'[1]Tipo '!$B$16,IF(D33=16,'[1]Tipo '!$B$17,IF(D33=17,'[1]Tipo '!$B$18,IF(D33=18,'[1]Tipo '!$B$19,IF(D33=19,'[1]Tipo '!$B$20,\"No ha seleccionado un tipo de contrato válido\")))))))))))))))))))","v":"CONTRATOS DE PRESTACIÓN DE SERVICIOS PROFESIONALES Y DE APOYO A LA GESTIÓN"},"CONTRATACIÓN DIRECTA","Prestación de servicios profesionales y de apoyo a la gestión, o para la ejecución de trabajos artísticos que sólo puedan encomendarse a determinadas personas naturales;","El contrato que se pretende celebrar, tendrá por objeto: ¿El contratista se obliga para con la Alcaldía Local De Teusaquillo a prestar sus servicios en el despacho del Alcalde Local, realizando la recepción, tratamiento, procesamiento y conservación del archivo oficial del despacho y las actividades operativas ¿","INVERSIÓN",45,{"$f":"IF(J33=1,'[1]Equivalencia BH-BMPT'!$D$2,IF(J33=2,'[1]Equivalencia BH-BMPT'!$D$3,IF(J33=3,'[1]Equivalencia BH-BMPT'!$D$4,IF(J33=4,'[1]Equivalencia BH-BMPT'!$D$5,IF(J33=5,'[1]Equivalencia BH-BMPT'!$D$6,IF(J33=6,'[1]Equivalencia BH-BMPT'!$D$7,IF(J33=7,'[1]Equivalencia BH-BMPT'!$D$8,IF(J33=8,'[1]Equivalencia BH-BMPT'!$D$9,IF(J33=9,'[1]Equivalencia BH-BMPT'!$D$10,IF(J33=10,'[1]Equivalencia BH-BMPT'!$D$11,IF(J33=11,'[1]Equivalencia BH-BMPT'!$D$12,IF(J33=12,'[1]Equivalencia BH-BMPT'!$D$13,IF(J33=13,'[1]Equivalencia BH-BMPT'!$D$14,IF(J33=14,'[1]Equivalencia BH-BMPT'!$D$15,IF(J33=15,'[1]Equivalencia BH-BMPT'!$D$16,IF(J33=16,'[1]Equivalencia BH-BMPT'!$D$17,IF(J33=17,'[1]Equivalencia BH-BMPT'!$D$18,IF(J33=18,'[1]Equivalencia BH-BMPT'!$D$19,IF(J33=19,'[1]Equivalencia BH-BMPT'!$D$20,IF(J33=20,'[1]Equivalencia BH-BMPT'!$D$21,IF(J33=21,'[1]Equivalencia BH-BMPT'!$D$22,IF(J33=22,'[1]Equivalencia BH-BMPT'!$D$23,IF(J33=23,'[1]Equivalencia BH-BMPT'!#REF!,IF(J33=24,'[1]Equivalencia BH-BMPT'!$D$25,IF(J33=25,'[1]Equivalencia BH-BMPT'!$D$26,IF(J33=26,'[1]Equivalencia BH-BMPT'!$D$27,IF(J33=27,'[1]Equivalencia BH-BMPT'!$D$28,IF(J33=28,'[1]Equivalencia BH-BMPT'!$D$29,IF(J33=29,'[1]Equivalencia BH-BMPT'!$D$30,IF(J33=30,'[1]Equivalencia BH-BMPT'!$D$31,IF(J33=31,'[1]Equivalencia BH-BMPT'!$D$32,IF(J33=32,'[1]Equivalencia BH-BMPT'!$D$33,IF(J33=33,'[1]Equivalencia BH-BMPT'!$D$34,IF(J33=34,'[1]Equivalencia BH-BMPT'!$D$35,IF(J33=35,'[1]Equivalencia BH-BMPT'!$D$36,IF(J33=36,'[1]Equivalencia BH-BMPT'!$D$37,IF(J33=37,'[1]Equivalencia BH-BMPT'!$D$38,IF(J33=38,'[1]Equivalencia BH-BMPT'!#REF!,IF(J33=39,'[1]Equivalencia BH-BMPT'!$D$40,IF(J33=40,'[1]Equivalencia BH-BMPT'!$D$41,IF(J33=41,'[1]Equivalencia BH-BMPT'!$D$42,IF(J33=42,'[1]Equivalencia BH-BMPT'!$D$43,IF(J33=43,'[1]Equivalencia BH-BMPT'!$D$44,IF(J33=44,'[1]Equivalencia BH-BMPT'!$D$45,IF(J33=45,'[1]Equivalencia BH-BMPT'!$D$46,\"No ha seleccionado un número de programa\")))))))))))))))))))))))))))))))))))))))))))))","v":"Gobernanza e influencia local, regional e internacional"},1329,1097332656,"VIANEY LUCIA ARDILA AVILA",21600000,null,null,null,8280000,29880000,27450000,"2017-02-10","2017-02-10","2018-01-10",240,92,null,null,"X",null,null,0.91867469879518071]
[16,2017,"CPS 016  2017",5,{"$f":"IF(D34=1,'[1]Tipo '!$B$2,IF(D34=2,'[1]Tipo '!$B$3,IF(D34=3,'[1]Tipo '!$B$4,IF(D34=4,'[1]Tipo '!$B$5,IF(D34=5,'[1]Tipo '!$B$6,IF(D34=6,'[1]Tipo '!$B$7,IF(D34=7,'[1]Tipo '!$B$8,IF(D34=8,'[1]Tipo '!$B$9,IF(D34=9,'[1]Tipo '!$B$10,IF(D34=10,'[1]Tipo '!$B$11,IF(D34=11,'[1]Tipo '!$B$12,IF(D34=12,'[1]Tipo '!$B$13,IF(D34=13,'[1]Tipo '!$B$14,IF(D34=14,'[1]Tipo '!$B$15,IF(D34=15,'[1]Tipo '!$B$16,IF(D34=16,'[1]Tipo '!$B$17,IF(D34=17,'[1]Tipo '!$B$18,IF(D34=18,'[1]Tipo '!$B$19,IF(D34=19,'[1]Tipo '!$B$20,\"No ha seleccionado un tipo de contrato válido\")))))))))))))))))))","v":"CONTRATOS DE PRESTACIÓN DE SERVICIOS PROFESIONALES Y DE APOYO A LA GESTIÓN"},"CONTRATACIÓN DIRECTA","Prestación de servicios profesionales y de apoyo a la gestión, o para la ejecución de trabajos artísticos que sólo puedan encomendarse a determinadas personas naturales;","EL CONTRATO QUE SE PRETENDE CELEBRAR, TENDRÁ POR OBJETO: ¿ EL CONTRATISTA SE OBLIGA PARA CON EL FONDO DE DESARROLLO LOCAL  DE TEUSAQUILLO A PRESTAR SUS SERVICIOS PROFESIONALES AL AREA DE GESTIÓN DE DESARROLLO LOCAL ¿ PRESUPUESTO Y CONTABILIDAD PARA APOYAR LA IMPLEMENTACIÓN DE LAS NORMAS INTERNACIONALES DE INFORMACIÓN FINANCIERA (NIIF)","INVERSIÓN",45,{"$f":"IF(J34=1,'[1]Equivalencia BH-BMPT'!$D$2,IF(J34=2,'[1]Equivalencia BH-BMPT'!$D$3,IF(J34=3,'[1]Equivalencia BH-BMPT'!$D$4,IF(J34=4,'[1]Equivalencia BH-BMPT'!$D$5,IF(J34=5,'[1]Equivalencia BH-BMPT'!$D$6,IF(J34=6,'[1]Equivalencia BH-BMPT'!$D$7,IF(J34=7,'[1]Equivalencia BH-BMPT'!$D$8,IF(J34=8,'[1]Equivalencia BH-BMPT'!$D$9,IF(J34=9,'[1]Equivalencia BH-BMPT'!$D$10,IF(J34=10,'[1]Equivalencia BH-BMPT'!$D$11,IF(J34=11,'[1]Equivalencia BH-BMPT'!$D$12,IF(J34=12,'[1]Equivalencia BH-BMPT'!$D$13,IF(J34=13,'[1]Equivalencia BH-BMPT'!$D$14,IF(J34=14,'[1]Equivalencia BH-BMPT'!$D$15,IF(J34=15,'[1]Equivalencia BH-BMPT'!$D$16,IF(J34=16,'[1]Equivalencia BH-BMPT'!$D$17,IF(J34=17,'[1]Equivalencia BH-BMPT'!$D$18,IF(J34=18,'[1]Equivalencia BH-BMPT'!$D$19,IF(J34=19,'[1]Equivalencia BH-BMPT'!$D$20,IF(J34=20,'[1]Equivalencia BH-BMPT'!$D$21,IF(J34=21,'[1]Equivalencia BH-BMPT'!$D$22,IF(J34=22,'[1]Equivalencia BH-BMPT'!$D$23,IF(J34=23,'[1]Equivalencia BH-BMPT'!#REF!,IF(J34=24,'[1]Equivalencia BH-BMPT'!$D$25,IF(J34=25,'[1]Equivalencia BH-BMPT'!$D$26,IF(J34=26,'[1]Equivalencia BH-BMPT'!$D$27,IF(J34=27,'[1]Equivalencia BH-BMPT'!$D$28,IF(J34=28,'[1]Equivalencia BH-BMPT'!$D$29,IF(J34=29,'[1]Equivalencia BH-BMPT'!$D$30,IF(J34=30,'[1]Equivalencia BH-BMPT'!$D$31,IF(J34=31,'[1]Equivalencia BH-BMPT'!$D$32,IF(J34=32,'[1]Equivalencia BH-BMPT'!$D$33,IF(J34=33,'[1]Equivalencia BH-BMPT'!$D$34,IF(J34=34,'[1]Equivalencia BH-BMPT'!$D$35,IF(J34=35,'[1]Equivalencia BH-BMPT'!$D$36,IF(J34=36,'[1]Equivalencia BH-BMPT'!$D$37,IF(J34=37,'[1]Equivalencia BH-BMPT'!$D$38,IF(J34=38,'[1]Equivalencia BH-BMPT'!#REF!,IF(J34=39,'[1]Equivalencia BH-BMPT'!$D$40,IF(J34=40,'[1]Equivalencia BH-BMPT'!$D$41,IF(J34=41,'[1]Equivalencia BH-BMPT'!$D$42,IF(J34=42,'[1]Equivalencia BH-BMPT'!$D$43,IF(J34=43,'[1]Equivalencia BH-BMPT'!$D$44,IF(J34=44,'[1]Equivalencia BH-BMPT'!$D$45,IF(J34=45,'[1]Equivalencia BH-BMPT'!$D$46,\"No ha seleccionado un número de programa\")))))))))))))))))))))))))))))))))))))))))))))","v":"Gobernanza e influencia local, regional e internacional"},1329,1010190370,"MAROLYM YISELH BERNAL TORO",37600000,null,null,null,14413333,52013333,47783333,"2017-02-10","2017-02-10","2018-01-10",240,92,null,null,"X",null,null,0.91867469827399828]
[17,2017,"CPS 017 2017 ",5,{"$f":"IF(D35=1,'[1]Tipo '!$B$2,IF(D35=2,'[1]Tipo '!$B$3,IF(D35=3,'[1]Tipo '!$B$4,IF(D35=4,'[1]Tipo '!$B$5,IF(D35=5,'[1]Tipo '!$B$6,IF(D35=6,'[1]Tipo '!$B$7,IF(D35=7,'[1]Tipo '!$B$8,IF(D35=8,'[1]Tipo '!$B$9,IF(D35=9,'[1]Tipo '!$B$10,IF(D35=10,'[1]Tipo '!$B$11,IF(D35=11,'[1]Tipo '!$B$12,IF(D35=12,'[1]Tipo '!$B$13,IF(D35=13,'[1]Tipo '!$B$14,IF(D35=14,'[1]Tipo '!$B$15,IF(D35=15,'[1]Tipo '!$B$16,IF(D35=16,'[1]Tipo '!$B$17,IF(D35=17,'[1]Tipo '!$B$18,IF(D35=18,'[1]Tipo '!$B$19,IF(D35=19,'[1]Tipo '!$B$20,\"No ha seleccionado un tipo de contrato válido\")))))))))))))))))))","v":"CONTRATOS DE PRESTACIÓN DE SERVICIOS PROFESIONALES Y DE APOYO A LA GESTIÓN"},"CONTRATACIÓN DIRECTA","Prestación de servicios profesionales y de apoyo a la gestión, o para la ejecución de trabajos artísticos que sólo puedan encomendarse a determinadas personas naturales;","El contratista se obliga para con el Fondo de Desarrollo Local de Teusaquillo a apoyar todas las actividades de tipo operativo y administrativo relacionadas con la formulación y ejecución de los proyectos (componentes) y contratos de infraestructura, el marco del plan de desarrollo local 2017-2020,  dentro de los proyectos 1338 ¿Teusaquillo Mejor para la conservación de la Malla Vial y Espacio Publico  Peatonal¿ y el proyecto 1348 ¿Teusaquillo con mejores parques recreativos y deportivos¿.","INVERSIÓN",18,{"$f":"IF(J35=1,'[1]Equivalencia BH-BMPT'!$D$2,IF(J35=2,'[1]Equivalencia BH-BMPT'!$D$3,IF(J35=3,'[1]Equivalencia BH-BMPT'!$D$4,IF(J35=4,'[1]Equivalencia BH-BMPT'!$D$5,IF(J35=5,'[1]Equivalencia BH-BMPT'!$D$6,IF(J35=6,'[1]Equivalencia BH-BMPT'!$D$7,IF(J35=7,'[1]Equivalencia BH-BMPT'!$D$8,IF(J35=8,'[1]Equivalencia BH-BMPT'!$D$9,IF(J35=9,'[1]Equivalencia BH-BMPT'!$D$10,IF(J35=10,'[1]Equivalencia BH-BMPT'!$D$11,IF(J35=11,'[1]Equivalencia BH-BMPT'!$D$12,IF(J35=12,'[1]Equivalencia BH-BMPT'!$D$13,IF(J35=13,'[1]Equivalencia BH-BMPT'!$D$14,IF(J35=14,'[1]Equivalencia BH-BMPT'!$D$15,IF(J35=15,'[1]Equivalencia BH-BMPT'!$D$16,IF(J35=16,'[1]Equivalencia BH-BMPT'!$D$17,IF(J35=17,'[1]Equivalencia BH-BMPT'!$D$18,IF(J35=18,'[1]Equivalencia BH-BMPT'!$D$19,IF(J35=19,'[1]Equivalencia BH-BMPT'!$D$20,IF(J35=20,'[1]Equivalencia BH-BMPT'!$D$21,IF(J35=21,'[1]Equivalencia BH-BMPT'!$D$22,IF(J35=22,'[1]Equivalencia BH-BMPT'!$D$23,IF(J35=23,'[1]Equivalencia BH-BMPT'!#REF!,IF(J35=24,'[1]Equivalencia BH-BMPT'!$D$25,IF(J35=25,'[1]Equivalencia BH-BMPT'!$D$26,IF(J35=26,'[1]Equivalencia BH-BMPT'!$D$27,IF(J35=27,'[1]Equivalencia BH-BMPT'!$D$28,IF(J35=28,'[1]Equivalencia BH-BMPT'!$D$29,IF(J35=29,'[1]Equivalencia BH-BMPT'!$D$30,IF(J35=30,'[1]Equivalencia BH-BMPT'!$D$31,IF(J35=31,'[1]Equivalencia BH-BMPT'!$D$32,IF(J35=32,'[1]Equivalencia BH-BMPT'!$D$33,IF(J35=33,'[1]Equivalencia BH-BMPT'!$D$34,IF(J35=34,'[1]Equivalencia BH-BMPT'!$D$35,IF(J35=35,'[1]Equivalencia BH-BMPT'!$D$36,IF(J35=36,'[1]Equivalencia BH-BMPT'!$D$37,IF(J35=37,'[1]Equivalencia BH-BMPT'!$D$38,IF(J35=38,'[1]Equivalencia BH-BMPT'!#REF!,IF(J35=39,'[1]Equivalencia BH-BMPT'!$D$40,IF(J35=40,'[1]Equivalencia BH-BMPT'!$D$41,IF(J35=41,'[1]Equivalencia BH-BMPT'!$D$42,IF(J35=42,'[1]Equivalencia BH-BMPT'!$D$43,IF(J35=43,'[1]Equivalencia BH-BMPT'!$D$44,IF(J35=44,'[1]Equivalencia BH-BMPT'!$D$45,IF(J35=45,'[1]Equivalencia BH-BMPT'!$D$46,\"No ha seleccionado un número de programa\")))))))))))))))))))))))))))))))))))))))))))))","v":"Mejor movilidad para todos"},1338,1024515563,"MONICA JOHANNA CHIPATECUA QUEVEDO",38640000,null,null,null,1200000,39840000,36600000,"2017-02-10","2017-02-10","2018-01-10",322,10,null,null,"X",null,null,0.91867469879518071]
[18,2017,"CPS 018 2017 ",5,{"$f":"IF(D36=1,'[1]Tipo '!$B$2,IF(D36=2,'[1]Tipo '!$B$3,IF(D36=3,'[1]Tipo '!$B$4,IF(D36=4,'[1]Tipo '!$B$5,IF(D36=5,'[1]Tipo '!$B$6,IF(D36=6,'[1]Tipo '!$B$7,IF(D36=7,'[1]Tipo '!$B$8,IF(D36=8,'[1]Tipo '!$B$9,IF(D36=9,'[1]Tipo '!$B$10,IF(D36=10,'[1]Tipo '!$B$11,IF(D36=11,'[1]Tipo '!$B$12,IF(D36=12,'[1]Tipo '!$B$13,IF(D36=13,'[1]Tipo '!$B$14,IF(D36=14,'[1]Tipo '!$B$15,IF(D36=15,'[1]Tipo '!$B$16,IF(D36=16,'[1]Tipo '!$B$17,IF(D36=17,'[1]Tipo '!$B$18,IF(D36=18,'[1]Tipo '!$B$19,IF(D36=19,'[1]Tipo '!$B$20,\"No ha seleccionado un tipo de contrato válido\")))))))))))))))))))","v":"CONTRATOS DE PRESTACIÓN DE SERVICIOS PROFESIONALES Y DE APOYO A LA GESTIÓN"},"CONTRATACIÓN DIRECTA","Prestación de servicios profesionales y de apoyo a la gestión, o para la ejecución de trabajos artísticos que sólo puedan encomendarse a determinadas personas naturales;","El contrato que se pretende celebrar, tendrá por objeto ¿Prestación de servicios profesionales al Área de Gestión de Desarrollo Local de Teusaquillo, en la formulación, evaluación, presentación y seguimiento de proyectos, para asegurar la adecuada inversión de los recursos locales, así como el seguimiento y actualización en el sistema de información SEGPLAN y a las matrices de inversión (MUSI)¿.El contrato que se pretende celebrar, tendrá por objeto ¿Prestación de servicios profesionales al Área de Gestión de Desarrollo Local de Teusaquillo, en la formulación, evaluación, presentación y seguimiento de proyectos, para asegurar la adecuada inversión de los recursos locales, así como el seguimiento y actualización en el sistema de información SEGPLAN y a las matrices de inversión (MUSI)¿.","INVERSIÓN",45,{"$f":"IF(J36=1,'[1]Equivalencia BH-BMPT'!$D$2,IF(J36=2,'[1]Equivalencia BH-BMPT'!$D$3,IF(J36=3,'[1]Equivalencia BH-BMPT'!$D$4,IF(J36=4,'[1]Equivalencia BH-BMPT'!$D$5,IF(J36=5,'[1]Equivalencia BH-BMPT'!$D$6,IF(J36=6,'[1]Equivalencia BH-BMPT'!$D$7,IF(J36=7,'[1]Equivalencia BH-BMPT'!$D$8,IF(J36=8,'[1]Equivalencia BH-BMPT'!$D$9,IF(J36=9,'[1]Equivalencia BH-BMPT'!$D$10,IF(J36=10,'[1]Equivalencia BH-BMPT'!$D$11,IF(J36=11,'[1]Equivalencia BH-BMPT'!$D$12,IF(J36=12,'[1]Equivalencia BH-BMPT'!$D$13,IF(J36=13,'[1]Equivalencia BH-BMPT'!$D$14,IF(J36=14,'[1]Equivalencia BH-BMPT'!$D$15,IF(J36=15,'[1]Equivalencia BH-BMPT'!$D$16,IF(J36=16,'[1]Equivalencia BH-BMPT'!$D$17,IF(J36=17,'[1]Equivalencia BH-BMPT'!$D$18,IF(J36=18,'[1]Equivalencia BH-BMPT'!$D$19,IF(J36=19,'[1]Equivalencia BH-BMPT'!$D$20,IF(J36=20,'[1]Equivalencia BH-BMPT'!$D$21,IF(J36=21,'[1]Equivalencia BH-BMPT'!$D$22,IF(J36=22,'[1]Equivalencia BH-BMPT'!$D$23,IF(J36=23,'[1]Equivalencia BH-BMPT'!#REF!,IF(J36=24,'[1]Equivalencia BH-BMPT'!$D$25,IF(J36=25,'[1]Equivalencia BH-BMPT'!$D$26,IF(J36=26,'[1]Equivalencia BH-BMPT'!$D$27,IF(J36=27,'[1]Equivalencia BH-BMPT'!$D$28,IF(J36=28,'[1]Equivalencia BH-BMPT'!$D$29,IF(J36=29,'[1]Equivalencia BH-BMPT'!$D$30,IF(J36=30,'[1]Equivalencia BH-BMPT'!$D$31,IF(J36=31,'[1]Equivalencia BH-BMPT'!$D$32,IF(J36=32,'[1]Equivalencia BH-BMPT'!$D$33,IF(J36=33,'[1]Equivalencia BH-BMPT'!$D$34,IF(J36=34,'[1]Equivalencia BH-BMPT'!$D$35,IF(J36=35,'[1]Equivalencia BH-BMPT'!$D$36,IF(J36=36,'[1]Equivalencia BH-BMPT'!$D$37,IF(J36=37,'[1]Equivalencia BH-BMPT'!$D$38,IF(J36=38,'[1]Equivalencia BH-BMPT'!#REF!,IF(J36=39,'[1]Equivalencia BH-BMPT'!$D$40,IF(J36=40,'[1]Equivalencia BH-BMPT'!$D$41,IF(J36=41,'[1]Equivalencia BH-BMPT'!$D$42,IF(J36=42,'[1]Equivalencia BH-BMPT'!$D$43,IF(J36=43,'[1]Equivalencia BH-BMPT'!$D$44,IF(J36=44,'[1]Equivalencia BH-BMPT'!$D$45,IF(J36=45,'[1]Equivalencia BH-BMPT'!$D$46,\"No ha seleccionado un número de programa\")))))))))))))))))))))))))))))))))))))))))))))","v":"Gobernanza e influencia local, regional e internacional"},1329,1144037315,"JACOBO PARDEY ROZO",30800000,null,null,null,0,30800000,30800000,"2017-02-14","2017-02-14","2017-09-13",210,0,null,null,null,null,"X",1]
[19,2017,"CPS 019  2017 ",5,{"$f":"IF(D37=1,'[1]Tipo '!$B$2,IF(D37=2,'[1]Tipo '!$B$3,IF(D37=3,'[1]Tipo '!$B$4,IF(D37=4,'[1]Tipo '!$B$5,IF(D37=5,'[1]Tipo '!$B$6,IF(D37=6,'[1]Tipo '!$B$7,IF(D37=7,'[1]Tipo '!$B$8,IF(D37=8,'[1]Tipo '!$B$9,IF(D37=9,'[1]Tipo '!$B$10,IF(D37=10,'[1]Tipo '!$B$11,IF(D37=11,'[1]Tipo '!$B$12,IF(D37=12,'[1]Tipo '!$B$13,IF(D37=13,'[1]Tipo '!$B$14,IF(D37=14,'[1]Tipo '!$B$15,IF(D37=15,'[1]Tipo '!$B$16,IF(D37=16,'[1]Tipo '!$B$17,IF(D37=17,'[1]Tipo '!$B$18,IF(D37=18,'[1]Tipo '!$B$19,IF(D37=19,'[1]Tipo '!$B$20,\"No ha seleccionado un tipo de contrato válido\")))))))))))))))))))","v":"CONTRATOS DE PRESTACIÓN DE SERVICIOS PROFESIONALES Y DE APOYO A LA GESTIÓN"},"CONTRATACIÓN DIRECTA","Prestación de servicios profesionales y de apoyo a la gestión, o para la ejecución de trabajos artísticos que sólo puedan encomendarse a determinadas personas naturales;","El contrato que se pretende celebrar, tendrá por objeto ¿EL CONTRATISTA SE OBLIGA A PRESTAR SUS  SERVICIOS  C0MO  APOYO  TECNICO Y ADMINISTRATIVO A LA ADMINISTRACION  LOCAL AL  AREA DE  GESTION  DE DESARROLLO LOCAL- PRENSA COMUNICACIONES","INVERSIÓN",45,{"$f":"IF(J37=1,'[1]Equivalencia BH-BMPT'!$D$2,IF(J37=2,'[1]Equivalencia BH-BMPT'!$D$3,IF(J37=3,'[1]Equivalencia BH-BMPT'!$D$4,IF(J37=4,'[1]Equivalencia BH-BMPT'!$D$5,IF(J37=5,'[1]Equivalencia BH-BMPT'!$D$6,IF(J37=6,'[1]Equivalencia BH-BMPT'!$D$7,IF(J37=7,'[1]Equivalencia BH-BMPT'!$D$8,IF(J37=8,'[1]Equivalencia BH-BMPT'!$D$9,IF(J37=9,'[1]Equivalencia BH-BMPT'!$D$10,IF(J37=10,'[1]Equivalencia BH-BMPT'!$D$11,IF(J37=11,'[1]Equivalencia BH-BMPT'!$D$12,IF(J37=12,'[1]Equivalencia BH-BMPT'!$D$13,IF(J37=13,'[1]Equivalencia BH-BMPT'!$D$14,IF(J37=14,'[1]Equivalencia BH-BMPT'!$D$15,IF(J37=15,'[1]Equivalencia BH-BMPT'!$D$16,IF(J37=16,'[1]Equivalencia BH-BMPT'!$D$17,IF(J37=17,'[1]Equivalencia BH-BMPT'!$D$18,IF(J37=18,'[1]Equivalencia BH-BMPT'!$D$19,IF(J37=19,'[1]Equivalencia BH-BMPT'!$D$20,IF(J37=20,'[1]Equivalencia BH-BMPT'!$D$21,IF(J37=21,'[1]Equivalencia BH-BMPT'!$D$22,IF(J37=22,'[1]Equivalencia BH-BMPT'!$D$23,IF(J37=23,'[1]Equivalencia BH-BMPT'!#REF!,IF(J37=24,'[1]Equivalencia BH-BMPT'!$D$25,IF(J37=25,'[1]Equivalencia BH-BMPT'!$D$26,IF(J37=26,'[1]Equivalencia BH-BMPT'!$D$27,IF(J37=27,'[1]Equivalencia BH-BMPT'!$D$28,IF(J37=28,'[1]Equivalencia BH-BMPT'!$D$29,IF(J37=29,'[1]Equivalencia BH-BMPT'!$D$30,IF(J37=30,'[1]Equivalencia BH-BMPT'!$D$31,IF(J37=31,'[1]Equivalencia BH-BMPT'!$D$32,IF(J37=32,'[1]Equivalencia BH-BMPT'!$D$33,IF(J37=33,'[1]Equivalencia BH-BMPT'!$D$34,IF(J37=34,'[1]Equivalencia BH-BMPT'!$D$35,IF(J37=35,'[1]Equivalencia BH-BMPT'!$D$36,IF(J37=36,'[1]Equivalencia BH-BMPT'!$D$37,IF(J37=37,'[1]Equivalencia BH-BMPT'!$D$38,IF(J37=38,'[1]Equivalencia BH-BMPT'!#REF!,IF(J37=39,'[1]Equivalencia BH-BMPT'!$D$40,IF(J37=40,'[1]Equivalencia BH-BMPT'!$D$41,IF(J37=41,'[1]Equivalencia BH-BMPT'!$D$42,IF(J37=42,'[1]Equivalencia BH-BMPT'!$D$43,IF(J37=43,'[1]Equivalencia BH-BMPT'!$D$44,IF(J37=44,'[1]Equivalencia BH-BMPT'!$D$45,IF(J37=45,'[1]Equivalencia BH-BMPT'!$D$46,\"No ha seleccionado un número de programa\")))))))))))))))))))))))))))))))))))))))))))))","v":"Gobernanza e influencia local, regional e internacional"},1329,79960305,"CRISTIAN JOSE BERNAL BAUTISTA",22400000,null,null,null,0,22400000,22400000,"2017-02-14","2017-02-15","2017-09-16",210,0,null,null,null,null,"X",1]
[20,2017,"CPS 020  2017",5,{"$f":"IF(D38=1,'[1]Tipo '!$B$2,IF(D38=2,'[1]Tipo '!$B$3,IF(D38=3,'[1]Tipo '!$B$4,IF(D38=4,'[1]Tipo '!$B$5,IF(D38=5,'[1]Tipo '!$B$6,IF(D38=6,'[1]Tipo '!$B$7,IF(D38=7,'[1]Tipo '!$B$8,IF(D38=8,'[1]Tipo '!$B$9,IF(D38=9,'[1]Tipo '!$B$10,IF(D38=10,'[1]Tipo '!$B$11,IF(D38=11,'[1]Tipo '!$B$12,IF(D38=12,'[1]Tipo '!$B$13,IF(D38=13,'[1]Tipo '!$B$14,IF(D38=14,'[1]Tipo '!$B$15,IF(D38=15,'[1]Tipo '!$B$16,IF(D38=16,'[1]Tipo '!$B$17,IF(D38=17,'[1]Tipo '!$B$18,IF(D38=18,'[1]Tipo '!$B$19,IF(D38=19,'[1]Tipo '!$B$20,\"No ha seleccionado un tipo de contrato válido\")))))))))))))))))))","v":"CONTRATOS DE PRESTACIÓN DE SERVICIOS PROFESIONALES Y DE APOYO A LA GESTIÓN"},"CONTRATACIÓN DIRECTA","Prestación de servicios profesionales y de apoyo a la gestión, o para la ejecución de trabajos artísticos que sólo puedan encomendarse a determinadas personas naturales;","El contrato que se pretende celebrar, tendrá por objeto¿¿Prestación de servicios profesionales al Área de Gestión de Desarrollo Local de Teusaquillo, en la formulación, evaluación, presentación y seguimiento de proyectos sociales y articulación de espacios locales e interinstitucionales","INVERSIÓN",45,{"$f":"IF(J38=1,'[1]Equivalencia BH-BMPT'!$D$2,IF(J38=2,'[1]Equivalencia BH-BMPT'!$D$3,IF(J38=3,'[1]Equivalencia BH-BMPT'!$D$4,IF(J38=4,'[1]Equivalencia BH-BMPT'!$D$5,IF(J38=5,'[1]Equivalencia BH-BMPT'!$D$6,IF(J38=6,'[1]Equivalencia BH-BMPT'!$D$7,IF(J38=7,'[1]Equivalencia BH-BMPT'!$D$8,IF(J38=8,'[1]Equivalencia BH-BMPT'!$D$9,IF(J38=9,'[1]Equivalencia BH-BMPT'!$D$10,IF(J38=10,'[1]Equivalencia BH-BMPT'!$D$11,IF(J38=11,'[1]Equivalencia BH-BMPT'!$D$12,IF(J38=12,'[1]Equivalencia BH-BMPT'!$D$13,IF(J38=13,'[1]Equivalencia BH-BMPT'!$D$14,IF(J38=14,'[1]Equivalencia BH-BMPT'!$D$15,IF(J38=15,'[1]Equivalencia BH-BMPT'!$D$16,IF(J38=16,'[1]Equivalencia BH-BMPT'!$D$17,IF(J38=17,'[1]Equivalencia BH-BMPT'!$D$18,IF(J38=18,'[1]Equivalencia BH-BMPT'!$D$19,IF(J38=19,'[1]Equivalencia BH-BMPT'!$D$20,IF(J38=20,'[1]Equivalencia BH-BMPT'!$D$21,IF(J38=21,'[1]Equivalencia BH-BMPT'!$D$22,IF(J38=22,'[1]Equivalencia BH-BMPT'!$D$23,IF(J38=23,'[1]Equivalencia BH-BMPT'!#REF!,IF(J38=24,'[1]Equivalencia BH-BMPT'!$D$25,IF(J38=25,'[1]Equivalencia BH-BMPT'!$D$26,IF(J38=26,'[1]Equivalencia BH-BMPT'!$D$27,IF(J38=27,'[1]Equivalencia BH-BMPT'!$D$28,IF(J38=28,'[1]Equivalencia BH-BMPT'!$D$29,IF(J38=29,'[1]Equivalencia BH-BMPT'!$D$30,IF(J38=30,'[1]Equivalencia BH-BMPT'!$D$31,IF(J38=31,'[1]Equivalencia BH-BMPT'!$D$32,IF(J38=32,'[1]Equivalencia BH-BMPT'!$D$33,IF(J38=33,'[1]Equivalencia BH-BMPT'!$D$34,IF(J38=34,'[1]Equivalencia BH-BMPT'!$D$35,IF(J38=35,'[1]Equivalencia BH-BMPT'!$D$36,IF(J38=36,'[1]Equivalencia BH-BMPT'!$D$37,IF(J38=37,'[1]Equivalencia BH-BMPT'!$D$38,IF(J38=38,'[1]Equivalencia BH-BMPT'!#REF!,IF(J38=39,'[1]Equivalencia BH-BMPT'!$D$40,IF(J38=40,'[1]Equivalencia BH-BMPT'!$D$41,IF(J38=41,'[1]Equivalencia BH-BMPT'!$D$42,IF(J38=42,'[1]Equivalencia BH-BMPT'!$D$43,IF(J38=43,'[1]Equivalencia BH-BMPT'!$D$44,IF(J38=44,'[1]Equivalencia BH-BMPT'!$D$45,IF(J38=45,'[1]Equivalencia BH-BMPT'!$D$46,\"No ha seleccionado un número de programa\")))))))))))))))))))))))))))))))))))))))))))))","v":"Gobernanza e influencia local, regional e internacional"},1329,52816918,"PAMELA  REYES PATRIA CAMARGO",32800000,null,null,null,0,32800000,32800000,"2017-02-14","2017-02-15","2017-09-14",240,0,null,null,null,null,"X",1]
[21,2017,"CPS 021  2017",5,{"$f":"IF(D39=1,'[1]Tipo '!$B$2,IF(D39=2,'[1]Tipo '!$B$3,IF(D39=3,'[1]Tipo '!$B$4,IF(D39=4,'[1]Tipo '!$B$5,IF(D39=5,'[1]Tipo '!$B$6,IF(D39=6,'[1]Tipo '!$B$7,IF(D39=7,'[1]Tipo '!$B$8,IF(D39=8,'[1]Tipo '!$B$9,IF(D39=9,'[1]Tipo '!$B$10,IF(D39=10,'[1]Tipo '!$B$11,IF(D39=11,'[1]Tipo '!$B$12,IF(D39=12,'[1]Tipo '!$B$13,IF(D39=13,'[1]Tipo '!$B$14,IF(D39=14,'[1]Tipo '!$B$15,IF(D39=15,'[1]Tipo '!$B$16,IF(D39=16,'[1]Tipo '!$B$17,IF(D39=17,'[1]Tipo '!$B$18,IF(D39=18,'[1]Tipo '!$B$19,IF(D39=19,'[1]Tipo '!$B$20,\"No ha seleccionado un tipo de contrato válido\")))))))))))))))))))","v":"CONTRATOS DE PRESTACIÓN DE SERVICIOS PROFESIONALES Y DE APOYO A LA GESTIÓN"},"CONTRATACIÓN DIRECTA","Prestación de servicios profesionales y de apoyo a la gestión, o para la ejecución de trabajos artísticos que sólo puedan encomendarse a determinadas personas naturales;","El contrato que se pretende celebrar, tendrá por objeto ¿El contratista se obliga para con la Alcaldía Local de Teusaquillo a prestar sus servicios en actividades operativas como el traslado, cuidado y entrega de la documentación, mensajería interna y externa que produzcan las oficinas de la Alcaldía Local.¿.","INVERSIÓN",45,{"$f":"IF(J39=1,'[1]Equivalencia BH-BMPT'!$D$2,IF(J39=2,'[1]Equivalencia BH-BMPT'!$D$3,IF(J39=3,'[1]Equivalencia BH-BMPT'!$D$4,IF(J39=4,'[1]Equivalencia BH-BMPT'!$D$5,IF(J39=5,'[1]Equivalencia BH-BMPT'!$D$6,IF(J39=6,'[1]Equivalencia BH-BMPT'!$D$7,IF(J39=7,'[1]Equivalencia BH-BMPT'!$D$8,IF(J39=8,'[1]Equivalencia BH-BMPT'!$D$9,IF(J39=9,'[1]Equivalencia BH-BMPT'!$D$10,IF(J39=10,'[1]Equivalencia BH-BMPT'!$D$11,IF(J39=11,'[1]Equivalencia BH-BMPT'!$D$12,IF(J39=12,'[1]Equivalencia BH-BMPT'!$D$13,IF(J39=13,'[1]Equivalencia BH-BMPT'!$D$14,IF(J39=14,'[1]Equivalencia BH-BMPT'!$D$15,IF(J39=15,'[1]Equivalencia BH-BMPT'!$D$16,IF(J39=16,'[1]Equivalencia BH-BMPT'!$D$17,IF(J39=17,'[1]Equivalencia BH-BMPT'!$D$18,IF(J39=18,'[1]Equivalencia BH-BMPT'!$D$19,IF(J39=19,'[1]Equivalencia BH-BMPT'!$D$20,IF(J39=20,'[1]Equivalencia BH-BMPT'!$D$21,IF(J39=21,'[1]Equivalencia BH-BMPT'!$D$22,IF(J39=22,'[1]Equivalencia BH-BMPT'!$D$23,IF(J39=23,'[1]Equivalencia BH-BMPT'!#REF!,IF(J39=24,'[1]Equivalencia BH-BMPT'!$D$25,IF(J39=25,'[1]Equivalencia BH-BMPT'!$D$26,IF(J39=26,'[1]Equivalencia BH-BMPT'!$D$27,IF(J39=27,'[1]Equivalencia BH-BMPT'!$D$28,IF(J39=28,'[1]Equivalencia BH-BMPT'!$D$29,IF(J39=29,'[1]Equivalencia BH-BMPT'!$D$30,IF(J39=30,'[1]Equivalencia BH-BMPT'!$D$31,IF(J39=31,'[1]Equivalencia BH-BMPT'!$D$32,IF(J39=32,'[1]Equivalencia BH-BMPT'!$D$33,IF(J39=33,'[1]Equivalencia BH-BMPT'!$D$34,IF(J39=34,'[1]Equivalencia BH-BMPT'!$D$35,IF(J39=35,'[1]Equivalencia BH-BMPT'!$D$36,IF(J39=36,'[1]Equivalencia BH-BMPT'!$D$37,IF(J39=37,'[1]Equivalencia BH-BMPT'!$D$38,IF(J39=38,'[1]Equivalencia BH-BMPT'!#REF!,IF(J39=39,'[1]Equivalencia BH-BMPT'!$D$40,IF(J39=40,'[1]Equivalencia BH-BMPT'!$D$41,IF(J39=41,'[1]Equivalencia BH-BMPT'!$D$42,IF(J39=42,'[1]Equivalencia BH-BMPT'!$D$43,IF(J39=43,'[1]Equivalencia BH-BMPT'!$D$44,IF(J39=44,'[1]Equivalencia BH-BMPT'!$D$45,IF(J39=45,'[1]Equivalencia BH-BMPT'!$D$46,\"No ha seleccionado un número de programa\")))))))))))))))))))))))))))))))))))))))))))))","v":"Gobernanza e influencia local, regional e internacional"},1329,51985575,"MARTHA ISABEL BLANCO JURADO",14000000,null,null,null,0,14000000,14000000,"2017-02-14","2017-02-14","2017-09-13",210,0,null,null,null,null,"X",1]
[22,2017,"CPS 022  2017",5,{"$f":"IF(D40=1,'[1]Tipo '!$B$2,IF(D40=2,'[1]Tipo '!$B$3,IF(D40=3,'[1]Tipo '!$B$4,IF(D40=4,'[1]Tipo '!$B$5,IF(D40=5,'[1]Tipo '!$B$6,IF(D40=6,'[1]Tipo '!$B$7,IF(D40=7,'[1]Tipo '!$B$8,IF(D40=8,'[1]Tipo '!$B$9,IF(D40=9,'[1]Tipo '!$B$10,IF(D40=10,'[1]Tipo '!$B$11,IF(D40=11,'[1]Tipo '!$B$12,IF(D40=12,'[1]Tipo '!$B$13,IF(D40=13,'[1]Tipo '!$B$14,IF(D40=14,'[1]Tipo '!$B$15,IF(D40=15,'[1]Tipo '!$B$16,IF(D40=16,'[1]Tipo '!$B$17,IF(D40=17,'[1]Tipo '!$B$18,IF(D40=18,'[1]Tipo '!$B$19,IF(D40=19,'[1]Tipo '!$B$20,\"No ha seleccionado un tipo de contrato válido\")))))))))))))))))))","v":"CONTRATOS DE PRESTACIÓN DE SERVICIOS PROFESIONALES Y DE APOYO A LA GESTIÓN"},"CONTRATACIÓN DIRECTA","Prestación de servicios profesionales y de apoyo a la gestión, o para la ejecución de trabajos artísticos que sólo puedan encomendarse a determinadas personas naturales;","El contrato que se pretende celebrar, tendrá por objeto ¿El contratista se obliga para con el Fondo de Desarrollo Local de Teusaquillo a prestar sus servicios profesionales realizando todas las actividades técnicas, y de coordinación institucional del proyecto 1330 ¿Teusaquillo mejor para el Ambiente","INVERSIÓN",45,{"$f":"IF(J40=1,'[1]Equivalencia BH-BMPT'!$D$2,IF(J40=2,'[1]Equivalencia BH-BMPT'!$D$3,IF(J40=3,'[1]Equivalencia BH-BMPT'!$D$4,IF(J40=4,'[1]Equivalencia BH-BMPT'!$D$5,IF(J40=5,'[1]Equivalencia BH-BMPT'!$D$6,IF(J40=6,'[1]Equivalencia BH-BMPT'!$D$7,IF(J40=7,'[1]Equivalencia BH-BMPT'!$D$8,IF(J40=8,'[1]Equivalencia BH-BMPT'!$D$9,IF(J40=9,'[1]Equivalencia BH-BMPT'!$D$10,IF(J40=10,'[1]Equivalencia BH-BMPT'!$D$11,IF(J40=11,'[1]Equivalencia BH-BMPT'!$D$12,IF(J40=12,'[1]Equivalencia BH-BMPT'!$D$13,IF(J40=13,'[1]Equivalencia BH-BMPT'!$D$14,IF(J40=14,'[1]Equivalencia BH-BMPT'!$D$15,IF(J40=15,'[1]Equivalencia BH-BMPT'!$D$16,IF(J40=16,'[1]Equivalencia BH-BMPT'!$D$17,IF(J40=17,'[1]Equivalencia BH-BMPT'!$D$18,IF(J40=18,'[1]Equivalencia BH-BMPT'!$D$19,IF(J40=19,'[1]Equivalencia BH-BMPT'!$D$20,IF(J40=20,'[1]Equivalencia BH-BMPT'!$D$21,IF(J40=21,'[1]Equivalencia BH-BMPT'!$D$22,IF(J40=22,'[1]Equivalencia BH-BMPT'!$D$23,IF(J40=23,'[1]Equivalencia BH-BMPT'!#REF!,IF(J40=24,'[1]Equivalencia BH-BMPT'!$D$25,IF(J40=25,'[1]Equivalencia BH-BMPT'!$D$26,IF(J40=26,'[1]Equivalencia BH-BMPT'!$D$27,IF(J40=27,'[1]Equivalencia BH-BMPT'!$D$28,IF(J40=28,'[1]Equivalencia BH-BMPT'!$D$29,IF(J40=29,'[1]Equivalencia BH-BMPT'!$D$30,IF(J40=30,'[1]Equivalencia BH-BMPT'!$D$31,IF(J40=31,'[1]Equivalencia BH-BMPT'!$D$32,IF(J40=32,'[1]Equivalencia BH-BMPT'!$D$33,IF(J40=33,'[1]Equivalencia BH-BMPT'!$D$34,IF(J40=34,'[1]Equivalencia BH-BMPT'!$D$35,IF(J40=35,'[1]Equivalencia BH-BMPT'!$D$36,IF(J40=36,'[1]Equivalencia BH-BMPT'!$D$37,IF(J40=37,'[1]Equivalencia BH-BMPT'!$D$38,IF(J40=38,'[1]Equivalencia BH-BMPT'!#REF!,IF(J40=39,'[1]Equivalencia BH-BMPT'!$D$40,IF(J40=40,'[1]Equivalencia BH-BMPT'!$D$41,IF(J40=41,'[1]Equivalencia BH-BMPT'!$D$42,IF(J40=42,'[1]Equivalencia BH-BMPT'!$D$43,IF(J40=43,'[1]Equivalencia BH-BMPT'!$D$44,IF(J40=44,'[1]Equivalencia BH-BMPT'!$D$45,IF(J40=45,'[1]Equivalencia BH-BMPT'!$D$46,\"No ha seleccionado un número de programa\")))))))))))))))))))))))))))))))))))))))))))))","v":"Gobernanza e influencia local, regional e internacional"},1329,52865785,"MARIA ELENA ORTEGA AMAYA",30100000,null,null,null,15050000,45150000,43143333,"2017-02-14","2017-02-14","2017-12-28",210,{"$f":"15+90","v":105},null,null,null,"X",null,0.95555554817275745]
[24,2017,"CPS 024  2017",5,{"$f":"IF(D41=1,'[1]Tipo '!$B$2,IF(D41=2,'[1]Tipo '!$B$3,IF(D41=3,'[1]Tipo '!$B$4,IF(D41=4,'[1]Tipo '!$B$5,IF(D41=5,'[1]Tipo '!$B$6,IF(D41=6,'[1]Tipo '!$B$7,IF(D41=7,'[1]Tipo '!$B$8,IF(D41=8,'[1]Tipo '!$B$9,IF(D41=9,'[1]Tipo '!$B$10,IF(D41=10,'[1]Tipo '!$B$11,IF(D41=11,'[1]Tipo '!$B$12,IF(D41=12,'[1]Tipo '!$B$13,IF(D41=13,'[1]Tipo '!$B$14,IF(D41=14,'[1]Tipo '!$B$15,IF(D41=15,'[1]Tipo '!$B$16,IF(D41=16,'[1]Tipo '!$B$17,IF(D41=17,'[1]Tipo '!$B$18,IF(D41=18,'[1]Tipo '!$B$19,IF(D41=19,'[1]Tipo '!$B$20,\"No ha seleccionado un tipo de contrato válido\")))))))))))))))))))","v":"CONTRATOS DE PRESTACIÓN DE SERVICIOS PROFESIONALES Y DE APOYO A LA GESTIÓN"},"CONTRATACIÓN DIRECTA","Prestación de servicios profesionales y de apoyo a la gestión, o para la ejecución de trabajos artísticos que sólo puedan encomendarse a determinadas personas naturales;","Prestación de servicios profesionales al Área de Gestión Policiva de la Alcaldía Local de Teusaquillo, con el fin de realizar las actividades concernientes a dar impulso y trámite procesal a las Actuaciones Administrativas al Régimen de Obras y Urbanismo y Preliminares, así como a los requerimientos relacionados al tema urbanístico.","INVERSIÓN",45,{"$f":"IF(J41=1,'[1]Equivalencia BH-BMPT'!$D$2,IF(J41=2,'[1]Equivalencia BH-BMPT'!$D$3,IF(J41=3,'[1]Equivalencia BH-BMPT'!$D$4,IF(J41=4,'[1]Equivalencia BH-BMPT'!$D$5,IF(J41=5,'[1]Equivalencia BH-BMPT'!$D$6,IF(J41=6,'[1]Equivalencia BH-BMPT'!$D$7,IF(J41=7,'[1]Equivalencia BH-BMPT'!$D$8,IF(J41=8,'[1]Equivalencia BH-BMPT'!$D$9,IF(J41=9,'[1]Equivalencia BH-BMPT'!$D$10,IF(J41=10,'[1]Equivalencia BH-BMPT'!$D$11,IF(J41=11,'[1]Equivalencia BH-BMPT'!$D$12,IF(J41=12,'[1]Equivalencia BH-BMPT'!$D$13,IF(J41=13,'[1]Equivalencia BH-BMPT'!$D$14,IF(J41=14,'[1]Equivalencia BH-BMPT'!$D$15,IF(J41=15,'[1]Equivalencia BH-BMPT'!$D$16,IF(J41=16,'[1]Equivalencia BH-BMPT'!$D$17,IF(J41=17,'[1]Equivalencia BH-BMPT'!$D$18,IF(J41=18,'[1]Equivalencia BH-BMPT'!$D$19,IF(J41=19,'[1]Equivalencia BH-BMPT'!$D$20,IF(J41=20,'[1]Equivalencia BH-BMPT'!$D$21,IF(J41=21,'[1]Equivalencia BH-BMPT'!$D$22,IF(J41=22,'[1]Equivalencia BH-BMPT'!$D$23,IF(J41=23,'[1]Equivalencia BH-BMPT'!#REF!,IF(J41=24,'[1]Equivalencia BH-BMPT'!$D$25,IF(J41=25,'[1]Equivalencia BH-BMPT'!$D$26,IF(J41=26,'[1]Equivalencia BH-BMPT'!$D$27,IF(J41=27,'[1]Equivalencia BH-BMPT'!$D$28,IF(J41=28,'[1]Equivalencia BH-BMPT'!$D$29,IF(J41=29,'[1]Equivalencia BH-BMPT'!$D$30,IF(J41=30,'[1]Equivalencia BH-BMPT'!$D$31,IF(J41=31,'[1]Equivalencia BH-BMPT'!$D$32,IF(J41=32,'[1]Equivalencia BH-BMPT'!$D$33,IF(J41=33,'[1]Equivalencia BH-BMPT'!$D$34,IF(J41=34,'[1]Equivalencia BH-BMPT'!$D$35,IF(J41=35,'[1]Equivalencia BH-BMPT'!$D$36,IF(J41=36,'[1]Equivalencia BH-BMPT'!$D$37,IF(J41=37,'[1]Equivalencia BH-BMPT'!$D$38,IF(J41=38,'[1]Equivalencia BH-BMPT'!#REF!,IF(J41=39,'[1]Equivalencia BH-BMPT'!$D$40,IF(J41=40,'[1]Equivalencia BH-BMPT'!$D$41,IF(J41=41,'[1]Equivalencia BH-BMPT'!$D$42,IF(J41=42,'[1]Equivalencia BH-BMPT'!$D$43,IF(J41=43,'[1]Equivalencia BH-BMPT'!$D$44,IF(J41=44,'[1]Equivalencia BH-BMPT'!$D$45,IF(J41=45,'[1]Equivalencia BH-BMPT'!$D$46,\"No ha seleccionado un número de programa\")))))))))))))))))))))))))))))))))))))))))))))","v":"Gobernanza e influencia local, regional e internacional"},1329,22501932,"BELKIS CECILIA CASTRO MONTERROSA",28402108,null,null,null,13930557,42332665,40303943,"2017-02-16","2017-02-17","2017-12-29",210,{"$f":"13+90","v":103},null,null,null,"X",null,0.95207667648611305]
[25,2017,"CPS 025  2017",5,{"$f":"IF(D42=1,'[1]Tipo '!$B$2,IF(D42=2,'[1]Tipo '!$B$3,IF(D42=3,'[1]Tipo '!$B$4,IF(D42=4,'[1]Tipo '!$B$5,IF(D42=5,'[1]Tipo '!$B$6,IF(D42=6,'[1]Tipo '!$B$7,IF(D42=7,'[1]Tipo '!$B$8,IF(D42=8,'[1]Tipo '!$B$9,IF(D42=9,'[1]Tipo '!$B$10,IF(D42=10,'[1]Tipo '!$B$11,IF(D42=11,'[1]Tipo '!$B$12,IF(D42=12,'[1]Tipo '!$B$13,IF(D42=13,'[1]Tipo '!$B$14,IF(D42=14,'[1]Tipo '!$B$15,IF(D42=15,'[1]Tipo '!$B$16,IF(D42=16,'[1]Tipo '!$B$17,IF(D42=17,'[1]Tipo '!$B$18,IF(D42=18,'[1]Tipo '!$B$19,IF(D42=19,'[1]Tipo '!$B$20,\"No ha seleccionado un tipo de contrato válido\")))))))))))))))))))","v":"CONTRATOS DE PRESTACIÓN DE SERVICIOS PROFESIONALES Y DE APOYO A LA GESTIÓN"},"CONTRATACIÓN DIRECTA","Prestación de servicios profesionales y de apoyo a la gestión, o para la ejecución de trabajos artísticos que sólo puedan encomendarse a determinadas personas naturales;","EL CONTRATISTA SE OBLIGA PARA CON EL FONDO DE DESARROLLO LOCAL A PRESTAR SUS SERVICIOS DE APOYO A LAS ACTIVIDADES QUE SE GENEREN EN LA JUNTA ADMINISTRADORA LOCAL DE TEUSAQUILLO.","INVERSIÓN",45,{"$f":"IF(J42=1,'[1]Equivalencia BH-BMPT'!$D$2,IF(J42=2,'[1]Equivalencia BH-BMPT'!$D$3,IF(J42=3,'[1]Equivalencia BH-BMPT'!$D$4,IF(J42=4,'[1]Equivalencia BH-BMPT'!$D$5,IF(J42=5,'[1]Equivalencia BH-BMPT'!$D$6,IF(J42=6,'[1]Equivalencia BH-BMPT'!$D$7,IF(J42=7,'[1]Equivalencia BH-BMPT'!$D$8,IF(J42=8,'[1]Equivalencia BH-BMPT'!$D$9,IF(J42=9,'[1]Equivalencia BH-BMPT'!$D$10,IF(J42=10,'[1]Equivalencia BH-BMPT'!$D$11,IF(J42=11,'[1]Equivalencia BH-BMPT'!$D$12,IF(J42=12,'[1]Equivalencia BH-BMPT'!$D$13,IF(J42=13,'[1]Equivalencia BH-BMPT'!$D$14,IF(J42=14,'[1]Equivalencia BH-BMPT'!$D$15,IF(J42=15,'[1]Equivalencia BH-BMPT'!$D$16,IF(J42=16,'[1]Equivalencia BH-BMPT'!$D$17,IF(J42=17,'[1]Equivalencia BH-BMPT'!$D$18,IF(J42=18,'[1]Equivalencia BH-BMPT'!$D$19,IF(J42=19,'[1]Equivalencia BH-BMPT'!$D$20,IF(J42=20,'[1]Equivalencia BH-BMPT'!$D$21,IF(J42=21,'[1]Equivalencia BH-BMPT'!$D$22,IF(J42=22,'[1]Equivalencia BH-BMPT'!$D$23,IF(J42=23,'[1]Equivalencia BH-BMPT'!#REF!,IF(J42=24,'[1]Equivalencia BH-BMPT'!$D$25,IF(J42=25,'[1]Equivalencia BH-BMPT'!$D$26,IF(J42=26,'[1]Equivalencia BH-BMPT'!$D$27,IF(J42=27,'[1]Equivalencia BH-BMPT'!$D$28,IF(J42=28,'[1]Equivalencia BH-BMPT'!$D$29,IF(J42=29,'[1]Equivalencia BH-BMPT'!$D$30,IF(J42=30,'[1]Equivalencia BH-BMPT'!$D$31,IF(J42=31,'[1]Equivalencia BH-BMPT'!$D$32,IF(J42=32,'[1]Equivalencia BH-BMPT'!$D$33,IF(J42=33,'[1]Equivalencia BH-BMPT'!$D$34,IF(J42=34,'[1]Equivalencia BH-BMPT'!$D$35,IF(J42=35,'[1]Equivalencia BH-BMPT'!$D$36,IF(J42=36,'[1]Equivalencia BH-BMPT'!$D$37,IF(J42=37,'[1]Equivalencia BH-BMPT'!$D$38,IF(J42=38,'[1]Equivalencia BH-BMPT'!#REF!,IF(J42=39,'[1]Equivalencia BH-BMPT'!$D$40,IF(J42=40,'[1]Equivalencia BH-BMPT'!$D$41,IF(J42=41,'[1]Equivalencia BH-BMPT'!$D$42,IF(J42=42,'[1]Equivalencia BH-BMPT'!$D$43,IF(J42=43,'[1]Equivalencia BH-BMPT'!$D$44,IF(J42=44,'[1]Equivalencia BH-BMPT'!$D$45,IF(J42=45,'[1]Equivalencia BH-BMPT'!$D$46,\"No ha seleccionado un número de programa\")))))))))))))))))))))))))))))))))))))))))))))","v":"Gobernanza e influencia local, regional e internacional"},1329,1018448341,"PEDRO ANGEL ZABALETA POLO",21700000,null,null,null,10023333,31723333,30173333,"2017-02-17","2017-02-23","2017-12-29",210,{"$f":"7+90","v":97},null,null,null,"X",null,0.95114006463318346]
[26,2017,"CPS 026  2017",5,{"$f":"IF(D43=1,'[1]Tipo '!$B$2,IF(D43=2,'[1]Tipo '!$B$3,IF(D43=3,'[1]Tipo '!$B$4,IF(D43=4,'[1]Tipo '!$B$5,IF(D43=5,'[1]Tipo '!$B$6,IF(D43=6,'[1]Tipo '!$B$7,IF(D43=7,'[1]Tipo '!$B$8,IF(D43=8,'[1]Tipo '!$B$9,IF(D43=9,'[1]Tipo '!$B$10,IF(D43=10,'[1]Tipo '!$B$11,IF(D43=11,'[1]Tipo '!$B$12,IF(D43=12,'[1]Tipo '!$B$13,IF(D43=13,'[1]Tipo '!$B$14,IF(D43=14,'[1]Tipo '!$B$15,IF(D43=15,'[1]Tipo '!$B$16,IF(D43=16,'[1]Tipo '!$B$17,IF(D43=17,'[1]Tipo '!$B$18,IF(D43=18,'[1]Tipo '!$B$19,IF(D43=19,'[1]Tipo '!$B$20,\"No ha seleccionado un tipo de contrato válido\")))))))))))))))))))","v":"CONTRATOS DE PRESTACIÓN DE SERVICIOS PROFESIONALES Y DE APOYO A LA GESTIÓN"},"CONTRATACIÓN DIRECTA","Prestación de servicios profesionales y de apoyo a la gestión, o para la ejecución de trabajos artísticos que sólo puedan encomendarse a determinadas personas naturales;","El contrato que se pretende celebrar, tendrá por objeto ¿Prestación de servicios de apoyo a la gestión al Área de Gestión Policiva de la Alcaldía Local de Teusaquillo, en las actividades concernientes a la recepción de correspondencia, registro, digitalización y seguimiento a los trámites administrativos de las oficinas de obras y jurídica, así como el manejo de agenda y elaboración de actas de reuniones¿.","INVERSIÓN",45,{"$f":"IF(J43=1,'[1]Equivalencia BH-BMPT'!$D$2,IF(J43=2,'[1]Equivalencia BH-BMPT'!$D$3,IF(J43=3,'[1]Equivalencia BH-BMPT'!$D$4,IF(J43=4,'[1]Equivalencia BH-BMPT'!$D$5,IF(J43=5,'[1]Equivalencia BH-BMPT'!$D$6,IF(J43=6,'[1]Equivalencia BH-BMPT'!$D$7,IF(J43=7,'[1]Equivalencia BH-BMPT'!$D$8,IF(J43=8,'[1]Equivalencia BH-BMPT'!$D$9,IF(J43=9,'[1]Equivalencia BH-BMPT'!$D$10,IF(J43=10,'[1]Equivalencia BH-BMPT'!$D$11,IF(J43=11,'[1]Equivalencia BH-BMPT'!$D$12,IF(J43=12,'[1]Equivalencia BH-BMPT'!$D$13,IF(J43=13,'[1]Equivalencia BH-BMPT'!$D$14,IF(J43=14,'[1]Equivalencia BH-BMPT'!$D$15,IF(J43=15,'[1]Equivalencia BH-BMPT'!$D$16,IF(J43=16,'[1]Equivalencia BH-BMPT'!$D$17,IF(J43=17,'[1]Equivalencia BH-BMPT'!$D$18,IF(J43=18,'[1]Equivalencia BH-BMPT'!$D$19,IF(J43=19,'[1]Equivalencia BH-BMPT'!$D$20,IF(J43=20,'[1]Equivalencia BH-BMPT'!$D$21,IF(J43=21,'[1]Equivalencia BH-BMPT'!$D$22,IF(J43=22,'[1]Equivalencia BH-BMPT'!$D$23,IF(J43=23,'[1]Equivalencia BH-BMPT'!#REF!,IF(J43=24,'[1]Equivalencia BH-BMPT'!$D$25,IF(J43=25,'[1]Equivalencia BH-BMPT'!$D$26,IF(J43=26,'[1]Equivalencia BH-BMPT'!$D$27,IF(J43=27,'[1]Equivalencia BH-BMPT'!$D$28,IF(J43=28,'[1]Equivalencia BH-BMPT'!$D$29,IF(J43=29,'[1]Equivalencia BH-BMPT'!$D$30,IF(J43=30,'[1]Equivalencia BH-BMPT'!$D$31,IF(J43=31,'[1]Equivalencia BH-BMPT'!$D$32,IF(J43=32,'[1]Equivalencia BH-BMPT'!$D$33,IF(J43=33,'[1]Equivalencia BH-BMPT'!$D$34,IF(J43=34,'[1]Equivalencia BH-BMPT'!$D$35,IF(J43=35,'[1]Equivalencia BH-BMPT'!$D$36,IF(J43=36,'[1]Equivalencia BH-BMPT'!$D$37,IF(J43=37,'[1]Equivalencia BH-BMPT'!$D$38,IF(J43=38,'[1]Equivalencia BH-BMPT'!#REF!,IF(J43=39,'[1]Equivalencia BH-BMPT'!$D$40,IF(J43=40,'[1]Equivalencia BH-BMPT'!$D$41,IF(J43=41,'[1]Equivalencia BH-BMPT'!$D$42,IF(J43=42,'[1]Equivalencia BH-BMPT'!$D$43,IF(J43=43,'[1]Equivalencia BH-BMPT'!$D$44,IF(J43=44,'[1]Equivalencia BH-BMPT'!$D$45,IF(J43=45,'[1]Equivalencia BH-BMPT'!$D$46,\"No ha seleccionado un número de programa\")))))))))))))))))))))))))))))))))))))))))))))","v":"Gobernanza e influencia local, regional e internacional"},1329,1015403868,"TORRES RICAUTE CINDY LICCETTE",20139672,null,null,null,0,20139672,20139672,"2017-02-16","2017-02-16","2017-09-15",210,0,null,null,null,null,"X",1]
[27,2017,"CPS 027  2017",5,{"$f":"IF(D44=1,'[1]Tipo '!$B$2,IF(D44=2,'[1]Tipo '!$B$3,IF(D44=3,'[1]Tipo '!$B$4,IF(D44=4,'[1]Tipo '!$B$5,IF(D44=5,'[1]Tipo '!$B$6,IF(D44=6,'[1]Tipo '!$B$7,IF(D44=7,'[1]Tipo '!$B$8,IF(D44=8,'[1]Tipo '!$B$9,IF(D44=9,'[1]Tipo '!$B$10,IF(D44=10,'[1]Tipo '!$B$11,IF(D44=11,'[1]Tipo '!$B$12,IF(D44=12,'[1]Tipo '!$B$13,IF(D44=13,'[1]Tipo '!$B$14,IF(D44=14,'[1]Tipo '!$B$15,IF(D44=15,'[1]Tipo '!$B$16,IF(D44=16,'[1]Tipo '!$B$17,IF(D44=17,'[1]Tipo '!$B$18,IF(D44=18,'[1]Tipo '!$B$19,IF(D44=19,'[1]Tipo '!$B$20,\"No ha seleccionado un tipo de contrato válido\")))))))))))))))))))","v":"CONTRATOS DE PRESTACIÓN DE SERVICIOS PROFESIONALES Y DE APOYO A LA GESTIÓN"},"CONTRATACIÓN DIRECTA","Prestación de servicios profesionales y de apoyo a la gestión, o para la ejecución de trabajos artísticos que sólo puedan encomendarse a determinadas personas naturales;","El contrato que se pretende celebrar, tendrá por objeto ¿Prestación de servicios profesionales al Área de Gestión Policiva en el trámite procesal  de las Actuaciones Administrativas y preliminares adelantadas con miras a la restitución del espacio público y la atención a los vendedores informales de la localidad¿.","INVERSIÓN",45,{"$f":"IF(J44=1,'[1]Equivalencia BH-BMPT'!$D$2,IF(J44=2,'[1]Equivalencia BH-BMPT'!$D$3,IF(J44=3,'[1]Equivalencia BH-BMPT'!$D$4,IF(J44=4,'[1]Equivalencia BH-BMPT'!$D$5,IF(J44=5,'[1]Equivalencia BH-BMPT'!$D$6,IF(J44=6,'[1]Equivalencia BH-BMPT'!$D$7,IF(J44=7,'[1]Equivalencia BH-BMPT'!$D$8,IF(J44=8,'[1]Equivalencia BH-BMPT'!$D$9,IF(J44=9,'[1]Equivalencia BH-BMPT'!$D$10,IF(J44=10,'[1]Equivalencia BH-BMPT'!$D$11,IF(J44=11,'[1]Equivalencia BH-BMPT'!$D$12,IF(J44=12,'[1]Equivalencia BH-BMPT'!$D$13,IF(J44=13,'[1]Equivalencia BH-BMPT'!$D$14,IF(J44=14,'[1]Equivalencia BH-BMPT'!$D$15,IF(J44=15,'[1]Equivalencia BH-BMPT'!$D$16,IF(J44=16,'[1]Equivalencia BH-BMPT'!$D$17,IF(J44=17,'[1]Equivalencia BH-BMPT'!$D$18,IF(J44=18,'[1]Equivalencia BH-BMPT'!$D$19,IF(J44=19,'[1]Equivalencia BH-BMPT'!$D$20,IF(J44=20,'[1]Equivalencia BH-BMPT'!$D$21,IF(J44=21,'[1]Equivalencia BH-BMPT'!$D$22,IF(J44=22,'[1]Equivalencia BH-BMPT'!$D$23,IF(J44=23,'[1]Equivalencia BH-BMPT'!#REF!,IF(J44=24,'[1]Equivalencia BH-BMPT'!$D$25,IF(J44=25,'[1]Equivalencia BH-BMPT'!$D$26,IF(J44=26,'[1]Equivalencia BH-BMPT'!$D$27,IF(J44=27,'[1]Equivalencia BH-BMPT'!$D$28,IF(J44=28,'[1]Equivalencia BH-BMPT'!$D$29,IF(J44=29,'[1]Equivalencia BH-BMPT'!$D$30,IF(J44=30,'[1]Equivalencia BH-BMPT'!$D$31,IF(J44=31,'[1]Equivalencia BH-BMPT'!$D$32,IF(J44=32,'[1]Equivalencia BH-BMPT'!$D$33,IF(J44=33,'[1]Equivalencia BH-BMPT'!$D$34,IF(J44=34,'[1]Equivalencia BH-BMPT'!$D$35,IF(J44=35,'[1]Equivalencia BH-BMPT'!$D$36,IF(J44=36,'[1]Equivalencia BH-BMPT'!$D$37,IF(J44=37,'[1]Equivalencia BH-BMPT'!$D$38,IF(J44=38,'[1]Equivalencia BH-BMPT'!#REF!,IF(J44=39,'[1]Equivalencia BH-BMPT'!$D$40,IF(J44=40,'[1]Equivalencia BH-BMPT'!$D$41,IF(J44=41,'[1]Equivalencia BH-BMPT'!$D$42,IF(J44=42,'[1]Equivalencia BH-BMPT'!$D$43,IF(J44=43,'[1]Equivalencia BH-BMPT'!$D$44,IF(J44=44,'[1]Equivalencia BH-BMPT'!$D$45,IF(J44=45,'[1]Equivalencia BH-BMPT'!$D$46,\"No ha seleccionado un número de programa\")))))))))))))))))))))))))))))))))))))))))))))","v":"Gobernanza e influencia local, regional e internacional"},1329,82391015,"OSCAR ANDRES MESA RODRIGUEZ",31500000,null,null,null,0,31500000,31350000,"2017-02-16","2017-02-16","2017-09-15",210,0,null,null,null,"X",null,0.99523809523809526]
[28,2017,"cps 28 2017",5,{"$f":"IF(D45=1,'[1]Tipo '!$B$2,IF(D45=2,'[1]Tipo '!$B$3,IF(D45=3,'[1]Tipo '!$B$4,IF(D45=4,'[1]Tipo '!$B$5,IF(D45=5,'[1]Tipo '!$B$6,IF(D45=6,'[1]Tipo '!$B$7,IF(D45=7,'[1]Tipo '!$B$8,IF(D45=8,'[1]Tipo '!$B$9,IF(D45=9,'[1]Tipo '!$B$10,IF(D45=10,'[1]Tipo '!$B$11,IF(D45=11,'[1]Tipo '!$B$12,IF(D45=12,'[1]Tipo '!$B$13,IF(D45=13,'[1]Tipo '!$B$14,IF(D45=14,'[1]Tipo '!$B$15,IF(D45=15,'[1]Tipo '!$B$16,IF(D45=16,'[1]Tipo '!$B$17,IF(D45=17,'[1]Tipo '!$B$18,IF(D45=18,'[1]Tipo '!$B$19,IF(D45=19,'[1]Tipo '!$B$20,\"No ha seleccionado un tipo de contrato válido\")))))))))))))))))))","v":"CONTRATOS DE PRESTACIÓN DE SERVICIOS PROFESIONALES Y DE APOYO A LA GESTIÓN"},"CONTRATACIÓN DIRECTA","Prestación de servicios profesionales y de apoyo a la gestión, o para la ejecución de trabajos artísticos que sólo puedan encomendarse a determinadas personas naturales;","El contrato que se pretende celebrar, tendrá por objeto¿¿Prestación de servicios profesionales al Área de Gestión Policiva para la descongestión e impulso procesal a las actuaciones administrativas y preliminares correspondientes al régimen de obras y urbanismo anteriores al año 2015, así como recepcionar diligencias de expresión de opiniones correspondientes al tema urbanístico.¿","INVERSIÓN",45,{"$f":"IF(J45=1,'[1]Equivalencia BH-BMPT'!$D$2,IF(J45=2,'[1]Equivalencia BH-BMPT'!$D$3,IF(J45=3,'[1]Equivalencia BH-BMPT'!$D$4,IF(J45=4,'[1]Equivalencia BH-BMPT'!$D$5,IF(J45=5,'[1]Equivalencia BH-BMPT'!$D$6,IF(J45=6,'[1]Equivalencia BH-BMPT'!$D$7,IF(J45=7,'[1]Equivalencia BH-BMPT'!$D$8,IF(J45=8,'[1]Equivalencia BH-BMPT'!$D$9,IF(J45=9,'[1]Equivalencia BH-BMPT'!$D$10,IF(J45=10,'[1]Equivalencia BH-BMPT'!$D$11,IF(J45=11,'[1]Equivalencia BH-BMPT'!$D$12,IF(J45=12,'[1]Equivalencia BH-BMPT'!$D$13,IF(J45=13,'[1]Equivalencia BH-BMPT'!$D$14,IF(J45=14,'[1]Equivalencia BH-BMPT'!$D$15,IF(J45=15,'[1]Equivalencia BH-BMPT'!$D$16,IF(J45=16,'[1]Equivalencia BH-BMPT'!$D$17,IF(J45=17,'[1]Equivalencia BH-BMPT'!$D$18,IF(J45=18,'[1]Equivalencia BH-BMPT'!$D$19,IF(J45=19,'[1]Equivalencia BH-BMPT'!$D$20,IF(J45=20,'[1]Equivalencia BH-BMPT'!$D$21,IF(J45=21,'[1]Equivalencia BH-BMPT'!$D$22,IF(J45=22,'[1]Equivalencia BH-BMPT'!$D$23,IF(J45=23,'[1]Equivalencia BH-BMPT'!#REF!,IF(J45=24,'[1]Equivalencia BH-BMPT'!$D$25,IF(J45=25,'[1]Equivalencia BH-BMPT'!$D$26,IF(J45=26,'[1]Equivalencia BH-BMPT'!$D$27,IF(J45=27,'[1]Equivalencia BH-BMPT'!$D$28,IF(J45=28,'[1]Equivalencia BH-BMPT'!$D$29,IF(J45=29,'[1]Equivalencia BH-BMPT'!$D$30,IF(J45=30,'[1]Equivalencia BH-BMPT'!$D$31,IF(J45=31,'[1]Equivalencia BH-BMPT'!$D$32,IF(J45=32,'[1]Equivalencia BH-BMPT'!$D$33,IF(J45=33,'[1]Equivalencia BH-BMPT'!$D$34,IF(J45=34,'[1]Equivalencia BH-BMPT'!$D$35,IF(J45=35,'[1]Equivalencia BH-BMPT'!$D$36,IF(J45=36,'[1]Equivalencia BH-BMPT'!$D$37,IF(J45=37,'[1]Equivalencia BH-BMPT'!$D$38,IF(J45=38,'[1]Equivalencia BH-BMPT'!#REF!,IF(J45=39,'[1]Equivalencia BH-BMPT'!$D$40,IF(J45=40,'[1]Equivalencia BH-BMPT'!$D$41,IF(J45=41,'[1]Equivalencia BH-BMPT'!$D$42,IF(J45=42,'[1]Equivalencia BH-BMPT'!$D$43,IF(J45=43,'[1]Equivalencia BH-BMPT'!$D$44,IF(J45=44,'[1]Equivalencia BH-BMPT'!$D$45,IF(J45=45,'[1]Equivalencia BH-BMPT'!$D$46,\"No ha seleccionado un número de programa\")))))))))))))))))))))))))))))))))))))))))))))","v":"Gobernanza e influencia local, regional e internacional"},1329,8722208,"ABELARDO JESUS RAMOS RAMOS",28402108,null,null,null,0,28402108,28402108,"2017-02-15","2017-02-24","2017-09-23",210,0,null,null,null,null,"X",1]
[29,2017,"CPS 029 2017  ",5,{"$f":"IF(D46=1,'[1]Tipo '!$B$2,IF(D46=2,'[1]Tipo '!$B$3,IF(D46=3,'[1]Tipo '!$B$4,IF(D46=4,'[1]Tipo '!$B$5,IF(D46=5,'[1]Tipo '!$B$6,IF(D46=6,'[1]Tipo '!$B$7,IF(D46=7,'[1]Tipo '!$B$8,IF(D46=8,'[1]Tipo '!$B$9,IF(D46=9,'[1]Tipo '!$B$10,IF(D46=10,'[1]Tipo '!$B$11,IF(D46=11,'[1]Tipo '!$B$12,IF(D46=12,'[1]Tipo '!$B$13,IF(D46=13,'[1]Tipo '!$B$14,IF(D46=14,'[1]Tipo '!$B$15,IF(D46=15,'[1]Tipo '!$B$16,IF(D46=16,'[1]Tipo '!$B$17,IF(D46=17,'[1]Tipo '!$B$18,IF(D46=18,'[1]Tipo '!$B$19,IF(D46=19,'[1]Tipo '!$B$20,\"No ha seleccionado un tipo de contrato válido\")))))))))))))))))))","v":"CONTRATOS DE PRESTACIÓN DE SERVICIOS PROFESIONALES Y DE APOYO A LA GESTIÓN"},"CONTRATACIÓN DIRECTA","Prestación de servicios profesionales y de apoyo a la gestión, o para la ejecución de trabajos artísticos que sólo puedan encomendarse a determinadas personas naturales;","El contrato que se pretende celebrar, tendrá por objeto¿¿Prestación de servicios profesionales al Área de Gestión Policiva de la Alcaldía Local de Teusaquillo, con el fin de realizar las actividades concernientes al trámite procesal de las Actuaciones Administrativas y requerimientos relacionados con Establecimientos de Comercio, así como recepcionar diligencias de expresión de opiniones correspondientes al tema.¿","INVERSIÓN",45,{"$f":"IF(J46=1,'[1]Equivalencia BH-BMPT'!$D$2,IF(J46=2,'[1]Equivalencia BH-BMPT'!$D$3,IF(J46=3,'[1]Equivalencia BH-BMPT'!$D$4,IF(J46=4,'[1]Equivalencia BH-BMPT'!$D$5,IF(J46=5,'[1]Equivalencia BH-BMPT'!$D$6,IF(J46=6,'[1]Equivalencia BH-BMPT'!$D$7,IF(J46=7,'[1]Equivalencia BH-BMPT'!$D$8,IF(J46=8,'[1]Equivalencia BH-BMPT'!$D$9,IF(J46=9,'[1]Equivalencia BH-BMPT'!$D$10,IF(J46=10,'[1]Equivalencia BH-BMPT'!$D$11,IF(J46=11,'[1]Equivalencia BH-BMPT'!$D$12,IF(J46=12,'[1]Equivalencia BH-BMPT'!$D$13,IF(J46=13,'[1]Equivalencia BH-BMPT'!$D$14,IF(J46=14,'[1]Equivalencia BH-BMPT'!$D$15,IF(J46=15,'[1]Equivalencia BH-BMPT'!$D$16,IF(J46=16,'[1]Equivalencia BH-BMPT'!$D$17,IF(J46=17,'[1]Equivalencia BH-BMPT'!$D$18,IF(J46=18,'[1]Equivalencia BH-BMPT'!$D$19,IF(J46=19,'[1]Equivalencia BH-BMPT'!$D$20,IF(J46=20,'[1]Equivalencia BH-BMPT'!$D$21,IF(J46=21,'[1]Equivalencia BH-BMPT'!$D$22,IF(J46=22,'[1]Equivalencia BH-BMPT'!$D$23,IF(J46=23,'[1]Equivalencia BH-BMPT'!#REF!,IF(J46=24,'[1]Equivalencia BH-BMPT'!$D$25,IF(J46=25,'[1]Equivalencia BH-BMPT'!$D$26,IF(J46=26,'[1]Equivalencia BH-BMPT'!$D$27,IF(J46=27,'[1]Equivalencia BH-BMPT'!$D$28,IF(J46=28,'[1]Equivalencia BH-BMPT'!$D$29,IF(J46=29,'[1]Equivalencia BH-BMPT'!$D$30,IF(J46=30,'[1]Equivalencia BH-BMPT'!$D$31,IF(J46=31,'[1]Equivalencia BH-BMPT'!$D$32,IF(J46=32,'[1]Equivalencia BH-BMPT'!$D$33,IF(J46=33,'[1]Equivalencia BH-BMPT'!$D$34,IF(J46=34,'[1]Equivalencia BH-BMPT'!$D$35,IF(J46=35,'[1]Equivalencia BH-BMPT'!$D$36,IF(J46=36,'[1]Equivalencia BH-BMPT'!$D$37,IF(J46=37,'[1]Equivalencia BH-BMPT'!$D$38,IF(J46=38,'[1]Equivalencia BH-BMPT'!#REF!,IF(J46=39,'[1]Equivalencia BH-BMPT'!$D$40,IF(J46=40,'[1]Equivalencia BH-BMPT'!$D$41,IF(J46=41,'[1]Equivalencia BH-BMPT'!$D$42,IF(J46=42,'[1]Equivalencia BH-BMPT'!$D$43,IF(J46=43,'[1]Equivalencia BH-BMPT'!$D$44,IF(J46=44,'[1]Equivalencia BH-BMPT'!$D$45,IF(J46=45,'[1]Equivalencia BH-BMPT'!$D$46,\"No ha seleccionado un número de programa\")))))))))))))))))))))))))))))))))))))))))))))","v":"Gobernanza e influencia local, regional e internacional"},1329,1016016305,"JHONATAN  DUCUARA CAITA",31500000,null,null,null,0,31500000,31500000,"2017-02-16","2017-02-17","2017-09-16",210,0,null,null,null,null,"X",1]
[30,2017,"CPS 030 2017 ",5,{"$f":"IF(D47=1,'[1]Tipo '!$B$2,IF(D47=2,'[1]Tipo '!$B$3,IF(D47=3,'[1]Tipo '!$B$4,IF(D47=4,'[1]Tipo '!$B$5,IF(D47=5,'[1]Tipo '!$B$6,IF(D47=6,'[1]Tipo '!$B$7,IF(D47=7,'[1]Tipo '!$B$8,IF(D47=8,'[1]Tipo '!$B$9,IF(D47=9,'[1]Tipo '!$B$10,IF(D47=10,'[1]Tipo '!$B$11,IF(D47=11,'[1]Tipo '!$B$12,IF(D47=12,'[1]Tipo '!$B$13,IF(D47=13,'[1]Tipo '!$B$14,IF(D47=14,'[1]Tipo '!$B$15,IF(D47=15,'[1]Tipo '!$B$16,IF(D47=16,'[1]Tipo '!$B$17,IF(D47=17,'[1]Tipo '!$B$18,IF(D47=18,'[1]Tipo '!$B$19,IF(D47=19,'[1]Tipo '!$B$20,\"No ha seleccionado un tipo de contrato válido\")))))))))))))))))))","v":"CONTRATOS DE PRESTACIÓN DE SERVICIOS PROFESIONALES Y DE APOYO A LA GESTIÓN"},"CONTRATACIÓN DIRECTA","Prestación de servicios profesionales y de apoyo a la gestión, o para la ejecución de trabajos artísticos que sólo puedan encomendarse a determinadas personas naturales;","El contrato que se pretende celebrar, tendrá por objeto¿Prestación de servicios de apoyo en el área de Gestión de Desarrollo Local para adelantar  las labores de clasificación,  foliado, digitalización, organización técnica, informática y demás necesarias para la gestión documental, así como el proceso de eliminación y transferencia de archivos inactivos de la alcaldía local de Teusaquillo de acuerdo a la normatividad vigente y en concordancia con los estándares de gestión documental y la administración¿.","INVERSIÓN",45,{"$f":"IF(J47=1,'[1]Equivalencia BH-BMPT'!$D$2,IF(J47=2,'[1]Equivalencia BH-BMPT'!$D$3,IF(J47=3,'[1]Equivalencia BH-BMPT'!$D$4,IF(J47=4,'[1]Equivalencia BH-BMPT'!$D$5,IF(J47=5,'[1]Equivalencia BH-BMPT'!$D$6,IF(J47=6,'[1]Equivalencia BH-BMPT'!$D$7,IF(J47=7,'[1]Equivalencia BH-BMPT'!$D$8,IF(J47=8,'[1]Equivalencia BH-BMPT'!$D$9,IF(J47=9,'[1]Equivalencia BH-BMPT'!$D$10,IF(J47=10,'[1]Equivalencia BH-BMPT'!$D$11,IF(J47=11,'[1]Equivalencia BH-BMPT'!$D$12,IF(J47=12,'[1]Equivalencia BH-BMPT'!$D$13,IF(J47=13,'[1]Equivalencia BH-BMPT'!$D$14,IF(J47=14,'[1]Equivalencia BH-BMPT'!$D$15,IF(J47=15,'[1]Equivalencia BH-BMPT'!$D$16,IF(J47=16,'[1]Equivalencia BH-BMPT'!$D$17,IF(J47=17,'[1]Equivalencia BH-BMPT'!$D$18,IF(J47=18,'[1]Equivalencia BH-BMPT'!$D$19,IF(J47=19,'[1]Equivalencia BH-BMPT'!$D$20,IF(J47=20,'[1]Equivalencia BH-BMPT'!$D$21,IF(J47=21,'[1]Equivalencia BH-BMPT'!$D$22,IF(J47=22,'[1]Equivalencia BH-BMPT'!$D$23,IF(J47=23,'[1]Equivalencia BH-BMPT'!#REF!,IF(J47=24,'[1]Equivalencia BH-BMPT'!$D$25,IF(J47=25,'[1]Equivalencia BH-BMPT'!$D$26,IF(J47=26,'[1]Equivalencia BH-BMPT'!$D$27,IF(J47=27,'[1]Equivalencia BH-BMPT'!$D$28,IF(J47=28,'[1]Equivalencia BH-BMPT'!$D$29,IF(J47=29,'[1]Equivalencia BH-BMPT'!$D$30,IF(J47=30,'[1]Equivalencia BH-BMPT'!$D$31,IF(J47=31,'[1]Equivalencia BH-BMPT'!$D$32,IF(J47=32,'[1]Equivalencia BH-BMPT'!$D$33,IF(J47=33,'[1]Equivalencia BH-BMPT'!$D$34,IF(J47=34,'[1]Equivalencia BH-BMPT'!$D$35,IF(J47=35,'[1]Equivalencia BH-BMPT'!$D$36,IF(J47=36,'[1]Equivalencia BH-BMPT'!$D$37,IF(J47=37,'[1]Equivalencia BH-BMPT'!$D$38,IF(J47=38,'[1]Equivalencia BH-BMPT'!#REF!,IF(J47=39,'[1]Equivalencia BH-BMPT'!$D$40,IF(J47=40,'[1]Equivalencia BH-BMPT'!$D$41,IF(J47=41,'[1]Equivalencia BH-BMPT'!$D$42,IF(J47=42,'[1]Equivalencia BH-BMPT'!$D$43,IF(J47=43,'[1]Equivalencia BH-BMPT'!$D$44,IF(J47=44,'[1]Equivalencia BH-BMPT'!$D$45,IF(J47=45,'[1]Equivalencia BH-BMPT'!$D$46,\"No ha seleccionado un número de programa\")))))))))))))))))))))))))))))))))))))))))))))","v":"Gobernanza e influencia local, regional e internacional"},1329,79614766,"JULIAN ENRIQUE ARIZA GONZALEZ",25303600,null,null,null,0,25303600,25303600,"2017-02-16","2017-02-17","2017-09-16",210,0,null,null,null,null,"X",1]
[31,2017,"CPS 031 2017 ",5,{"$f":"IF(D48=1,'[1]Tipo '!$B$2,IF(D48=2,'[1]Tipo '!$B$3,IF(D48=3,'[1]Tipo '!$B$4,IF(D48=4,'[1]Tipo '!$B$5,IF(D48=5,'[1]Tipo '!$B$6,IF(D48=6,'[1]Tipo '!$B$7,IF(D48=7,'[1]Tipo '!$B$8,IF(D48=8,'[1]Tipo '!$B$9,IF(D48=9,'[1]Tipo '!$B$10,IF(D48=10,'[1]Tipo '!$B$11,IF(D48=11,'[1]Tipo '!$B$12,IF(D48=12,'[1]Tipo '!$B$13,IF(D48=13,'[1]Tipo '!$B$14,IF(D48=14,'[1]Tipo '!$B$15,IF(D48=15,'[1]Tipo '!$B$16,IF(D48=16,'[1]Tipo '!$B$17,IF(D48=17,'[1]Tipo '!$B$18,IF(D48=18,'[1]Tipo '!$B$19,IF(D48=19,'[1]Tipo '!$B$20,\"No ha seleccionado un tipo de contrato válido\")))))))))))))))))))","v":"CONTRATOS DE PRESTACIÓN DE SERVICIOS PROFESIONALES Y DE APOYO A LA GESTIÓN"},"CONTRATACIÓN DIRECTA","Prestación de servicios profesionales y de apoyo a la gestión, o para la ejecución de trabajos artísticos que sólo puedan encomendarse a determinadas personas naturales;","Prestar sus servicios profesionales en el área Gestión De Desarrollo Local  Administrativa y Financiera  como apoyo a la gestión realizando las actividades precontractuales y contractuales necesarias que conlleven a dar cumplimiento al plan anual de adquisiciones 2017, en los rubros de gastos de funcionamiento y componentes asignados del Proyecto 1329, plan de gestión y  plan de Desarrollo local 2017-2020 de acuerdo a los presentes  estudios previos","INVERSIÓN",45,{"$f":"IF(J48=1,'[1]Equivalencia BH-BMPT'!$D$2,IF(J48=2,'[1]Equivalencia BH-BMPT'!$D$3,IF(J48=3,'[1]Equivalencia BH-BMPT'!$D$4,IF(J48=4,'[1]Equivalencia BH-BMPT'!$D$5,IF(J48=5,'[1]Equivalencia BH-BMPT'!$D$6,IF(J48=6,'[1]Equivalencia BH-BMPT'!$D$7,IF(J48=7,'[1]Equivalencia BH-BMPT'!$D$8,IF(J48=8,'[1]Equivalencia BH-BMPT'!$D$9,IF(J48=9,'[1]Equivalencia BH-BMPT'!$D$10,IF(J48=10,'[1]Equivalencia BH-BMPT'!$D$11,IF(J48=11,'[1]Equivalencia BH-BMPT'!$D$12,IF(J48=12,'[1]Equivalencia BH-BMPT'!$D$13,IF(J48=13,'[1]Equivalencia BH-BMPT'!$D$14,IF(J48=14,'[1]Equivalencia BH-BMPT'!$D$15,IF(J48=15,'[1]Equivalencia BH-BMPT'!$D$16,IF(J48=16,'[1]Equivalencia BH-BMPT'!$D$17,IF(J48=17,'[1]Equivalencia BH-BMPT'!$D$18,IF(J48=18,'[1]Equivalencia BH-BMPT'!$D$19,IF(J48=19,'[1]Equivalencia BH-BMPT'!$D$20,IF(J48=20,'[1]Equivalencia BH-BMPT'!$D$21,IF(J48=21,'[1]Equivalencia BH-BMPT'!$D$22,IF(J48=22,'[1]Equivalencia BH-BMPT'!$D$23,IF(J48=23,'[1]Equivalencia BH-BMPT'!#REF!,IF(J48=24,'[1]Equivalencia BH-BMPT'!$D$25,IF(J48=25,'[1]Equivalencia BH-BMPT'!$D$26,IF(J48=26,'[1]Equivalencia BH-BMPT'!$D$27,IF(J48=27,'[1]Equivalencia BH-BMPT'!$D$28,IF(J48=28,'[1]Equivalencia BH-BMPT'!$D$29,IF(J48=29,'[1]Equivalencia BH-BMPT'!$D$30,IF(J48=30,'[1]Equivalencia BH-BMPT'!$D$31,IF(J48=31,'[1]Equivalencia BH-BMPT'!$D$32,IF(J48=32,'[1]Equivalencia BH-BMPT'!$D$33,IF(J48=33,'[1]Equivalencia BH-BMPT'!$D$34,IF(J48=34,'[1]Equivalencia BH-BMPT'!$D$35,IF(J48=35,'[1]Equivalencia BH-BMPT'!$D$36,IF(J48=36,'[1]Equivalencia BH-BMPT'!$D$37,IF(J48=37,'[1]Equivalencia BH-BMPT'!$D$38,IF(J48=38,'[1]Equivalencia BH-BMPT'!#REF!,IF(J48=39,'[1]Equivalencia BH-BMPT'!$D$40,IF(J48=40,'[1]Equivalencia BH-BMPT'!$D$41,IF(J48=41,'[1]Equivalencia BH-BMPT'!$D$42,IF(J48=42,'[1]Equivalencia BH-BMPT'!$D$43,IF(J48=43,'[1]Equivalencia BH-BMPT'!$D$44,IF(J48=44,'[1]Equivalencia BH-BMPT'!$D$45,IF(J48=45,'[1]Equivalencia BH-BMPT'!$D$46,\"No ha seleccionado un número de programa\")))))))))))))))))))))))))))))))))))))))))))))","v":"Gobernanza e influencia local, regional e internacional"},1329,79765033,"DAIRO JEZZID LEON ROMERO",31500000,null,null,null,0,31500000,31500000,"2017-02-17","2017-02-17","2017-09-16",210,0,null,null,null,null,"X",1]
[32,2017,"CPS 032 2017 ",5,{"$f":"IF(D49=1,'[1]Tipo '!$B$2,IF(D49=2,'[1]Tipo '!$B$3,IF(D49=3,'[1]Tipo '!$B$4,IF(D49=4,'[1]Tipo '!$B$5,IF(D49=5,'[1]Tipo '!$B$6,IF(D49=6,'[1]Tipo '!$B$7,IF(D49=7,'[1]Tipo '!$B$8,IF(D49=8,'[1]Tipo '!$B$9,IF(D49=9,'[1]Tipo '!$B$10,IF(D49=10,'[1]Tipo '!$B$11,IF(D49=11,'[1]Tipo '!$B$12,IF(D49=12,'[1]Tipo '!$B$13,IF(D49=13,'[1]Tipo '!$B$14,IF(D49=14,'[1]Tipo '!$B$15,IF(D49=15,'[1]Tipo '!$B$16,IF(D49=16,'[1]Tipo '!$B$17,IF(D49=17,'[1]Tipo '!$B$18,IF(D49=18,'[1]Tipo '!$B$19,IF(D49=19,'[1]Tipo '!$B$20,\"No ha seleccionado un tipo de contrato válido\")))))))))))))))))))","v":"CONTRATOS DE PRESTACIÓN DE SERVICIOS PROFESIONALES Y DE APOYO A LA GESTIÓN"},"CONTRATACIÓN DIRECTA","Prestación de servicios profesionales y de apoyo a la gestión, o para la ejecución de trabajos artísticos que sólo puedan encomendarse a determinadas personas naturales;","EL CONTRATISTA SE OBLIGA PARA CON EL FONDO A PRESTAR SUS SERVICIOS PROFESIONALES AL DESPACHO EN TEMAS DE COMUNICACIÓN SOCIAL DE LOS CANALES INTERNO Y EXTERNOS","INVERSIÓN",45,{"$f":"IF(J49=1,'[1]Equivalencia BH-BMPT'!$D$2,IF(J49=2,'[1]Equivalencia BH-BMPT'!$D$3,IF(J49=3,'[1]Equivalencia BH-BMPT'!$D$4,IF(J49=4,'[1]Equivalencia BH-BMPT'!$D$5,IF(J49=5,'[1]Equivalencia BH-BMPT'!$D$6,IF(J49=6,'[1]Equivalencia BH-BMPT'!$D$7,IF(J49=7,'[1]Equivalencia BH-BMPT'!$D$8,IF(J49=8,'[1]Equivalencia BH-BMPT'!$D$9,IF(J49=9,'[1]Equivalencia BH-BMPT'!$D$10,IF(J49=10,'[1]Equivalencia BH-BMPT'!$D$11,IF(J49=11,'[1]Equivalencia BH-BMPT'!$D$12,IF(J49=12,'[1]Equivalencia BH-BMPT'!$D$13,IF(J49=13,'[1]Equivalencia BH-BMPT'!$D$14,IF(J49=14,'[1]Equivalencia BH-BMPT'!$D$15,IF(J49=15,'[1]Equivalencia BH-BMPT'!$D$16,IF(J49=16,'[1]Equivalencia BH-BMPT'!$D$17,IF(J49=17,'[1]Equivalencia BH-BMPT'!$D$18,IF(J49=18,'[1]Equivalencia BH-BMPT'!$D$19,IF(J49=19,'[1]Equivalencia BH-BMPT'!$D$20,IF(J49=20,'[1]Equivalencia BH-BMPT'!$D$21,IF(J49=21,'[1]Equivalencia BH-BMPT'!$D$22,IF(J49=22,'[1]Equivalencia BH-BMPT'!$D$23,IF(J49=23,'[1]Equivalencia BH-BMPT'!#REF!,IF(J49=24,'[1]Equivalencia BH-BMPT'!$D$25,IF(J49=25,'[1]Equivalencia BH-BMPT'!$D$26,IF(J49=26,'[1]Equivalencia BH-BMPT'!$D$27,IF(J49=27,'[1]Equivalencia BH-BMPT'!$D$28,IF(J49=28,'[1]Equivalencia BH-BMPT'!$D$29,IF(J49=29,'[1]Equivalencia BH-BMPT'!$D$30,IF(J49=30,'[1]Equivalencia BH-BMPT'!$D$31,IF(J49=31,'[1]Equivalencia BH-BMPT'!$D$32,IF(J49=32,'[1]Equivalencia BH-BMPT'!$D$33,IF(J49=33,'[1]Equivalencia BH-BMPT'!$D$34,IF(J49=34,'[1]Equivalencia BH-BMPT'!$D$35,IF(J49=35,'[1]Equivalencia BH-BMPT'!$D$36,IF(J49=36,'[1]Equivalencia BH-BMPT'!$D$37,IF(J49=37,'[1]Equivalencia BH-BMPT'!$D$38,IF(J49=38,'[1]Equivalencia BH-BMPT'!#REF!,IF(J49=39,'[1]Equivalencia BH-BMPT'!$D$40,IF(J49=40,'[1]Equivalencia BH-BMPT'!$D$41,IF(J49=41,'[1]Equivalencia BH-BMPT'!$D$42,IF(J49=42,'[1]Equivalencia BH-BMPT'!$D$43,IF(J49=43,'[1]Equivalencia BH-BMPT'!$D$44,IF(J49=44,'[1]Equivalencia BH-BMPT'!$D$45,IF(J49=45,'[1]Equivalencia BH-BMPT'!$D$46,\"No ha seleccionado un número de programa\")))))))))))))))))))))))))))))))))))))))))))))","v":"Gobernanza e influencia local, regional e internacional"},1329,52862078,"PAOLA ANDREA VANEGAS PINZON",30100000,null,null,null,0,30100000,30100000,"2017-02-20","2017-02-23","2017-09-22",210,0,null,null,null,null,"X",1]
[33,2017,"CPS 033  2017 ",5,{"$f":"IF(D50=1,'[1]Tipo '!$B$2,IF(D50=2,'[1]Tipo '!$B$3,IF(D50=3,'[1]Tipo '!$B$4,IF(D50=4,'[1]Tipo '!$B$5,IF(D50=5,'[1]Tipo '!$B$6,IF(D50=6,'[1]Tipo '!$B$7,IF(D50=7,'[1]Tipo '!$B$8,IF(D50=8,'[1]Tipo '!$B$9,IF(D50=9,'[1]Tipo '!$B$10,IF(D50=10,'[1]Tipo '!$B$11,IF(D50=11,'[1]Tipo '!$B$12,IF(D50=12,'[1]Tipo '!$B$13,IF(D50=13,'[1]Tipo '!$B$14,IF(D50=14,'[1]Tipo '!$B$15,IF(D50=15,'[1]Tipo '!$B$16,IF(D50=16,'[1]Tipo '!$B$17,IF(D50=17,'[1]Tipo '!$B$18,IF(D50=18,'[1]Tipo '!$B$19,IF(D50=19,'[1]Tipo '!$B$20,\"No ha seleccionado un tipo de contrato válido\")))))))))))))))))))","v":"CONTRATOS DE PRESTACIÓN DE SERVICIOS PROFESIONALES Y DE APOYO A LA GESTIÓN"},"CONTRATACIÓN DIRECTA","Prestación de servicios profesionales y de apoyo a la gestión, o para la ejecución de trabajos artísticos que sólo puedan encomendarse a determinadas personas naturales;","El contrato que se pretende celebrar, tendrá por objeto ¿Prestar sus servicios como auxiliar administrativo en la Secretaría General de Inspecciones","INVERSIÓN",45,{"$f":"IF(J50=1,'[1]Equivalencia BH-BMPT'!$D$2,IF(J50=2,'[1]Equivalencia BH-BMPT'!$D$3,IF(J50=3,'[1]Equivalencia BH-BMPT'!$D$4,IF(J50=4,'[1]Equivalencia BH-BMPT'!$D$5,IF(J50=5,'[1]Equivalencia BH-BMPT'!$D$6,IF(J50=6,'[1]Equivalencia BH-BMPT'!$D$7,IF(J50=7,'[1]Equivalencia BH-BMPT'!$D$8,IF(J50=8,'[1]Equivalencia BH-BMPT'!$D$9,IF(J50=9,'[1]Equivalencia BH-BMPT'!$D$10,IF(J50=10,'[1]Equivalencia BH-BMPT'!$D$11,IF(J50=11,'[1]Equivalencia BH-BMPT'!$D$12,IF(J50=12,'[1]Equivalencia BH-BMPT'!$D$13,IF(J50=13,'[1]Equivalencia BH-BMPT'!$D$14,IF(J50=14,'[1]Equivalencia BH-BMPT'!$D$15,IF(J50=15,'[1]Equivalencia BH-BMPT'!$D$16,IF(J50=16,'[1]Equivalencia BH-BMPT'!$D$17,IF(J50=17,'[1]Equivalencia BH-BMPT'!$D$18,IF(J50=18,'[1]Equivalencia BH-BMPT'!$D$19,IF(J50=19,'[1]Equivalencia BH-BMPT'!$D$20,IF(J50=20,'[1]Equivalencia BH-BMPT'!$D$21,IF(J50=21,'[1]Equivalencia BH-BMPT'!$D$22,IF(J50=22,'[1]Equivalencia BH-BMPT'!$D$23,IF(J50=23,'[1]Equivalencia BH-BMPT'!#REF!,IF(J50=24,'[1]Equivalencia BH-BMPT'!$D$25,IF(J50=25,'[1]Equivalencia BH-BMPT'!$D$26,IF(J50=26,'[1]Equivalencia BH-BMPT'!$D$27,IF(J50=27,'[1]Equivalencia BH-BMPT'!$D$28,IF(J50=28,'[1]Equivalencia BH-BMPT'!$D$29,IF(J50=29,'[1]Equivalencia BH-BMPT'!$D$30,IF(J50=30,'[1]Equivalencia BH-BMPT'!$D$31,IF(J50=31,'[1]Equivalencia BH-BMPT'!$D$32,IF(J50=32,'[1]Equivalencia BH-BMPT'!$D$33,IF(J50=33,'[1]Equivalencia BH-BMPT'!$D$34,IF(J50=34,'[1]Equivalencia BH-BMPT'!$D$35,IF(J50=35,'[1]Equivalencia BH-BMPT'!$D$36,IF(J50=36,'[1]Equivalencia BH-BMPT'!$D$37,IF(J50=37,'[1]Equivalencia BH-BMPT'!$D$38,IF(J50=38,'[1]Equivalencia BH-BMPT'!#REF!,IF(J50=39,'[1]Equivalencia BH-BMPT'!$D$40,IF(J50=40,'[1]Equivalencia BH-BMPT'!$D$41,IF(J50=41,'[1]Equivalencia BH-BMPT'!$D$42,IF(J50=42,'[1]Equivalencia BH-BMPT'!$D$43,IF(J50=43,'[1]Equivalencia BH-BMPT'!$D$44,IF(J50=44,'[1]Equivalencia BH-BMPT'!$D$45,IF(J50=45,'[1]Equivalencia BH-BMPT'!$D$46,\"No ha seleccionado un número de programa\")))))))))))))))))))))))))))))))))))))))))))))","v":"Gobernanza e influencia local, regional e internacional"},1329,80112111,"DANIEL RICARDO HURTADO BAUTISTA",17200000,null,null,null,4873333,22073333,20998333,"2017-02-17","2017-02-22","2017-12-29",240,68,null,null,null,"X",null,0.95129870056325427]
[34,2017,"CPS 034  2017",5,{"$f":"IF(D51=1,'[1]Tipo '!$B$2,IF(D51=2,'[1]Tipo '!$B$3,IF(D51=3,'[1]Tipo '!$B$4,IF(D51=4,'[1]Tipo '!$B$5,IF(D51=5,'[1]Tipo '!$B$6,IF(D51=6,'[1]Tipo '!$B$7,IF(D51=7,'[1]Tipo '!$B$8,IF(D51=8,'[1]Tipo '!$B$9,IF(D51=9,'[1]Tipo '!$B$10,IF(D51=10,'[1]Tipo '!$B$11,IF(D51=11,'[1]Tipo '!$B$12,IF(D51=12,'[1]Tipo '!$B$13,IF(D51=13,'[1]Tipo '!$B$14,IF(D51=14,'[1]Tipo '!$B$15,IF(D51=15,'[1]Tipo '!$B$16,IF(D51=16,'[1]Tipo '!$B$17,IF(D51=17,'[1]Tipo '!$B$18,IF(D51=18,'[1]Tipo '!$B$19,IF(D51=19,'[1]Tipo '!$B$20,\"No ha seleccionado un tipo de contrato válido\")))))))))))))))))))","v":"CONTRATOS DE PRESTACIÓN DE SERVICIOS PROFESIONALES Y DE APOYO A LA GESTIÓN"},"CONTRATACIÓN DIRECTA","Prestación de servicios profesionales y de apoyo a la gestión, o para la ejecución de trabajos artísticos que sólo puedan encomendarse a determinadas personas naturales;","El contrato que se pretende celebrar, tendrá por objeto ¿Servicios de apoyo al Área de Gestión de Desarrollo Local en labores administrativas como la recepción de correspondencia, registro, digitalización, así como el manejo e agenda y elaboración de actas de reunión","INVERSIÓN",45,{"$f":"IF(J51=1,'[1]Equivalencia BH-BMPT'!$D$2,IF(J51=2,'[1]Equivalencia BH-BMPT'!$D$3,IF(J51=3,'[1]Equivalencia BH-BMPT'!$D$4,IF(J51=4,'[1]Equivalencia BH-BMPT'!$D$5,IF(J51=5,'[1]Equivalencia BH-BMPT'!$D$6,IF(J51=6,'[1]Equivalencia BH-BMPT'!$D$7,IF(J51=7,'[1]Equivalencia BH-BMPT'!$D$8,IF(J51=8,'[1]Equivalencia BH-BMPT'!$D$9,IF(J51=9,'[1]Equivalencia BH-BMPT'!$D$10,IF(J51=10,'[1]Equivalencia BH-BMPT'!$D$11,IF(J51=11,'[1]Equivalencia BH-BMPT'!$D$12,IF(J51=12,'[1]Equivalencia BH-BMPT'!$D$13,IF(J51=13,'[1]Equivalencia BH-BMPT'!$D$14,IF(J51=14,'[1]Equivalencia BH-BMPT'!$D$15,IF(J51=15,'[1]Equivalencia BH-BMPT'!$D$16,IF(J51=16,'[1]Equivalencia BH-BMPT'!$D$17,IF(J51=17,'[1]Equivalencia BH-BMPT'!$D$18,IF(J51=18,'[1]Equivalencia BH-BMPT'!$D$19,IF(J51=19,'[1]Equivalencia BH-BMPT'!$D$20,IF(J51=20,'[1]Equivalencia BH-BMPT'!$D$21,IF(J51=21,'[1]Equivalencia BH-BMPT'!$D$22,IF(J51=22,'[1]Equivalencia BH-BMPT'!$D$23,IF(J51=23,'[1]Equivalencia BH-BMPT'!#REF!,IF(J51=24,'[1]Equivalencia BH-BMPT'!$D$25,IF(J51=25,'[1]Equivalencia BH-BMPT'!$D$26,IF(J51=26,'[1]Equivalencia BH-BMPT'!$D$27,IF(J51=27,'[1]Equivalencia BH-BMPT'!$D$28,IF(J51=28,'[1]Equivalencia BH-BMPT'!$D$29,IF(J51=29,'[1]Equivalencia BH-BMPT'!$D$30,IF(J51=30,'[1]Equivalencia BH-BMPT'!$D$31,IF(J51=31,'[1]Equivalencia BH-BMPT'!$D$32,IF(J51=32,'[1]Equivalencia BH-BMPT'!$D$33,IF(J51=33,'[1]Equivalencia BH-BMPT'!$D$34,IF(J51=34,'[1]Equivalencia BH-BMPT'!$D$35,IF(J51=35,'[1]Equivalencia BH-BMPT'!$D$36,IF(J51=36,'[1]Equivalencia BH-BMPT'!$D$37,IF(J51=37,'[1]Equivalencia BH-BMPT'!$D$38,IF(J51=38,'[1]Equivalencia BH-BMPT'!#REF!,IF(J51=39,'[1]Equivalencia BH-BMPT'!$D$40,IF(J51=40,'[1]Equivalencia BH-BMPT'!$D$41,IF(J51=41,'[1]Equivalencia BH-BMPT'!$D$42,IF(J51=42,'[1]Equivalencia BH-BMPT'!$D$43,IF(J51=43,'[1]Equivalencia BH-BMPT'!$D$44,IF(J51=44,'[1]Equivalencia BH-BMPT'!$D$45,IF(J51=45,'[1]Equivalencia BH-BMPT'!$D$46,\"No ha seleccionado un número de programa\")))))))))))))))))))))))))))))))))))))))))))))","v":"Gobernanza e influencia local, regional e internacional"},1329,1022957446,"JOHANA  RORIGUEZ ALFONZO",14700000,null,null,null,0,14700000,14700000,"2017-02-21","2017-02-21","2017-09-20",210,0,null,null,null,null,"X",1]
[35,2017,"CPS 035  2017",5,{"$f":"IF(D52=1,'[1]Tipo '!$B$2,IF(D52=2,'[1]Tipo '!$B$3,IF(D52=3,'[1]Tipo '!$B$4,IF(D52=4,'[1]Tipo '!$B$5,IF(D52=5,'[1]Tipo '!$B$6,IF(D52=6,'[1]Tipo '!$B$7,IF(D52=7,'[1]Tipo '!$B$8,IF(D52=8,'[1]Tipo '!$B$9,IF(D52=9,'[1]Tipo '!$B$10,IF(D52=10,'[1]Tipo '!$B$11,IF(D52=11,'[1]Tipo '!$B$12,IF(D52=12,'[1]Tipo '!$B$13,IF(D52=13,'[1]Tipo '!$B$14,IF(D52=14,'[1]Tipo '!$B$15,IF(D52=15,'[1]Tipo '!$B$16,IF(D52=16,'[1]Tipo '!$B$17,IF(D52=17,'[1]Tipo '!$B$18,IF(D52=18,'[1]Tipo '!$B$19,IF(D52=19,'[1]Tipo '!$B$20,\"No ha seleccionado un tipo de contrato válido\")))))))))))))))))))","v":"CONTRATOS DE PRESTACIÓN DE SERVICIOS PROFESIONALES Y DE APOYO A LA GESTIÓN"},"CONTRATACIÓN DIRECTA","Prestación de servicios profesionales y de apoyo a la gestión, o para la ejecución de trabajos artísticos que sólo puedan encomendarse a determinadas personas naturales;","El contrato que se pretende celebrar, tendrá por objeto ¿Prestar los servicios técnicos de apoyo a la gestión en la ejecución de las actividades administrativas y operativas en temas relacionados con Establecimientos de Comercio y Espacio Público, que se adelanten en el Área de Gestión Policiva de la Alcaldía local de Teusaquillo¿.","INVERSIÓN",45,{"$f":"IF(J52=1,'[1]Equivalencia BH-BMPT'!$D$2,IF(J52=2,'[1]Equivalencia BH-BMPT'!$D$3,IF(J52=3,'[1]Equivalencia BH-BMPT'!$D$4,IF(J52=4,'[1]Equivalencia BH-BMPT'!$D$5,IF(J52=5,'[1]Equivalencia BH-BMPT'!$D$6,IF(J52=6,'[1]Equivalencia BH-BMPT'!$D$7,IF(J52=7,'[1]Equivalencia BH-BMPT'!$D$8,IF(J52=8,'[1]Equivalencia BH-BMPT'!$D$9,IF(J52=9,'[1]Equivalencia BH-BMPT'!$D$10,IF(J52=10,'[1]Equivalencia BH-BMPT'!$D$11,IF(J52=11,'[1]Equivalencia BH-BMPT'!$D$12,IF(J52=12,'[1]Equivalencia BH-BMPT'!$D$13,IF(J52=13,'[1]Equivalencia BH-BMPT'!$D$14,IF(J52=14,'[1]Equivalencia BH-BMPT'!$D$15,IF(J52=15,'[1]Equivalencia BH-BMPT'!$D$16,IF(J52=16,'[1]Equivalencia BH-BMPT'!$D$17,IF(J52=17,'[1]Equivalencia BH-BMPT'!$D$18,IF(J52=18,'[1]Equivalencia BH-BMPT'!$D$19,IF(J52=19,'[1]Equivalencia BH-BMPT'!$D$20,IF(J52=20,'[1]Equivalencia BH-BMPT'!$D$21,IF(J52=21,'[1]Equivalencia BH-BMPT'!$D$22,IF(J52=22,'[1]Equivalencia BH-BMPT'!$D$23,IF(J52=23,'[1]Equivalencia BH-BMPT'!#REF!,IF(J52=24,'[1]Equivalencia BH-BMPT'!$D$25,IF(J52=25,'[1]Equivalencia BH-BMPT'!$D$26,IF(J52=26,'[1]Equivalencia BH-BMPT'!$D$27,IF(J52=27,'[1]Equivalencia BH-BMPT'!$D$28,IF(J52=28,'[1]Equivalencia BH-BMPT'!$D$29,IF(J52=29,'[1]Equivalencia BH-BMPT'!$D$30,IF(J52=30,'[1]Equivalencia BH-BMPT'!$D$31,IF(J52=31,'[1]Equivalencia BH-BMPT'!$D$32,IF(J52=32,'[1]Equivalencia BH-BMPT'!$D$33,IF(J52=33,'[1]Equivalencia BH-BMPT'!$D$34,IF(J52=34,'[1]Equivalencia BH-BMPT'!$D$35,IF(J52=35,'[1]Equivalencia BH-BMPT'!$D$36,IF(J52=36,'[1]Equivalencia BH-BMPT'!$D$37,IF(J52=37,'[1]Equivalencia BH-BMPT'!$D$38,IF(J52=38,'[1]Equivalencia BH-BMPT'!#REF!,IF(J52=39,'[1]Equivalencia BH-BMPT'!$D$40,IF(J52=40,'[1]Equivalencia BH-BMPT'!$D$41,IF(J52=41,'[1]Equivalencia BH-BMPT'!$D$42,IF(J52=42,'[1]Equivalencia BH-BMPT'!$D$43,IF(J52=43,'[1]Equivalencia BH-BMPT'!$D$44,IF(J52=44,'[1]Equivalencia BH-BMPT'!$D$45,IF(J52=45,'[1]Equivalencia BH-BMPT'!$D$46,\"No ha seleccionado un número de programa\")))))))))))))))))))))))))))))))))))))))))))))","v":"Gobernanza e influencia local, regional e internacional"},1329,1010172202,"JOSE MANUEL SANCHEZ TAMAYO",10800000,null,null,null,0,10800000,10800000,"2017-02-21","2017-02-22","2017-06-21",120,0,null,null,null,null,"X",1]
[36,2017,"CPS 036  2017",5,{"$f":"IF(D53=1,'[1]Tipo '!$B$2,IF(D53=2,'[1]Tipo '!$B$3,IF(D53=3,'[1]Tipo '!$B$4,IF(D53=4,'[1]Tipo '!$B$5,IF(D53=5,'[1]Tipo '!$B$6,IF(D53=6,'[1]Tipo '!$B$7,IF(D53=7,'[1]Tipo '!$B$8,IF(D53=8,'[1]Tipo '!$B$9,IF(D53=9,'[1]Tipo '!$B$10,IF(D53=10,'[1]Tipo '!$B$11,IF(D53=11,'[1]Tipo '!$B$12,IF(D53=12,'[1]Tipo '!$B$13,IF(D53=13,'[1]Tipo '!$B$14,IF(D53=14,'[1]Tipo '!$B$15,IF(D53=15,'[1]Tipo '!$B$16,IF(D53=16,'[1]Tipo '!$B$17,IF(D53=17,'[1]Tipo '!$B$18,IF(D53=18,'[1]Tipo '!$B$19,IF(D53=19,'[1]Tipo '!$B$20,\"No ha seleccionado un tipo de contrato válido\")))))))))))))))))))","v":"CONTRATOS DE PRESTACIÓN DE SERVICIOS PROFESIONALES Y DE APOYO A LA GESTIÓN"},"CONTRATACIÓN DIRECTA","Prestación de servicios profesionales y de apoyo a la gestión, o para la ejecución de trabajos artísticos que sólo puedan encomendarse a determinadas personas naturales;","El contrato que se pretende celebrar, tendrá por objeto ¿El contratista  se obliga para con la Fondo de Desarrollo Local de Teusaquillo a prestar sus servicios profesionales en  las acciones de seguimiento del Convenio 1419 de 2009 y en los   procesos de infraestructura y malla vial contemplados en el plan de Desarrollo Local¿.","INVERSIÓN",18,{"$f":"IF(J53=1,'[1]Equivalencia BH-BMPT'!$D$2,IF(J53=2,'[1]Equivalencia BH-BMPT'!$D$3,IF(J53=3,'[1]Equivalencia BH-BMPT'!$D$4,IF(J53=4,'[1]Equivalencia BH-BMPT'!$D$5,IF(J53=5,'[1]Equivalencia BH-BMPT'!$D$6,IF(J53=6,'[1]Equivalencia BH-BMPT'!$D$7,IF(J53=7,'[1]Equivalencia BH-BMPT'!$D$8,IF(J53=8,'[1]Equivalencia BH-BMPT'!$D$9,IF(J53=9,'[1]Equivalencia BH-BMPT'!$D$10,IF(J53=10,'[1]Equivalencia BH-BMPT'!$D$11,IF(J53=11,'[1]Equivalencia BH-BMPT'!$D$12,IF(J53=12,'[1]Equivalencia BH-BMPT'!$D$13,IF(J53=13,'[1]Equivalencia BH-BMPT'!$D$14,IF(J53=14,'[1]Equivalencia BH-BMPT'!$D$15,IF(J53=15,'[1]Equivalencia BH-BMPT'!$D$16,IF(J53=16,'[1]Equivalencia BH-BMPT'!$D$17,IF(J53=17,'[1]Equivalencia BH-BMPT'!$D$18,IF(J53=18,'[1]Equivalencia BH-BMPT'!$D$19,IF(J53=19,'[1]Equivalencia BH-BMPT'!$D$20,IF(J53=20,'[1]Equivalencia BH-BMPT'!$D$21,IF(J53=21,'[1]Equivalencia BH-BMPT'!$D$22,IF(J53=22,'[1]Equivalencia BH-BMPT'!$D$23,IF(J53=23,'[1]Equivalencia BH-BMPT'!#REF!,IF(J53=24,'[1]Equivalencia BH-BMPT'!$D$25,IF(J53=25,'[1]Equivalencia BH-BMPT'!$D$26,IF(J53=26,'[1]Equivalencia BH-BMPT'!$D$27,IF(J53=27,'[1]Equivalencia BH-BMPT'!$D$28,IF(J53=28,'[1]Equivalencia BH-BMPT'!$D$29,IF(J53=29,'[1]Equivalencia BH-BMPT'!$D$30,IF(J53=30,'[1]Equivalencia BH-BMPT'!$D$31,IF(J53=31,'[1]Equivalencia BH-BMPT'!$D$32,IF(J53=32,'[1]Equivalencia BH-BMPT'!$D$33,IF(J53=33,'[1]Equivalencia BH-BMPT'!$D$34,IF(J53=34,'[1]Equivalencia BH-BMPT'!$D$35,IF(J53=35,'[1]Equivalencia BH-BMPT'!$D$36,IF(J53=36,'[1]Equivalencia BH-BMPT'!$D$37,IF(J53=37,'[1]Equivalencia BH-BMPT'!$D$38,IF(J53=38,'[1]Equivalencia BH-BMPT'!#REF!,IF(J53=39,'[1]Equivalencia BH-BMPT'!$D$40,IF(J53=40,'[1]Equivalencia BH-BMPT'!$D$41,IF(J53=41,'[1]Equivalencia BH-BMPT'!$D$42,IF(J53=42,'[1]Equivalencia BH-BMPT'!$D$43,IF(J53=43,'[1]Equivalencia BH-BMPT'!$D$44,IF(J53=44,'[1]Equivalencia BH-BMPT'!$D$45,IF(J53=45,'[1]Equivalencia BH-BMPT'!$D$46,\"No ha seleccionado un número de programa\")))))))))))))))))))))))))))))))))))))))))))))","v":"Mejor movilidad para todos"},1338,79796327,"ANDRES RICARDO GARAVITO FERNANDEZ",46650000,null,null,null,0,46650000,44100980,"2017-02-21","2017-02-21","2017-12-31",null,0,null,null,null,"X",null,0.94535862808145765]
[36,2017,"CPS 036  2017",5,{"$f":"IF(D54=1,'[1]Tipo '!$B$2,IF(D54=2,'[1]Tipo '!$B$3,IF(D54=3,'[1]Tipo '!$B$4,IF(D54=4,'[1]Tipo '!$B$5,IF(D54=5,'[1]Tipo '!$B$6,IF(D54=6,'[1]Tipo '!$B$7,IF(D54=7,'[1]Tipo '!$B$8,IF(D54=8,'[1]Tipo '!$B$9,IF(D54=9,'[1]Tipo '!$B$10,IF(D54=10,'[1]Tipo '!$B$11,IF(D54=11,'[1]Tipo '!$B$12,IF(D54=12,'[1]Tipo '!$B$13,IF(D54=13,'[1]Tipo '!$B$14,IF(D54=14,'[1]Tipo '!$B$15,IF(D54=15,'[1]Tipo '!$B$16,IF(D54=16,'[1]Tipo '!$B$17,IF(D54=17,'[1]Tipo '!$B$18,IF(D54=18,'[1]Tipo '!$B$19,IF(D54=19,'[1]Tipo '!$B$20,\"No ha seleccionado un tipo de contrato válido\")))))))))))))))))))","v":"CONTRATOS DE PRESTACIÓN DE SERVICIOS PROFESIONALES Y DE APOYO A LA GESTIÓN"},"CONTRATACIÓN DIRECTA","Prestación de servicios profesionales y de apoyo a la gestión, o para la ejecución de trabajos artísticos que sólo puedan encomendarse a determinadas personas naturales;","El contrato que se pretende celebrar, tendrá por objeto ¿El contratista  se obliga para con la Fondo de Desarrollo Local de Teusaquillo a prestar sus servicios profesionales en  las acciones de seguimiento del Convenio 1419 de 2009 y en los   procesos de infraestructura y malla vial contemplados en el plan de Desarrollo Local¿.","INVERSIÓN",45,{"$f":"IF(J54=1,'[1]Equivalencia BH-BMPT'!$D$2,IF(J54=2,'[1]Equivalencia BH-BMPT'!$D$3,IF(J54=3,'[1]Equivalencia BH-BMPT'!$D$4,IF(J54=4,'[1]Equivalencia BH-BMPT'!$D$5,IF(J54=5,'[1]Equivalencia BH-BMPT'!$D$6,IF(J54=6,'[1]Equivalencia BH-BMPT'!$D$7,IF(J54=7,'[1]Equivalencia BH-BMPT'!$D$8,IF(J54=8,'[1]Equivalencia BH-BMPT'!$D$9,IF(J54=9,'[1]Equivalencia BH-BMPT'!$D$10,IF(J54=10,'[1]Equivalencia BH-BMPT'!$D$11,IF(J54=11,'[1]Equivalencia BH-BMPT'!$D$12,IF(J54=12,'[1]Equivalencia BH-BMPT'!$D$13,IF(J54=13,'[1]Equivalencia BH-BMPT'!$D$14,IF(J54=14,'[1]Equivalencia BH-BMPT'!$D$15,IF(J54=15,'[1]Equivalencia BH-BMPT'!$D$16,IF(J54=16,'[1]Equivalencia BH-BMPT'!$D$17,IF(J54=17,'[1]Equivalencia BH-BMPT'!$D$18,IF(J54=18,'[1]Equivalencia BH-BMPT'!$D$19,IF(J54=19,'[1]Equivalencia BH-BMPT'!$D$20,IF(J54=20,'[1]Equivalencia BH-BMPT'!$D$21,IF(J54=21,'[1]Equivalencia BH-BMPT'!$D$22,IF(J54=22,'[1]Equivalencia BH-BMPT'!$D$23,IF(J54=23,'[1]Equivalencia BH-BMPT'!#REF!,IF(J54=24,'[1]Equivalencia BH-BMPT'!$D$25,IF(J54=25,'[1]Equivalencia BH-BMPT'!$D$26,IF(J54=26,'[1]Equivalencia BH-BMPT'!$D$27,IF(J54=27,'[1]Equivalencia BH-BMPT'!$D$28,IF(J54=28,'[1]Equivalencia BH-BMPT'!$D$29,IF(J54=29,'[1]Equivalencia BH-BMPT'!$D$30,IF(J54=30,'[1]Equivalencia BH-BMPT'!$D$31,IF(J54=31,'[1]Equivalencia BH-BMPT'!$D$32,IF(J54=32,'[1]Equivalencia BH-BMPT'!$D$33,IF(J54=33,'[1]Equivalencia BH-BMPT'!$D$34,IF(J54=34,'[1]Equivalencia BH-BMPT'!$D$35,IF(J54=35,'[1]Equivalencia BH-BMPT'!$D$36,IF(J54=36,'[1]Equivalencia BH-BMPT'!$D$37,IF(J54=37,'[1]Equivalencia BH-BMPT'!$D$38,IF(J54=38,'[1]Equivalencia BH-BMPT'!#REF!,IF(J54=39,'[1]Equivalencia BH-BMPT'!$D$40,IF(J54=40,'[1]Equivalencia BH-BMPT'!$D$41,IF(J54=41,'[1]Equivalencia BH-BMPT'!$D$42,IF(J54=42,'[1]Equivalencia BH-BMPT'!$D$43,IF(J54=43,'[1]Equivalencia BH-BMPT'!$D$44,IF(J54=44,'[1]Equivalencia BH-BMPT'!$D$45,IF(J54=45,'[1]Equivalencia BH-BMPT'!$D$46,\"No ha seleccionado un número de programa\")))))))))))))))))))))))))))))))))))))))))))))","v":"Gobernanza e influencia local, regional e internacional"},1329,79796327,"ANDRES RICARDO GARAVITO FERNANDEZ",10366667,null,null,null,0,10366667,9799020,"2017-02-21","2017-02-21","2017-12-31",null,0,null,null,null,"X",null,0.94524305642305284]
[37,2017,"CPS 037  2017",5,{"$f":"IF(D55=1,'[1]Tipo '!$B$2,IF(D55=2,'[1]Tipo '!$B$3,IF(D55=3,'[1]Tipo '!$B$4,IF(D55=4,'[1]Tipo '!$B$5,IF(D55=5,'[1]Tipo '!$B$6,IF(D55=6,'[1]Tipo '!$B$7,IF(D55=7,'[1]Tipo '!$B$8,IF(D55=8,'[1]Tipo '!$B$9,IF(D55=9,'[1]Tipo '!$B$10,IF(D55=10,'[1]Tipo '!$B$11,IF(D55=11,'[1]Tipo '!$B$12,IF(D55=12,'[1]Tipo '!$B$13,IF(D55=13,'[1]Tipo '!$B$14,IF(D55=14,'[1]Tipo '!$B$15,IF(D55=15,'[1]Tipo '!$B$16,IF(D55=16,'[1]Tipo '!$B$17,IF(D55=17,'[1]Tipo '!$B$18,IF(D55=18,'[1]Tipo '!$B$19,IF(D55=19,'[1]Tipo '!$B$20,\"No ha seleccionado un tipo de contrato válido\")))))))))))))))))))","v":"CONTRATOS DE PRESTACIÓN DE SERVICIOS PROFESIONALES Y DE APOYO A LA GESTIÓN"},"CONTRATACIÓN DIRECTA","Prestación de servicios profesionales y de apoyo a la gestión, o para la ejecución de trabajos artísticos que sólo puedan encomendarse a determinadas personas naturales;","Prestación de servicios de apoyo en el Área de Gestión de Desarrollo Local para adelantar las labores de clasificación,  foliado, digitalización, organización técnica, informática y demás necesarias para la gestión documental, así como el proceso de eliminación y transferencia de archivos inactivos de la Alcaldía Local de Teusaquillo de acuerdo a la normatividad vigente y en concordancia con los estándares de gestión documental y la administración","INVERSIÓN",45,{"$f":"IF(J55=1,'[1]Equivalencia BH-BMPT'!$D$2,IF(J55=2,'[1]Equivalencia BH-BMPT'!$D$3,IF(J55=3,'[1]Equivalencia BH-BMPT'!$D$4,IF(J55=4,'[1]Equivalencia BH-BMPT'!$D$5,IF(J55=5,'[1]Equivalencia BH-BMPT'!$D$6,IF(J55=6,'[1]Equivalencia BH-BMPT'!$D$7,IF(J55=7,'[1]Equivalencia BH-BMPT'!$D$8,IF(J55=8,'[1]Equivalencia BH-BMPT'!$D$9,IF(J55=9,'[1]Equivalencia BH-BMPT'!$D$10,IF(J55=10,'[1]Equivalencia BH-BMPT'!$D$11,IF(J55=11,'[1]Equivalencia BH-BMPT'!$D$12,IF(J55=12,'[1]Equivalencia BH-BMPT'!$D$13,IF(J55=13,'[1]Equivalencia BH-BMPT'!$D$14,IF(J55=14,'[1]Equivalencia BH-BMPT'!$D$15,IF(J55=15,'[1]Equivalencia BH-BMPT'!$D$16,IF(J55=16,'[1]Equivalencia BH-BMPT'!$D$17,IF(J55=17,'[1]Equivalencia BH-BMPT'!$D$18,IF(J55=18,'[1]Equivalencia BH-BMPT'!$D$19,IF(J55=19,'[1]Equivalencia BH-BMPT'!$D$20,IF(J55=20,'[1]Equivalencia BH-BMPT'!$D$21,IF(J55=21,'[1]Equivalencia BH-BMPT'!$D$22,IF(J55=22,'[1]Equivalencia BH-BMPT'!$D$23,IF(J55=23,'[1]Equivalencia BH-BMPT'!#REF!,IF(J55=24,'[1]Equivalencia BH-BMPT'!$D$25,IF(J55=25,'[1]Equivalencia BH-BMPT'!$D$26,IF(J55=26,'[1]Equivalencia BH-BMPT'!$D$27,IF(J55=27,'[1]Equivalencia BH-BMPT'!$D$28,IF(J55=28,'[1]Equivalencia BH-BMPT'!$D$29,IF(J55=29,'[1]Equivalencia BH-BMPT'!$D$30,IF(J55=30,'[1]Equivalencia BH-BMPT'!$D$31,IF(J55=31,'[1]Equivalencia BH-BMPT'!$D$32,IF(J55=32,'[1]Equivalencia BH-BMPT'!$D$33,IF(J55=33,'[1]Equivalencia BH-BMPT'!$D$34,IF(J55=34,'[1]Equivalencia BH-BMPT'!$D$35,IF(J55=35,'[1]Equivalencia BH-BMPT'!$D$36,IF(J55=36,'[1]Equivalencia BH-BMPT'!$D$37,IF(J55=37,'[1]Equivalencia BH-BMPT'!$D$38,IF(J55=38,'[1]Equivalencia BH-BMPT'!#REF!,IF(J55=39,'[1]Equivalencia BH-BMPT'!$D$40,IF(J55=40,'[1]Equivalencia BH-BMPT'!$D$41,IF(J55=41,'[1]Equivalencia BH-BMPT'!$D$42,IF(J55=42,'[1]Equivalencia BH-BMPT'!$D$43,IF(J55=43,'[1]Equivalencia BH-BMPT'!$D$44,IF(J55=44,'[1]Equivalencia BH-BMPT'!$D$45,IF(J55=45,'[1]Equivalencia BH-BMPT'!$D$46,\"No ha seleccionado un número de programa\")))))))))))))))))))))))))))))))))))))))))))))","v":"Gobernanza e influencia local, regional e internacional"},1329,52938311,"GINNA PAOLA ZEA MATEUS",18200000,null,null,null,8406667,26606667,25306667,"2017-02-23","2017-02-23","2017-12-29",210,97,null,null,null,"X",null,0.95114006575870624]
[38,2017,"CPS 038  2017",5,{"$f":"IF(D56=1,'[1]Tipo '!$B$2,IF(D56=2,'[1]Tipo '!$B$3,IF(D56=3,'[1]Tipo '!$B$4,IF(D56=4,'[1]Tipo '!$B$5,IF(D56=5,'[1]Tipo '!$B$6,IF(D56=6,'[1]Tipo '!$B$7,IF(D56=7,'[1]Tipo '!$B$8,IF(D56=8,'[1]Tipo '!$B$9,IF(D56=9,'[1]Tipo '!$B$10,IF(D56=10,'[1]Tipo '!$B$11,IF(D56=11,'[1]Tipo '!$B$12,IF(D56=12,'[1]Tipo '!$B$13,IF(D56=13,'[1]Tipo '!$B$14,IF(D56=14,'[1]Tipo '!$B$15,IF(D56=15,'[1]Tipo '!$B$16,IF(D56=16,'[1]Tipo '!$B$17,IF(D56=17,'[1]Tipo '!$B$18,IF(D56=18,'[1]Tipo '!$B$19,IF(D56=19,'[1]Tipo '!$B$20,\"No ha seleccionado un tipo de contrato válido\")))))))))))))))))))","v":"CONTRATOS DE PRESTACIÓN DE SERVICIOS PROFESIONALES Y DE APOYO A LA GESTIÓN"},"CONTRATACIÓN DIRECTA","Prestación de servicios profesionales y de apoyo a la gestión, o para la ejecución de trabajos artísticos que sólo puedan encomendarse a determinadas personas naturales;","El contrato que se pretende celebrar, tendrá por objeto¿¿¿Prestar los servicios de apoyo al Área de Gestión Policiva de la Alcaldía Local de Teusaquillo en la actualización de la base de datos necesarias para la elaboración de informes solicitados por las diferentes entidades relacionadas con establecimientos de comercio y espacio público, de las actuaciones administrativas y preliminares llevadas en el área, así como el apoyo jurídico al trámite de peticiones, quejas y reclamos¿","INVERSIÓN",45,{"$f":"IF(J56=1,'[1]Equivalencia BH-BMPT'!$D$2,IF(J56=2,'[1]Equivalencia BH-BMPT'!$D$3,IF(J56=3,'[1]Equivalencia BH-BMPT'!$D$4,IF(J56=4,'[1]Equivalencia BH-BMPT'!$D$5,IF(J56=5,'[1]Equivalencia BH-BMPT'!$D$6,IF(J56=6,'[1]Equivalencia BH-BMPT'!$D$7,IF(J56=7,'[1]Equivalencia BH-BMPT'!$D$8,IF(J56=8,'[1]Equivalencia BH-BMPT'!$D$9,IF(J56=9,'[1]Equivalencia BH-BMPT'!$D$10,IF(J56=10,'[1]Equivalencia BH-BMPT'!$D$11,IF(J56=11,'[1]Equivalencia BH-BMPT'!$D$12,IF(J56=12,'[1]Equivalencia BH-BMPT'!$D$13,IF(J56=13,'[1]Equivalencia BH-BMPT'!$D$14,IF(J56=14,'[1]Equivalencia BH-BMPT'!$D$15,IF(J56=15,'[1]Equivalencia BH-BMPT'!$D$16,IF(J56=16,'[1]Equivalencia BH-BMPT'!$D$17,IF(J56=17,'[1]Equivalencia BH-BMPT'!$D$18,IF(J56=18,'[1]Equivalencia BH-BMPT'!$D$19,IF(J56=19,'[1]Equivalencia BH-BMPT'!$D$20,IF(J56=20,'[1]Equivalencia BH-BMPT'!$D$21,IF(J56=21,'[1]Equivalencia BH-BMPT'!$D$22,IF(J56=22,'[1]Equivalencia BH-BMPT'!$D$23,IF(J56=23,'[1]Equivalencia BH-BMPT'!#REF!,IF(J56=24,'[1]Equivalencia BH-BMPT'!$D$25,IF(J56=25,'[1]Equivalencia BH-BMPT'!$D$26,IF(J56=26,'[1]Equivalencia BH-BMPT'!$D$27,IF(J56=27,'[1]Equivalencia BH-BMPT'!$D$28,IF(J56=28,'[1]Equivalencia BH-BMPT'!$D$29,IF(J56=29,'[1]Equivalencia BH-BMPT'!$D$30,IF(J56=30,'[1]Equivalencia BH-BMPT'!$D$31,IF(J56=31,'[1]Equivalencia BH-BMPT'!$D$32,IF(J56=32,'[1]Equivalencia BH-BMPT'!$D$33,IF(J56=33,'[1]Equivalencia BH-BMPT'!$D$34,IF(J56=34,'[1]Equivalencia BH-BMPT'!$D$35,IF(J56=35,'[1]Equivalencia BH-BMPT'!$D$36,IF(J56=36,'[1]Equivalencia BH-BMPT'!$D$37,IF(J56=37,'[1]Equivalencia BH-BMPT'!$D$38,IF(J56=38,'[1]Equivalencia BH-BMPT'!#REF!,IF(J56=39,'[1]Equivalencia BH-BMPT'!$D$40,IF(J56=40,'[1]Equivalencia BH-BMPT'!$D$41,IF(J56=41,'[1]Equivalencia BH-BMPT'!$D$42,IF(J56=42,'[1]Equivalencia BH-BMPT'!$D$43,IF(J56=43,'[1]Equivalencia BH-BMPT'!$D$44,IF(J56=44,'[1]Equivalencia BH-BMPT'!$D$45,IF(J56=45,'[1]Equivalencia BH-BMPT'!$D$46,\"No ha seleccionado un número de programa\")))))))))))))))))))))))))))))))))))))))))))))","v":"Gobernanza e influencia local, regional e internacional"},1329,79951944,"WILLIAM ANDRES ORTIZ GONZALEZ",19950000,null,null,null,0,19950000,19950000,"2017-02-22","2017-02-22","2017-09-21",210,0,null,null,null,null,"X",1]
[39,2017,"CPS 039  2017",5,{"$f":"IF(D57=1,'[1]Tipo '!$B$2,IF(D57=2,'[1]Tipo '!$B$3,IF(D57=3,'[1]Tipo '!$B$4,IF(D57=4,'[1]Tipo '!$B$5,IF(D57=5,'[1]Tipo '!$B$6,IF(D57=6,'[1]Tipo '!$B$7,IF(D57=7,'[1]Tipo '!$B$8,IF(D57=8,'[1]Tipo '!$B$9,IF(D57=9,'[1]Tipo '!$B$10,IF(D57=10,'[1]Tipo '!$B$11,IF(D57=11,'[1]Tipo '!$B$12,IF(D57=12,'[1]Tipo '!$B$13,IF(D57=13,'[1]Tipo '!$B$14,IF(D57=14,'[1]Tipo '!$B$15,IF(D57=15,'[1]Tipo '!$B$16,IF(D57=16,'[1]Tipo '!$B$17,IF(D57=17,'[1]Tipo '!$B$18,IF(D57=18,'[1]Tipo '!$B$19,IF(D57=19,'[1]Tipo '!$B$20,\"No ha seleccionado un tipo de contrato válido\")))))))))))))))))))","v":"CONTRATOS DE PRESTACIÓN DE SERVICIOS PROFESIONALES Y DE APOYO A LA GESTIÓN"},"CONTRATACIÓN DIRECTA","Prestación de servicios profesionales y de apoyo a la gestión, o para la ejecución de trabajos artísticos que sólo puedan encomendarse a determinadas personas naturales;","Prestar los servicios profesionales como Administrador de la Red de Voz y Datos,  brindando asistencia y soporte técnico del software y hardware de los equipos y programas que maneja la entidad así como a los usuarios que desarrollen sus actividades en la Alcaldía Local de Teusaquillo.","INVERSIÓN",45,{"$f":"IF(J57=1,'[1]Equivalencia BH-BMPT'!$D$2,IF(J57=2,'[1]Equivalencia BH-BMPT'!$D$3,IF(J57=3,'[1]Equivalencia BH-BMPT'!$D$4,IF(J57=4,'[1]Equivalencia BH-BMPT'!$D$5,IF(J57=5,'[1]Equivalencia BH-BMPT'!$D$6,IF(J57=6,'[1]Equivalencia BH-BMPT'!$D$7,IF(J57=7,'[1]Equivalencia BH-BMPT'!$D$8,IF(J57=8,'[1]Equivalencia BH-BMPT'!$D$9,IF(J57=9,'[1]Equivalencia BH-BMPT'!$D$10,IF(J57=10,'[1]Equivalencia BH-BMPT'!$D$11,IF(J57=11,'[1]Equivalencia BH-BMPT'!$D$12,IF(J57=12,'[1]Equivalencia BH-BMPT'!$D$13,IF(J57=13,'[1]Equivalencia BH-BMPT'!$D$14,IF(J57=14,'[1]Equivalencia BH-BMPT'!$D$15,IF(J57=15,'[1]Equivalencia BH-BMPT'!$D$16,IF(J57=16,'[1]Equivalencia BH-BMPT'!$D$17,IF(J57=17,'[1]Equivalencia BH-BMPT'!$D$18,IF(J57=18,'[1]Equivalencia BH-BMPT'!$D$19,IF(J57=19,'[1]Equivalencia BH-BMPT'!$D$20,IF(J57=20,'[1]Equivalencia BH-BMPT'!$D$21,IF(J57=21,'[1]Equivalencia BH-BMPT'!$D$22,IF(J57=22,'[1]Equivalencia BH-BMPT'!$D$23,IF(J57=23,'[1]Equivalencia BH-BMPT'!#REF!,IF(J57=24,'[1]Equivalencia BH-BMPT'!$D$25,IF(J57=25,'[1]Equivalencia BH-BMPT'!$D$26,IF(J57=26,'[1]Equivalencia BH-BMPT'!$D$27,IF(J57=27,'[1]Equivalencia BH-BMPT'!$D$28,IF(J57=28,'[1]Equivalencia BH-BMPT'!$D$29,IF(J57=29,'[1]Equivalencia BH-BMPT'!$D$30,IF(J57=30,'[1]Equivalencia BH-BMPT'!$D$31,IF(J57=31,'[1]Equivalencia BH-BMPT'!$D$32,IF(J57=32,'[1]Equivalencia BH-BMPT'!$D$33,IF(J57=33,'[1]Equivalencia BH-BMPT'!$D$34,IF(J57=34,'[1]Equivalencia BH-BMPT'!$D$35,IF(J57=35,'[1]Equivalencia BH-BMPT'!$D$36,IF(J57=36,'[1]Equivalencia BH-BMPT'!$D$37,IF(J57=37,'[1]Equivalencia BH-BMPT'!$D$38,IF(J57=38,'[1]Equivalencia BH-BMPT'!#REF!,IF(J57=39,'[1]Equivalencia BH-BMPT'!$D$40,IF(J57=40,'[1]Equivalencia BH-BMPT'!$D$41,IF(J57=41,'[1]Equivalencia BH-BMPT'!$D$42,IF(J57=42,'[1]Equivalencia BH-BMPT'!$D$43,IF(J57=43,'[1]Equivalencia BH-BMPT'!$D$44,IF(J57=44,'[1]Equivalencia BH-BMPT'!$D$45,IF(J57=45,'[1]Equivalencia BH-BMPT'!$D$46,\"No ha seleccionado un número de programa\")))))))))))))))))))))))))))))))))))))))))))))","v":"Gobernanza e influencia local, regional e internacional"},1329,79415517,"JOHN JAIRO ARBELAEZ CASTAÑEDA",19200000,null,null,null,9600000,28800000,28800000,"2017-02-23","2017-02-24","2017-08-23",120,60,null,null,null,null,"X",1]
[40,2017,"CPS 040  2017",5,{"$f":"IF(D58=1,'[1]Tipo '!$B$2,IF(D58=2,'[1]Tipo '!$B$3,IF(D58=3,'[1]Tipo '!$B$4,IF(D58=4,'[1]Tipo '!$B$5,IF(D58=5,'[1]Tipo '!$B$6,IF(D58=6,'[1]Tipo '!$B$7,IF(D58=7,'[1]Tipo '!$B$8,IF(D58=8,'[1]Tipo '!$B$9,IF(D58=9,'[1]Tipo '!$B$10,IF(D58=10,'[1]Tipo '!$B$11,IF(D58=11,'[1]Tipo '!$B$12,IF(D58=12,'[1]Tipo '!$B$13,IF(D58=13,'[1]Tipo '!$B$14,IF(D58=14,'[1]Tipo '!$B$15,IF(D58=15,'[1]Tipo '!$B$16,IF(D58=16,'[1]Tipo '!$B$17,IF(D58=17,'[1]Tipo '!$B$18,IF(D58=18,'[1]Tipo '!$B$19,IF(D58=19,'[1]Tipo '!$B$20,\"No ha seleccionado un tipo de contrato válido\")))))))))))))))))))","v":"CONTRATOS DE PRESTACIÓN DE SERVICIOS PROFESIONALES Y DE APOYO A LA GESTIÓN"},"CONTRATACIÓN DIRECTA","Prestación de servicios profesionales y de apoyo a la gestión, o para la ejecución de trabajos artísticos que sólo puedan encomendarse a determinadas personas naturales;","El contrato que se pretende celebrar, tendrá por objeto ¿Prestación de servicios profesionales al Área de Gestión Policiva para la descongestión y trámite procesal a las actuaciones administrativas y preliminares correspondientes a Establecimientos de Comercio anteriores al año 2014.¿.","INVERSIÓN",45,{"$f":"IF(J58=1,'[1]Equivalencia BH-BMPT'!$D$2,IF(J58=2,'[1]Equivalencia BH-BMPT'!$D$3,IF(J58=3,'[1]Equivalencia BH-BMPT'!$D$4,IF(J58=4,'[1]Equivalencia BH-BMPT'!$D$5,IF(J58=5,'[1]Equivalencia BH-BMPT'!$D$6,IF(J58=6,'[1]Equivalencia BH-BMPT'!$D$7,IF(J58=7,'[1]Equivalencia BH-BMPT'!$D$8,IF(J58=8,'[1]Equivalencia BH-BMPT'!$D$9,IF(J58=9,'[1]Equivalencia BH-BMPT'!$D$10,IF(J58=10,'[1]Equivalencia BH-BMPT'!$D$11,IF(J58=11,'[1]Equivalencia BH-BMPT'!$D$12,IF(J58=12,'[1]Equivalencia BH-BMPT'!$D$13,IF(J58=13,'[1]Equivalencia BH-BMPT'!$D$14,IF(J58=14,'[1]Equivalencia BH-BMPT'!$D$15,IF(J58=15,'[1]Equivalencia BH-BMPT'!$D$16,IF(J58=16,'[1]Equivalencia BH-BMPT'!$D$17,IF(J58=17,'[1]Equivalencia BH-BMPT'!$D$18,IF(J58=18,'[1]Equivalencia BH-BMPT'!$D$19,IF(J58=19,'[1]Equivalencia BH-BMPT'!$D$20,IF(J58=20,'[1]Equivalencia BH-BMPT'!$D$21,IF(J58=21,'[1]Equivalencia BH-BMPT'!$D$22,IF(J58=22,'[1]Equivalencia BH-BMPT'!$D$23,IF(J58=23,'[1]Equivalencia BH-BMPT'!#REF!,IF(J58=24,'[1]Equivalencia BH-BMPT'!$D$25,IF(J58=25,'[1]Equivalencia BH-BMPT'!$D$26,IF(J58=26,'[1]Equivalencia BH-BMPT'!$D$27,IF(J58=27,'[1]Equivalencia BH-BMPT'!$D$28,IF(J58=28,'[1]Equivalencia BH-BMPT'!$D$29,IF(J58=29,'[1]Equivalencia BH-BMPT'!$D$30,IF(J58=30,'[1]Equivalencia BH-BMPT'!$D$31,IF(J58=31,'[1]Equivalencia BH-BMPT'!$D$32,IF(J58=32,'[1]Equivalencia BH-BMPT'!$D$33,IF(J58=33,'[1]Equivalencia BH-BMPT'!$D$34,IF(J58=34,'[1]Equivalencia BH-BMPT'!$D$35,IF(J58=35,'[1]Equivalencia BH-BMPT'!$D$36,IF(J58=36,'[1]Equivalencia BH-BMPT'!$D$37,IF(J58=37,'[1]Equivalencia BH-BMPT'!$D$38,IF(J58=38,'[1]Equivalencia BH-BMPT'!#REF!,IF(J58=39,'[1]Equivalencia BH-BMPT'!$D$40,IF(J58=40,'[1]Equivalencia BH-BMPT'!$D$41,IF(J58=41,'[1]Equivalencia BH-BMPT'!$D$42,IF(J58=42,'[1]Equivalencia BH-BMPT'!$D$43,IF(J58=43,'[1]Equivalencia BH-BMPT'!$D$44,IF(J58=44,'[1]Equivalencia BH-BMPT'!$D$45,IF(J58=45,'[1]Equivalencia BH-BMPT'!$D$46,\"No ha seleccionado un número de programa\")))))))))))))))))))))))))))))))))))))))))))))","v":"Gobernanza e influencia local, regional e internacional"},1329,1106395824,"ZAIDE NATALIE BURGOS BARRETO",26600000,null,null,null,0,26600000,26600000,"2017-02-24","2017-02-27","2017-09-26",210,0,null,null,null,null,"X",1]
[41,2017,"CPS 041  2017",5,{"$f":"IF(D59=1,'[1]Tipo '!$B$2,IF(D59=2,'[1]Tipo '!$B$3,IF(D59=3,'[1]Tipo '!$B$4,IF(D59=4,'[1]Tipo '!$B$5,IF(D59=5,'[1]Tipo '!$B$6,IF(D59=6,'[1]Tipo '!$B$7,IF(D59=7,'[1]Tipo '!$B$8,IF(D59=8,'[1]Tipo '!$B$9,IF(D59=9,'[1]Tipo '!$B$10,IF(D59=10,'[1]Tipo '!$B$11,IF(D59=11,'[1]Tipo '!$B$12,IF(D59=12,'[1]Tipo '!$B$13,IF(D59=13,'[1]Tipo '!$B$14,IF(D59=14,'[1]Tipo '!$B$15,IF(D59=15,'[1]Tipo '!$B$16,IF(D59=16,'[1]Tipo '!$B$17,IF(D59=17,'[1]Tipo '!$B$18,IF(D59=18,'[1]Tipo '!$B$19,IF(D59=19,'[1]Tipo '!$B$20,\"No ha seleccionado un tipo de contrato válido\")))))))))))))))))))","v":"CONTRATOS DE PRESTACIÓN DE SERVICIOS PROFESIONALES Y DE APOYO A LA GESTIÓN"},"CONTRATACIÓN DIRECTA","Prestación de servicios profesionales y de apoyo a la gestión, o para la ejecución de trabajos artísticos que sólo puedan encomendarse a determinadas personas naturales;","El contrato que se pretende celebrar, tendrá por objeto ¿Prestar los servicios técnicos para la operación, seguimiento y cumplimiento de los procesos y procedimientos del servicio social Apoyos para la Seguridad Económica Tipo C, requeridos para el oportuno y adecuado registro, cruce y reporte de los datos en el sistema de información y registro de Beneficiarios¿SIRBE, que contribuyan a la garantía de los derechos de la población mayor en el marco de la Política Pública Social para el Envejecimiento y la Vejez  en el Distrito Capital a cargo de la Alcaldía Local Teusaquillo.¿.","INVERSIÓN",45,{"$f":"IF(J59=1,'[1]Equivalencia BH-BMPT'!$D$2,IF(J59=2,'[1]Equivalencia BH-BMPT'!$D$3,IF(J59=3,'[1]Equivalencia BH-BMPT'!$D$4,IF(J59=4,'[1]Equivalencia BH-BMPT'!$D$5,IF(J59=5,'[1]Equivalencia BH-BMPT'!$D$6,IF(J59=6,'[1]Equivalencia BH-BMPT'!$D$7,IF(J59=7,'[1]Equivalencia BH-BMPT'!$D$8,IF(J59=8,'[1]Equivalencia BH-BMPT'!$D$9,IF(J59=9,'[1]Equivalencia BH-BMPT'!$D$10,IF(J59=10,'[1]Equivalencia BH-BMPT'!$D$11,IF(J59=11,'[1]Equivalencia BH-BMPT'!$D$12,IF(J59=12,'[1]Equivalencia BH-BMPT'!$D$13,IF(J59=13,'[1]Equivalencia BH-BMPT'!$D$14,IF(J59=14,'[1]Equivalencia BH-BMPT'!$D$15,IF(J59=15,'[1]Equivalencia BH-BMPT'!$D$16,IF(J59=16,'[1]Equivalencia BH-BMPT'!$D$17,IF(J59=17,'[1]Equivalencia BH-BMPT'!$D$18,IF(J59=18,'[1]Equivalencia BH-BMPT'!$D$19,IF(J59=19,'[1]Equivalencia BH-BMPT'!$D$20,IF(J59=20,'[1]Equivalencia BH-BMPT'!$D$21,IF(J59=21,'[1]Equivalencia BH-BMPT'!$D$22,IF(J59=22,'[1]Equivalencia BH-BMPT'!$D$23,IF(J59=23,'[1]Equivalencia BH-BMPT'!#REF!,IF(J59=24,'[1]Equivalencia BH-BMPT'!$D$25,IF(J59=25,'[1]Equivalencia BH-BMPT'!$D$26,IF(J59=26,'[1]Equivalencia BH-BMPT'!$D$27,IF(J59=27,'[1]Equivalencia BH-BMPT'!$D$28,IF(J59=28,'[1]Equivalencia BH-BMPT'!$D$29,IF(J59=29,'[1]Equivalencia BH-BMPT'!$D$30,IF(J59=30,'[1]Equivalencia BH-BMPT'!$D$31,IF(J59=31,'[1]Equivalencia BH-BMPT'!$D$32,IF(J59=32,'[1]Equivalencia BH-BMPT'!$D$33,IF(J59=33,'[1]Equivalencia BH-BMPT'!$D$34,IF(J59=34,'[1]Equivalencia BH-BMPT'!$D$35,IF(J59=35,'[1]Equivalencia BH-BMPT'!$D$36,IF(J59=36,'[1]Equivalencia BH-BMPT'!$D$37,IF(J59=37,'[1]Equivalencia BH-BMPT'!$D$38,IF(J59=38,'[1]Equivalencia BH-BMPT'!#REF!,IF(J59=39,'[1]Equivalencia BH-BMPT'!$D$40,IF(J59=40,'[1]Equivalencia BH-BMPT'!$D$41,IF(J59=41,'[1]Equivalencia BH-BMPT'!$D$42,IF(J59=42,'[1]Equivalencia BH-BMPT'!$D$43,IF(J59=43,'[1]Equivalencia BH-BMPT'!$D$44,IF(J59=44,'[1]Equivalencia BH-BMPT'!$D$45,IF(J59=45,'[1]Equivalencia BH-BMPT'!$D$46,\"No ha seleccionado un número de programa\")))))))))))))))))))))))))))))))))))))))))))))","v":"Gobernanza e influencia local, regional e internacional"},1329,1031141363,"GERALDINE  MONTENEGRO LOZADA",15500000,null,null,null,0,15500000,15500000,"2017-02-28","2017-02-28","2017-08-02",210,0,null,null,null,null,"X",1]
[42,2017,"CPS 042  2017",5,{"$f":"IF(D60=1,'[1]Tipo '!$B$2,IF(D60=2,'[1]Tipo '!$B$3,IF(D60=3,'[1]Tipo '!$B$4,IF(D60=4,'[1]Tipo '!$B$5,IF(D60=5,'[1]Tipo '!$B$6,IF(D60=6,'[1]Tipo '!$B$7,IF(D60=7,'[1]Tipo '!$B$8,IF(D60=8,'[1]Tipo '!$B$9,IF(D60=9,'[1]Tipo '!$B$10,IF(D60=10,'[1]Tipo '!$B$11,IF(D60=11,'[1]Tipo '!$B$12,IF(D60=12,'[1]Tipo '!$B$13,IF(D60=13,'[1]Tipo '!$B$14,IF(D60=14,'[1]Tipo '!$B$15,IF(D60=15,'[1]Tipo '!$B$16,IF(D60=16,'[1]Tipo '!$B$17,IF(D60=17,'[1]Tipo '!$B$18,IF(D60=18,'[1]Tipo '!$B$19,IF(D60=19,'[1]Tipo '!$B$20,\"No ha seleccionado un tipo de contrato válido\")))))))))))))))))))","v":"CONTRATOS DE PRESTACIÓN DE SERVICIOS PROFESIONALES Y DE APOYO A LA GESTIÓN"},"CONTRATACIÓN DIRECTA","Prestación de servicios profesionales y de apoyo a la gestión, o para la ejecución de trabajos artísticos que sólo puedan encomendarse a determinadas personas naturales;","¿El contrato que se pretende celebrar, tendrá por objeto Prestación de servicios profesionales al Despacho del Alcalde Local para que realice las actividades de seguimiento a  las respuestas de los requerimientos realizados por los diferentes entes de control y El Concejo de Bogotá de acuerdo a las metas establecidas en el Plan de Desarrollo, Plan de Gestión y Plan de Mejoramiento","INVERSIÓN",45,{"$f":"IF(J60=1,'[1]Equivalencia BH-BMPT'!$D$2,IF(J60=2,'[1]Equivalencia BH-BMPT'!$D$3,IF(J60=3,'[1]Equivalencia BH-BMPT'!$D$4,IF(J60=4,'[1]Equivalencia BH-BMPT'!$D$5,IF(J60=5,'[1]Equivalencia BH-BMPT'!$D$6,IF(J60=6,'[1]Equivalencia BH-BMPT'!$D$7,IF(J60=7,'[1]Equivalencia BH-BMPT'!$D$8,IF(J60=8,'[1]Equivalencia BH-BMPT'!$D$9,IF(J60=9,'[1]Equivalencia BH-BMPT'!$D$10,IF(J60=10,'[1]Equivalencia BH-BMPT'!$D$11,IF(J60=11,'[1]Equivalencia BH-BMPT'!$D$12,IF(J60=12,'[1]Equivalencia BH-BMPT'!$D$13,IF(J60=13,'[1]Equivalencia BH-BMPT'!$D$14,IF(J60=14,'[1]Equivalencia BH-BMPT'!$D$15,IF(J60=15,'[1]Equivalencia BH-BMPT'!$D$16,IF(J60=16,'[1]Equivalencia BH-BMPT'!$D$17,IF(J60=17,'[1]Equivalencia BH-BMPT'!$D$18,IF(J60=18,'[1]Equivalencia BH-BMPT'!$D$19,IF(J60=19,'[1]Equivalencia BH-BMPT'!$D$20,IF(J60=20,'[1]Equivalencia BH-BMPT'!$D$21,IF(J60=21,'[1]Equivalencia BH-BMPT'!$D$22,IF(J60=22,'[1]Equivalencia BH-BMPT'!$D$23,IF(J60=23,'[1]Equivalencia BH-BMPT'!#REF!,IF(J60=24,'[1]Equivalencia BH-BMPT'!$D$25,IF(J60=25,'[1]Equivalencia BH-BMPT'!$D$26,IF(J60=26,'[1]Equivalencia BH-BMPT'!$D$27,IF(J60=27,'[1]Equivalencia BH-BMPT'!$D$28,IF(J60=28,'[1]Equivalencia BH-BMPT'!$D$29,IF(J60=29,'[1]Equivalencia BH-BMPT'!$D$30,IF(J60=30,'[1]Equivalencia BH-BMPT'!$D$31,IF(J60=31,'[1]Equivalencia BH-BMPT'!$D$32,IF(J60=32,'[1]Equivalencia BH-BMPT'!$D$33,IF(J60=33,'[1]Equivalencia BH-BMPT'!$D$34,IF(J60=34,'[1]Equivalencia BH-BMPT'!$D$35,IF(J60=35,'[1]Equivalencia BH-BMPT'!$D$36,IF(J60=36,'[1]Equivalencia BH-BMPT'!$D$37,IF(J60=37,'[1]Equivalencia BH-BMPT'!$D$38,IF(J60=38,'[1]Equivalencia BH-BMPT'!#REF!,IF(J60=39,'[1]Equivalencia BH-BMPT'!$D$40,IF(J60=40,'[1]Equivalencia BH-BMPT'!$D$41,IF(J60=41,'[1]Equivalencia BH-BMPT'!$D$42,IF(J60=42,'[1]Equivalencia BH-BMPT'!$D$43,IF(J60=43,'[1]Equivalencia BH-BMPT'!$D$44,IF(J60=44,'[1]Equivalencia BH-BMPT'!$D$45,IF(J60=45,'[1]Equivalencia BH-BMPT'!$D$46,\"No ha seleccionado un número de programa\")))))))))))))))))))))))))))))))))))))))))))))","v":"Gobernanza e influencia local, regional e internacional"},1329,38610462,"ANDREA MARCELA GONZALEZ LARGO",32900000,null,null,null,13003341,45903341,44336667,"2017-03-01","2017-03-06","2017-12-28",210,{"$f":"23+60","v":83},null,null,null,"X",null,0.96587015311151314]
[43,2017,"CPS 043  2017",5,{"$f":"IF(D61=1,'[1]Tipo '!$B$2,IF(D61=2,'[1]Tipo '!$B$3,IF(D61=3,'[1]Tipo '!$B$4,IF(D61=4,'[1]Tipo '!$B$5,IF(D61=5,'[1]Tipo '!$B$6,IF(D61=6,'[1]Tipo '!$B$7,IF(D61=7,'[1]Tipo '!$B$8,IF(D61=8,'[1]Tipo '!$B$9,IF(D61=9,'[1]Tipo '!$B$10,IF(D61=10,'[1]Tipo '!$B$11,IF(D61=11,'[1]Tipo '!$B$12,IF(D61=12,'[1]Tipo '!$B$13,IF(D61=13,'[1]Tipo '!$B$14,IF(D61=14,'[1]Tipo '!$B$15,IF(D61=15,'[1]Tipo '!$B$16,IF(D61=16,'[1]Tipo '!$B$17,IF(D61=17,'[1]Tipo '!$B$18,IF(D61=18,'[1]Tipo '!$B$19,IF(D61=19,'[1]Tipo '!$B$20,\"No ha seleccionado un tipo de contrato válido\")))))))))))))))))))","v":"CONTRATOS DE PRESTACIÓN DE SERVICIOS PROFESIONALES Y DE APOYO A LA GESTIÓN"},"CONTRATACIÓN DIRECTA","Prestación de servicios profesionales y de apoyo a la gestión, o para la ejecución de trabajos artísticos que sólo puedan encomendarse a determinadas personas naturales;","El contrato que se pretende celebrar, tendrá por objeto¿¿Prestación de servicios profesionalescon el fin de gestionar el proceso de cobro persuasivo dentro de las Actuaciones Administrativas que se adelantan en el Área de Gestión Policiva, así como dar trámite a las actuaciones administrativas relacionadas con establecimientos de comercio y/o espacio público, peticiones, quejas y requerimientos¿","INVERSIÓN",45,{"$f":"IF(J61=1,'[1]Equivalencia BH-BMPT'!$D$2,IF(J61=2,'[1]Equivalencia BH-BMPT'!$D$3,IF(J61=3,'[1]Equivalencia BH-BMPT'!$D$4,IF(J61=4,'[1]Equivalencia BH-BMPT'!$D$5,IF(J61=5,'[1]Equivalencia BH-BMPT'!$D$6,IF(J61=6,'[1]Equivalencia BH-BMPT'!$D$7,IF(J61=7,'[1]Equivalencia BH-BMPT'!$D$8,IF(J61=8,'[1]Equivalencia BH-BMPT'!$D$9,IF(J61=9,'[1]Equivalencia BH-BMPT'!$D$10,IF(J61=10,'[1]Equivalencia BH-BMPT'!$D$11,IF(J61=11,'[1]Equivalencia BH-BMPT'!$D$12,IF(J61=12,'[1]Equivalencia BH-BMPT'!$D$13,IF(J61=13,'[1]Equivalencia BH-BMPT'!$D$14,IF(J61=14,'[1]Equivalencia BH-BMPT'!$D$15,IF(J61=15,'[1]Equivalencia BH-BMPT'!$D$16,IF(J61=16,'[1]Equivalencia BH-BMPT'!$D$17,IF(J61=17,'[1]Equivalencia BH-BMPT'!$D$18,IF(J61=18,'[1]Equivalencia BH-BMPT'!$D$19,IF(J61=19,'[1]Equivalencia BH-BMPT'!$D$20,IF(J61=20,'[1]Equivalencia BH-BMPT'!$D$21,IF(J61=21,'[1]Equivalencia BH-BMPT'!$D$22,IF(J61=22,'[1]Equivalencia BH-BMPT'!$D$23,IF(J61=23,'[1]Equivalencia BH-BMPT'!#REF!,IF(J61=24,'[1]Equivalencia BH-BMPT'!$D$25,IF(J61=25,'[1]Equivalencia BH-BMPT'!$D$26,IF(J61=26,'[1]Equivalencia BH-BMPT'!$D$27,IF(J61=27,'[1]Equivalencia BH-BMPT'!$D$28,IF(J61=28,'[1]Equivalencia BH-BMPT'!$D$29,IF(J61=29,'[1]Equivalencia BH-BMPT'!$D$30,IF(J61=30,'[1]Equivalencia BH-BMPT'!$D$31,IF(J61=31,'[1]Equivalencia BH-BMPT'!$D$32,IF(J61=32,'[1]Equivalencia BH-BMPT'!$D$33,IF(J61=33,'[1]Equivalencia BH-BMPT'!$D$34,IF(J61=34,'[1]Equivalencia BH-BMPT'!$D$35,IF(J61=35,'[1]Equivalencia BH-BMPT'!$D$36,IF(J61=36,'[1]Equivalencia BH-BMPT'!$D$37,IF(J61=37,'[1]Equivalencia BH-BMPT'!$D$38,IF(J61=38,'[1]Equivalencia BH-BMPT'!#REF!,IF(J61=39,'[1]Equivalencia BH-BMPT'!$D$40,IF(J61=40,'[1]Equivalencia BH-BMPT'!$D$41,IF(J61=41,'[1]Equivalencia BH-BMPT'!$D$42,IF(J61=42,'[1]Equivalencia BH-BMPT'!$D$43,IF(J61=43,'[1]Equivalencia BH-BMPT'!$D$44,IF(J61=44,'[1]Equivalencia BH-BMPT'!$D$45,IF(J61=45,'[1]Equivalencia BH-BMPT'!$D$46,\"No ha seleccionado un número de programa\")))))))))))))))))))))))))))))))))))))))))))))","v":"Gobernanza e influencia local, regional e internacional"},1329,12646690,"LUIS FERNANDO QUINTERO CALDERON",21000000,null,null,null,10500000,31500000,31080000,"2017-03-02","2017-03-03","2017-10-17",150,75,null,null,null,"X",null,0.98666666666666669]
[44,2017,"CPS 044  2017",5,{"$f":"IF(D62=1,'[1]Tipo '!$B$2,IF(D62=2,'[1]Tipo '!$B$3,IF(D62=3,'[1]Tipo '!$B$4,IF(D62=4,'[1]Tipo '!$B$5,IF(D62=5,'[1]Tipo '!$B$6,IF(D62=6,'[1]Tipo '!$B$7,IF(D62=7,'[1]Tipo '!$B$8,IF(D62=8,'[1]Tipo '!$B$9,IF(D62=9,'[1]Tipo '!$B$10,IF(D62=10,'[1]Tipo '!$B$11,IF(D62=11,'[1]Tipo '!$B$12,IF(D62=12,'[1]Tipo '!$B$13,IF(D62=13,'[1]Tipo '!$B$14,IF(D62=14,'[1]Tipo '!$B$15,IF(D62=15,'[1]Tipo '!$B$16,IF(D62=16,'[1]Tipo '!$B$17,IF(D62=17,'[1]Tipo '!$B$18,IF(D62=18,'[1]Tipo '!$B$19,IF(D62=19,'[1]Tipo '!$B$20,\"No ha seleccionado un tipo de contrato válido\")))))))))))))))))))","v":"CONTRATOS DE PRESTACIÓN DE SERVICIOS PROFESIONALES Y DE APOYO A LA GESTIÓN"},"CONTRATACIÓN DIRECTA","Prestación de servicios profesionales y de apoyo a la gestión, o para la ejecución de trabajos artísticos que sólo puedan encomendarse a determinadas personas naturales;","EL CONTRATISTA SE OBLIGA PARA CON EL FONDO A PRESTAR SUS SERVICIOS PARA APOYAR EL PROCESO DE RADICACIÓN, NOTIFICACION Y ENTREGA DE LA CORRESPONDENCIA INTERNA Y EXTERNA DE LA ALCALDIA LOCAL DE TEUSAQUILLO","INVERSIÓN",45,{"$f":"IF(J62=1,'[1]Equivalencia BH-BMPT'!$D$2,IF(J62=2,'[1]Equivalencia BH-BMPT'!$D$3,IF(J62=3,'[1]Equivalencia BH-BMPT'!$D$4,IF(J62=4,'[1]Equivalencia BH-BMPT'!$D$5,IF(J62=5,'[1]Equivalencia BH-BMPT'!$D$6,IF(J62=6,'[1]Equivalencia BH-BMPT'!$D$7,IF(J62=7,'[1]Equivalencia BH-BMPT'!$D$8,IF(J62=8,'[1]Equivalencia BH-BMPT'!$D$9,IF(J62=9,'[1]Equivalencia BH-BMPT'!$D$10,IF(J62=10,'[1]Equivalencia BH-BMPT'!$D$11,IF(J62=11,'[1]Equivalencia BH-BMPT'!$D$12,IF(J62=12,'[1]Equivalencia BH-BMPT'!$D$13,IF(J62=13,'[1]Equivalencia BH-BMPT'!$D$14,IF(J62=14,'[1]Equivalencia BH-BMPT'!$D$15,IF(J62=15,'[1]Equivalencia BH-BMPT'!$D$16,IF(J62=16,'[1]Equivalencia BH-BMPT'!$D$17,IF(J62=17,'[1]Equivalencia BH-BMPT'!$D$18,IF(J62=18,'[1]Equivalencia BH-BMPT'!$D$19,IF(J62=19,'[1]Equivalencia BH-BMPT'!$D$20,IF(J62=20,'[1]Equivalencia BH-BMPT'!$D$21,IF(J62=21,'[1]Equivalencia BH-BMPT'!$D$22,IF(J62=22,'[1]Equivalencia BH-BMPT'!$D$23,IF(J62=23,'[1]Equivalencia BH-BMPT'!#REF!,IF(J62=24,'[1]Equivalencia BH-BMPT'!$D$25,IF(J62=25,'[1]Equivalencia BH-BMPT'!$D$26,IF(J62=26,'[1]Equivalencia BH-BMPT'!$D$27,IF(J62=27,'[1]Equivalencia BH-BMPT'!$D$28,IF(J62=28,'[1]Equivalencia BH-BMPT'!$D$29,IF(J62=29,'[1]Equivalencia BH-BMPT'!$D$30,IF(J62=30,'[1]Equivalencia BH-BMPT'!$D$31,IF(J62=31,'[1]Equivalencia BH-BMPT'!$D$32,IF(J62=32,'[1]Equivalencia BH-BMPT'!$D$33,IF(J62=33,'[1]Equivalencia BH-BMPT'!$D$34,IF(J62=34,'[1]Equivalencia BH-BMPT'!$D$35,IF(J62=35,'[1]Equivalencia BH-BMPT'!$D$36,IF(J62=36,'[1]Equivalencia BH-BMPT'!$D$37,IF(J62=37,'[1]Equivalencia BH-BMPT'!$D$38,IF(J62=38,'[1]Equivalencia BH-BMPT'!#REF!,IF(J62=39,'[1]Equivalencia BH-BMPT'!$D$40,IF(J62=40,'[1]Equivalencia BH-BMPT'!$D$41,IF(J62=41,'[1]Equivalencia BH-BMPT'!$D$42,IF(J62=42,'[1]Equivalencia BH-BMPT'!$D$43,IF(J62=43,'[1]Equivalencia BH-BMPT'!$D$44,IF(J62=44,'[1]Equivalencia BH-BMPT'!$D$45,IF(J62=45,'[1]Equivalencia BH-BMPT'!$D$46,\"No ha seleccionado un número de programa\")))))))))))))))))))))))))))))))))))))))))))))","v":"Gobernanza e influencia local, regional e internacional"},1329,1032462820,"JENNIFER VANNESA DIAZ NIÑO",14700000,null,null,null,6650000,21350000,19460000,"2017-03-03","2017-03-07","2018-01-10",210,95,null,null,"X",null,null,0.91147540983606556]
[45,2017,"CPS 045  2017",5,{"$f":"IF(D63=1,'[1]Tipo '!$B$2,IF(D63=2,'[1]Tipo '!$B$3,IF(D63=3,'[1]Tipo '!$B$4,IF(D63=4,'[1]Tipo '!$B$5,IF(D63=5,'[1]Tipo '!$B$6,IF(D63=6,'[1]Tipo '!$B$7,IF(D63=7,'[1]Tipo '!$B$8,IF(D63=8,'[1]Tipo '!$B$9,IF(D63=9,'[1]Tipo '!$B$10,IF(D63=10,'[1]Tipo '!$B$11,IF(D63=11,'[1]Tipo '!$B$12,IF(D63=12,'[1]Tipo '!$B$13,IF(D63=13,'[1]Tipo '!$B$14,IF(D63=14,'[1]Tipo '!$B$15,IF(D63=15,'[1]Tipo '!$B$16,IF(D63=16,'[1]Tipo '!$B$17,IF(D63=17,'[1]Tipo '!$B$18,IF(D63=18,'[1]Tipo '!$B$19,IF(D63=19,'[1]Tipo '!$B$20,\"No ha seleccionado un tipo de contrato válido\")))))))))))))))))))","v":"CONTRATOS DE PRESTACIÓN DE SERVICIOS PROFESIONALES Y DE APOYO A LA GESTIÓN"},"CONTRATACIÓN DIRECTA","Prestación de servicios profesionales y de apoyo a la gestión, o para la ejecución de trabajos artísticos que sólo puedan encomendarse a determinadas personas naturales;","Prestación de servicios profesionales al Área de Gestión Policiva a través de visitas a terreno y emisión de conceptos técnicos, para verificar el cumplimiento de la normatividad relativa a establecimientos de comercio y espacio público","INVERSIÓN",45,{"$f":"IF(J63=1,'[1]Equivalencia BH-BMPT'!$D$2,IF(J63=2,'[1]Equivalencia BH-BMPT'!$D$3,IF(J63=3,'[1]Equivalencia BH-BMPT'!$D$4,IF(J63=4,'[1]Equivalencia BH-BMPT'!$D$5,IF(J63=5,'[1]Equivalencia BH-BMPT'!$D$6,IF(J63=6,'[1]Equivalencia BH-BMPT'!$D$7,IF(J63=7,'[1]Equivalencia BH-BMPT'!$D$8,IF(J63=8,'[1]Equivalencia BH-BMPT'!$D$9,IF(J63=9,'[1]Equivalencia BH-BMPT'!$D$10,IF(J63=10,'[1]Equivalencia BH-BMPT'!$D$11,IF(J63=11,'[1]Equivalencia BH-BMPT'!$D$12,IF(J63=12,'[1]Equivalencia BH-BMPT'!$D$13,IF(J63=13,'[1]Equivalencia BH-BMPT'!$D$14,IF(J63=14,'[1]Equivalencia BH-BMPT'!$D$15,IF(J63=15,'[1]Equivalencia BH-BMPT'!$D$16,IF(J63=16,'[1]Equivalencia BH-BMPT'!$D$17,IF(J63=17,'[1]Equivalencia BH-BMPT'!$D$18,IF(J63=18,'[1]Equivalencia BH-BMPT'!$D$19,IF(J63=19,'[1]Equivalencia BH-BMPT'!$D$20,IF(J63=20,'[1]Equivalencia BH-BMPT'!$D$21,IF(J63=21,'[1]Equivalencia BH-BMPT'!$D$22,IF(J63=22,'[1]Equivalencia BH-BMPT'!$D$23,IF(J63=23,'[1]Equivalencia BH-BMPT'!#REF!,IF(J63=24,'[1]Equivalencia BH-BMPT'!$D$25,IF(J63=25,'[1]Equivalencia BH-BMPT'!$D$26,IF(J63=26,'[1]Equivalencia BH-BMPT'!$D$27,IF(J63=27,'[1]Equivalencia BH-BMPT'!$D$28,IF(J63=28,'[1]Equivalencia BH-BMPT'!$D$29,IF(J63=29,'[1]Equivalencia BH-BMPT'!$D$30,IF(J63=30,'[1]Equivalencia BH-BMPT'!$D$31,IF(J63=31,'[1]Equivalencia BH-BMPT'!$D$32,IF(J63=32,'[1]Equivalencia BH-BMPT'!$D$33,IF(J63=33,'[1]Equivalencia BH-BMPT'!$D$34,IF(J63=34,'[1]Equivalencia BH-BMPT'!$D$35,IF(J63=35,'[1]Equivalencia BH-BMPT'!$D$36,IF(J63=36,'[1]Equivalencia BH-BMPT'!$D$37,IF(J63=37,'[1]Equivalencia BH-BMPT'!$D$38,IF(J63=38,'[1]Equivalencia BH-BMPT'!#REF!,IF(J63=39,'[1]Equivalencia BH-BMPT'!$D$40,IF(J63=40,'[1]Equivalencia BH-BMPT'!$D$41,IF(J63=41,'[1]Equivalencia BH-BMPT'!$D$42,IF(J63=42,'[1]Equivalencia BH-BMPT'!$D$43,IF(J63=43,'[1]Equivalencia BH-BMPT'!$D$44,IF(J63=44,'[1]Equivalencia BH-BMPT'!$D$45,IF(J63=45,'[1]Equivalencia BH-BMPT'!$D$46,\"No ha seleccionado un número de programa\")))))))))))))))))))))))))))))))))))))))))))))","v":"Gobernanza e influencia local, regional e internacional"},1329,52104732,"DIANA MAYERLY LARROTA RAMIREZ",29400000,null,null,null,0,29400000,29400000,"2017-03-06","2017-03-09","8/102017",210,0,null,null,null,null,"X",1]
[46,2017,"CPS 046  2017",5,{"$f":"IF(D64=1,'[1]Tipo '!$B$2,IF(D64=2,'[1]Tipo '!$B$3,IF(D64=3,'[1]Tipo '!$B$4,IF(D64=4,'[1]Tipo '!$B$5,IF(D64=5,'[1]Tipo '!$B$6,IF(D64=6,'[1]Tipo '!$B$7,IF(D64=7,'[1]Tipo '!$B$8,IF(D64=8,'[1]Tipo '!$B$9,IF(D64=9,'[1]Tipo '!$B$10,IF(D64=10,'[1]Tipo '!$B$11,IF(D64=11,'[1]Tipo '!$B$12,IF(D64=12,'[1]Tipo '!$B$13,IF(D64=13,'[1]Tipo '!$B$14,IF(D64=14,'[1]Tipo '!$B$15,IF(D64=15,'[1]Tipo '!$B$16,IF(D64=16,'[1]Tipo '!$B$17,IF(D64=17,'[1]Tipo '!$B$18,IF(D64=18,'[1]Tipo '!$B$19,IF(D64=19,'[1]Tipo '!$B$20,\"No ha seleccionado un tipo de contrato válido\")))))))))))))))))))","v":"CONTRATOS DE PRESTACIÓN DE SERVICIOS PROFESIONALES Y DE APOYO A LA GESTIÓN"},"CONTRATACIÓN DIRECTA","Prestación de servicios profesionales y de apoyo a la gestión, o para la ejecución de trabajos artísticos que sólo puedan encomendarse a determinadas personas naturales;","Prestación de servicios profesionales al Área de Gestión Policiva de la Alcaldía Local de Teusaquillo, en las actividades concernientes a registros, certificaciones, actualizaciones de datos, entre otras, con el fin dar cumplimiento a lo establecido en ley 675 de 2001 y 746 de 2009 y demás normas vigentes, así como, atender peticiones y requerimientos relacionados con propiedad horizontal.¿","INVERSIÓN",45,{"$f":"IF(J64=1,'[1]Equivalencia BH-BMPT'!$D$2,IF(J64=2,'[1]Equivalencia BH-BMPT'!$D$3,IF(J64=3,'[1]Equivalencia BH-BMPT'!$D$4,IF(J64=4,'[1]Equivalencia BH-BMPT'!$D$5,IF(J64=5,'[1]Equivalencia BH-BMPT'!$D$6,IF(J64=6,'[1]Equivalencia BH-BMPT'!$D$7,IF(J64=7,'[1]Equivalencia BH-BMPT'!$D$8,IF(J64=8,'[1]Equivalencia BH-BMPT'!$D$9,IF(J64=9,'[1]Equivalencia BH-BMPT'!$D$10,IF(J64=10,'[1]Equivalencia BH-BMPT'!$D$11,IF(J64=11,'[1]Equivalencia BH-BMPT'!$D$12,IF(J64=12,'[1]Equivalencia BH-BMPT'!$D$13,IF(J64=13,'[1]Equivalencia BH-BMPT'!$D$14,IF(J64=14,'[1]Equivalencia BH-BMPT'!$D$15,IF(J64=15,'[1]Equivalencia BH-BMPT'!$D$16,IF(J64=16,'[1]Equivalencia BH-BMPT'!$D$17,IF(J64=17,'[1]Equivalencia BH-BMPT'!$D$18,IF(J64=18,'[1]Equivalencia BH-BMPT'!$D$19,IF(J64=19,'[1]Equivalencia BH-BMPT'!$D$20,IF(J64=20,'[1]Equivalencia BH-BMPT'!$D$21,IF(J64=21,'[1]Equivalencia BH-BMPT'!$D$22,IF(J64=22,'[1]Equivalencia BH-BMPT'!$D$23,IF(J64=23,'[1]Equivalencia BH-BMPT'!#REF!,IF(J64=24,'[1]Equivalencia BH-BMPT'!$D$25,IF(J64=25,'[1]Equivalencia BH-BMPT'!$D$26,IF(J64=26,'[1]Equivalencia BH-BMPT'!$D$27,IF(J64=27,'[1]Equivalencia BH-BMPT'!$D$28,IF(J64=28,'[1]Equivalencia BH-BMPT'!$D$29,IF(J64=29,'[1]Equivalencia BH-BMPT'!$D$30,IF(J64=30,'[1]Equivalencia BH-BMPT'!$D$31,IF(J64=31,'[1]Equivalencia BH-BMPT'!$D$32,IF(J64=32,'[1]Equivalencia BH-BMPT'!$D$33,IF(J64=33,'[1]Equivalencia BH-BMPT'!$D$34,IF(J64=34,'[1]Equivalencia BH-BMPT'!$D$35,IF(J64=35,'[1]Equivalencia BH-BMPT'!$D$36,IF(J64=36,'[1]Equivalencia BH-BMPT'!$D$37,IF(J64=37,'[1]Equivalencia BH-BMPT'!$D$38,IF(J64=38,'[1]Equivalencia BH-BMPT'!#REF!,IF(J64=39,'[1]Equivalencia BH-BMPT'!$D$40,IF(J64=40,'[1]Equivalencia BH-BMPT'!$D$41,IF(J64=41,'[1]Equivalencia BH-BMPT'!$D$42,IF(J64=42,'[1]Equivalencia BH-BMPT'!$D$43,IF(J64=43,'[1]Equivalencia BH-BMPT'!$D$44,IF(J64=44,'[1]Equivalencia BH-BMPT'!$D$45,IF(J64=45,'[1]Equivalencia BH-BMPT'!$D$46,\"No ha seleccionado un número de programa\")))))))))))))))))))))))))))))))))))))))))))))","v":"Gobernanza e influencia local, regional e internacional"},1329,1018407386,"KAREN GIULIANA JARA RIVEROS",25200000,null,null,null,0,25200000,22120000,"2017-03-06","2017-03-07","2017-09-06",180,0,null,null,null,"X",null,0.87777777777777777]
[47,2017,"CPS 047  2017",5,{"$f":"IF(D65=1,'[1]Tipo '!$B$2,IF(D65=2,'[1]Tipo '!$B$3,IF(D65=3,'[1]Tipo '!$B$4,IF(D65=4,'[1]Tipo '!$B$5,IF(D65=5,'[1]Tipo '!$B$6,IF(D65=6,'[1]Tipo '!$B$7,IF(D65=7,'[1]Tipo '!$B$8,IF(D65=8,'[1]Tipo '!$B$9,IF(D65=9,'[1]Tipo '!$B$10,IF(D65=10,'[1]Tipo '!$B$11,IF(D65=11,'[1]Tipo '!$B$12,IF(D65=12,'[1]Tipo '!$B$13,IF(D65=13,'[1]Tipo '!$B$14,IF(D65=14,'[1]Tipo '!$B$15,IF(D65=15,'[1]Tipo '!$B$16,IF(D65=16,'[1]Tipo '!$B$17,IF(D65=17,'[1]Tipo '!$B$18,IF(D65=18,'[1]Tipo '!$B$19,IF(D65=19,'[1]Tipo '!$B$20,\"No ha seleccionado un tipo de contrato válido\")))))))))))))))))))","v":"CONTRATOS DE PRESTACIÓN DE SERVICIOS PROFESIONALES Y DE APOYO A LA GESTIÓN"},"CONTRATACIÓN DIRECTA","Prestación de servicios profesionales y de apoyo a la gestión, o para la ejecución de trabajos artísticos que sólo puedan encomendarse a determinadas personas naturales;","El contrato que se pretende celebrar, tendrá por objeto: ¿Prestar servicios profesionales para el seguimiento a la estabilidad de las obras ejecutadas con recursos del Fondo de Desarrollo Local de Teusaquillo y apoyar en la realización de las actividades en el desarrollo de los proyectos de infraestructura","INVERSIÓN",18,{"$f":"IF(J65=1,'[1]Equivalencia BH-BMPT'!$D$2,IF(J65=2,'[1]Equivalencia BH-BMPT'!$D$3,IF(J65=3,'[1]Equivalencia BH-BMPT'!$D$4,IF(J65=4,'[1]Equivalencia BH-BMPT'!$D$5,IF(J65=5,'[1]Equivalencia BH-BMPT'!$D$6,IF(J65=6,'[1]Equivalencia BH-BMPT'!$D$7,IF(J65=7,'[1]Equivalencia BH-BMPT'!$D$8,IF(J65=8,'[1]Equivalencia BH-BMPT'!$D$9,IF(J65=9,'[1]Equivalencia BH-BMPT'!$D$10,IF(J65=10,'[1]Equivalencia BH-BMPT'!$D$11,IF(J65=11,'[1]Equivalencia BH-BMPT'!$D$12,IF(J65=12,'[1]Equivalencia BH-BMPT'!$D$13,IF(J65=13,'[1]Equivalencia BH-BMPT'!$D$14,IF(J65=14,'[1]Equivalencia BH-BMPT'!$D$15,IF(J65=15,'[1]Equivalencia BH-BMPT'!$D$16,IF(J65=16,'[1]Equivalencia BH-BMPT'!$D$17,IF(J65=17,'[1]Equivalencia BH-BMPT'!$D$18,IF(J65=18,'[1]Equivalencia BH-BMPT'!$D$19,IF(J65=19,'[1]Equivalencia BH-BMPT'!$D$20,IF(J65=20,'[1]Equivalencia BH-BMPT'!$D$21,IF(J65=21,'[1]Equivalencia BH-BMPT'!$D$22,IF(J65=22,'[1]Equivalencia BH-BMPT'!$D$23,IF(J65=23,'[1]Equivalencia BH-BMPT'!#REF!,IF(J65=24,'[1]Equivalencia BH-BMPT'!$D$25,IF(J65=25,'[1]Equivalencia BH-BMPT'!$D$26,IF(J65=26,'[1]Equivalencia BH-BMPT'!$D$27,IF(J65=27,'[1]Equivalencia BH-BMPT'!$D$28,IF(J65=28,'[1]Equivalencia BH-BMPT'!$D$29,IF(J65=29,'[1]Equivalencia BH-BMPT'!$D$30,IF(J65=30,'[1]Equivalencia BH-BMPT'!$D$31,IF(J65=31,'[1]Equivalencia BH-BMPT'!$D$32,IF(J65=32,'[1]Equivalencia BH-BMPT'!$D$33,IF(J65=33,'[1]Equivalencia BH-BMPT'!$D$34,IF(J65=34,'[1]Equivalencia BH-BMPT'!$D$35,IF(J65=35,'[1]Equivalencia BH-BMPT'!$D$36,IF(J65=36,'[1]Equivalencia BH-BMPT'!$D$37,IF(J65=37,'[1]Equivalencia BH-BMPT'!$D$38,IF(J65=38,'[1]Equivalencia BH-BMPT'!#REF!,IF(J65=39,'[1]Equivalencia BH-BMPT'!$D$40,IF(J65=40,'[1]Equivalencia BH-BMPT'!$D$41,IF(J65=41,'[1]Equivalencia BH-BMPT'!$D$42,IF(J65=42,'[1]Equivalencia BH-BMPT'!$D$43,IF(J65=43,'[1]Equivalencia BH-BMPT'!$D$44,IF(J65=44,'[1]Equivalencia BH-BMPT'!$D$45,IF(J65=45,'[1]Equivalencia BH-BMPT'!$D$46,\"No ha seleccionado un número de programa\")))))))))))))))))))))))))))))))))))))))))))))","v":"Mejor movilidad para todos"},1338,52152211,"DORA ALIX HERNANDEZ CEBALLOS",31500000,null,null,null,0,31500000,31500000,"2017-03-07","2017-03-10","2017-10-09",210,0,null,null,null,null,"X",1]
[48,2016,"CPS 048  2017",5,{"$f":"IF(D66=1,'[1]Tipo '!$B$2,IF(D66=2,'[1]Tipo '!$B$3,IF(D66=3,'[1]Tipo '!$B$4,IF(D66=4,'[1]Tipo '!$B$5,IF(D66=5,'[1]Tipo '!$B$6,IF(D66=6,'[1]Tipo '!$B$7,IF(D66=7,'[1]Tipo '!$B$8,IF(D66=8,'[1]Tipo '!$B$9,IF(D66=9,'[1]Tipo '!$B$10,IF(D66=10,'[1]Tipo '!$B$11,IF(D66=11,'[1]Tipo '!$B$12,IF(D66=12,'[1]Tipo '!$B$13,IF(D66=13,'[1]Tipo '!$B$14,IF(D66=14,'[1]Tipo '!$B$15,IF(D66=15,'[1]Tipo '!$B$16,IF(D66=16,'[1]Tipo '!$B$17,IF(D66=17,'[1]Tipo '!$B$18,IF(D66=18,'[1]Tipo '!$B$19,IF(D66=19,'[1]Tipo '!$B$20,\"No ha seleccionado un tipo de contrato válido\")))))))))))))))))))","v":"CONTRATOS DE PRESTACIÓN DE SERVICIOS PROFESIONALES Y DE APOYO A LA GESTIÓN"},"CONTRATACIÓN DIRECTA","Prestación de servicios profesionales y de apoyo a la gestión, o para la ejecución de trabajos artísticos que sólo puedan encomendarse a determinadas personas naturales;","El contrato que se pretende celebrar, tendrá por objeto ¿El contratista se obliga para con el Fondo de Desarrollo Local de Teusaquillo a prestar sus servicios profesionales realizando actividades diagnosticas de los proyectos ambientales, desde la coordinación  interinstitucional  y  apoyo a la las acciones de implementación del PIGA¿.","INVERSIÓN",45,{"$f":"IF(J66=1,'[1]Equivalencia BH-BMPT'!$D$2,IF(J66=2,'[1]Equivalencia BH-BMPT'!$D$3,IF(J66=3,'[1]Equivalencia BH-BMPT'!$D$4,IF(J66=4,'[1]Equivalencia BH-BMPT'!$D$5,IF(J66=5,'[1]Equivalencia BH-BMPT'!$D$6,IF(J66=6,'[1]Equivalencia BH-BMPT'!$D$7,IF(J66=7,'[1]Equivalencia BH-BMPT'!$D$8,IF(J66=8,'[1]Equivalencia BH-BMPT'!$D$9,IF(J66=9,'[1]Equivalencia BH-BMPT'!$D$10,IF(J66=10,'[1]Equivalencia BH-BMPT'!$D$11,IF(J66=11,'[1]Equivalencia BH-BMPT'!$D$12,IF(J66=12,'[1]Equivalencia BH-BMPT'!$D$13,IF(J66=13,'[1]Equivalencia BH-BMPT'!$D$14,IF(J66=14,'[1]Equivalencia BH-BMPT'!$D$15,IF(J66=15,'[1]Equivalencia BH-BMPT'!$D$16,IF(J66=16,'[1]Equivalencia BH-BMPT'!$D$17,IF(J66=17,'[1]Equivalencia BH-BMPT'!$D$18,IF(J66=18,'[1]Equivalencia BH-BMPT'!$D$19,IF(J66=19,'[1]Equivalencia BH-BMPT'!$D$20,IF(J66=20,'[1]Equivalencia BH-BMPT'!$D$21,IF(J66=21,'[1]Equivalencia BH-BMPT'!$D$22,IF(J66=22,'[1]Equivalencia BH-BMPT'!$D$23,IF(J66=23,'[1]Equivalencia BH-BMPT'!#REF!,IF(J66=24,'[1]Equivalencia BH-BMPT'!$D$25,IF(J66=25,'[1]Equivalencia BH-BMPT'!$D$26,IF(J66=26,'[1]Equivalencia BH-BMPT'!$D$27,IF(J66=27,'[1]Equivalencia BH-BMPT'!$D$28,IF(J66=28,'[1]Equivalencia BH-BMPT'!$D$29,IF(J66=29,'[1]Equivalencia BH-BMPT'!$D$30,IF(J66=30,'[1]Equivalencia BH-BMPT'!$D$31,IF(J66=31,'[1]Equivalencia BH-BMPT'!$D$32,IF(J66=32,'[1]Equivalencia BH-BMPT'!$D$33,IF(J66=33,'[1]Equivalencia BH-BMPT'!$D$34,IF(J66=34,'[1]Equivalencia BH-BMPT'!$D$35,IF(J66=35,'[1]Equivalencia BH-BMPT'!$D$36,IF(J66=36,'[1]Equivalencia BH-BMPT'!$D$37,IF(J66=37,'[1]Equivalencia BH-BMPT'!$D$38,IF(J66=38,'[1]Equivalencia BH-BMPT'!#REF!,IF(J66=39,'[1]Equivalencia BH-BMPT'!$D$40,IF(J66=40,'[1]Equivalencia BH-BMPT'!$D$41,IF(J66=41,'[1]Equivalencia BH-BMPT'!$D$42,IF(J66=42,'[1]Equivalencia BH-BMPT'!$D$43,IF(J66=43,'[1]Equivalencia BH-BMPT'!$D$44,IF(J66=44,'[1]Equivalencia BH-BMPT'!$D$45,IF(J66=45,'[1]Equivalencia BH-BMPT'!$D$46,\"No ha seleccionado un número de programa\")))))))))))))))))))))))))))))))))))))))))))))","v":"Gobernanza e influencia local, regional e internacional"},1329,80772758,"CAMILO ANDRES ACUÑA CARO",25200000,null,null,null,12600000,37800000,37800000,"2017-03-07","2017-03-09","2017-12-08",180,90,null,null,null,null,"X",1]
[49,2017,"CPS 049  2017",4,{"$f":"IF(D67=1,'[1]Tipo '!$B$2,IF(D67=2,'[1]Tipo '!$B$3,IF(D67=3,'[1]Tipo '!$B$4,IF(D67=4,'[1]Tipo '!$B$5,IF(D67=5,'[1]Tipo '!$B$6,IF(D67=6,'[1]Tipo '!$B$7,IF(D67=7,'[1]Tipo '!$B$8,IF(D67=8,'[1]Tipo '!$B$9,IF(D67=9,'[1]Tipo '!$B$10,IF(D67=10,'[1]Tipo '!$B$11,IF(D67=11,'[1]Tipo '!$B$12,IF(D67=12,'[1]Tipo '!$B$13,IF(D67=13,'[1]Tipo '!$B$14,IF(D67=14,'[1]Tipo '!$B$15,IF(D67=15,'[1]Tipo '!$B$16,IF(D67=16,'[1]Tipo '!$B$17,IF(D67=17,'[1]Tipo '!$B$18,IF(D67=18,'[1]Tipo '!$B$19,IF(D67=19,'[1]Tipo '!$B$20,\"No ha seleccionado un tipo de contrato válido\")))))))))))))))))))","v":"CONTRATOS DE PRESTACIÓN DE SERVICIOS"},"Contratación mínima cuantia ","No aplica","PRESTAR EL SERVICIO INTEGRAL DE FOTOCOPIADO A PRECIOS UNITARIOS SIN FORMULA DE REAJUSTE MEDIANTE EL SISTEMA DE OUTSOURCING DE ACUERDO CON LOS PRESENTES ESTUDIOS PREVIOS, ANEXOS TECNICOS E INVITACIÓN","FUNCIONAMIENTO",null,{"$f":"IF(J67=1,'[1]Equivalencia BH-BMPT'!$D$2,IF(J67=2,'[1]Equivalencia BH-BMPT'!$D$3,IF(J67=3,'[1]Equivalencia BH-BMPT'!$D$4,IF(J67=4,'[1]Equivalencia BH-BMPT'!$D$5,IF(J67=5,'[1]Equivalencia BH-BMPT'!$D$6,IF(J67=6,'[1]Equivalencia BH-BMPT'!$D$7,IF(J67=7,'[1]Equivalencia BH-BMPT'!$D$8,IF(J67=8,'[1]Equivalencia BH-BMPT'!$D$9,IF(J67=9,'[1]Equivalencia BH-BMPT'!$D$10,IF(J67=10,'[1]Equivalencia BH-BMPT'!$D$11,IF(J67=11,'[1]Equivalencia BH-BMPT'!$D$12,IF(J67=12,'[1]Equivalencia BH-BMPT'!$D$13,IF(J67=13,'[1]Equivalencia BH-BMPT'!$D$14,IF(J67=14,'[1]Equivalencia BH-BMPT'!$D$15,IF(J67=15,'[1]Equivalencia BH-BMPT'!$D$16,IF(J67=16,'[1]Equivalencia BH-BMPT'!$D$17,IF(J67=17,'[1]Equivalencia BH-BMPT'!$D$18,IF(J67=18,'[1]Equivalencia BH-BMPT'!$D$19,IF(J67=19,'[1]Equivalencia BH-BMPT'!$D$20,IF(J67=20,'[1]Equivalencia BH-BMPT'!$D$21,IF(J67=21,'[1]Equivalencia BH-BMPT'!$D$22,IF(J67=22,'[1]Equivalencia BH-BMPT'!$D$23,IF(J67=23,'[1]Equivalencia BH-BMPT'!#REF!,IF(J67=24,'[1]Equivalencia BH-BMPT'!$D$25,IF(J67=25,'[1]Equivalencia BH-BMPT'!$D$26,IF(J67=26,'[1]Equivalencia BH-BMPT'!$D$27,IF(J67=27,'[1]Equivalencia BH-BMPT'!$D$28,IF(J67=28,'[1]Equivalencia BH-BMPT'!$D$29,IF(J67=29,'[1]Equivalencia BH-BMPT'!$D$30,IF(J67=30,'[1]Equivalencia BH-BMPT'!$D$31,IF(J67=31,'[1]Equivalencia BH-BMPT'!$D$32,IF(J67=32,'[1]Equivalencia BH-BMPT'!$D$33,IF(J67=33,'[1]Equivalencia BH-BMPT'!$D$34,IF(J67=34,'[1]Equivalencia BH-BMPT'!$D$35,IF(J67=35,'[1]Equivalencia BH-BMPT'!$D$36,IF(J67=36,'[1]Equivalencia BH-BMPT'!$D$37,IF(J67=37,'[1]Equivalencia BH-BMPT'!$D$38,IF(J67=38,'[1]Equivalencia BH-BMPT'!#REF!,IF(J67=39,'[1]Equivalencia BH-BMPT'!$D$40,IF(J67=40,'[1]Equivalencia BH-BMPT'!$D$41,IF(J67=41,'[1]Equivalencia BH-BMPT'!$D$42,IF(J67=42,'[1]Equivalencia BH-BMPT'!$D$43,IF(J67=43,'[1]Equivalencia BH-BMPT'!$D$44,IF(J67=44,'[1]Equivalencia BH-BMPT'!$D$45,IF(J67=45,'[1]Equivalencia BH-BMPT'!$D$46,\"No ha seleccionado un número de programa\")))))))))))))))))))))))))))))))))))))))))))))","v":"No ha seleccionado un número de programa"},null,830080796,"SERTCO S&S LTDA",19008000,null,null,null,0,19008000,18131450,"2017-03-23","2017-04-11","2018-03-10",330,0,null,null,"X",null,null,0.95388520622895623]
[50,2017,"CPS 050 2017",5,{"$f":"IF(D68=1,'[1]Tipo '!$B$2,IF(D68=2,'[1]Tipo '!$B$3,IF(D68=3,'[1]Tipo '!$B$4,IF(D68=4,'[1]Tipo '!$B$5,IF(D68=5,'[1]Tipo '!$B$6,IF(D68=6,'[1]Tipo '!$B$7,IF(D68=7,'[1]Tipo '!$B$8,IF(D68=8,'[1]Tipo '!$B$9,IF(D68=9,'[1]Tipo '!$B$10,IF(D68=10,'[1]Tipo '!$B$11,IF(D68=11,'[1]Tipo '!$B$12,IF(D68=12,'[1]Tipo '!$B$13,IF(D68=13,'[1]Tipo '!$B$14,IF(D68=14,'[1]Tipo '!$B$15,IF(D68=15,'[1]Tipo '!$B$16,IF(D68=16,'[1]Tipo '!$B$17,IF(D68=17,'[1]Tipo '!$B$18,IF(D68=18,'[1]Tipo '!$B$19,IF(D68=19,'[1]Tipo '!$B$20,\"No ha seleccionado un tipo de contrato válido\")))))))))))))))))))","v":"CONTRATOS DE PRESTACIÓN DE SERVICIOS PROFESIONALES Y DE APOYO A LA GESTIÓN"},"CONTRATACIÓN DIRECTA","Prestación de servicios profesionales y de apoyo a la gestión, o para la ejecución de trabajos artísticos que sólo puedan encomendarse a determinadas personas naturales;","El contrato que se pretende celebrar, tendrá por objeto ¿Prestación de servicios profesionales al Área de Gestión Policiva a través de visitas a terreno y emisión de conceptos técnicos, para verificar el cumplimiento de la normatividad relativa a establecimientos de comercio y espacio público y obras y urbanismo","INVERSIÓN",45,{"$f":"IF(J68=1,'[1]Equivalencia BH-BMPT'!$D$2,IF(J68=2,'[1]Equivalencia BH-BMPT'!$D$3,IF(J68=3,'[1]Equivalencia BH-BMPT'!$D$4,IF(J68=4,'[1]Equivalencia BH-BMPT'!$D$5,IF(J68=5,'[1]Equivalencia BH-BMPT'!$D$6,IF(J68=6,'[1]Equivalencia BH-BMPT'!$D$7,IF(J68=7,'[1]Equivalencia BH-BMPT'!$D$8,IF(J68=8,'[1]Equivalencia BH-BMPT'!$D$9,IF(J68=9,'[1]Equivalencia BH-BMPT'!$D$10,IF(J68=10,'[1]Equivalencia BH-BMPT'!$D$11,IF(J68=11,'[1]Equivalencia BH-BMPT'!$D$12,IF(J68=12,'[1]Equivalencia BH-BMPT'!$D$13,IF(J68=13,'[1]Equivalencia BH-BMPT'!$D$14,IF(J68=14,'[1]Equivalencia BH-BMPT'!$D$15,IF(J68=15,'[1]Equivalencia BH-BMPT'!$D$16,IF(J68=16,'[1]Equivalencia BH-BMPT'!$D$17,IF(J68=17,'[1]Equivalencia BH-BMPT'!$D$18,IF(J68=18,'[1]Equivalencia BH-BMPT'!$D$19,IF(J68=19,'[1]Equivalencia BH-BMPT'!$D$20,IF(J68=20,'[1]Equivalencia BH-BMPT'!$D$21,IF(J68=21,'[1]Equivalencia BH-BMPT'!$D$22,IF(J68=22,'[1]Equivalencia BH-BMPT'!$D$23,IF(J68=23,'[1]Equivalencia BH-BMPT'!#REF!,IF(J68=24,'[1]Equivalencia BH-BMPT'!$D$25,IF(J68=25,'[1]Equivalencia BH-BMPT'!$D$26,IF(J68=26,'[1]Equivalencia BH-BMPT'!$D$27,IF(J68=27,'[1]Equivalencia BH-BMPT'!$D$28,IF(J68=28,'[1]Equivalencia BH-BMPT'!$D$29,IF(J68=29,'[1]Equivalencia BH-BMPT'!$D$30,IF(J68=30,'[1]Equivalencia BH-BMPT'!$D$31,IF(J68=31,'[1]Equivalencia BH-BMPT'!$D$32,IF(J68=32,'[1]Equivalencia BH-BMPT'!$D$33,IF(J68=33,'[1]Equivalencia BH-BMPT'!$D$34,IF(J68=34,'[1]Equivalencia BH-BMPT'!$D$35,IF(J68=35,'[1]Equivalencia BH-BMPT'!$D$36,IF(J68=36,'[1]Equivalencia BH-BMPT'!$D$37,IF(J68=37,'[1]Equivalencia BH-BMPT'!$D$38,IF(J68=38,'[1]Equivalencia BH-BMPT'!#REF!,IF(J68=39,'[1]Equivalencia BH-BMPT'!$D$40,IF(J68=40,'[1]Equivalencia BH-BMPT'!$D$41,IF(J68=41,'[1]Equivalencia BH-BMPT'!$D$42,IF(J68=42,'[1]Equivalencia BH-BMPT'!$D$43,IF(J68=43,'[1]Equivalencia BH-BMPT'!$D$44,IF(J68=44,'[1]Equivalencia BH-BMPT'!$D$45,IF(J68=45,'[1]Equivalencia BH-BMPT'!$D$46,\"No ha seleccionado un número de programa\")))))))))))))))))))))))))))))))))))))))))))))","v":"Gobernanza e influencia local, regional e internacional"},1329,19427171,"JOSE GABRIEL MOLINA LAGOS",22500000,null,null,null,0,22500000,0,"2017-04-11","2017-04-18","2017-10-18",150,0,null,null,null,"X",null,0]
[51,2017,"CPS 051 17 ",5,{"$f":"IF(D69=1,'[1]Tipo '!$B$2,IF(D69=2,'[1]Tipo '!$B$3,IF(D69=3,'[1]Tipo '!$B$4,IF(D69=4,'[1]Tipo '!$B$5,IF(D69=5,'[1]Tipo '!$B$6,IF(D69=6,'[1]Tipo '!$B$7,IF(D69=7,'[1]Tipo '!$B$8,IF(D69=8,'[1]Tipo '!$B$9,IF(D69=9,'[1]Tipo '!$B$10,IF(D69=10,'[1]Tipo '!$B$11,IF(D69=11,'[1]Tipo '!$B$12,IF(D69=12,'[1]Tipo '!$B$13,IF(D69=13,'[1]Tipo '!$B$14,IF(D69=14,'[1]Tipo '!$B$15,IF(D69=15,'[1]Tipo '!$B$16,IF(D69=16,'[1]Tipo '!$B$17,IF(D69=17,'[1]Tipo '!$B$18,IF(D69=18,'[1]Tipo '!$B$19,IF(D69=19,'[1]Tipo '!$B$20,\"No ha seleccionado un tipo de contrato válido\")))))))))))))))))))","v":"CONTRATOS DE PRESTACIÓN DE SERVICIOS PROFESIONALES Y DE APOYO A LA GESTIÓN"},"CONTRATACIÓN DIRECTA","Prestación de servicios profesionales y de apoyo a la gestión, o para la ejecución de trabajos artísticos que sólo puedan encomendarse a determinadas personas naturales;","El contrato que se pretende celebrar, tendrá por objeto ¿Prestación de servicios profesionales al Área de Gestión Policiva para la descongestión e impulso procesal a las actuaciones administrativas y preliminares correspondientes al régimen de obras y urbanismo, establecimientos de comercio y espacio público, así como recepcionar diligencias de expresión de opiniones correspondientes al tema urbanístico, establecimientos comerciales y espacio público.¿.","INVERSIÓN",45,{"$f":"IF(J69=1,'[1]Equivalencia BH-BMPT'!$D$2,IF(J69=2,'[1]Equivalencia BH-BMPT'!$D$3,IF(J69=3,'[1]Equivalencia BH-BMPT'!$D$4,IF(J69=4,'[1]Equivalencia BH-BMPT'!$D$5,IF(J69=5,'[1]Equivalencia BH-BMPT'!$D$6,IF(J69=6,'[1]Equivalencia BH-BMPT'!$D$7,IF(J69=7,'[1]Equivalencia BH-BMPT'!$D$8,IF(J69=8,'[1]Equivalencia BH-BMPT'!$D$9,IF(J69=9,'[1]Equivalencia BH-BMPT'!$D$10,IF(J69=10,'[1]Equivalencia BH-BMPT'!$D$11,IF(J69=11,'[1]Equivalencia BH-BMPT'!$D$12,IF(J69=12,'[1]Equivalencia BH-BMPT'!$D$13,IF(J69=13,'[1]Equivalencia BH-BMPT'!$D$14,IF(J69=14,'[1]Equivalencia BH-BMPT'!$D$15,IF(J69=15,'[1]Equivalencia BH-BMPT'!$D$16,IF(J69=16,'[1]Equivalencia BH-BMPT'!$D$17,IF(J69=17,'[1]Equivalencia BH-BMPT'!$D$18,IF(J69=18,'[1]Equivalencia BH-BMPT'!$D$19,IF(J69=19,'[1]Equivalencia BH-BMPT'!$D$20,IF(J69=20,'[1]Equivalencia BH-BMPT'!$D$21,IF(J69=21,'[1]Equivalencia BH-BMPT'!$D$22,IF(J69=22,'[1]Equivalencia BH-BMPT'!$D$23,IF(J69=23,'[1]Equivalencia BH-BMPT'!#REF!,IF(J69=24,'[1]Equivalencia BH-BMPT'!$D$25,IF(J69=25,'[1]Equivalencia BH-BMPT'!$D$26,IF(J69=26,'[1]Equivalencia BH-BMPT'!$D$27,IF(J69=27,'[1]Equivalencia BH-BMPT'!$D$28,IF(J69=28,'[1]Equivalencia BH-BMPT'!$D$29,IF(J69=29,'[1]Equivalencia BH-BMPT'!$D$30,IF(J69=30,'[1]Equivalencia BH-BMPT'!$D$31,IF(J69=31,'[1]Equivalencia BH-BMPT'!$D$32,IF(J69=32,'[1]Equivalencia BH-BMPT'!$D$33,IF(J69=33,'[1]Equivalencia BH-BMPT'!$D$34,IF(J69=34,'[1]Equivalencia BH-BMPT'!$D$35,IF(J69=35,'[1]Equivalencia BH-BMPT'!$D$36,IF(J69=36,'[1]Equivalencia BH-BMPT'!$D$37,IF(J69=37,'[1]Equivalencia BH-BMPT'!$D$38,IF(J69=38,'[1]Equivalencia BH-BMPT'!#REF!,IF(J69=39,'[1]Equivalencia BH-BMPT'!$D$40,IF(J69=40,'[1]Equivalencia BH-BMPT'!$D$41,IF(J69=41,'[1]Equivalencia BH-BMPT'!$D$42,IF(J69=42,'[1]Equivalencia BH-BMPT'!$D$43,IF(J69=43,'[1]Equivalencia BH-BMPT'!$D$44,IF(J69=44,'[1]Equivalencia BH-BMPT'!$D$45,IF(J69=45,'[1]Equivalencia BH-BMPT'!$D$46,\"No ha seleccionado un número de programa\")))))))))))))))))))))))))))))))))))))))))))))","v":"Gobernanza e influencia local, regional e internacional"},1329,1019026678,"ANA MARIA MAZO LOPEZ",38850000,null,null,null,0,38850000,34800000,"2017-04-11","2017-04-17","2018-01-04",259,0,null,null,"X",null,null,0.89575289575289574]
[52,2017,"SAMC 002 2017 ",4,{"$f":"IF(D70=1,'[1]Tipo '!$B$2,IF(D70=2,'[1]Tipo '!$B$3,IF(D70=3,'[1]Tipo '!$B$4,IF(D70=4,'[1]Tipo '!$B$5,IF(D70=5,'[1]Tipo '!$B$6,IF(D70=6,'[1]Tipo '!$B$7,IF(D70=7,'[1]Tipo '!$B$8,IF(D70=8,'[1]Tipo '!$B$9,IF(D70=9,'[1]Tipo '!$B$10,IF(D70=10,'[1]Tipo '!$B$11,IF(D70=11,'[1]Tipo '!$B$12,IF(D70=12,'[1]Tipo '!$B$13,IF(D70=13,'[1]Tipo '!$B$14,IF(D70=14,'[1]Tipo '!$B$15,IF(D70=15,'[1]Tipo '!$B$16,IF(D70=16,'[1]Tipo '!$B$17,IF(D70=17,'[1]Tipo '!$B$18,IF(D70=18,'[1]Tipo '!$B$19,IF(D70=19,'[1]Tipo '!$B$20,\"No ha seleccionado un tipo de contrato válido\")))))))))))))))))))","v":"CONTRATOS DE PRESTACIÓN DE SERVICIOS"},"Selección abreviada ","Selección abreviada por menor cuantía ","El contrato que se pretende celebrar, tendrá por objeto ¿PRESTAR EL SERVICIO INTEGRAL DE ASEO, CAFETERÍA Y MANTENIMIENTO DE LAS INSTALACIONES FISICAS, CON PERSONAL, EQUIPOS, INSUMOS, MATERIALES Y HERRAMIENTAS NECESARIAS PARA LA PRESTACIÓN DEL SERVICIO REQUERIDO, EN LAS INSTALACIONES DONDE FUNCIONEN LAS DEPENDENCIAS DE LA ALCALDÍA LOCAL DE TEUSAQUILLO, INCLUIDA LA JAL DE TEUSAQUILLO, DE ACUERDO A LOS ESTUDIOS PREVIOS, PLIEGO DE CONDICIONES Y ANEXOS TECNICOS ¿.","FUNCIONAMIENTO",null,{"$f":"IF(J70=1,'[1]Equivalencia BH-BMPT'!$D$2,IF(J70=2,'[1]Equivalencia BH-BMPT'!$D$3,IF(J70=3,'[1]Equivalencia BH-BMPT'!$D$4,IF(J70=4,'[1]Equivalencia BH-BMPT'!$D$5,IF(J70=5,'[1]Equivalencia BH-BMPT'!$D$6,IF(J70=6,'[1]Equivalencia BH-BMPT'!$D$7,IF(J70=7,'[1]Equivalencia BH-BMPT'!$D$8,IF(J70=8,'[1]Equivalencia BH-BMPT'!$D$9,IF(J70=9,'[1]Equivalencia BH-BMPT'!$D$10,IF(J70=10,'[1]Equivalencia BH-BMPT'!$D$11,IF(J70=11,'[1]Equivalencia BH-BMPT'!$D$12,IF(J70=12,'[1]Equivalencia BH-BMPT'!$D$13,IF(J70=13,'[1]Equivalencia BH-BMPT'!$D$14,IF(J70=14,'[1]Equivalencia BH-BMPT'!$D$15,IF(J70=15,'[1]Equivalencia BH-BMPT'!$D$16,IF(J70=16,'[1]Equivalencia BH-BMPT'!$D$17,IF(J70=17,'[1]Equivalencia BH-BMPT'!$D$18,IF(J70=18,'[1]Equivalencia BH-BMPT'!$D$19,IF(J70=19,'[1]Equivalencia BH-BMPT'!$D$20,IF(J70=20,'[1]Equivalencia BH-BMPT'!$D$21,IF(J70=21,'[1]Equivalencia BH-BMPT'!$D$22,IF(J70=22,'[1]Equivalencia BH-BMPT'!$D$23,IF(J70=23,'[1]Equivalencia BH-BMPT'!#REF!,IF(J70=24,'[1]Equivalencia BH-BMPT'!$D$25,IF(J70=25,'[1]Equivalencia BH-BMPT'!$D$26,IF(J70=26,'[1]Equivalencia BH-BMPT'!$D$27,IF(J70=27,'[1]Equivalencia BH-BMPT'!$D$28,IF(J70=28,'[1]Equivalencia BH-BMPT'!$D$29,IF(J70=29,'[1]Equivalencia BH-BMPT'!$D$30,IF(J70=30,'[1]Equivalencia BH-BMPT'!$D$31,IF(J70=31,'[1]Equivalencia BH-BMPT'!$D$32,IF(J70=32,'[1]Equivalencia BH-BMPT'!$D$33,IF(J70=33,'[1]Equivalencia BH-BMPT'!$D$34,IF(J70=34,'[1]Equivalencia BH-BMPT'!$D$35,IF(J70=35,'[1]Equivalencia BH-BMPT'!$D$36,IF(J70=36,'[1]Equivalencia BH-BMPT'!$D$37,IF(J70=37,'[1]Equivalencia BH-BMPT'!$D$38,IF(J70=38,'[1]Equivalencia BH-BMPT'!#REF!,IF(J70=39,'[1]Equivalencia BH-BMPT'!$D$40,IF(J70=40,'[1]Equivalencia BH-BMPT'!$D$41,IF(J70=41,'[1]Equivalencia BH-BMPT'!$D$42,IF(J70=42,'[1]Equivalencia BH-BMPT'!$D$43,IF(J70=43,'[1]Equivalencia BH-BMPT'!$D$44,IF(J70=44,'[1]Equivalencia BH-BMPT'!$D$45,IF(J70=45,'[1]Equivalencia BH-BMPT'!$D$46,\"No ha seleccionado un número de programa\")))))))))))))))))))))))))))))))))))))))))))))","v":"No ha seleccionado un número de programa"},null,900183528,"ARIOS COLOMBIA SAS",27000000,null,null,null,0,27000000,1890431,"2017-05-02","2017-05-02","2018-03-03",300,0,null,null,"X",null,null,7.001596296296296E-2]
[52,2017,"SAMC 002 2017 ",4,{"$f":"IF(D71=1,'[1]Tipo '!$B$2,IF(D71=2,'[1]Tipo '!$B$3,IF(D71=3,'[1]Tipo '!$B$4,IF(D71=4,'[1]Tipo '!$B$5,IF(D71=5,'[1]Tipo '!$B$6,IF(D71=6,'[1]Tipo '!$B$7,IF(D71=7,'[1]Tipo '!$B$8,IF(D71=8,'[1]Tipo '!$B$9,IF(D71=9,'[1]Tipo '!$B$10,IF(D71=10,'[1]Tipo '!$B$11,IF(D71=11,'[1]Tipo '!$B$12,IF(D71=12,'[1]Tipo '!$B$13,IF(D71=13,'[1]Tipo '!$B$14,IF(D71=14,'[1]Tipo '!$B$15,IF(D71=15,'[1]Tipo '!$B$16,IF(D71=16,'[1]Tipo '!$B$17,IF(D71=17,'[1]Tipo '!$B$18,IF(D71=18,'[1]Tipo '!$B$19,IF(D71=19,'[1]Tipo '!$B$20,\"No ha seleccionado un tipo de contrato válido\")))))))))))))))))))","v":"CONTRATOS DE PRESTACIÓN DE SERVICIOS"},"Selección abreviada ","Selección abreviada por menor cuantía ","El contrato que se pretende celebrar, tendrá por objeto ¿PRESTAR EL SERVICIO INTEGRAL DE ASEO, CAFETERÍA Y MANTENIMIENTO DE LAS INSTALACIONES FISICAS, CON PERSONAL, EQUIPOS, INSUMOS, MATERIALES Y HERRAMIENTAS NECESARIAS PARA LA PRESTACIÓN DEL SERVICIO REQUERIDO, EN LAS INSTALACIONES DONDE FUNCIONEN LAS DEPENDENCIAS DE LA ALCALDÍA LOCAL DE TEUSAQUILLO, INCLUIDA LA JAL DE TEUSAQUILLO, DE ACUERDO A LOS ESTUDIOS PREVIOS, PLIEGO DE CONDICIONES Y ANEXOS TECNICOS ¿.","FUNCIONAMIENTO",null,{"$f":"IF(J71=1,'[1]Equivalencia BH-BMPT'!$D$2,IF(J71=2,'[1]Equivalencia BH-BMPT'!$D$3,IF(J71=3,'[1]Equivalencia BH-BMPT'!$D$4,IF(J71=4,'[1]Equivalencia BH-BMPT'!$D$5,IF(J71=5,'[1]Equivalencia BH-BMPT'!$D$6,IF(J71=6,'[1]Equivalencia BH-BMPT'!$D$7,IF(J71=7,'[1]Equivalencia BH-BMPT'!$D$8,IF(J71=8,'[1]Equivalencia BH-BMPT'!$D$9,IF(J71=9,'[1]Equivalencia BH-BMPT'!$D$10,IF(J71=10,'[1]Equivalencia BH-BMPT'!$D$11,IF(J71=11,'[1]Equivalencia BH-BMPT'!$D$12,IF(J71=12,'[1]Equivalencia BH-BMPT'!$D$13,IF(J71=13,'[1]Equivalencia BH-BMPT'!$D$14,IF(J71=14,'[1]Equivalencia BH-BMPT'!$D$15,IF(J71=15,'[1]Equivalencia BH-BMPT'!$D$16,IF(J71=16,'[1]Equivalencia BH-BMPT'!$D$17,IF(J71=17,'[1]Equivalencia BH-BMPT'!$D$18,IF(J71=18,'[1]Equivalencia BH-BMPT'!$D$19,IF(J71=19,'[1]Equivalencia BH-BMPT'!$D$20,IF(J71=20,'[1]Equivalencia BH-BMPT'!$D$21,IF(J71=21,'[1]Equivalencia BH-BMPT'!$D$22,IF(J71=22,'[1]Equivalencia BH-BMPT'!$D$23,IF(J71=23,'[1]Equivalencia BH-BMPT'!#REF!,IF(J71=24,'[1]Equivalencia BH-BMPT'!$D$25,IF(J71=25,'[1]Equivalencia BH-BMPT'!$D$26,IF(J71=26,'[1]Equivalencia BH-BMPT'!$D$27,IF(J71=27,'[1]Equivalencia BH-BMPT'!$D$28,IF(J71=28,'[1]Equivalencia BH-BMPT'!$D$29,IF(J71=29,'[1]Equivalencia BH-BMPT'!$D$30,IF(J71=30,'[1]Equivalencia BH-BMPT'!$D$31,IF(J71=31,'[1]Equivalencia BH-BMPT'!$D$32,IF(J71=32,'[1]Equivalencia BH-BMPT'!$D$33,IF(J71=33,'[1]Equivalencia BH-BMPT'!$D$34,IF(J71=34,'[1]Equivalencia BH-BMPT'!$D$35,IF(J71=35,'[1]Equivalencia BH-BMPT'!$D$36,IF(J71=36,'[1]Equivalencia BH-BMPT'!$D$37,IF(J71=37,'[1]Equivalencia BH-BMPT'!$D$38,IF(J71=38,'[1]Equivalencia BH-BMPT'!#REF!,IF(J71=39,'[1]Equivalencia BH-BMPT'!$D$40,IF(J71=40,'[1]Equivalencia BH-BMPT'!$D$41,IF(J71=41,'[1]Equivalencia BH-BMPT'!$D$42,IF(J71=42,'[1]Equivalencia BH-BMPT'!$D$43,IF(J71=43,'[1]Equivalencia BH-BMPT'!$D$44,IF(J71=44,'[1]Equivalencia BH-BMPT'!$D$45,IF(J71=45,'[1]Equivalencia BH-BMPT'!$D$46,\"No ha seleccionado un número de programa\")))))))))))))))))))))))))))))))))))))))))))))","v":"No ha seleccionado un número de programa"},null,900183528,"ARIOS COLOMBIA SAS",93500000,null,null,null,0,93500000,51615653,"2017-05-02","2017-05-02","2018-03-03",300,0,null,null,"X",null,null,0.55203906951871662]
[53,2017,"FDLT-SASI-003-2017",9,{"$f":"IF(D72=1,'[1]Tipo '!$B$2,IF(D72=2,'[1]Tipo '!$B$3,IF(D72=3,'[1]Tipo '!$B$4,IF(D72=4,'[1]Tipo '!$B$5,IF(D72=5,'[1]Tipo '!$B$6,IF(D72=6,'[1]Tipo '!$B$7,IF(D72=7,'[1]Tipo '!$B$8,IF(D72=8,'[1]Tipo '!$B$9,IF(D72=9,'[1]Tipo '!$B$10,IF(D72=10,'[1]Tipo '!$B$11,IF(D72=11,'[1]Tipo '!$B$12,IF(D72=12,'[1]Tipo '!$B$13,IF(D72=13,'[1]Tipo '!$B$14,IF(D72=14,'[1]Tipo '!$B$15,IF(D72=15,'[1]Tipo '!$B$16,IF(D72=16,'[1]Tipo '!$B$17,IF(D72=17,'[1]Tipo '!$B$18,IF(D72=18,'[1]Tipo '!$B$19,IF(D72=19,'[1]Tipo '!$B$20,\"No ha seleccionado un tipo de contrato válido\")))))))))))))))))))","v":"ARRENDAMIENTO DE BIENES INMUEBLES"},"CONTRATACIÓN DIRECTA","El arrendamiento o adquisición de inmuebles","OBJETO: El contrato que se pretende celebrar, tendrá por objeto: ¿Entregar a EL FONDO DE DESARROLLO LOCAL DE TEUSAQUILLO a título de arrendamiento, el uso y goce de un inmueble identificado con la nomenclatura Calle 37 No.19-36, para el funcionamiento del depósito y oficina del almacén de la Alcaldía Local, además de contar con los espacios adecuados para la realización de las actividades propias de los diferentes espacios de participación ciudadana¿. ","FUNCIONAMIENTO",null,{"$f":"IF(J72=1,'[1]Equivalencia BH-BMPT'!$D$2,IF(J72=2,'[1]Equivalencia BH-BMPT'!$D$3,IF(J72=3,'[1]Equivalencia BH-BMPT'!$D$4,IF(J72=4,'[1]Equivalencia BH-BMPT'!$D$5,IF(J72=5,'[1]Equivalencia BH-BMPT'!$D$6,IF(J72=6,'[1]Equivalencia BH-BMPT'!$D$7,IF(J72=7,'[1]Equivalencia BH-BMPT'!$D$8,IF(J72=8,'[1]Equivalencia BH-BMPT'!$D$9,IF(J72=9,'[1]Equivalencia BH-BMPT'!$D$10,IF(J72=10,'[1]Equivalencia BH-BMPT'!$D$11,IF(J72=11,'[1]Equivalencia BH-BMPT'!$D$12,IF(J72=12,'[1]Equivalencia BH-BMPT'!$D$13,IF(J72=13,'[1]Equivalencia BH-BMPT'!$D$14,IF(J72=14,'[1]Equivalencia BH-BMPT'!$D$15,IF(J72=15,'[1]Equivalencia BH-BMPT'!$D$16,IF(J72=16,'[1]Equivalencia BH-BMPT'!$D$17,IF(J72=17,'[1]Equivalencia BH-BMPT'!$D$18,IF(J72=18,'[1]Equivalencia BH-BMPT'!$D$19,IF(J72=19,'[1]Equivalencia BH-BMPT'!$D$20,IF(J72=20,'[1]Equivalencia BH-BMPT'!$D$21,IF(J72=21,'[1]Equivalencia BH-BMPT'!$D$22,IF(J72=22,'[1]Equivalencia BH-BMPT'!$D$23,IF(J72=23,'[1]Equivalencia BH-BMPT'!#REF!,IF(J72=24,'[1]Equivalencia BH-BMPT'!$D$25,IF(J72=25,'[1]Equivalencia BH-BMPT'!$D$26,IF(J72=26,'[1]Equivalencia BH-BMPT'!$D$27,IF(J72=27,'[1]Equivalencia BH-BMPT'!$D$28,IF(J72=28,'[1]Equivalencia BH-BMPT'!$D$29,IF(J72=29,'[1]Equivalencia BH-BMPT'!$D$30,IF(J72=30,'[1]Equivalencia BH-BMPT'!$D$31,IF(J72=31,'[1]Equivalencia BH-BMPT'!$D$32,IF(J72=32,'[1]Equivalencia BH-BMPT'!$D$33,IF(J72=33,'[1]Equivalencia BH-BMPT'!$D$34,IF(J72=34,'[1]Equivalencia BH-BMPT'!$D$35,IF(J72=35,'[1]Equivalencia BH-BMPT'!$D$36,IF(J72=36,'[1]Equivalencia BH-BMPT'!$D$37,IF(J72=37,'[1]Equivalencia BH-BMPT'!$D$38,IF(J72=38,'[1]Equivalencia BH-BMPT'!#REF!,IF(J72=39,'[1]Equivalencia BH-BMPT'!$D$40,IF(J72=40,'[1]Equivalencia BH-BMPT'!$D$41,IF(J72=41,'[1]Equivalencia BH-BMPT'!$D$42,IF(J72=42,'[1]Equivalencia BH-BMPT'!$D$43,IF(J72=43,'[1]Equivalencia BH-BMPT'!$D$44,IF(J72=44,'[1]Equivalencia BH-BMPT'!$D$45,IF(J72=45,'[1]Equivalencia BH-BMPT'!$D$46,\"No ha seleccionado un número de programa\")))))))))))))))))))))))))))))))))))))))))))))","v":"No ha seleccionado un número de programa"},null,41565172,"CECILIA  CABEZA SANTACRUZ",61180000,null,null,null,4370000,65550000,61180000,"2017-06-02","2017-06-04","2018-01-18",210,15,null,null,"X",null,null,0.93333333333333335]
[54,2017,"CPS 054 2017 ",5,{"$f":"IF(D73=1,'[1]Tipo '!$B$2,IF(D73=2,'[1]Tipo '!$B$3,IF(D73=3,'[1]Tipo '!$B$4,IF(D73=4,'[1]Tipo '!$B$5,IF(D73=5,'[1]Tipo '!$B$6,IF(D73=6,'[1]Tipo '!$B$7,IF(D73=7,'[1]Tipo '!$B$8,IF(D73=8,'[1]Tipo '!$B$9,IF(D73=9,'[1]Tipo '!$B$10,IF(D73=10,'[1]Tipo '!$B$11,IF(D73=11,'[1]Tipo '!$B$12,IF(D73=12,'[1]Tipo '!$B$13,IF(D73=13,'[1]Tipo '!$B$14,IF(D73=14,'[1]Tipo '!$B$15,IF(D73=15,'[1]Tipo '!$B$16,IF(D73=16,'[1]Tipo '!$B$17,IF(D73=17,'[1]Tipo '!$B$18,IF(D73=18,'[1]Tipo '!$B$19,IF(D73=19,'[1]Tipo '!$B$20,\"No ha seleccionado un tipo de contrato válido\")))))))))))))))))))","v":"CONTRATOS DE PRESTACIÓN DE SERVICIOS PROFESIONALES Y DE APOYO A LA GESTIÓN"},"CONTRATACIÓN DIRECTA","Prestación de servicios profesionales y de apoyo a la gestión, o para la ejecución de trabajos artísticos que sólo puedan encomendarse a determinadas personas naturales;","¿El contratista se obliga para con el Fondo de Desarrollo Local de Teusaquillo a prestar sus servicios profesionales para realizar todas las actividades inherentes a la formulación y el seguimiento de todos los proyectos y contratos de parques recreo deportivos dentro del proyecto 1348 Teusaquillo con Mejores Parques Recreativos y Deportivos¿.","INVERSIÓN",17,{"$f":"IF(J73=1,'[1]Equivalencia BH-BMPT'!$D$2,IF(J73=2,'[1]Equivalencia BH-BMPT'!$D$3,IF(J73=3,'[1]Equivalencia BH-BMPT'!$D$4,IF(J73=4,'[1]Equivalencia BH-BMPT'!$D$5,IF(J73=5,'[1]Equivalencia BH-BMPT'!$D$6,IF(J73=6,'[1]Equivalencia BH-BMPT'!$D$7,IF(J73=7,'[1]Equivalencia BH-BMPT'!$D$8,IF(J73=8,'[1]Equivalencia BH-BMPT'!$D$9,IF(J73=9,'[1]Equivalencia BH-BMPT'!$D$10,IF(J73=10,'[1]Equivalencia BH-BMPT'!$D$11,IF(J73=11,'[1]Equivalencia BH-BMPT'!$D$12,IF(J73=12,'[1]Equivalencia BH-BMPT'!$D$13,IF(J73=13,'[1]Equivalencia BH-BMPT'!$D$14,IF(J73=14,'[1]Equivalencia BH-BMPT'!$D$15,IF(J73=15,'[1]Equivalencia BH-BMPT'!$D$16,IF(J73=16,'[1]Equivalencia BH-BMPT'!$D$17,IF(J73=17,'[1]Equivalencia BH-BMPT'!$D$18,IF(J73=18,'[1]Equivalencia BH-BMPT'!$D$19,IF(J73=19,'[1]Equivalencia BH-BMPT'!$D$20,IF(J73=20,'[1]Equivalencia BH-BMPT'!$D$21,IF(J73=21,'[1]Equivalencia BH-BMPT'!$D$22,IF(J73=22,'[1]Equivalencia BH-BMPT'!$D$23,IF(J73=23,'[1]Equivalencia BH-BMPT'!#REF!,IF(J73=24,'[1]Equivalencia BH-BMPT'!$D$25,IF(J73=25,'[1]Equivalencia BH-BMPT'!$D$26,IF(J73=26,'[1]Equivalencia BH-BMPT'!$D$27,IF(J73=27,'[1]Equivalencia BH-BMPT'!$D$28,IF(J73=28,'[1]Equivalencia BH-BMPT'!$D$29,IF(J73=29,'[1]Equivalencia BH-BMPT'!$D$30,IF(J73=30,'[1]Equivalencia BH-BMPT'!$D$31,IF(J73=31,'[1]Equivalencia BH-BMPT'!$D$32,IF(J73=32,'[1]Equivalencia BH-BMPT'!$D$33,IF(J73=33,'[1]Equivalencia BH-BMPT'!$D$34,IF(J73=34,'[1]Equivalencia BH-BMPT'!$D$35,IF(J73=35,'[1]Equivalencia BH-BMPT'!$D$36,IF(J73=36,'[1]Equivalencia BH-BMPT'!$D$37,IF(J73=37,'[1]Equivalencia BH-BMPT'!$D$38,IF(J73=38,'[1]Equivalencia BH-BMPT'!#REF!,IF(J73=39,'[1]Equivalencia BH-BMPT'!$D$40,IF(J73=40,'[1]Equivalencia BH-BMPT'!$D$41,IF(J73=41,'[1]Equivalencia BH-BMPT'!$D$42,IF(J73=42,'[1]Equivalencia BH-BMPT'!$D$43,IF(J73=43,'[1]Equivalencia BH-BMPT'!$D$44,IF(J73=44,'[1]Equivalencia BH-BMPT'!$D$45,IF(J73=45,'[1]Equivalencia BH-BMPT'!$D$46,\"No ha seleccionado un número de programa\")))))))))))))))))))))))))))))))))))))))))))))","v":"Espacio público, derecho de todos"},1348,52530406,"CATHERINNE  HURTADO SANCHEZ",31500000,null,null,null,0,31500000,16950000,"2017-06-01","2017-06-01","2018-03-21",210,0,null,null,"X",null,null,0.53809523809523807]
[55,2017,null,9,{"$f":"IF(D74=1,'[1]Tipo '!$B$2,IF(D74=2,'[1]Tipo '!$B$3,IF(D74=3,'[1]Tipo '!$B$4,IF(D74=4,'[1]Tipo '!$B$5,IF(D74=5,'[1]Tipo '!$B$6,IF(D74=6,'[1]Tipo '!$B$7,IF(D74=7,'[1]Tipo '!$B$8,IF(D74=8,'[1]Tipo '!$B$9,IF(D74=9,'[1]Tipo '!$B$10,IF(D74=10,'[1]Tipo '!$B$11,IF(D74=11,'[1]Tipo '!$B$12,IF(D74=12,'[1]Tipo '!$B$13,IF(D74=13,'[1]Tipo '!$B$14,IF(D74=14,'[1]Tipo '!$B$15,IF(D74=15,'[1]Tipo '!$B$16,IF(D74=16,'[1]Tipo '!$B$17,IF(D74=17,'[1]Tipo '!$B$18,IF(D74=18,'[1]Tipo '!$B$19,IF(D74=19,'[1]Tipo '!$B$20,\"No ha seleccionado un tipo de contrato válido\")))))))))))))))))))","v":"ARRENDAMIENTO DE BIENES INMUEBLES"},"CONTRATACIÓN DIRECTA","El arrendamiento o adquisición de inmuebles","ADICIÓN Y PRORROGA NO 1 CAR-055-2016. PRORROGAR EL PLAZO DE LA EJECUCION DEL CONTRATO DE ARRENDAMIENTO CAR-055-2016 POR EL TERMINO DE SEIS MESES APARTIR DEL ...","FUNCIONAMIENTO",null,{"$f":"IF(J74=1,'[1]Equivalencia BH-BMPT'!$D$2,IF(J74=2,'[1]Equivalencia BH-BMPT'!$D$3,IF(J74=3,'[1]Equivalencia BH-BMPT'!$D$4,IF(J74=4,'[1]Equivalencia BH-BMPT'!$D$5,IF(J74=5,'[1]Equivalencia BH-BMPT'!$D$6,IF(J74=6,'[1]Equivalencia BH-BMPT'!$D$7,IF(J74=7,'[1]Equivalencia BH-BMPT'!$D$8,IF(J74=8,'[1]Equivalencia BH-BMPT'!$D$9,IF(J74=9,'[1]Equivalencia BH-BMPT'!$D$10,IF(J74=10,'[1]Equivalencia BH-BMPT'!$D$11,IF(J74=11,'[1]Equivalencia BH-BMPT'!$D$12,IF(J74=12,'[1]Equivalencia BH-BMPT'!$D$13,IF(J74=13,'[1]Equivalencia BH-BMPT'!$D$14,IF(J74=14,'[1]Equivalencia BH-BMPT'!$D$15,IF(J74=15,'[1]Equivalencia BH-BMPT'!$D$16,IF(J74=16,'[1]Equivalencia BH-BMPT'!$D$17,IF(J74=17,'[1]Equivalencia BH-BMPT'!$D$18,IF(J74=18,'[1]Equivalencia BH-BMPT'!$D$19,IF(J74=19,'[1]Equivalencia BH-BMPT'!$D$20,IF(J74=20,'[1]Equivalencia BH-BMPT'!$D$21,IF(J74=21,'[1]Equivalencia BH-BMPT'!$D$22,IF(J74=22,'[1]Equivalencia BH-BMPT'!$D$23,IF(J74=23,'[1]Equivalencia BH-BMPT'!#REF!,IF(J74=24,'[1]Equivalencia BH-BMPT'!$D$25,IF(J74=25,'[1]Equivalencia BH-BMPT'!$D$26,IF(J74=26,'[1]Equivalencia BH-BMPT'!$D$27,IF(J74=27,'[1]Equivalencia BH-BMPT'!$D$28,IF(J74=28,'[1]Equivalencia BH-BMPT'!$D$29,IF(J74=29,'[1]Equivalencia BH-BMPT'!$D$30,IF(J74=30,'[1]Equivalencia BH-BMPT'!$D$31,IF(J74=31,'[1]Equivalencia BH-BMPT'!$D$32,IF(J74=32,'[1]Equivalencia BH-BMPT'!$D$33,IF(J74=33,'[1]Equivalencia BH-BMPT'!$D$34,IF(J74=34,'[1]Equivalencia BH-BMPT'!$D$35,IF(J74=35,'[1]Equivalencia BH-BMPT'!$D$36,IF(J74=36,'[1]Equivalencia BH-BMPT'!$D$37,IF(J74=37,'[1]Equivalencia BH-BMPT'!$D$38,IF(J74=38,'[1]Equivalencia BH-BMPT'!#REF!,IF(J74=39,'[1]Equivalencia BH-BMPT'!$D$40,IF(J74=40,'[1]Equivalencia BH-BMPT'!$D$41,IF(J74=41,'[1]Equivalencia BH-BMPT'!$D$42,IF(J74=42,'[1]Equivalencia BH-BMPT'!$D$43,IF(J74=43,'[1]Equivalencia BH-BMPT'!$D$44,IF(J74=44,'[1]Equivalencia BH-BMPT'!$D$45,IF(J74=45,'[1]Equivalencia BH-BMPT'!$D$46,\"No ha seleccionado un número de programa\")))))))))))))))))))))))))))))))))))))))))))))","v":"No ha seleccionado un número de programa"},null,900521065,"HOLDINGRIP SAS",null,null,null,null,87360000,87360000,72800000,"2016-06-26","2016-06-27","2018-01-26",360,180,null,null,"X",null,null,0.83333333333333337]
[55,2017,"CPS 055 2017 ",5,{"$f":"IF(D75=1,'[1]Tipo '!$B$2,IF(D75=2,'[1]Tipo '!$B$3,IF(D75=3,'[1]Tipo '!$B$4,IF(D75=4,'[1]Tipo '!$B$5,IF(D75=5,'[1]Tipo '!$B$6,IF(D75=6,'[1]Tipo '!$B$7,IF(D75=7,'[1]Tipo '!$B$8,IF(D75=8,'[1]Tipo '!$B$9,IF(D75=9,'[1]Tipo '!$B$10,IF(D75=10,'[1]Tipo '!$B$11,IF(D75=11,'[1]Tipo '!$B$12,IF(D75=12,'[1]Tipo '!$B$13,IF(D75=13,'[1]Tipo '!$B$14,IF(D75=14,'[1]Tipo '!$B$15,IF(D75=15,'[1]Tipo '!$B$16,IF(D75=16,'[1]Tipo '!$B$17,IF(D75=17,'[1]Tipo '!$B$18,IF(D75=18,'[1]Tipo '!$B$19,IF(D75=19,'[1]Tipo '!$B$20,\"No ha seleccionado un tipo de contrato válido\")))))))))))))))))))","v":"CONTRATOS DE PRESTACIÓN DE SERVICIOS PROFESIONALES Y DE APOYO A LA GESTIÓN"},"CONTRATACIÓN DIRECTA","Prestación de servicios profesionales y de apoyo a la gestión, o para la ejecución de trabajos artísticos que sólo puedan encomendarse a determinadas personas naturales;","OBJETO: El contrato que se pretende celebrar, tendrá por objeto: ¿Prestación de servicios profesionales al Área de Gestión de Desarrollo Local para adelantar trámites precontractuales y contractuales en el marco de los proyectos previstos en el Plan de Desarrollo Local ¿Teusaquillo Mejor para Todos 2017-2020¿. .","INVERSIÓN",45,{"$f":"IF(J75=1,'[1]Equivalencia BH-BMPT'!$D$2,IF(J75=2,'[1]Equivalencia BH-BMPT'!$D$3,IF(J75=3,'[1]Equivalencia BH-BMPT'!$D$4,IF(J75=4,'[1]Equivalencia BH-BMPT'!$D$5,IF(J75=5,'[1]Equivalencia BH-BMPT'!$D$6,IF(J75=6,'[1]Equivalencia BH-BMPT'!$D$7,IF(J75=7,'[1]Equivalencia BH-BMPT'!$D$8,IF(J75=8,'[1]Equivalencia BH-BMPT'!$D$9,IF(J75=9,'[1]Equivalencia BH-BMPT'!$D$10,IF(J75=10,'[1]Equivalencia BH-BMPT'!$D$11,IF(J75=11,'[1]Equivalencia BH-BMPT'!$D$12,IF(J75=12,'[1]Equivalencia BH-BMPT'!$D$13,IF(J75=13,'[1]Equivalencia BH-BMPT'!$D$14,IF(J75=14,'[1]Equivalencia BH-BMPT'!$D$15,IF(J75=15,'[1]Equivalencia BH-BMPT'!$D$16,IF(J75=16,'[1]Equivalencia BH-BMPT'!$D$17,IF(J75=17,'[1]Equivalencia BH-BMPT'!$D$18,IF(J75=18,'[1]Equivalencia BH-BMPT'!$D$19,IF(J75=19,'[1]Equivalencia BH-BMPT'!$D$20,IF(J75=20,'[1]Equivalencia BH-BMPT'!$D$21,IF(J75=21,'[1]Equivalencia BH-BMPT'!$D$22,IF(J75=22,'[1]Equivalencia BH-BMPT'!$D$23,IF(J75=23,'[1]Equivalencia BH-BMPT'!#REF!,IF(J75=24,'[1]Equivalencia BH-BMPT'!$D$25,IF(J75=25,'[1]Equivalencia BH-BMPT'!$D$26,IF(J75=26,'[1]Equivalencia BH-BMPT'!$D$27,IF(J75=27,'[1]Equivalencia BH-BMPT'!$D$28,IF(J75=28,'[1]Equivalencia BH-BMPT'!$D$29,IF(J75=29,'[1]Equivalencia BH-BMPT'!$D$30,IF(J75=30,'[1]Equivalencia BH-BMPT'!$D$31,IF(J75=31,'[1]Equivalencia BH-BMPT'!$D$32,IF(J75=32,'[1]Equivalencia BH-BMPT'!$D$33,IF(J75=33,'[1]Equivalencia BH-BMPT'!$D$34,IF(J75=34,'[1]Equivalencia BH-BMPT'!$D$35,IF(J75=35,'[1]Equivalencia BH-BMPT'!$D$36,IF(J75=36,'[1]Equivalencia BH-BMPT'!$D$37,IF(J75=37,'[1]Equivalencia BH-BMPT'!$D$38,IF(J75=38,'[1]Equivalencia BH-BMPT'!#REF!,IF(J75=39,'[1]Equivalencia BH-BMPT'!$D$40,IF(J75=40,'[1]Equivalencia BH-BMPT'!$D$41,IF(J75=41,'[1]Equivalencia BH-BMPT'!$D$42,IF(J75=42,'[1]Equivalencia BH-BMPT'!$D$43,IF(J75=43,'[1]Equivalencia BH-BMPT'!$D$44,IF(J75=44,'[1]Equivalencia BH-BMPT'!$D$45,IF(J75=45,'[1]Equivalencia BH-BMPT'!$D$46,\"No ha seleccionado un número de programa\")))))))))))))))))))))))))))))))))))))))))))))","v":"Gobernanza e influencia local, regional e internacional"},1329,79472050,"MARIO  HERRERA CUENCA",42496667,null,null,null,0,42496667,38226667,"2017-06-07","2017-06-07","2018-01-04",{"$f":"29+180","v":209},0,null,null,"X",null,null,0.89952153188860673]
[56,2017,"CPS 056 2017 ",5,{"$f":"IF(D76=1,'[1]Tipo '!$B$2,IF(D76=2,'[1]Tipo '!$B$3,IF(D76=3,'[1]Tipo '!$B$4,IF(D76=4,'[1]Tipo '!$B$5,IF(D76=5,'[1]Tipo '!$B$6,IF(D76=6,'[1]Tipo '!$B$7,IF(D76=7,'[1]Tipo '!$B$8,IF(D76=8,'[1]Tipo '!$B$9,IF(D76=9,'[1]Tipo '!$B$10,IF(D76=10,'[1]Tipo '!$B$11,IF(D76=11,'[1]Tipo '!$B$12,IF(D76=12,'[1]Tipo '!$B$13,IF(D76=13,'[1]Tipo '!$B$14,IF(D76=14,'[1]Tipo '!$B$15,IF(D76=15,'[1]Tipo '!$B$16,IF(D76=16,'[1]Tipo '!$B$17,IF(D76=17,'[1]Tipo '!$B$18,IF(D76=18,'[1]Tipo '!$B$19,IF(D76=19,'[1]Tipo '!$B$20,\"No ha seleccionado un tipo de contrato válido\")))))))))))))))))))","v":"CONTRATOS DE PRESTACIÓN DE SERVICIOS PROFESIONALES Y DE APOYO A LA GESTIÓN"},"CONTRATACIÓN DIRECTA","Prestación de servicios profesionales y de apoyo a la gestión, o para la ejecución de trabajos artísticos que sólo puedan encomendarse a determinadas personas naturales;","OBJETO: El contrato que se pretende celebrar, tendrá por objeto: ¿El contratista se obliga para con el fondo a prestar sus servicios profesionales en la Alcaldía Local de Teusaquillo para impulsar y coordinar la implementación del sistema de calidad¿.","INVERSIÓN",45,{"$f":"IF(J76=1,'[1]Equivalencia BH-BMPT'!$D$2,IF(J76=2,'[1]Equivalencia BH-BMPT'!$D$3,IF(J76=3,'[1]Equivalencia BH-BMPT'!$D$4,IF(J76=4,'[1]Equivalencia BH-BMPT'!$D$5,IF(J76=5,'[1]Equivalencia BH-BMPT'!$D$6,IF(J76=6,'[1]Equivalencia BH-BMPT'!$D$7,IF(J76=7,'[1]Equivalencia BH-BMPT'!$D$8,IF(J76=8,'[1]Equivalencia BH-BMPT'!$D$9,IF(J76=9,'[1]Equivalencia BH-BMPT'!$D$10,IF(J76=10,'[1]Equivalencia BH-BMPT'!$D$11,IF(J76=11,'[1]Equivalencia BH-BMPT'!$D$12,IF(J76=12,'[1]Equivalencia BH-BMPT'!$D$13,IF(J76=13,'[1]Equivalencia BH-BMPT'!$D$14,IF(J76=14,'[1]Equivalencia BH-BMPT'!$D$15,IF(J76=15,'[1]Equivalencia BH-BMPT'!$D$16,IF(J76=16,'[1]Equivalencia BH-BMPT'!$D$17,IF(J76=17,'[1]Equivalencia BH-BMPT'!$D$18,IF(J76=18,'[1]Equivalencia BH-BMPT'!$D$19,IF(J76=19,'[1]Equivalencia BH-BMPT'!$D$20,IF(J76=20,'[1]Equivalencia BH-BMPT'!$D$21,IF(J76=21,'[1]Equivalencia BH-BMPT'!$D$22,IF(J76=22,'[1]Equivalencia BH-BMPT'!$D$23,IF(J76=23,'[1]Equivalencia BH-BMPT'!#REF!,IF(J76=24,'[1]Equivalencia BH-BMPT'!$D$25,IF(J76=25,'[1]Equivalencia BH-BMPT'!$D$26,IF(J76=26,'[1]Equivalencia BH-BMPT'!$D$27,IF(J76=27,'[1]Equivalencia BH-BMPT'!$D$28,IF(J76=28,'[1]Equivalencia BH-BMPT'!$D$29,IF(J76=29,'[1]Equivalencia BH-BMPT'!$D$30,IF(J76=30,'[1]Equivalencia BH-BMPT'!$D$31,IF(J76=31,'[1]Equivalencia BH-BMPT'!$D$32,IF(J76=32,'[1]Equivalencia BH-BMPT'!$D$33,IF(J76=33,'[1]Equivalencia BH-BMPT'!$D$34,IF(J76=34,'[1]Equivalencia BH-BMPT'!$D$35,IF(J76=35,'[1]Equivalencia BH-BMPT'!$D$36,IF(J76=36,'[1]Equivalencia BH-BMPT'!$D$37,IF(J76=37,'[1]Equivalencia BH-BMPT'!$D$38,IF(J76=38,'[1]Equivalencia BH-BMPT'!#REF!,IF(J76=39,'[1]Equivalencia BH-BMPT'!$D$40,IF(J76=40,'[1]Equivalencia BH-BMPT'!$D$41,IF(J76=41,'[1]Equivalencia BH-BMPT'!$D$42,IF(J76=42,'[1]Equivalencia BH-BMPT'!$D$43,IF(J76=43,'[1]Equivalencia BH-BMPT'!$D$44,IF(J76=44,'[1]Equivalencia BH-BMPT'!$D$45,IF(J76=45,'[1]Equivalencia BH-BMPT'!$D$46,\"No ha seleccionado un número de programa\")))))))))))))))))))))))))))))))))))))))))))))","v":"Gobernanza e influencia local, regional e internacional"},1329,1020770122,"VANESSA  CASTILLO GIRALDO",29956667,null,null,null,1003333,30960000,27090000,"2017-06-02","2017-06-06","2018-01-10",{"$f":"29+180","v":209},7,null,null,"X",null,null,0.90430621003331246]
[57,2017,"CPS 057  2017 ",4,{"$f":"IF(D77=1,'[1]Tipo '!$B$2,IF(D77=2,'[1]Tipo '!$B$3,IF(D77=3,'[1]Tipo '!$B$4,IF(D77=4,'[1]Tipo '!$B$5,IF(D77=5,'[1]Tipo '!$B$6,IF(D77=6,'[1]Tipo '!$B$7,IF(D77=7,'[1]Tipo '!$B$8,IF(D77=8,'[1]Tipo '!$B$9,IF(D77=9,'[1]Tipo '!$B$10,IF(D77=10,'[1]Tipo '!$B$11,IF(D77=11,'[1]Tipo '!$B$12,IF(D77=12,'[1]Tipo '!$B$13,IF(D77=13,'[1]Tipo '!$B$14,IF(D77=14,'[1]Tipo '!$B$15,IF(D77=15,'[1]Tipo '!$B$16,IF(D77=16,'[1]Tipo '!$B$17,IF(D77=17,'[1]Tipo '!$B$18,IF(D77=18,'[1]Tipo '!$B$19,IF(D77=19,'[1]Tipo '!$B$20,\"No ha seleccionado un tipo de contrato válido\")))))))))))))))))))","v":"CONTRATOS DE PRESTACIÓN DE SERVICIOS"},"Contratación mínima cuantia ","No aplica","El contrato que se pretende celebrar, tendrá por objeto¿Contratar a monto agotable el mantenimiento preventivo y correctivo incluyendo mano de obra y/o suministro de repuestos originales y llantas, para los vehículos de propiedad del Fondo de Desarrollo Local de Teusaquillo y los vehículos que adquiera el FDLT de acuerdo a los presentes estudios previos¿.","FUNCIONAMIENTO",null,{"$f":"IF(J77=1,'[1]Equivalencia BH-BMPT'!$D$2,IF(J77=2,'[1]Equivalencia BH-BMPT'!$D$3,IF(J77=3,'[1]Equivalencia BH-BMPT'!$D$4,IF(J77=4,'[1]Equivalencia BH-BMPT'!$D$5,IF(J77=5,'[1]Equivalencia BH-BMPT'!$D$6,IF(J77=6,'[1]Equivalencia BH-BMPT'!$D$7,IF(J77=7,'[1]Equivalencia BH-BMPT'!$D$8,IF(J77=8,'[1]Equivalencia BH-BMPT'!$D$9,IF(J77=9,'[1]Equivalencia BH-BMPT'!$D$10,IF(J77=10,'[1]Equivalencia BH-BMPT'!$D$11,IF(J77=11,'[1]Equivalencia BH-BMPT'!$D$12,IF(J77=12,'[1]Equivalencia BH-BMPT'!$D$13,IF(J77=13,'[1]Equivalencia BH-BMPT'!$D$14,IF(J77=14,'[1]Equivalencia BH-BMPT'!$D$15,IF(J77=15,'[1]Equivalencia BH-BMPT'!$D$16,IF(J77=16,'[1]Equivalencia BH-BMPT'!$D$17,IF(J77=17,'[1]Equivalencia BH-BMPT'!$D$18,IF(J77=18,'[1]Equivalencia BH-BMPT'!$D$19,IF(J77=19,'[1]Equivalencia BH-BMPT'!$D$20,IF(J77=20,'[1]Equivalencia BH-BMPT'!$D$21,IF(J77=21,'[1]Equivalencia BH-BMPT'!$D$22,IF(J77=22,'[1]Equivalencia BH-BMPT'!$D$23,IF(J77=23,'[1]Equivalencia BH-BMPT'!#REF!,IF(J77=24,'[1]Equivalencia BH-BMPT'!$D$25,IF(J77=25,'[1]Equivalencia BH-BMPT'!$D$26,IF(J77=26,'[1]Equivalencia BH-BMPT'!$D$27,IF(J77=27,'[1]Equivalencia BH-BMPT'!$D$28,IF(J77=28,'[1]Equivalencia BH-BMPT'!$D$29,IF(J77=29,'[1]Equivalencia BH-BMPT'!$D$30,IF(J77=30,'[1]Equivalencia BH-BMPT'!$D$31,IF(J77=31,'[1]Equivalencia BH-BMPT'!$D$32,IF(J77=32,'[1]Equivalencia BH-BMPT'!$D$33,IF(J77=33,'[1]Equivalencia BH-BMPT'!$D$34,IF(J77=34,'[1]Equivalencia BH-BMPT'!$D$35,IF(J77=35,'[1]Equivalencia BH-BMPT'!$D$36,IF(J77=36,'[1]Equivalencia BH-BMPT'!$D$37,IF(J77=37,'[1]Equivalencia BH-BMPT'!$D$38,IF(J77=38,'[1]Equivalencia BH-BMPT'!#REF!,IF(J77=39,'[1]Equivalencia BH-BMPT'!$D$40,IF(J77=40,'[1]Equivalencia BH-BMPT'!$D$41,IF(J77=41,'[1]Equivalencia BH-BMPT'!$D$42,IF(J77=42,'[1]Equivalencia BH-BMPT'!$D$43,IF(J77=43,'[1]Equivalencia BH-BMPT'!$D$44,IF(J77=44,'[1]Equivalencia BH-BMPT'!$D$45,IF(J77=45,'[1]Equivalencia BH-BMPT'!$D$46,\"No ha seleccionado un número de programa\")))))))))))))))))))))))))))))))))))))))))))))","v":"No ha seleccionado un número de programa"},null,900542932,"COMPAÑIA DE SERVICIOS AUTOMOTRICES SAS",3000000,null,null,null,0,{"$f":"+O77+S77","v":3000000},0,"2017-06-16","2017-06-30","2018-01-29",210,0,null,null,"X",null,null,0]
[57,2017,"CPS 057  2018",4,{"$f":"IF(D78=1,'[1]Tipo '!$B$2,IF(D78=2,'[1]Tipo '!$B$3,IF(D78=3,'[1]Tipo '!$B$4,IF(D78=4,'[1]Tipo '!$B$5,IF(D78=5,'[1]Tipo '!$B$6,IF(D78=6,'[1]Tipo '!$B$7,IF(D78=7,'[1]Tipo '!$B$8,IF(D78=8,'[1]Tipo '!$B$9,IF(D78=9,'[1]Tipo '!$B$10,IF(D78=10,'[1]Tipo '!$B$11,IF(D78=11,'[1]Tipo '!$B$12,IF(D78=12,'[1]Tipo '!$B$13,IF(D78=13,'[1]Tipo '!$B$14,IF(D78=14,'[1]Tipo '!$B$15,IF(D78=15,'[1]Tipo '!$B$16,IF(D78=16,'[1]Tipo '!$B$17,IF(D78=17,'[1]Tipo '!$B$18,IF(D78=18,'[1]Tipo '!$B$19,IF(D78=19,'[1]Tipo '!$B$20,\"No ha seleccionado un tipo de contrato válido\")))))))))))))))))))","v":"CONTRATOS DE PRESTACIÓN DE SERVICIOS"},"Contratación mínima cuantia ","No aplica","El contrato que se pretende celebrar, tendrá por objeto¿Contratar a monto agotable el mantenimiento preventivo y correctivo incluyendo mano de obra y/o suministro de repuestos originales y llantas, para los vehículos de propiedad del Fondo de Desarrollo Local de Teusaquillo y los vehículos que adquiera el FDLT de acuerdo a los presentes estudios previos¿","FUNCIONAMIENTO",null,{"$f":"IF(J78=1,'[1]Equivalencia BH-BMPT'!$D$2,IF(J78=2,'[1]Equivalencia BH-BMPT'!$D$3,IF(J78=3,'[1]Equivalencia BH-BMPT'!$D$4,IF(J78=4,'[1]Equivalencia BH-BMPT'!$D$5,IF(J78=5,'[1]Equivalencia BH-BMPT'!$D$6,IF(J78=6,'[1]Equivalencia BH-BMPT'!$D$7,IF(J78=7,'[1]Equivalencia BH-BMPT'!$D$8,IF(J78=8,'[1]Equivalencia BH-BMPT'!$D$9,IF(J78=9,'[1]Equivalencia BH-BMPT'!$D$10,IF(J78=10,'[1]Equivalencia BH-BMPT'!$D$11,IF(J78=11,'[1]Equivalencia BH-BMPT'!$D$12,IF(J78=12,'[1]Equivalencia BH-BMPT'!$D$13,IF(J78=13,'[1]Equivalencia BH-BMPT'!$D$14,IF(J78=14,'[1]Equivalencia BH-BMPT'!$D$15,IF(J78=15,'[1]Equivalencia BH-BMPT'!$D$16,IF(J78=16,'[1]Equivalencia BH-BMPT'!$D$17,IF(J78=17,'[1]Equivalencia BH-BMPT'!$D$18,IF(J78=18,'[1]Equivalencia BH-BMPT'!$D$19,IF(J78=19,'[1]Equivalencia BH-BMPT'!$D$20,IF(J78=20,'[1]Equivalencia BH-BMPT'!$D$21,IF(J78=21,'[1]Equivalencia BH-BMPT'!$D$22,IF(J78=22,'[1]Equivalencia BH-BMPT'!$D$23,IF(J78=23,'[1]Equivalencia BH-BMPT'!#REF!,IF(J78=24,'[1]Equivalencia BH-BMPT'!$D$25,IF(J78=25,'[1]Equivalencia BH-BMPT'!$D$26,IF(J78=26,'[1]Equivalencia BH-BMPT'!$D$27,IF(J78=27,'[1]Equivalencia BH-BMPT'!$D$28,IF(J78=28,'[1]Equivalencia BH-BMPT'!$D$29,IF(J78=29,'[1]Equivalencia BH-BMPT'!$D$30,IF(J78=30,'[1]Equivalencia BH-BMPT'!$D$31,IF(J78=31,'[1]Equivalencia BH-BMPT'!$D$32,IF(J78=32,'[1]Equivalencia BH-BMPT'!$D$33,IF(J78=33,'[1]Equivalencia BH-BMPT'!$D$34,IF(J78=34,'[1]Equivalencia BH-BMPT'!$D$35,IF(J78=35,'[1]Equivalencia BH-BMPT'!$D$36,IF(J78=36,'[1]Equivalencia BH-BMPT'!$D$37,IF(J78=37,'[1]Equivalencia BH-BMPT'!$D$38,IF(J78=38,'[1]Equivalencia BH-BMPT'!#REF!,IF(J78=39,'[1]Equivalencia BH-BMPT'!$D$40,IF(J78=40,'[1]Equivalencia BH-BMPT'!$D$41,IF(J78=41,'[1]Equivalencia BH-BMPT'!$D$42,IF(J78=42,'[1]Equivalencia BH-BMPT'!$D$43,IF(J78=43,'[1]Equivalencia BH-BMPT'!$D$44,IF(J78=44,'[1]Equivalencia BH-BMPT'!$D$45,IF(J78=45,'[1]Equivalencia BH-BMPT'!$D$46,\"No ha seleccionado un número de programa\")))))))))))))))))))))))))))))))))))))))))))))","v":"No ha seleccionado un número de programa"},null,900542932,"COMPAÑIA DE SERVICIOS AUTOMOTRICES SAS",15000000,null,null,null,0,15000000,0,"2017-06-16","2017-06-30","2018-01-29",210,0,null,null,"X",null,null,0]
[58,2017,"CPS 058 2017 ",4,{"$f":"IF(D79=1,'[1]Tipo '!$B$2,IF(D79=2,'[1]Tipo '!$B$3,IF(D79=3,'[1]Tipo '!$B$4,IF(D79=4,'[1]Tipo '!$B$5,IF(D79=5,'[1]Tipo '!$B$6,IF(D79=6,'[1]Tipo '!$B$7,IF(D79=7,'[1]Tipo '!$B$8,IF(D79=8,'[1]Tipo '!$B$9,IF(D79=9,'[1]Tipo '!$B$10,IF(D79=10,'[1]Tipo '!$B$11,IF(D79=11,'[1]Tipo '!$B$12,IF(D79=12,'[1]Tipo '!$B$13,IF(D79=13,'[1]Tipo '!$B$14,IF(D79=14,'[1]Tipo '!$B$15,IF(D79=15,'[1]Tipo '!$B$16,IF(D79=16,'[1]Tipo '!$B$17,IF(D79=17,'[1]Tipo '!$B$18,IF(D79=18,'[1]Tipo '!$B$19,IF(D79=19,'[1]Tipo '!$B$20,\"No ha seleccionado un tipo de contrato válido\")))))))))))))))))))","v":"CONTRATOS DE PRESTACIÓN DE SERVICIOS"},"Selección abreviada ","Bolsas de productos","OBJETO: EL CONTRATO QUE SE PRETENDE CELEBRAR, TENDRÁ POR OBJETO ¿ADQUISICIÓN A TRAVÉS DE LA BOLSA MERCANTIL DE COLOMBIA S.A. EL SERVICIO DE VIGILANCIA Y SEGURIDAD PRIVADA CON MEDIOS TECNOLOGICOS EN LOS PREDIOS Y CON LAS CONDICIONES TECNICAS QUE DESIGNE EL FONDO DE DESARROLLO LOCAL DE TEUSAQUILLO¿. NOTA: LOS PAGOS SE REALIZARAN CON EL ENDOSO RESPECTIVO ACORDE A LOS SOPORTES Y LO CONTENIDO EN EL ACTA REALIZADA EN EL DESPACHO DE LA ALCLADIA LOCAL DE TEUSAQUILLO EL DIA 12-07-2017 - DOCTORA CORNELIA NISPERUZA FLOREX - ALCALDESA LOCAL (E) Y DEMAS ASISTENTES.","FUNCIONAMIENTO",null,{"$f":"IF(J79=1,'[1]Equivalencia BH-BMPT'!$D$2,IF(J79=2,'[1]Equivalencia BH-BMPT'!$D$3,IF(J79=3,'[1]Equivalencia BH-BMPT'!$D$4,IF(J79=4,'[1]Equivalencia BH-BMPT'!$D$5,IF(J79=5,'[1]Equivalencia BH-BMPT'!$D$6,IF(J79=6,'[1]Equivalencia BH-BMPT'!$D$7,IF(J79=7,'[1]Equivalencia BH-BMPT'!$D$8,IF(J79=8,'[1]Equivalencia BH-BMPT'!$D$9,IF(J79=9,'[1]Equivalencia BH-BMPT'!$D$10,IF(J79=10,'[1]Equivalencia BH-BMPT'!$D$11,IF(J79=11,'[1]Equivalencia BH-BMPT'!$D$12,IF(J79=12,'[1]Equivalencia BH-BMPT'!$D$13,IF(J79=13,'[1]Equivalencia BH-BMPT'!$D$14,IF(J79=14,'[1]Equivalencia BH-BMPT'!$D$15,IF(J79=15,'[1]Equivalencia BH-BMPT'!$D$16,IF(J79=16,'[1]Equivalencia BH-BMPT'!$D$17,IF(J79=17,'[1]Equivalencia BH-BMPT'!$D$18,IF(J79=18,'[1]Equivalencia BH-BMPT'!$D$19,IF(J79=19,'[1]Equivalencia BH-BMPT'!$D$20,IF(J79=20,'[1]Equivalencia BH-BMPT'!$D$21,IF(J79=21,'[1]Equivalencia BH-BMPT'!$D$22,IF(J79=22,'[1]Equivalencia BH-BMPT'!$D$23,IF(J79=23,'[1]Equivalencia BH-BMPT'!#REF!,IF(J79=24,'[1]Equivalencia BH-BMPT'!$D$25,IF(J79=25,'[1]Equivalencia BH-BMPT'!$D$26,IF(J79=26,'[1]Equivalencia BH-BMPT'!$D$27,IF(J79=27,'[1]Equivalencia BH-BMPT'!$D$28,IF(J79=28,'[1]Equivalencia BH-BMPT'!$D$29,IF(J79=29,'[1]Equivalencia BH-BMPT'!$D$30,IF(J79=30,'[1]Equivalencia BH-BMPT'!$D$31,IF(J79=31,'[1]Equivalencia BH-BMPT'!$D$32,IF(J79=32,'[1]Equivalencia BH-BMPT'!$D$33,IF(J79=33,'[1]Equivalencia BH-BMPT'!$D$34,IF(J79=34,'[1]Equivalencia BH-BMPT'!$D$35,IF(J79=35,'[1]Equivalencia BH-BMPT'!$D$36,IF(J79=36,'[1]Equivalencia BH-BMPT'!$D$37,IF(J79=37,'[1]Equivalencia BH-BMPT'!$D$38,IF(J79=38,'[1]Equivalencia BH-BMPT'!#REF!,IF(J79=39,'[1]Equivalencia BH-BMPT'!$D$40,IF(J79=40,'[1]Equivalencia BH-BMPT'!$D$41,IF(J79=41,'[1]Equivalencia BH-BMPT'!$D$42,IF(J79=42,'[1]Equivalencia BH-BMPT'!$D$43,IF(J79=43,'[1]Equivalencia BH-BMPT'!$D$44,IF(J79=44,'[1]Equivalencia BH-BMPT'!$D$45,IF(J79=45,'[1]Equivalencia BH-BMPT'!$D$46,\"No ha seleccionado un número de programa\")))))))))))))))))))))))))))))))))))))))))))))","v":"No ha seleccionado un número de programa"},null,860071250,"BMC BOLSA MERCANTIL DE COLOMBIA S.A.",328000000,null,null,null,0,328000000,171459735,"2017-07-12","2017-07-13","2018-03-31",259,0,null,null,"X",null,null,0.52274309451219514]
[59,2017,"CPS 059 2017",5,{"$f":"IF(D80=1,'[1]Tipo '!$B$2,IF(D80=2,'[1]Tipo '!$B$3,IF(D80=3,'[1]Tipo '!$B$4,IF(D80=4,'[1]Tipo '!$B$5,IF(D80=5,'[1]Tipo '!$B$6,IF(D80=6,'[1]Tipo '!$B$7,IF(D80=7,'[1]Tipo '!$B$8,IF(D80=8,'[1]Tipo '!$B$9,IF(D80=9,'[1]Tipo '!$B$10,IF(D80=10,'[1]Tipo '!$B$11,IF(D80=11,'[1]Tipo '!$B$12,IF(D80=12,'[1]Tipo '!$B$13,IF(D80=13,'[1]Tipo '!$B$14,IF(D80=14,'[1]Tipo '!$B$15,IF(D80=15,'[1]Tipo '!$B$16,IF(D80=16,'[1]Tipo '!$B$17,IF(D80=17,'[1]Tipo '!$B$18,IF(D80=18,'[1]Tipo '!$B$19,IF(D80=19,'[1]Tipo '!$B$20,\"No ha seleccionado un tipo de contrato válido\")))))))))))))))))))","v":"CONTRATOS DE PRESTACIÓN DE SERVICIOS PROFESIONALES Y DE APOYO A LA GESTIÓN"},"CONTRATACIÓN DIRECTA","Prestación de servicios profesionales y de apoyo a la gestión, o para la ejecución de trabajos artísticos que sólo puedan encomendarse a determinadas personas naturales;","El contrato que se pretende celebrar, tendrá por objeto: ¿EL CONTRATISTA SE OBLIGA PARA CON EL FONDO DE DESARROLLO LOCAL A PRESTAR SUS SERVICIOS DE APOYO A LAS ACTIVIDADES QUE SE GENEREN EN LA JUNTA ADMINISTRADORA LOCAL DE TEUSAQUILLO¿.","INVERSIÓN",45,{"$f":"IF(J80=1,'[1]Equivalencia BH-BMPT'!$D$2,IF(J80=2,'[1]Equivalencia BH-BMPT'!$D$3,IF(J80=3,'[1]Equivalencia BH-BMPT'!$D$4,IF(J80=4,'[1]Equivalencia BH-BMPT'!$D$5,IF(J80=5,'[1]Equivalencia BH-BMPT'!$D$6,IF(J80=6,'[1]Equivalencia BH-BMPT'!$D$7,IF(J80=7,'[1]Equivalencia BH-BMPT'!$D$8,IF(J80=8,'[1]Equivalencia BH-BMPT'!$D$9,IF(J80=9,'[1]Equivalencia BH-BMPT'!$D$10,IF(J80=10,'[1]Equivalencia BH-BMPT'!$D$11,IF(J80=11,'[1]Equivalencia BH-BMPT'!$D$12,IF(J80=12,'[1]Equivalencia BH-BMPT'!$D$13,IF(J80=13,'[1]Equivalencia BH-BMPT'!$D$14,IF(J80=14,'[1]Equivalencia BH-BMPT'!$D$15,IF(J80=15,'[1]Equivalencia BH-BMPT'!$D$16,IF(J80=16,'[1]Equivalencia BH-BMPT'!$D$17,IF(J80=17,'[1]Equivalencia BH-BMPT'!$D$18,IF(J80=18,'[1]Equivalencia BH-BMPT'!$D$19,IF(J80=19,'[1]Equivalencia BH-BMPT'!$D$20,IF(J80=20,'[1]Equivalencia BH-BMPT'!$D$21,IF(J80=21,'[1]Equivalencia BH-BMPT'!$D$22,IF(J80=22,'[1]Equivalencia BH-BMPT'!$D$23,IF(J80=23,'[1]Equivalencia BH-BMPT'!#REF!,IF(J80=24,'[1]Equivalencia BH-BMPT'!$D$25,IF(J80=25,'[1]Equivalencia BH-BMPT'!$D$26,IF(J80=26,'[1]Equivalencia BH-BMPT'!$D$27,IF(J80=27,'[1]Equivalencia BH-BMPT'!$D$28,IF(J80=28,'[1]Equivalencia BH-BMPT'!$D$29,IF(J80=29,'[1]Equivalencia BH-BMPT'!$D$30,IF(J80=30,'[1]Equivalencia BH-BMPT'!$D$31,IF(J80=31,'[1]Equivalencia BH-BMPT'!$D$32,IF(J80=32,'[1]Equivalencia BH-BMPT'!$D$33,IF(J80=33,'[1]Equivalencia BH-BMPT'!$D$34,IF(J80=34,'[1]Equivalencia BH-BMPT'!$D$35,IF(J80=35,'[1]Equivalencia BH-BMPT'!$D$36,IF(J80=36,'[1]Equivalencia BH-BMPT'!$D$37,IF(J80=37,'[1]Equivalencia BH-BMPT'!$D$38,IF(J80=38,'[1]Equivalencia BH-BMPT'!#REF!,IF(J80=39,'[1]Equivalencia BH-BMPT'!$D$40,IF(J80=40,'[1]Equivalencia BH-BMPT'!$D$41,IF(J80=41,'[1]Equivalencia BH-BMPT'!$D$42,IF(J80=42,'[1]Equivalencia BH-BMPT'!$D$43,IF(J80=43,'[1]Equivalencia BH-BMPT'!$D$44,IF(J80=44,'[1]Equivalencia BH-BMPT'!$D$45,IF(J80=45,'[1]Equivalencia BH-BMPT'!$D$46,\"No ha seleccionado un número de programa\")))))))))))))))))))))))))))))))))))))))))))))","v":"Gobernanza e influencia local, regional e internacional"},1329,1098771185,"HAINER ALI ALVERNIA ANGARITA",17733333,null,null,null,0,17733333,15680000,"2017-06-22","2017-06-27","2018-01-05",190,0,null,null,"X",null,null,0.88421054293628842]
[60,2017,"FDLT-SASI-003-2016",11,{"$f":"IF(D81=1,'[1]Tipo '!$B$2,IF(D81=2,'[1]Tipo '!$B$3,IF(D81=3,'[1]Tipo '!$B$4,IF(D81=4,'[1]Tipo '!$B$5,IF(D81=5,'[1]Tipo '!$B$6,IF(D81=6,'[1]Tipo '!$B$7,IF(D81=7,'[1]Tipo '!$B$8,IF(D81=8,'[1]Tipo '!$B$9,IF(D81=9,'[1]Tipo '!$B$10,IF(D81=10,'[1]Tipo '!$B$11,IF(D81=11,'[1]Tipo '!$B$12,IF(D81=12,'[1]Tipo '!$B$13,IF(D81=13,'[1]Tipo '!$B$14,IF(D81=14,'[1]Tipo '!$B$15,IF(D81=15,'[1]Tipo '!$B$16,IF(D81=16,'[1]Tipo '!$B$17,IF(D81=17,'[1]Tipo '!$B$18,IF(D81=18,'[1]Tipo '!$B$19,IF(D81=19,'[1]Tipo '!$B$20,\"No ha seleccionado un tipo de contrato válido\")))))))))))))))))))","v":"SUMINISTRO"},"Selección abreviada ","Selección abreviada por menor cuantía ","¿EL SUMINISTRO DE ELEMENTOS DE PAPELERÍA TONERS, TINTAS, CARTUCHOS, CONSUMIBLES Y ELEMENTOS DE IMPRESIÓN, ASÍ COMO LOS ELEMENTOS Y UTILES DE OFICINA CON DESTINO AL FDL DE TEUSAQUILLO, CONFORME A LAS NECESIDADES DE LA ENTIDAD POR EL SISTEMA DE PEDIDO A DEMANDA¿.","FUNCIONAMIENTO",null,{"$f":"IF(J81=1,'[1]Equivalencia BH-BMPT'!$D$2,IF(J81=2,'[1]Equivalencia BH-BMPT'!$D$3,IF(J81=3,'[1]Equivalencia BH-BMPT'!$D$4,IF(J81=4,'[1]Equivalencia BH-BMPT'!$D$5,IF(J81=5,'[1]Equivalencia BH-BMPT'!$D$6,IF(J81=6,'[1]Equivalencia BH-BMPT'!$D$7,IF(J81=7,'[1]Equivalencia BH-BMPT'!$D$8,IF(J81=8,'[1]Equivalencia BH-BMPT'!$D$9,IF(J81=9,'[1]Equivalencia BH-BMPT'!$D$10,IF(J81=10,'[1]Equivalencia BH-BMPT'!$D$11,IF(J81=11,'[1]Equivalencia BH-BMPT'!$D$12,IF(J81=12,'[1]Equivalencia BH-BMPT'!$D$13,IF(J81=13,'[1]Equivalencia BH-BMPT'!$D$14,IF(J81=14,'[1]Equivalencia BH-BMPT'!$D$15,IF(J81=15,'[1]Equivalencia BH-BMPT'!$D$16,IF(J81=16,'[1]Equivalencia BH-BMPT'!$D$17,IF(J81=17,'[1]Equivalencia BH-BMPT'!$D$18,IF(J81=18,'[1]Equivalencia BH-BMPT'!$D$19,IF(J81=19,'[1]Equivalencia BH-BMPT'!$D$20,IF(J81=20,'[1]Equivalencia BH-BMPT'!$D$21,IF(J81=21,'[1]Equivalencia BH-BMPT'!$D$22,IF(J81=22,'[1]Equivalencia BH-BMPT'!$D$23,IF(J81=23,'[1]Equivalencia BH-BMPT'!#REF!,IF(J81=24,'[1]Equivalencia BH-BMPT'!$D$25,IF(J81=25,'[1]Equivalencia BH-BMPT'!$D$26,IF(J81=26,'[1]Equivalencia BH-BMPT'!$D$27,IF(J81=27,'[1]Equivalencia BH-BMPT'!$D$28,IF(J81=28,'[1]Equivalencia BH-BMPT'!$D$29,IF(J81=29,'[1]Equivalencia BH-BMPT'!$D$30,IF(J81=30,'[1]Equivalencia BH-BMPT'!$D$31,IF(J81=31,'[1]Equivalencia BH-BMPT'!$D$32,IF(J81=32,'[1]Equivalencia BH-BMPT'!$D$33,IF(J81=33,'[1]Equivalencia BH-BMPT'!$D$34,IF(J81=34,'[1]Equivalencia BH-BMPT'!$D$35,IF(J81=35,'[1]Equivalencia BH-BMPT'!$D$36,IF(J81=36,'[1]Equivalencia BH-BMPT'!$D$37,IF(J81=37,'[1]Equivalencia BH-BMPT'!$D$38,IF(J81=38,'[1]Equivalencia BH-BMPT'!#REF!,IF(J81=39,'[1]Equivalencia BH-BMPT'!$D$40,IF(J81=40,'[1]Equivalencia BH-BMPT'!$D$41,IF(J81=41,'[1]Equivalencia BH-BMPT'!$D$42,IF(J81=42,'[1]Equivalencia BH-BMPT'!$D$43,IF(J81=43,'[1]Equivalencia BH-BMPT'!$D$44,IF(J81=44,'[1]Equivalencia BH-BMPT'!$D$45,IF(J81=45,'[1]Equivalencia BH-BMPT'!$D$46,\"No ha seleccionado un número de programa\")))))))))))))))))))))))))))))))))))))))))))))","v":"No ha seleccionado un número de programa"},null,860053274,"GRUPO LOS LAGOS S.A.S",50000000,null,null,null,25000000,75000000,39974414,"2017-06-28","2017-07-07","2018-04-06",210,60,null,null,"X",null,null,0.5329921866666667]
[60,2017,"FDLT-SASI-003-2017",11,{"$f":"IF(D82=1,'[1]Tipo '!$B$2,IF(D82=2,'[1]Tipo '!$B$3,IF(D82=3,'[1]Tipo '!$B$4,IF(D82=4,'[1]Tipo '!$B$5,IF(D82=5,'[1]Tipo '!$B$6,IF(D82=6,'[1]Tipo '!$B$7,IF(D82=7,'[1]Tipo '!$B$8,IF(D82=8,'[1]Tipo '!$B$9,IF(D82=9,'[1]Tipo '!$B$10,IF(D82=10,'[1]Tipo '!$B$11,IF(D82=11,'[1]Tipo '!$B$12,IF(D82=12,'[1]Tipo '!$B$13,IF(D82=13,'[1]Tipo '!$B$14,IF(D82=14,'[1]Tipo '!$B$15,IF(D82=15,'[1]Tipo '!$B$16,IF(D82=16,'[1]Tipo '!$B$17,IF(D82=17,'[1]Tipo '!$B$18,IF(D82=18,'[1]Tipo '!$B$19,IF(D82=19,'[1]Tipo '!$B$20,\"No ha seleccionado un tipo de contrato válido\")))))))))))))))))))","v":"SUMINISTRO"},"Selección abreviada ","Selección abreviada por menor cuantía ","¿EL SUMINISTRO DE ELEMENTOS DE PAPELERÍA TONERS, TINTAS, CARTUCHOS, CONSUMIBLES Y ELEMENTOS DE IMPRESIÓN, ASÍ COMO LOS ELEMENTOS Y UTILES DE OFICINA CON DESTINO AL FDL DE TEUSAQUILLO, CONFORME A LAS NECESIDADES DE LA ENTIDAD POR EL SISTEMA DE PEDIDO A DEMANDA¿.","FUNCIONAMIENTO",null,{"$f":"IF(J82=1,'[1]Equivalencia BH-BMPT'!$D$2,IF(J82=2,'[1]Equivalencia BH-BMPT'!$D$3,IF(J82=3,'[1]Equivalencia BH-BMPT'!$D$4,IF(J82=4,'[1]Equivalencia BH-BMPT'!$D$5,IF(J82=5,'[1]Equivalencia BH-BMPT'!$D$6,IF(J82=6,'[1]Equivalencia BH-BMPT'!$D$7,IF(J82=7,'[1]Equivalencia BH-BMPT'!$D$8,IF(J82=8,'[1]Equivalencia BH-BMPT'!$D$9,IF(J82=9,'[1]Equivalencia BH-BMPT'!$D$10,IF(J82=10,'[1]Equivalencia BH-BMPT'!$D$11,IF(J82=11,'[1]Equivalencia BH-BMPT'!$D$12,IF(J82=12,'[1]Equivalencia BH-BMPT'!$D$13,IF(J82=13,'[1]Equivalencia BH-BMPT'!$D$14,IF(J82=14,'[1]Equivalencia BH-BMPT'!$D$15,IF(J82=15,'[1]Equivalencia BH-BMPT'!$D$16,IF(J82=16,'[1]Equivalencia BH-BMPT'!$D$17,IF(J82=17,'[1]Equivalencia BH-BMPT'!$D$18,IF(J82=18,'[1]Equivalencia BH-BMPT'!$D$19,IF(J82=19,'[1]Equivalencia BH-BMPT'!$D$20,IF(J82=20,'[1]Equivalencia BH-BMPT'!$D$21,IF(J82=21,'[1]Equivalencia BH-BMPT'!$D$22,IF(J82=22,'[1]Equivalencia BH-BMPT'!$D$23,IF(J82=23,'[1]Equivalencia BH-BMPT'!#REF!,IF(J82=24,'[1]Equivalencia BH-BMPT'!$D$25,IF(J82=25,'[1]Equivalencia BH-BMPT'!$D$26,IF(J82=26,'[1]Equivalencia BH-BMPT'!$D$27,IF(J82=27,'[1]Equivalencia BH-BMPT'!$D$28,IF(J82=28,'[1]Equivalencia BH-BMPT'!$D$29,IF(J82=29,'[1]Equivalencia BH-BMPT'!$D$30,IF(J82=30,'[1]Equivalencia BH-BMPT'!$D$31,IF(J82=31,'[1]Equivalencia BH-BMPT'!$D$32,IF(J82=32,'[1]Equivalencia BH-BMPT'!$D$33,IF(J82=33,'[1]Equivalencia BH-BMPT'!$D$34,IF(J82=34,'[1]Equivalencia BH-BMPT'!$D$35,IF(J82=35,'[1]Equivalencia BH-BMPT'!$D$36,IF(J82=36,'[1]Equivalencia BH-BMPT'!$D$37,IF(J82=37,'[1]Equivalencia BH-BMPT'!$D$38,IF(J82=38,'[1]Equivalencia BH-BMPT'!#REF!,IF(J82=39,'[1]Equivalencia BH-BMPT'!$D$40,IF(J82=40,'[1]Equivalencia BH-BMPT'!$D$41,IF(J82=41,'[1]Equivalencia BH-BMPT'!$D$42,IF(J82=42,'[1]Equivalencia BH-BMPT'!$D$43,IF(J82=43,'[1]Equivalencia BH-BMPT'!$D$44,IF(J82=44,'[1]Equivalencia BH-BMPT'!$D$45,IF(J82=45,'[1]Equivalencia BH-BMPT'!$D$46,\"No ha seleccionado un número de programa\")))))))))))))))))))))))))))))))))))))))))))))","v":"No ha seleccionado un número de programa"},null,860053274,"GRUPO LOS LAGOS S.A.S",60000000,null,null,null,30000000,90000000,49271407,"2017-06-28","2017-07-07","2018-04-06",210,60,null,null,"X",null,null,0.54746007777777783]
[61,2017,"CPS 061  2017 ",5,{"$f":"IF(D83=1,'[1]Tipo '!$B$2,IF(D83=2,'[1]Tipo '!$B$3,IF(D83=3,'[1]Tipo '!$B$4,IF(D83=4,'[1]Tipo '!$B$5,IF(D83=5,'[1]Tipo '!$B$6,IF(D83=6,'[1]Tipo '!$B$7,IF(D83=7,'[1]Tipo '!$B$8,IF(D83=8,'[1]Tipo '!$B$9,IF(D83=9,'[1]Tipo '!$B$10,IF(D83=10,'[1]Tipo '!$B$11,IF(D83=11,'[1]Tipo '!$B$12,IF(D83=12,'[1]Tipo '!$B$13,IF(D83=13,'[1]Tipo '!$B$14,IF(D83=14,'[1]Tipo '!$B$15,IF(D83=15,'[1]Tipo '!$B$16,IF(D83=16,'[1]Tipo '!$B$17,IF(D83=17,'[1]Tipo '!$B$18,IF(D83=18,'[1]Tipo '!$B$19,IF(D83=19,'[1]Tipo '!$B$20,\"No ha seleccionado un tipo de contrato válido\")))))))))))))))))))","v":"CONTRATOS DE PRESTACIÓN DE SERVICIOS PROFESIONALES Y DE APOYO A LA GESTIÓN"},"CONTRATACIÓN DIRECTA","Prestación de servicios profesionales y de apoyo a la gestión, o para la ejecución de trabajos artísticos que sólo puedan encomendarse a determinadas personas naturales;","OBJETO: ¿Prestar los servicios técnicos de apoyo a la gestión en la ejecución de las actividades administrativas y operativas en temas relacionados con Establecimientos de Comercio y Espacio Público e Inspección Vigilancia y Control que se adelanten en el Área de Gestión Policiva de la Alcaldía local de Teusaquillo¿.","INVERSIÓN",45,{"$f":"IF(J83=1,'[1]Equivalencia BH-BMPT'!$D$2,IF(J83=2,'[1]Equivalencia BH-BMPT'!$D$3,IF(J83=3,'[1]Equivalencia BH-BMPT'!$D$4,IF(J83=4,'[1]Equivalencia BH-BMPT'!$D$5,IF(J83=5,'[1]Equivalencia BH-BMPT'!$D$6,IF(J83=6,'[1]Equivalencia BH-BMPT'!$D$7,IF(J83=7,'[1]Equivalencia BH-BMPT'!$D$8,IF(J83=8,'[1]Equivalencia BH-BMPT'!$D$9,IF(J83=9,'[1]Equivalencia BH-BMPT'!$D$10,IF(J83=10,'[1]Equivalencia BH-BMPT'!$D$11,IF(J83=11,'[1]Equivalencia BH-BMPT'!$D$12,IF(J83=12,'[1]Equivalencia BH-BMPT'!$D$13,IF(J83=13,'[1]Equivalencia BH-BMPT'!$D$14,IF(J83=14,'[1]Equivalencia BH-BMPT'!$D$15,IF(J83=15,'[1]Equivalencia BH-BMPT'!$D$16,IF(J83=16,'[1]Equivalencia BH-BMPT'!$D$17,IF(J83=17,'[1]Equivalencia BH-BMPT'!$D$18,IF(J83=18,'[1]Equivalencia BH-BMPT'!$D$19,IF(J83=19,'[1]Equivalencia BH-BMPT'!$D$20,IF(J83=20,'[1]Equivalencia BH-BMPT'!$D$21,IF(J83=21,'[1]Equivalencia BH-BMPT'!$D$22,IF(J83=22,'[1]Equivalencia BH-BMPT'!$D$23,IF(J83=23,'[1]Equivalencia BH-BMPT'!#REF!,IF(J83=24,'[1]Equivalencia BH-BMPT'!$D$25,IF(J83=25,'[1]Equivalencia BH-BMPT'!$D$26,IF(J83=26,'[1]Equivalencia BH-BMPT'!$D$27,IF(J83=27,'[1]Equivalencia BH-BMPT'!$D$28,IF(J83=28,'[1]Equivalencia BH-BMPT'!$D$29,IF(J83=29,'[1]Equivalencia BH-BMPT'!$D$30,IF(J83=30,'[1]Equivalencia BH-BMPT'!$D$31,IF(J83=31,'[1]Equivalencia BH-BMPT'!$D$32,IF(J83=32,'[1]Equivalencia BH-BMPT'!$D$33,IF(J83=33,'[1]Equivalencia BH-BMPT'!$D$34,IF(J83=34,'[1]Equivalencia BH-BMPT'!$D$35,IF(J83=35,'[1]Equivalencia BH-BMPT'!$D$36,IF(J83=36,'[1]Equivalencia BH-BMPT'!$D$37,IF(J83=37,'[1]Equivalencia BH-BMPT'!$D$38,IF(J83=38,'[1]Equivalencia BH-BMPT'!#REF!,IF(J83=39,'[1]Equivalencia BH-BMPT'!$D$40,IF(J83=40,'[1]Equivalencia BH-BMPT'!$D$41,IF(J83=41,'[1]Equivalencia BH-BMPT'!$D$42,IF(J83=42,'[1]Equivalencia BH-BMPT'!$D$43,IF(J83=43,'[1]Equivalencia BH-BMPT'!$D$44,IF(J83=44,'[1]Equivalencia BH-BMPT'!$D$45,IF(J83=45,'[1]Equivalencia BH-BMPT'!$D$46,\"No ha seleccionado un número de programa\")))))))))))))))))))))))))))))))))))))))))))))","v":"Gobernanza e influencia local, regional e internacional"},1329,1010172202,"JOSE MANUEL SANCHEZ TAMAYO",16333333,null,null,null,0,16333333,14746667,"2017-07-07","2017-07-07","2017-12-31",{"$f":"25+150","v":175},0,null,null,null,"X",null,0.90285718169096285,null,null,null,null,{"$f":"AF83+AH83+AJ83","v":0.90285718169096285},{"$f":"AG83+AI83+AK83","v":0.90285718169096285}]
[62,2017,"CPS 062 2017 ",5,{"$f":"IF(D84=1,'[1]Tipo '!$B$2,IF(D84=2,'[1]Tipo '!$B$3,IF(D84=3,'[1]Tipo '!$B$4,IF(D84=4,'[1]Tipo '!$B$5,IF(D84=5,'[1]Tipo '!$B$6,IF(D84=6,'[1]Tipo '!$B$7,IF(D84=7,'[1]Tipo '!$B$8,IF(D84=8,'[1]Tipo '!$B$9,IF(D84=9,'[1]Tipo '!$B$10,IF(D84=10,'[1]Tipo '!$B$11,IF(D84=11,'[1]Tipo '!$B$12,IF(D84=12,'[1]Tipo '!$B$13,IF(D84=13,'[1]Tipo '!$B$14,IF(D84=14,'[1]Tipo '!$B$15,IF(D84=15,'[1]Tipo '!$B$16,IF(D84=16,'[1]Tipo '!$B$17,IF(D84=17,'[1]Tipo '!$B$18,IF(D84=18,'[1]Tipo '!$B$19,IF(D84=19,'[1]Tipo '!$B$20,\"No ha seleccionado un tipo de contrato válido\")))))))))))))))))))","v":"CONTRATOS DE PRESTACIÓN DE SERVICIOS PROFESIONALES Y DE APOYO A LA GESTIÓN"},"CONTRATACIÓN DIRECTA","Prestación de servicios profesionales y de apoyo a la gestión, o para la ejecución de trabajos artísticos que sólo puedan encomendarse a determinadas personas naturales;","OBJETO: El contrato que se pretende celebrar, tendrá por objeto ¿EL CONTRATISTA SE OBLIGA PARA CON EL FONDO A PRESTAR SUS SERVICIOS DE APOYO EN LA CONDUCCIÓN DE LOS VEHÍCULOS DE PROPIEDAD DEL FONDO DE DESARROLLO LOCAL DE TEUSAQUILLO, INCLUIDO EL VEHÍCULO PESADO TIPO CAMIÓN ¿.","INVERSIÓN",45,{"$f":"IF(J84=1,'[1]Equivalencia BH-BMPT'!$D$2,IF(J84=2,'[1]Equivalencia BH-BMPT'!$D$3,IF(J84=3,'[1]Equivalencia BH-BMPT'!$D$4,IF(J84=4,'[1]Equivalencia BH-BMPT'!$D$5,IF(J84=5,'[1]Equivalencia BH-BMPT'!$D$6,IF(J84=6,'[1]Equivalencia BH-BMPT'!$D$7,IF(J84=7,'[1]Equivalencia BH-BMPT'!$D$8,IF(J84=8,'[1]Equivalencia BH-BMPT'!$D$9,IF(J84=9,'[1]Equivalencia BH-BMPT'!$D$10,IF(J84=10,'[1]Equivalencia BH-BMPT'!$D$11,IF(J84=11,'[1]Equivalencia BH-BMPT'!$D$12,IF(J84=12,'[1]Equivalencia BH-BMPT'!$D$13,IF(J84=13,'[1]Equivalencia BH-BMPT'!$D$14,IF(J84=14,'[1]Equivalencia BH-BMPT'!$D$15,IF(J84=15,'[1]Equivalencia BH-BMPT'!$D$16,IF(J84=16,'[1]Equivalencia BH-BMPT'!$D$17,IF(J84=17,'[1]Equivalencia BH-BMPT'!$D$18,IF(J84=18,'[1]Equivalencia BH-BMPT'!$D$19,IF(J84=19,'[1]Equivalencia BH-BMPT'!$D$20,IF(J84=20,'[1]Equivalencia BH-BMPT'!$D$21,IF(J84=21,'[1]Equivalencia BH-BMPT'!$D$22,IF(J84=22,'[1]Equivalencia BH-BMPT'!$D$23,IF(J84=23,'[1]Equivalencia BH-BMPT'!#REF!,IF(J84=24,'[1]Equivalencia BH-BMPT'!$D$25,IF(J84=25,'[1]Equivalencia BH-BMPT'!$D$26,IF(J84=26,'[1]Equivalencia BH-BMPT'!$D$27,IF(J84=27,'[1]Equivalencia BH-BMPT'!$D$28,IF(J84=28,'[1]Equivalencia BH-BMPT'!$D$29,IF(J84=29,'[1]Equivalencia BH-BMPT'!$D$30,IF(J84=30,'[1]Equivalencia BH-BMPT'!$D$31,IF(J84=31,'[1]Equivalencia BH-BMPT'!$D$32,IF(J84=32,'[1]Equivalencia BH-BMPT'!$D$33,IF(J84=33,'[1]Equivalencia BH-BMPT'!$D$34,IF(J84=34,'[1]Equivalencia BH-BMPT'!$D$35,IF(J84=35,'[1]Equivalencia BH-BMPT'!$D$36,IF(J84=36,'[1]Equivalencia BH-BMPT'!$D$37,IF(J84=37,'[1]Equivalencia BH-BMPT'!$D$38,IF(J84=38,'[1]Equivalencia BH-BMPT'!#REF!,IF(J84=39,'[1]Equivalencia BH-BMPT'!$D$40,IF(J84=40,'[1]Equivalencia BH-BMPT'!$D$41,IF(J84=41,'[1]Equivalencia BH-BMPT'!$D$42,IF(J84=42,'[1]Equivalencia BH-BMPT'!$D$43,IF(J84=43,'[1]Equivalencia BH-BMPT'!$D$44,IF(J84=44,'[1]Equivalencia BH-BMPT'!$D$45,IF(J84=45,'[1]Equivalencia BH-BMPT'!$D$46,\"No ha seleccionado un número de programa\")))))))))))))))))))))))))))))))))))))))))))))","v":"Gobernanza e influencia local, regional e internacional"},1329,79502612,"OMAR  PARDO SALAMANCA",10466666,null,null,null,533333,10999999,9200000,"2017-07-26","2017-07-27","2018-01-10",{"$f":"7+150","v":157},8,null,null,"X",null,null,0.83636371239670115]
[63,2017,"CPS 063 2017",5,{"$f":"IF(D85=1,'[1]Tipo '!$B$2,IF(D85=2,'[1]Tipo '!$B$3,IF(D85=3,'[1]Tipo '!$B$4,IF(D85=4,'[1]Tipo '!$B$5,IF(D85=5,'[1]Tipo '!$B$6,IF(D85=6,'[1]Tipo '!$B$7,IF(D85=7,'[1]Tipo '!$B$8,IF(D85=8,'[1]Tipo '!$B$9,IF(D85=9,'[1]Tipo '!$B$10,IF(D85=10,'[1]Tipo '!$B$11,IF(D85=11,'[1]Tipo '!$B$12,IF(D85=12,'[1]Tipo '!$B$13,IF(D85=13,'[1]Tipo '!$B$14,IF(D85=14,'[1]Tipo '!$B$15,IF(D85=15,'[1]Tipo '!$B$16,IF(D85=16,'[1]Tipo '!$B$17,IF(D85=17,'[1]Tipo '!$B$18,IF(D85=18,'[1]Tipo '!$B$19,IF(D85=19,'[1]Tipo '!$B$20,\"No ha seleccionado un tipo de contrato válido\")))))))))))))))))))","v":"CONTRATOS DE PRESTACIÓN DE SERVICIOS PROFESIONALES Y DE APOYO A LA GESTIÓN"},"CONTRATACIÓN DIRECTA","Prestación de servicios profesionales y de apoyo a la gestión, o para la ejecución de trabajos artísticos que sólo puedan encomendarse a determinadas personas naturales;","OBJETO: El contrato que se pretende celebrar, tendrá por objeto ¿Prestar los servicios técnicos para la operación, seguimiento y cumplimiento de los procesos y procedimientos del servicio social Apoyos para la Seguridad Económica Tipo C, requeridos para el oportuno y adecuado registro, cruce y reporte de los datos en el sistema de información y registro de Beneficiarios¿SIRBE, que contribuyan a la garantía de los derechos de la población mayor en el marco de la Política Pública Social para el Envejecimiento y la Vejez  en el Distrito Capital a cargo de la Alcaldía Local Teusaquillo.¿","INVERSIÓN",3,{"$f":"IF(J85=1,'[1]Equivalencia BH-BMPT'!$D$2,IF(J85=2,'[1]Equivalencia BH-BMPT'!$D$3,IF(J85=3,'[1]Equivalencia BH-BMPT'!$D$4,IF(J85=4,'[1]Equivalencia BH-BMPT'!$D$5,IF(J85=5,'[1]Equivalencia BH-BMPT'!$D$6,IF(J85=6,'[1]Equivalencia BH-BMPT'!$D$7,IF(J85=7,'[1]Equivalencia BH-BMPT'!$D$8,IF(J85=8,'[1]Equivalencia BH-BMPT'!$D$9,IF(J85=9,'[1]Equivalencia BH-BMPT'!$D$10,IF(J85=10,'[1]Equivalencia BH-BMPT'!$D$11,IF(J85=11,'[1]Equivalencia BH-BMPT'!$D$12,IF(J85=12,'[1]Equivalencia BH-BMPT'!$D$13,IF(J85=13,'[1]Equivalencia BH-BMPT'!$D$14,IF(J85=14,'[1]Equivalencia BH-BMPT'!$D$15,IF(J85=15,'[1]Equivalencia BH-BMPT'!$D$16,IF(J85=16,'[1]Equivalencia BH-BMPT'!$D$17,IF(J85=17,'[1]Equivalencia BH-BMPT'!$D$18,IF(J85=18,'[1]Equivalencia BH-BMPT'!$D$19,IF(J85=19,'[1]Equivalencia BH-BMPT'!$D$20,IF(J85=20,'[1]Equivalencia BH-BMPT'!$D$21,IF(J85=21,'[1]Equivalencia BH-BMPT'!$D$22,IF(J85=22,'[1]Equivalencia BH-BMPT'!$D$23,IF(J85=23,'[1]Equivalencia BH-BMPT'!#REF!,IF(J85=24,'[1]Equivalencia BH-BMPT'!$D$25,IF(J85=25,'[1]Equivalencia BH-BMPT'!$D$26,IF(J85=26,'[1]Equivalencia BH-BMPT'!$D$27,IF(J85=27,'[1]Equivalencia BH-BMPT'!$D$28,IF(J85=28,'[1]Equivalencia BH-BMPT'!$D$29,IF(J85=29,'[1]Equivalencia BH-BMPT'!$D$30,IF(J85=30,'[1]Equivalencia BH-BMPT'!$D$31,IF(J85=31,'[1]Equivalencia BH-BMPT'!$D$32,IF(J85=32,'[1]Equivalencia BH-BMPT'!$D$33,IF(J85=33,'[1]Equivalencia BH-BMPT'!$D$34,IF(J85=34,'[1]Equivalencia BH-BMPT'!$D$35,IF(J85=35,'[1]Equivalencia BH-BMPT'!$D$36,IF(J85=36,'[1]Equivalencia BH-BMPT'!$D$37,IF(J85=37,'[1]Equivalencia BH-BMPT'!$D$38,IF(J85=38,'[1]Equivalencia BH-BMPT'!#REF!,IF(J85=39,'[1]Equivalencia BH-BMPT'!$D$40,IF(J85=40,'[1]Equivalencia BH-BMPT'!$D$41,IF(J85=41,'[1]Equivalencia BH-BMPT'!$D$42,IF(J85=42,'[1]Equivalencia BH-BMPT'!$D$43,IF(J85=43,'[1]Equivalencia BH-BMPT'!$D$44,IF(J85=44,'[1]Equivalencia BH-BMPT'!$D$45,IF(J85=45,'[1]Equivalencia BH-BMPT'!$D$46,\"No ha seleccionado un número de programa\")))))))))))))))))))))))))))))))))))))))))))))","v":"Igualdad y autonomía para una Bogotá incluyente"},1357,1031141363,"GERALDINE  MONTENEGRO LOZADA",2800000,null,null,null,0,2800000,2800000,"2017-08-03","2017-08-03","2017-09-01",30,0,null,null,null,null,"X",1]
[64,2017,"CPS 064 2017 ",4,{"$f":"IF(D86=1,'[1]Tipo '!$B$2,IF(D86=2,'[1]Tipo '!$B$3,IF(D86=3,'[1]Tipo '!$B$4,IF(D86=4,'[1]Tipo '!$B$5,IF(D86=5,'[1]Tipo '!$B$6,IF(D86=6,'[1]Tipo '!$B$7,IF(D86=7,'[1]Tipo '!$B$8,IF(D86=8,'[1]Tipo '!$B$9,IF(D86=9,'[1]Tipo '!$B$10,IF(D86=10,'[1]Tipo '!$B$11,IF(D86=11,'[1]Tipo '!$B$12,IF(D86=12,'[1]Tipo '!$B$13,IF(D86=13,'[1]Tipo '!$B$14,IF(D86=14,'[1]Tipo '!$B$15,IF(D86=15,'[1]Tipo '!$B$16,IF(D86=16,'[1]Tipo '!$B$17,IF(D86=17,'[1]Tipo '!$B$18,IF(D86=18,'[1]Tipo '!$B$19,IF(D86=19,'[1]Tipo '!$B$20,\"No ha seleccionado un tipo de contrato válido\")))))))))))))))))))","v":"CONTRATOS DE PRESTACIÓN DE SERVICIOS"},"Contratación mínima cuantia ","No aplica","¿REALIZAR EL MANTENIMIENTO PREVENTIVO Y CORRECTIVO DE LOS EQUIPOS DE CÓMPUTO, IMPRESORAS, ESCANER, VIDEO BEAM, UPS, EQUIPOS ACTIVOS (SWITCH), SERVIDOR PROPIEDAD DEL FONDO DE DESARROLLO LOCAL DE TEUSAQUILLO, INCLUIDA BOLSA DE REPUESTOS AGOTABLE, SEGÚN NECESIDADES DE LA ENTIDAD DE ACUERDO A LOS PRESENTES ESTUDIOS PREVIOS¿.","FUNCIONAMIENTO",null,{"$f":"IF(J86=1,'[1]Equivalencia BH-BMPT'!$D$2,IF(J86=2,'[1]Equivalencia BH-BMPT'!$D$3,IF(J86=3,'[1]Equivalencia BH-BMPT'!$D$4,IF(J86=4,'[1]Equivalencia BH-BMPT'!$D$5,IF(J86=5,'[1]Equivalencia BH-BMPT'!$D$6,IF(J86=6,'[1]Equivalencia BH-BMPT'!$D$7,IF(J86=7,'[1]Equivalencia BH-BMPT'!$D$8,IF(J86=8,'[1]Equivalencia BH-BMPT'!$D$9,IF(J86=9,'[1]Equivalencia BH-BMPT'!$D$10,IF(J86=10,'[1]Equivalencia BH-BMPT'!$D$11,IF(J86=11,'[1]Equivalencia BH-BMPT'!$D$12,IF(J86=12,'[1]Equivalencia BH-BMPT'!$D$13,IF(J86=13,'[1]Equivalencia BH-BMPT'!$D$14,IF(J86=14,'[1]Equivalencia BH-BMPT'!$D$15,IF(J86=15,'[1]Equivalencia BH-BMPT'!$D$16,IF(J86=16,'[1]Equivalencia BH-BMPT'!$D$17,IF(J86=17,'[1]Equivalencia BH-BMPT'!$D$18,IF(J86=18,'[1]Equivalencia BH-BMPT'!$D$19,IF(J86=19,'[1]Equivalencia BH-BMPT'!$D$20,IF(J86=20,'[1]Equivalencia BH-BMPT'!$D$21,IF(J86=21,'[1]Equivalencia BH-BMPT'!$D$22,IF(J86=22,'[1]Equivalencia BH-BMPT'!$D$23,IF(J86=23,'[1]Equivalencia BH-BMPT'!#REF!,IF(J86=24,'[1]Equivalencia BH-BMPT'!$D$25,IF(J86=25,'[1]Equivalencia BH-BMPT'!$D$26,IF(J86=26,'[1]Equivalencia BH-BMPT'!$D$27,IF(J86=27,'[1]Equivalencia BH-BMPT'!$D$28,IF(J86=28,'[1]Equivalencia BH-BMPT'!$D$29,IF(J86=29,'[1]Equivalencia BH-BMPT'!$D$30,IF(J86=30,'[1]Equivalencia BH-BMPT'!$D$31,IF(J86=31,'[1]Equivalencia BH-BMPT'!$D$32,IF(J86=32,'[1]Equivalencia BH-BMPT'!$D$33,IF(J86=33,'[1]Equivalencia BH-BMPT'!$D$34,IF(J86=34,'[1]Equivalencia BH-BMPT'!$D$35,IF(J86=35,'[1]Equivalencia BH-BMPT'!$D$36,IF(J86=36,'[1]Equivalencia BH-BMPT'!$D$37,IF(J86=37,'[1]Equivalencia BH-BMPT'!$D$38,IF(J86=38,'[1]Equivalencia BH-BMPT'!#REF!,IF(J86=39,'[1]Equivalencia BH-BMPT'!$D$40,IF(J86=40,'[1]Equivalencia BH-BMPT'!$D$41,IF(J86=41,'[1]Equivalencia BH-BMPT'!$D$42,IF(J86=42,'[1]Equivalencia BH-BMPT'!$D$43,IF(J86=43,'[1]Equivalencia BH-BMPT'!$D$44,IF(J86=44,'[1]Equivalencia BH-BMPT'!$D$45,IF(J86=45,'[1]Equivalencia BH-BMPT'!$D$46,\"No ha seleccionado un número de programa\")))))))))))))))))))))))))))))))))))))))))))))","v":"No ha seleccionado un número de programa"},null,900280219,"AA MANTENIMIENTO A COMPUTADORES S.A.S.",20000000,null,null,null,5000000,25000000,21035550,"2017-08-04","2017-08-15","2018-02-14",180,0,null,null,"X",null,null,0.841422]
[65,2017,"CPS 065  2017",5,{"$f":"IF(D87=1,'[1]Tipo '!$B$2,IF(D87=2,'[1]Tipo '!$B$3,IF(D87=3,'[1]Tipo '!$B$4,IF(D87=4,'[1]Tipo '!$B$5,IF(D87=5,'[1]Tipo '!$B$6,IF(D87=6,'[1]Tipo '!$B$7,IF(D87=7,'[1]Tipo '!$B$8,IF(D87=8,'[1]Tipo '!$B$9,IF(D87=9,'[1]Tipo '!$B$10,IF(D87=10,'[1]Tipo '!$B$11,IF(D87=11,'[1]Tipo '!$B$12,IF(D87=12,'[1]Tipo '!$B$13,IF(D87=13,'[1]Tipo '!$B$14,IF(D87=14,'[1]Tipo '!$B$15,IF(D87=15,'[1]Tipo '!$B$16,IF(D87=16,'[1]Tipo '!$B$17,IF(D87=17,'[1]Tipo '!$B$18,IF(D87=18,'[1]Tipo '!$B$19,IF(D87=19,'[1]Tipo '!$B$20,\"No ha seleccionado un tipo de contrato válido\")))))))))))))))))))","v":"CONTRATOS DE PRESTACIÓN DE SERVICIOS PROFESIONALES Y DE APOYO A LA GESTIÓN"},"CONTRATACIÓN DIRECTA","Prestación de servicios profesionales y de apoyo a la gestión, o para la ejecución de trabajos artísticos que sólo puedan encomendarse a determinadas personas naturales;","OBJETO: El contrato que se pretende celebrar, tendrá por objeto ¿Prestación de servicios para Apoyar y dar soporte técnico al administrador y usuario final de la red de sistemas y tecnología e información de la Alcaldía Local¿.","INVERSIÓN",45,{"$f":"IF(J87=1,'[1]Equivalencia BH-BMPT'!$D$2,IF(J87=2,'[1]Equivalencia BH-BMPT'!$D$3,IF(J87=3,'[1]Equivalencia BH-BMPT'!$D$4,IF(J87=4,'[1]Equivalencia BH-BMPT'!$D$5,IF(J87=5,'[1]Equivalencia BH-BMPT'!$D$6,IF(J87=6,'[1]Equivalencia BH-BMPT'!$D$7,IF(J87=7,'[1]Equivalencia BH-BMPT'!$D$8,IF(J87=8,'[1]Equivalencia BH-BMPT'!$D$9,IF(J87=9,'[1]Equivalencia BH-BMPT'!$D$10,IF(J87=10,'[1]Equivalencia BH-BMPT'!$D$11,IF(J87=11,'[1]Equivalencia BH-BMPT'!$D$12,IF(J87=12,'[1]Equivalencia BH-BMPT'!$D$13,IF(J87=13,'[1]Equivalencia BH-BMPT'!$D$14,IF(J87=14,'[1]Equivalencia BH-BMPT'!$D$15,IF(J87=15,'[1]Equivalencia BH-BMPT'!$D$16,IF(J87=16,'[1]Equivalencia BH-BMPT'!$D$17,IF(J87=17,'[1]Equivalencia BH-BMPT'!$D$18,IF(J87=18,'[1]Equivalencia BH-BMPT'!$D$19,IF(J87=19,'[1]Equivalencia BH-BMPT'!$D$20,IF(J87=20,'[1]Equivalencia BH-BMPT'!$D$21,IF(J87=21,'[1]Equivalencia BH-BMPT'!$D$22,IF(J87=22,'[1]Equivalencia BH-BMPT'!$D$23,IF(J87=23,'[1]Equivalencia BH-BMPT'!#REF!,IF(J87=24,'[1]Equivalencia BH-BMPT'!$D$25,IF(J87=25,'[1]Equivalencia BH-BMPT'!$D$26,IF(J87=26,'[1]Equivalencia BH-BMPT'!$D$27,IF(J87=27,'[1]Equivalencia BH-BMPT'!$D$28,IF(J87=28,'[1]Equivalencia BH-BMPT'!$D$29,IF(J87=29,'[1]Equivalencia BH-BMPT'!$D$30,IF(J87=30,'[1]Equivalencia BH-BMPT'!$D$31,IF(J87=31,'[1]Equivalencia BH-BMPT'!$D$32,IF(J87=32,'[1]Equivalencia BH-BMPT'!$D$33,IF(J87=33,'[1]Equivalencia BH-BMPT'!$D$34,IF(J87=34,'[1]Equivalencia BH-BMPT'!$D$35,IF(J87=35,'[1]Equivalencia BH-BMPT'!$D$36,IF(J87=36,'[1]Equivalencia BH-BMPT'!$D$37,IF(J87=37,'[1]Equivalencia BH-BMPT'!$D$38,IF(J87=38,'[1]Equivalencia BH-BMPT'!#REF!,IF(J87=39,'[1]Equivalencia BH-BMPT'!$D$40,IF(J87=40,'[1]Equivalencia BH-BMPT'!$D$41,IF(J87=41,'[1]Equivalencia BH-BMPT'!$D$42,IF(J87=42,'[1]Equivalencia BH-BMPT'!$D$43,IF(J87=43,'[1]Equivalencia BH-BMPT'!$D$44,IF(J87=44,'[1]Equivalencia BH-BMPT'!$D$45,IF(J87=45,'[1]Equivalencia BH-BMPT'!$D$46,\"No ha seleccionado un número de programa\")))))))))))))))))))))))))))))))))))))))))))))","v":"Gobernanza e influencia local, regional e internacional"},1329,80041124,"JOHN ALEJANDRO HERMOSO FORERO",13300000,null,null,null,1100000,14400000,11700000,"2017-08-10","2017-08-18","2018-01-10",134,11,null,null,"X",null,null,0.8125]
[66,2017,"CPS  066  2017 ",5,{"$f":"IF(D88=1,'[1]Tipo '!$B$2,IF(D88=2,'[1]Tipo '!$B$3,IF(D88=3,'[1]Tipo '!$B$4,IF(D88=4,'[1]Tipo '!$B$5,IF(D88=5,'[1]Tipo '!$B$6,IF(D88=6,'[1]Tipo '!$B$7,IF(D88=7,'[1]Tipo '!$B$8,IF(D88=8,'[1]Tipo '!$B$9,IF(D88=9,'[1]Tipo '!$B$10,IF(D88=10,'[1]Tipo '!$B$11,IF(D88=11,'[1]Tipo '!$B$12,IF(D88=12,'[1]Tipo '!$B$13,IF(D88=13,'[1]Tipo '!$B$14,IF(D88=14,'[1]Tipo '!$B$15,IF(D88=15,'[1]Tipo '!$B$16,IF(D88=16,'[1]Tipo '!$B$17,IF(D88=17,'[1]Tipo '!$B$18,IF(D88=18,'[1]Tipo '!$B$19,IF(D88=19,'[1]Tipo '!$B$20,\"No ha seleccionado un tipo de contrato válido\")))))))))))))))))))","v":"CONTRATOS DE PRESTACIÓN DE SERVICIOS PROFESIONALES Y DE APOYO A LA GESTIÓN"},"CONTRATACIÓN DIRECTA","Prestación de servicios profesionales y de apoyo a la gestión, o para la ejecución de trabajos artísticos que sólo puedan encomendarse a determinadas personas naturales;","El contrato que se pretende celebrar, tendrá por objeto ¿Prestar los servicios profesionales como Administrador de la Red de Voz y Datos, de la Alcaldía Local de Teusaquillo y JALT, brindando asistencia y soporte técnico del software y hardware de los equipos y programas que maneja la entidad, así como a los usuarios que desarrollen sus actividades en la Alcaldía Local de Teusaquillo y JALT, de acuerdo a los presentes estudios previos","INVERSIÓN",45,{"$f":"IF(J88=1,'[1]Equivalencia BH-BMPT'!$D$2,IF(J88=2,'[1]Equivalencia BH-BMPT'!$D$3,IF(J88=3,'[1]Equivalencia BH-BMPT'!$D$4,IF(J88=4,'[1]Equivalencia BH-BMPT'!$D$5,IF(J88=5,'[1]Equivalencia BH-BMPT'!$D$6,IF(J88=6,'[1]Equivalencia BH-BMPT'!$D$7,IF(J88=7,'[1]Equivalencia BH-BMPT'!$D$8,IF(J88=8,'[1]Equivalencia BH-BMPT'!$D$9,IF(J88=9,'[1]Equivalencia BH-BMPT'!$D$10,IF(J88=10,'[1]Equivalencia BH-BMPT'!$D$11,IF(J88=11,'[1]Equivalencia BH-BMPT'!$D$12,IF(J88=12,'[1]Equivalencia BH-BMPT'!$D$13,IF(J88=13,'[1]Equivalencia BH-BMPT'!$D$14,IF(J88=14,'[1]Equivalencia BH-BMPT'!$D$15,IF(J88=15,'[1]Equivalencia BH-BMPT'!$D$16,IF(J88=16,'[1]Equivalencia BH-BMPT'!$D$17,IF(J88=17,'[1]Equivalencia BH-BMPT'!$D$18,IF(J88=18,'[1]Equivalencia BH-BMPT'!$D$19,IF(J88=19,'[1]Equivalencia BH-BMPT'!$D$20,IF(J88=20,'[1]Equivalencia BH-BMPT'!$D$21,IF(J88=21,'[1]Equivalencia BH-BMPT'!$D$22,IF(J88=22,'[1]Equivalencia BH-BMPT'!$D$23,IF(J88=23,'[1]Equivalencia BH-BMPT'!#REF!,IF(J88=24,'[1]Equivalencia BH-BMPT'!$D$25,IF(J88=25,'[1]Equivalencia BH-BMPT'!$D$26,IF(J88=26,'[1]Equivalencia BH-BMPT'!$D$27,IF(J88=27,'[1]Equivalencia BH-BMPT'!$D$28,IF(J88=28,'[1]Equivalencia BH-BMPT'!$D$29,IF(J88=29,'[1]Equivalencia BH-BMPT'!$D$30,IF(J88=30,'[1]Equivalencia BH-BMPT'!$D$31,IF(J88=31,'[1]Equivalencia BH-BMPT'!$D$32,IF(J88=32,'[1]Equivalencia BH-BMPT'!$D$33,IF(J88=33,'[1]Equivalencia BH-BMPT'!$D$34,IF(J88=34,'[1]Equivalencia BH-BMPT'!$D$35,IF(J88=35,'[1]Equivalencia BH-BMPT'!$D$36,IF(J88=36,'[1]Equivalencia BH-BMPT'!$D$37,IF(J88=37,'[1]Equivalencia BH-BMPT'!$D$38,IF(J88=38,'[1]Equivalencia BH-BMPT'!#REF!,IF(J88=39,'[1]Equivalencia BH-BMPT'!$D$40,IF(J88=40,'[1]Equivalencia BH-BMPT'!$D$41,IF(J88=41,'[1]Equivalencia BH-BMPT'!$D$42,IF(J88=42,'[1]Equivalencia BH-BMPT'!$D$43,IF(J88=43,'[1]Equivalencia BH-BMPT'!$D$44,IF(J88=44,'[1]Equivalencia BH-BMPT'!$D$45,IF(J88=45,'[1]Equivalencia BH-BMPT'!$D$46,\"No ha seleccionado un número de programa\")))))))))))))))))))))))))))))))))))))))))))))","v":"Gobernanza e influencia local, regional e internacional"},1329,79415517,"JOHN JAIRO ARBELAEZ CASTAÑEDA",19040000,null,null,null,0,19040000,16640000,"2017-09-01","2017-09-01","2017-12-29",{"$f":"29+90","v":119},0,null,null,null,"X",null,0.87394957983193278]
[67,2017,null,10,{"$f":"IF(D89=1,'[1]Tipo '!$B$2,IF(D89=2,'[1]Tipo '!$B$3,IF(D89=3,'[1]Tipo '!$B$4,IF(D89=4,'[1]Tipo '!$B$5,IF(D89=5,'[1]Tipo '!$B$6,IF(D89=6,'[1]Tipo '!$B$7,IF(D89=7,'[1]Tipo '!$B$8,IF(D89=8,'[1]Tipo '!$B$9,IF(D89=9,'[1]Tipo '!$B$10,IF(D89=10,'[1]Tipo '!$B$11,IF(D89=11,'[1]Tipo '!$B$12,IF(D89=12,'[1]Tipo '!$B$13,IF(D89=13,'[1]Tipo '!$B$14,IF(D89=14,'[1]Tipo '!$B$15,IF(D89=15,'[1]Tipo '!$B$16,IF(D89=16,'[1]Tipo '!$B$17,IF(D89=17,'[1]Tipo '!$B$18,IF(D89=18,'[1]Tipo '!$B$19,IF(D89=19,'[1]Tipo '!$B$20,\"No ha seleccionado un tipo de contrato válido\")))))))))))))))))))","v":"SEGUROS"},"Selección abreviada ","Selección abreviada por menor cuantía ","Adicionar el contrato de seguros N° 067-2016, cuyo objeto es ¿Contratar una compañía de seguros legalmente constituida en Colombia, con el fin de asegurar los bienes muebles e inmuebles y demás intereses patrimoniales del Fondo de Desarrollo local de Teusaquillo y los que se encuentran bajo su cuidado, tenencia, control o por los que legalmente pueda ser responsable","FUNCIONAMIENTO",null,{"$f":"IF(J89=1,'[1]Equivalencia BH-BMPT'!$D$2,IF(J89=2,'[1]Equivalencia BH-BMPT'!$D$3,IF(J89=3,'[1]Equivalencia BH-BMPT'!$D$4,IF(J89=4,'[1]Equivalencia BH-BMPT'!$D$5,IF(J89=5,'[1]Equivalencia BH-BMPT'!$D$6,IF(J89=6,'[1]Equivalencia BH-BMPT'!$D$7,IF(J89=7,'[1]Equivalencia BH-BMPT'!$D$8,IF(J89=8,'[1]Equivalencia BH-BMPT'!$D$9,IF(J89=9,'[1]Equivalencia BH-BMPT'!$D$10,IF(J89=10,'[1]Equivalencia BH-BMPT'!$D$11,IF(J89=11,'[1]Equivalencia BH-BMPT'!$D$12,IF(J89=12,'[1]Equivalencia BH-BMPT'!$D$13,IF(J89=13,'[1]Equivalencia BH-BMPT'!$D$14,IF(J89=14,'[1]Equivalencia BH-BMPT'!$D$15,IF(J89=15,'[1]Equivalencia BH-BMPT'!$D$16,IF(J89=16,'[1]Equivalencia BH-BMPT'!$D$17,IF(J89=17,'[1]Equivalencia BH-BMPT'!$D$18,IF(J89=18,'[1]Equivalencia BH-BMPT'!$D$19,IF(J89=19,'[1]Equivalencia BH-BMPT'!$D$20,IF(J89=20,'[1]Equivalencia BH-BMPT'!$D$21,IF(J89=21,'[1]Equivalencia BH-BMPT'!$D$22,IF(J89=22,'[1]Equivalencia BH-BMPT'!$D$23,IF(J89=23,'[1]Equivalencia BH-BMPT'!#REF!,IF(J89=24,'[1]Equivalencia BH-BMPT'!$D$25,IF(J89=25,'[1]Equivalencia BH-BMPT'!$D$26,IF(J89=26,'[1]Equivalencia BH-BMPT'!$D$27,IF(J89=27,'[1]Equivalencia BH-BMPT'!$D$28,IF(J89=28,'[1]Equivalencia BH-BMPT'!$D$29,IF(J89=29,'[1]Equivalencia BH-BMPT'!$D$30,IF(J89=30,'[1]Equivalencia BH-BMPT'!$D$31,IF(J89=31,'[1]Equivalencia BH-BMPT'!$D$32,IF(J89=32,'[1]Equivalencia BH-BMPT'!$D$33,IF(J89=33,'[1]Equivalencia BH-BMPT'!$D$34,IF(J89=34,'[1]Equivalencia BH-BMPT'!$D$35,IF(J89=35,'[1]Equivalencia BH-BMPT'!$D$36,IF(J89=36,'[1]Equivalencia BH-BMPT'!$D$37,IF(J89=37,'[1]Equivalencia BH-BMPT'!$D$38,IF(J89=38,'[1]Equivalencia BH-BMPT'!#REF!,IF(J89=39,'[1]Equivalencia BH-BMPT'!$D$40,IF(J89=40,'[1]Equivalencia BH-BMPT'!$D$41,IF(J89=41,'[1]Equivalencia BH-BMPT'!$D$42,IF(J89=42,'[1]Equivalencia BH-BMPT'!$D$43,IF(J89=43,'[1]Equivalencia BH-BMPT'!$D$44,IF(J89=44,'[1]Equivalencia BH-BMPT'!$D$45,IF(J89=45,'[1]Equivalencia BH-BMPT'!$D$46,\"No ha seleccionado un número de programa\")))))))))))))))))))))))))))))))))))))))))))))","v":"No ha seleccionado un número de programa"},null,860002400,"LA PREVISORA S A COMPAÑIA DE SEGUROS",null,null,null,null,20627541,20627541,20627541,"2016-09-22","2016-09-26","2017-08-11",230,90,null,null,null,"X",null,1]
[67,2017,"CPS  067 2017 ",5,{"$f":"IF(D90=1,'[1]Tipo '!$B$2,IF(D90=2,'[1]Tipo '!$B$3,IF(D90=3,'[1]Tipo '!$B$4,IF(D90=4,'[1]Tipo '!$B$5,IF(D90=5,'[1]Tipo '!$B$6,IF(D90=6,'[1]Tipo '!$B$7,IF(D90=7,'[1]Tipo '!$B$8,IF(D90=8,'[1]Tipo '!$B$9,IF(D90=9,'[1]Tipo '!$B$10,IF(D90=10,'[1]Tipo '!$B$11,IF(D90=11,'[1]Tipo '!$B$12,IF(D90=12,'[1]Tipo '!$B$13,IF(D90=13,'[1]Tipo '!$B$14,IF(D90=14,'[1]Tipo '!$B$15,IF(D90=15,'[1]Tipo '!$B$16,IF(D90=16,'[1]Tipo '!$B$17,IF(D90=17,'[1]Tipo '!$B$18,IF(D90=18,'[1]Tipo '!$B$19,IF(D90=19,'[1]Tipo '!$B$20,\"No ha seleccionado un tipo de contrato válido\")))))))))))))))))))","v":"CONTRATOS DE PRESTACIÓN DE SERVICIOS PROFESIONALES Y DE APOYO A LA GESTIÓN"},"CONTRATACIÓN DIRECTA","Prestación de servicios profesionales y de apoyo a la gestión, o para la ejecución de trabajos artísticos que sólo puedan encomendarse a determinadas personas naturales;","EL CONTRATO QUE SE PRETENDE CELEBRAR, TENDRÁ POR OBJETO \"APOYAR OPERATIVAMENTE LAS ACCIONES RELACIONADAS CON LA APLICACION DE COMPARENDOS POR COMPORTAMIENTOS CONTRARIOS A LAS CONVIVENCIAS, DESPACHOS COMISORIOS, CTUALIZACION DE APLICATIVOS ENTRE OTROAS QUE SE REQUIERAN\"","INVERSIÓN",45,{"$f":"IF(J90=1,'[1]Equivalencia BH-BMPT'!$D$2,IF(J90=2,'[1]Equivalencia BH-BMPT'!$D$3,IF(J90=3,'[1]Equivalencia BH-BMPT'!$D$4,IF(J90=4,'[1]Equivalencia BH-BMPT'!$D$5,IF(J90=5,'[1]Equivalencia BH-BMPT'!$D$6,IF(J90=6,'[1]Equivalencia BH-BMPT'!$D$7,IF(J90=7,'[1]Equivalencia BH-BMPT'!$D$8,IF(J90=8,'[1]Equivalencia BH-BMPT'!$D$9,IF(J90=9,'[1]Equivalencia BH-BMPT'!$D$10,IF(J90=10,'[1]Equivalencia BH-BMPT'!$D$11,IF(J90=11,'[1]Equivalencia BH-BMPT'!$D$12,IF(J90=12,'[1]Equivalencia BH-BMPT'!$D$13,IF(J90=13,'[1]Equivalencia BH-BMPT'!$D$14,IF(J90=14,'[1]Equivalencia BH-BMPT'!$D$15,IF(J90=15,'[1]Equivalencia BH-BMPT'!$D$16,IF(J90=16,'[1]Equivalencia BH-BMPT'!$D$17,IF(J90=17,'[1]Equivalencia BH-BMPT'!$D$18,IF(J90=18,'[1]Equivalencia BH-BMPT'!$D$19,IF(J90=19,'[1]Equivalencia BH-BMPT'!$D$20,IF(J90=20,'[1]Equivalencia BH-BMPT'!$D$21,IF(J90=21,'[1]Equivalencia BH-BMPT'!$D$22,IF(J90=22,'[1]Equivalencia BH-BMPT'!$D$23,IF(J90=23,'[1]Equivalencia BH-BMPT'!#REF!,IF(J90=24,'[1]Equivalencia BH-BMPT'!$D$25,IF(J90=25,'[1]Equivalencia BH-BMPT'!$D$26,IF(J90=26,'[1]Equivalencia BH-BMPT'!$D$27,IF(J90=27,'[1]Equivalencia BH-BMPT'!$D$28,IF(J90=28,'[1]Equivalencia BH-BMPT'!$D$29,IF(J90=29,'[1]Equivalencia BH-BMPT'!$D$30,IF(J90=30,'[1]Equivalencia BH-BMPT'!$D$31,IF(J90=31,'[1]Equivalencia BH-BMPT'!$D$32,IF(J90=32,'[1]Equivalencia BH-BMPT'!$D$33,IF(J90=33,'[1]Equivalencia BH-BMPT'!$D$34,IF(J90=34,'[1]Equivalencia BH-BMPT'!$D$35,IF(J90=35,'[1]Equivalencia BH-BMPT'!$D$36,IF(J90=36,'[1]Equivalencia BH-BMPT'!$D$37,IF(J90=37,'[1]Equivalencia BH-BMPT'!$D$38,IF(J90=38,'[1]Equivalencia BH-BMPT'!#REF!,IF(J90=39,'[1]Equivalencia BH-BMPT'!$D$40,IF(J90=40,'[1]Equivalencia BH-BMPT'!$D$41,IF(J90=41,'[1]Equivalencia BH-BMPT'!$D$42,IF(J90=42,'[1]Equivalencia BH-BMPT'!$D$43,IF(J90=43,'[1]Equivalencia BH-BMPT'!$D$44,IF(J90=44,'[1]Equivalencia BH-BMPT'!$D$45,IF(J90=45,'[1]Equivalencia BH-BMPT'!$D$46,\"No ha seleccionado un número de programa\")))))))))))))))))))))))))))))))))))))))))))))","v":"Gobernanza e influencia local, regional e internacional"},1329,1015407312,"ANDREA CATALINA GARCIA FLOREZ",11124771,null,null,null,1054935,12179706,9590320,"2017-09-05","2017-09-05","2018-01-10",{"$f":"26+90","v":116},11,null,null,"X",null,null,0.78740160066261045]
[68,2016,null,4,{"$f":"IF(D91=1,'[1]Tipo '!$B$2,IF(D91=2,'[1]Tipo '!$B$3,IF(D91=3,'[1]Tipo '!$B$4,IF(D91=4,'[1]Tipo '!$B$5,IF(D91=5,'[1]Tipo '!$B$6,IF(D91=6,'[1]Tipo '!$B$7,IF(D91=7,'[1]Tipo '!$B$8,IF(D91=8,'[1]Tipo '!$B$9,IF(D91=9,'[1]Tipo '!$B$10,IF(D91=10,'[1]Tipo '!$B$11,IF(D91=11,'[1]Tipo '!$B$12,IF(D91=12,'[1]Tipo '!$B$13,IF(D91=13,'[1]Tipo '!$B$14,IF(D91=14,'[1]Tipo '!$B$15,IF(D91=15,'[1]Tipo '!$B$16,IF(D91=16,'[1]Tipo '!$B$17,IF(D91=17,'[1]Tipo '!$B$18,IF(D91=18,'[1]Tipo '!$B$19,IF(D91=19,'[1]Tipo '!$B$20,\"No ha seleccionado un tipo de contrato válido\")))))))))))))))))))","v":"CONTRATOS DE PRESTACIÓN DE SERVICIOS"},"Selección abreviada ","Selección abreviada por menor cuantía ","ADICIÓN Y PRORROGA NO 2 AL CPS NO. 068-2015  CUYO OBJETO ES:¿ PRESTAR A LA ALCALDÍA LOCAL DE TEUSAQUILLO EL SERVICIO INTEGRAL DE TRANSPORTE TERRESTRE ESPECIAL CONTINÚO, CON EL PROPÓSITO DE TRASLADAR A LOS FUNCIONARIOS/AS, CONTRATISTAS Y/O USUARIOS EN EL MARCO DE LA MISIONALIDAD DE LA ALCALDÍA LOCAL DE TEUSAQUILLO, EN CUMPLIMIENTO AL PLAN DE GESTIÓN, PLAN DE DESARROLLO LOCAL, DE CONFORMIDAD CON LOS PRESENTES ESTUDIOS PREVIOS¿.","FUNCIONAMIENTO",null,{"$f":"IF(J91=1,'[1]Equivalencia BH-BMPT'!$D$2,IF(J91=2,'[1]Equivalencia BH-BMPT'!$D$3,IF(J91=3,'[1]Equivalencia BH-BMPT'!$D$4,IF(J91=4,'[1]Equivalencia BH-BMPT'!$D$5,IF(J91=5,'[1]Equivalencia BH-BMPT'!$D$6,IF(J91=6,'[1]Equivalencia BH-BMPT'!$D$7,IF(J91=7,'[1]Equivalencia BH-BMPT'!$D$8,IF(J91=8,'[1]Equivalencia BH-BMPT'!$D$9,IF(J91=9,'[1]Equivalencia BH-BMPT'!$D$10,IF(J91=10,'[1]Equivalencia BH-BMPT'!$D$11,IF(J91=11,'[1]Equivalencia BH-BMPT'!$D$12,IF(J91=12,'[1]Equivalencia BH-BMPT'!$D$13,IF(J91=13,'[1]Equivalencia BH-BMPT'!$D$14,IF(J91=14,'[1]Equivalencia BH-BMPT'!$D$15,IF(J91=15,'[1]Equivalencia BH-BMPT'!$D$16,IF(J91=16,'[1]Equivalencia BH-BMPT'!$D$17,IF(J91=17,'[1]Equivalencia BH-BMPT'!$D$18,IF(J91=18,'[1]Equivalencia BH-BMPT'!$D$19,IF(J91=19,'[1]Equivalencia BH-BMPT'!$D$20,IF(J91=20,'[1]Equivalencia BH-BMPT'!$D$21,IF(J91=21,'[1]Equivalencia BH-BMPT'!$D$22,IF(J91=22,'[1]Equivalencia BH-BMPT'!$D$23,IF(J91=23,'[1]Equivalencia BH-BMPT'!#REF!,IF(J91=24,'[1]Equivalencia BH-BMPT'!$D$25,IF(J91=25,'[1]Equivalencia BH-BMPT'!$D$26,IF(J91=26,'[1]Equivalencia BH-BMPT'!$D$27,IF(J91=27,'[1]Equivalencia BH-BMPT'!$D$28,IF(J91=28,'[1]Equivalencia BH-BMPT'!$D$29,IF(J91=29,'[1]Equivalencia BH-BMPT'!$D$30,IF(J91=30,'[1]Equivalencia BH-BMPT'!$D$31,IF(J91=31,'[1]Equivalencia BH-BMPT'!$D$32,IF(J91=32,'[1]Equivalencia BH-BMPT'!$D$33,IF(J91=33,'[1]Equivalencia BH-BMPT'!$D$34,IF(J91=34,'[1]Equivalencia BH-BMPT'!$D$35,IF(J91=35,'[1]Equivalencia BH-BMPT'!$D$36,IF(J91=36,'[1]Equivalencia BH-BMPT'!$D$37,IF(J91=37,'[1]Equivalencia BH-BMPT'!$D$38,IF(J91=38,'[1]Equivalencia BH-BMPT'!#REF!,IF(J91=39,'[1]Equivalencia BH-BMPT'!$D$40,IF(J91=40,'[1]Equivalencia BH-BMPT'!$D$41,IF(J91=41,'[1]Equivalencia BH-BMPT'!$D$42,IF(J91=42,'[1]Equivalencia BH-BMPT'!$D$43,IF(J91=43,'[1]Equivalencia BH-BMPT'!$D$44,IF(J91=44,'[1]Equivalencia BH-BMPT'!$D$45,IF(J91=45,'[1]Equivalencia BH-BMPT'!$D$46,\"No ha seleccionado un número de programa\")))))))))))))))))))))))))))))))))))))))))))))","v":"No ha seleccionado un número de programa"},null,830102646,"TRANSPORTES ESIVANS SAS",null,null,null,null,13689763,13689763,13689763,"2016-09-27","2016-09-30","2017-08-29",180,60,null,null,null,null,"X",1]
[68,2017,"CPS 068 2017 ",10,{"$f":"IF(D92=1,'[1]Tipo '!$B$2,IF(D92=2,'[1]Tipo '!$B$3,IF(D92=3,'[1]Tipo '!$B$4,IF(D92=4,'[1]Tipo '!$B$5,IF(D92=5,'[1]Tipo '!$B$6,IF(D92=6,'[1]Tipo '!$B$7,IF(D92=7,'[1]Tipo '!$B$8,IF(D92=8,'[1]Tipo '!$B$9,IF(D92=9,'[1]Tipo '!$B$10,IF(D92=10,'[1]Tipo '!$B$11,IF(D92=11,'[1]Tipo '!$B$12,IF(D92=12,'[1]Tipo '!$B$13,IF(D92=13,'[1]Tipo '!$B$14,IF(D92=14,'[1]Tipo '!$B$15,IF(D92=15,'[1]Tipo '!$B$16,IF(D92=16,'[1]Tipo '!$B$17,IF(D92=17,'[1]Tipo '!$B$18,IF(D92=18,'[1]Tipo '!$B$19,IF(D92=19,'[1]Tipo '!$B$20,\"No ha seleccionado un tipo de contrato válido\")))))))))))))))))))","v":"SEGUROS"},"Selección abreviada ","Selección abreviada por menor cuantía ","Adquisición de las pólizas de daños y patrimoniales, para el programa de seguros del Fondo de Desarrollo Local de Teusaquillo con el fin de proteger los bienes muebles e inmuebles de su propiedad, los intereses patrimoniales y los que se encuentren bajo su cuidado, custodia, tenencia y control","FUNCIONAMIENTO",null,{"$f":"IF(J92=1,'[1]Equivalencia BH-BMPT'!$D$2,IF(J92=2,'[1]Equivalencia BH-BMPT'!$D$3,IF(J92=3,'[1]Equivalencia BH-BMPT'!$D$4,IF(J92=4,'[1]Equivalencia BH-BMPT'!$D$5,IF(J92=5,'[1]Equivalencia BH-BMPT'!$D$6,IF(J92=6,'[1]Equivalencia BH-BMPT'!$D$7,IF(J92=7,'[1]Equivalencia BH-BMPT'!$D$8,IF(J92=8,'[1]Equivalencia BH-BMPT'!$D$9,IF(J92=9,'[1]Equivalencia BH-BMPT'!$D$10,IF(J92=10,'[1]Equivalencia BH-BMPT'!$D$11,IF(J92=11,'[1]Equivalencia BH-BMPT'!$D$12,IF(J92=12,'[1]Equivalencia BH-BMPT'!$D$13,IF(J92=13,'[1]Equivalencia BH-BMPT'!$D$14,IF(J92=14,'[1]Equivalencia BH-BMPT'!$D$15,IF(J92=15,'[1]Equivalencia BH-BMPT'!$D$16,IF(J92=16,'[1]Equivalencia BH-BMPT'!$D$17,IF(J92=17,'[1]Equivalencia BH-BMPT'!$D$18,IF(J92=18,'[1]Equivalencia BH-BMPT'!$D$19,IF(J92=19,'[1]Equivalencia BH-BMPT'!$D$20,IF(J92=20,'[1]Equivalencia BH-BMPT'!$D$21,IF(J92=21,'[1]Equivalencia BH-BMPT'!$D$22,IF(J92=22,'[1]Equivalencia BH-BMPT'!$D$23,IF(J92=23,'[1]Equivalencia BH-BMPT'!#REF!,IF(J92=24,'[1]Equivalencia BH-BMPT'!$D$25,IF(J92=25,'[1]Equivalencia BH-BMPT'!$D$26,IF(J92=26,'[1]Equivalencia BH-BMPT'!$D$27,IF(J92=27,'[1]Equivalencia BH-BMPT'!$D$28,IF(J92=28,'[1]Equivalencia BH-BMPT'!$D$29,IF(J92=29,'[1]Equivalencia BH-BMPT'!$D$30,IF(J92=30,'[1]Equivalencia BH-BMPT'!$D$31,IF(J92=31,'[1]Equivalencia BH-BMPT'!$D$32,IF(J92=32,'[1]Equivalencia BH-BMPT'!$D$33,IF(J92=33,'[1]Equivalencia BH-BMPT'!$D$34,IF(J92=34,'[1]Equivalencia BH-BMPT'!$D$35,IF(J92=35,'[1]Equivalencia BH-BMPT'!$D$36,IF(J92=36,'[1]Equivalencia BH-BMPT'!$D$37,IF(J92=37,'[1]Equivalencia BH-BMPT'!$D$38,IF(J92=38,'[1]Equivalencia BH-BMPT'!#REF!,IF(J92=39,'[1]Equivalencia BH-BMPT'!$D$40,IF(J92=40,'[1]Equivalencia BH-BMPT'!$D$41,IF(J92=41,'[1]Equivalencia BH-BMPT'!$D$42,IF(J92=42,'[1]Equivalencia BH-BMPT'!$D$43,IF(J92=43,'[1]Equivalencia BH-BMPT'!$D$44,IF(J92=44,'[1]Equivalencia BH-BMPT'!$D$45,IF(J92=45,'[1]Equivalencia BH-BMPT'!$D$46,\"No ha seleccionado un número de programa\")))))))))))))))))))))))))))))))))))))))))))))","v":"No ha seleccionado un número de programa"},null,860002400,"LA PREVISORA S A COMPAÑIA DE SEGUROS",44372459,null,null,null,0,44372459,36448536,"2017-09-15","2017-09-16","2018-04-19",215,0,null,null,"X",null,null,0.82142249542672408]
[70,2017,"CPS 070 2017 ",5,{"$f":"IF(D93=1,'[1]Tipo '!$B$2,IF(D93=2,'[1]Tipo '!$B$3,IF(D93=3,'[1]Tipo '!$B$4,IF(D93=4,'[1]Tipo '!$B$5,IF(D93=5,'[1]Tipo '!$B$6,IF(D93=6,'[1]Tipo '!$B$7,IF(D93=7,'[1]Tipo '!$B$8,IF(D93=8,'[1]Tipo '!$B$9,IF(D93=9,'[1]Tipo '!$B$10,IF(D93=10,'[1]Tipo '!$B$11,IF(D93=11,'[1]Tipo '!$B$12,IF(D93=12,'[1]Tipo '!$B$13,IF(D93=13,'[1]Tipo '!$B$14,IF(D93=14,'[1]Tipo '!$B$15,IF(D93=15,'[1]Tipo '!$B$16,IF(D93=16,'[1]Tipo '!$B$17,IF(D93=17,'[1]Tipo '!$B$18,IF(D93=18,'[1]Tipo '!$B$19,IF(D93=19,'[1]Tipo '!$B$20,\"No ha seleccionado un tipo de contrato válido\")))))))))))))))))))","v":"CONTRATOS DE PRESTACIÓN DE SERVICIOS PROFESIONALES Y DE APOYO A LA GESTIÓN"},"CONTRATACIÓN DIRECTA","Prestación de servicios profesionales y de apoyo a la gestión, o para la ejecución de trabajos artísticos que sólo puedan encomendarse a determinadas personas naturales;","OBJETO: El contrato que se pretende celebrar, tendrá por objeto ¿Apoyar la gestión documental de la Alcaldía Local para la implementación del Procedimiento De Gestión Documental en el desarrollo de actividades como la recepción, distribución, trámite, organización, consulta, conservación y disposición final de los documentos que producen todas las dependencias de la Administración Local¿.","INVERSIÓN",45,{"$f":"IF(J93=1,'[1]Equivalencia BH-BMPT'!$D$2,IF(J93=2,'[1]Equivalencia BH-BMPT'!$D$3,IF(J93=3,'[1]Equivalencia BH-BMPT'!$D$4,IF(J93=4,'[1]Equivalencia BH-BMPT'!$D$5,IF(J93=5,'[1]Equivalencia BH-BMPT'!$D$6,IF(J93=6,'[1]Equivalencia BH-BMPT'!$D$7,IF(J93=7,'[1]Equivalencia BH-BMPT'!$D$8,IF(J93=8,'[1]Equivalencia BH-BMPT'!$D$9,IF(J93=9,'[1]Equivalencia BH-BMPT'!$D$10,IF(J93=10,'[1]Equivalencia BH-BMPT'!$D$11,IF(J93=11,'[1]Equivalencia BH-BMPT'!$D$12,IF(J93=12,'[1]Equivalencia BH-BMPT'!$D$13,IF(J93=13,'[1]Equivalencia BH-BMPT'!$D$14,IF(J93=14,'[1]Equivalencia BH-BMPT'!$D$15,IF(J93=15,'[1]Equivalencia BH-BMPT'!$D$16,IF(J93=16,'[1]Equivalencia BH-BMPT'!$D$17,IF(J93=17,'[1]Equivalencia BH-BMPT'!$D$18,IF(J93=18,'[1]Equivalencia BH-BMPT'!$D$19,IF(J93=19,'[1]Equivalencia BH-BMPT'!$D$20,IF(J93=20,'[1]Equivalencia BH-BMPT'!$D$21,IF(J93=21,'[1]Equivalencia BH-BMPT'!$D$22,IF(J93=22,'[1]Equivalencia BH-BMPT'!$D$23,IF(J93=23,'[1]Equivalencia BH-BMPT'!#REF!,IF(J93=24,'[1]Equivalencia BH-BMPT'!$D$25,IF(J93=25,'[1]Equivalencia BH-BMPT'!$D$26,IF(J93=26,'[1]Equivalencia BH-BMPT'!$D$27,IF(J93=27,'[1]Equivalencia BH-BMPT'!$D$28,IF(J93=28,'[1]Equivalencia BH-BMPT'!$D$29,IF(J93=29,'[1]Equivalencia BH-BMPT'!$D$30,IF(J93=30,'[1]Equivalencia BH-BMPT'!$D$31,IF(J93=31,'[1]Equivalencia BH-BMPT'!$D$32,IF(J93=32,'[1]Equivalencia BH-BMPT'!$D$33,IF(J93=33,'[1]Equivalencia BH-BMPT'!$D$34,IF(J93=34,'[1]Equivalencia BH-BMPT'!$D$35,IF(J93=35,'[1]Equivalencia BH-BMPT'!$D$36,IF(J93=36,'[1]Equivalencia BH-BMPT'!$D$37,IF(J93=37,'[1]Equivalencia BH-BMPT'!$D$38,IF(J93=38,'[1]Equivalencia BH-BMPT'!#REF!,IF(J93=39,'[1]Equivalencia BH-BMPT'!$D$40,IF(J93=40,'[1]Equivalencia BH-BMPT'!$D$41,IF(J93=41,'[1]Equivalencia BH-BMPT'!$D$42,IF(J93=42,'[1]Equivalencia BH-BMPT'!$D$43,IF(J93=43,'[1]Equivalencia BH-BMPT'!$D$44,IF(J93=44,'[1]Equivalencia BH-BMPT'!$D$45,IF(J93=45,'[1]Equivalencia BH-BMPT'!$D$46,\"No ha seleccionado un número de programa\")))))))))))))))))))))))))))))))))))))))))))))","v":"Gobernanza e influencia local, regional e internacional"},1329,51749302,"MARTHA JEANETH CASTRO MENDOZA",10230000,null,null,null,0,10230000,8576667,"2017-09-20","2017-09-22","2017-12-30",{"$f":"9+90","v":99},0,null,null,null,null,"X",0.83838387096774192]
[71,2017,"CPS 071 2017 ",5,{"$f":"IF(D94=1,'[1]Tipo '!$B$2,IF(D94=2,'[1]Tipo '!$B$3,IF(D94=3,'[1]Tipo '!$B$4,IF(D94=4,'[1]Tipo '!$B$5,IF(D94=5,'[1]Tipo '!$B$6,IF(D94=6,'[1]Tipo '!$B$7,IF(D94=7,'[1]Tipo '!$B$8,IF(D94=8,'[1]Tipo '!$B$9,IF(D94=9,'[1]Tipo '!$B$10,IF(D94=10,'[1]Tipo '!$B$11,IF(D94=11,'[1]Tipo '!$B$12,IF(D94=12,'[1]Tipo '!$B$13,IF(D94=13,'[1]Tipo '!$B$14,IF(D94=14,'[1]Tipo '!$B$15,IF(D94=15,'[1]Tipo '!$B$16,IF(D94=16,'[1]Tipo '!$B$17,IF(D94=17,'[1]Tipo '!$B$18,IF(D94=18,'[1]Tipo '!$B$19,IF(D94=19,'[1]Tipo '!$B$20,\"No ha seleccionado un tipo de contrato válido\")))))))))))))))))))","v":"CONTRATOS DE PRESTACIÓN DE SERVICIOS PROFESIONALES Y DE APOYO A LA GESTIÓN"},"CONTRATACIÓN DIRECTA","Prestación de servicios profesionales y de apoyo a la gestión, o para la ejecución de trabajos artísticos que sólo puedan encomendarse a determinadas personas naturales;","El contrato que se pretende celebrar, tendrá por objeto:  \"Prestar servicios profesionales como apoyo a la gestión en el Área Gestión de Desarrollo Local de Teusaquillo realizando las actividades precontractuales, de ejecución, seguimiento y liquidación necesarias que conlleven a dar cumplimiento al plan anual de adquisiciones 2017 en lo referente a los rubros de funcionamiento y componentes asignados del Proyecto 1329, plan de gestión, de acuerdo a los presentes estudios previos","INVERSIÓN",45,{"$f":"IF(J94=1,'[1]Equivalencia BH-BMPT'!$D$2,IF(J94=2,'[1]Equivalencia BH-BMPT'!$D$3,IF(J94=3,'[1]Equivalencia BH-BMPT'!$D$4,IF(J94=4,'[1]Equivalencia BH-BMPT'!$D$5,IF(J94=5,'[1]Equivalencia BH-BMPT'!$D$6,IF(J94=6,'[1]Equivalencia BH-BMPT'!$D$7,IF(J94=7,'[1]Equivalencia BH-BMPT'!$D$8,IF(J94=8,'[1]Equivalencia BH-BMPT'!$D$9,IF(J94=9,'[1]Equivalencia BH-BMPT'!$D$10,IF(J94=10,'[1]Equivalencia BH-BMPT'!$D$11,IF(J94=11,'[1]Equivalencia BH-BMPT'!$D$12,IF(J94=12,'[1]Equivalencia BH-BMPT'!$D$13,IF(J94=13,'[1]Equivalencia BH-BMPT'!$D$14,IF(J94=14,'[1]Equivalencia BH-BMPT'!$D$15,IF(J94=15,'[1]Equivalencia BH-BMPT'!$D$16,IF(J94=16,'[1]Equivalencia BH-BMPT'!$D$17,IF(J94=17,'[1]Equivalencia BH-BMPT'!$D$18,IF(J94=18,'[1]Equivalencia BH-BMPT'!$D$19,IF(J94=19,'[1]Equivalencia BH-BMPT'!$D$20,IF(J94=20,'[1]Equivalencia BH-BMPT'!$D$21,IF(J94=21,'[1]Equivalencia BH-BMPT'!$D$22,IF(J94=22,'[1]Equivalencia BH-BMPT'!$D$23,IF(J94=23,'[1]Equivalencia BH-BMPT'!#REF!,IF(J94=24,'[1]Equivalencia BH-BMPT'!$D$25,IF(J94=25,'[1]Equivalencia BH-BMPT'!$D$26,IF(J94=26,'[1]Equivalencia BH-BMPT'!$D$27,IF(J94=27,'[1]Equivalencia BH-BMPT'!$D$28,IF(J94=28,'[1]Equivalencia BH-BMPT'!$D$29,IF(J94=29,'[1]Equivalencia BH-BMPT'!$D$30,IF(J94=30,'[1]Equivalencia BH-BMPT'!$D$31,IF(J94=31,'[1]Equivalencia BH-BMPT'!$D$32,IF(J94=32,'[1]Equivalencia BH-BMPT'!$D$33,IF(J94=33,'[1]Equivalencia BH-BMPT'!$D$34,IF(J94=34,'[1]Equivalencia BH-BMPT'!$D$35,IF(J94=35,'[1]Equivalencia BH-BMPT'!$D$36,IF(J94=36,'[1]Equivalencia BH-BMPT'!$D$37,IF(J94=37,'[1]Equivalencia BH-BMPT'!$D$38,IF(J94=38,'[1]Equivalencia BH-BMPT'!#REF!,IF(J94=39,'[1]Equivalencia BH-BMPT'!$D$40,IF(J94=40,'[1]Equivalencia BH-BMPT'!$D$41,IF(J94=41,'[1]Equivalencia BH-BMPT'!$D$42,IF(J94=42,'[1]Equivalencia BH-BMPT'!$D$43,IF(J94=43,'[1]Equivalencia BH-BMPT'!$D$44,IF(J94=44,'[1]Equivalencia BH-BMPT'!$D$45,IF(J94=45,'[1]Equivalencia BH-BMPT'!$D$46,\"No ha seleccionado un número de programa\")))))))))))))))))))))))))))))))))))))))))))))","v":"Gobernanza e influencia local, regional e internacional"},1329,79765033,"DAIRO JEZZID LEON ROMERO",14700000,null,null,null,1800000,16500000,12450000,"2017-09-22","2017-09-22","2018-01-10",{"$f":"8+90","v":98},12,null,null,"X",null,null,0.75454545454545452]
[72,2017,"CPS 072 2017 ",5,{"$f":"IF(D95=1,'[1]Tipo '!$B$2,IF(D95=2,'[1]Tipo '!$B$3,IF(D95=3,'[1]Tipo '!$B$4,IF(D95=4,'[1]Tipo '!$B$5,IF(D95=5,'[1]Tipo '!$B$6,IF(D95=6,'[1]Tipo '!$B$7,IF(D95=7,'[1]Tipo '!$B$8,IF(D95=8,'[1]Tipo '!$B$9,IF(D95=9,'[1]Tipo '!$B$10,IF(D95=10,'[1]Tipo '!$B$11,IF(D95=11,'[1]Tipo '!$B$12,IF(D95=12,'[1]Tipo '!$B$13,IF(D95=13,'[1]Tipo '!$B$14,IF(D95=14,'[1]Tipo '!$B$15,IF(D95=15,'[1]Tipo '!$B$16,IF(D95=16,'[1]Tipo '!$B$17,IF(D95=17,'[1]Tipo '!$B$18,IF(D95=18,'[1]Tipo '!$B$19,IF(D95=19,'[1]Tipo '!$B$20,\"No ha seleccionado un tipo de contrato válido\")))))))))))))))))))","v":"CONTRATOS DE PRESTACIÓN DE SERVICIOS PROFESIONALES Y DE APOYO A LA GESTIÓN"},"CONTRATACIÓN DIRECTA","Prestación de servicios profesionales y de apoyo a la gestión, o para la ejecución de trabajos artísticos que sólo puedan encomendarse a determinadas personas naturales;","El contrato que se pretende celebrar, tendrá por objeto ¿Prestación de servicios de apoyo de logística que se requieran en el desarrollo de las actividades relativas a recuperación y embellecimiento del espacio público dentro del proyecto 1338 Teusaquillo Mejor para la conservación de la malla vial local y Espacio Público Peatonal¿.","INVERSIÓN",18,{"$f":"IF(J95=1,'[1]Equivalencia BH-BMPT'!$D$2,IF(J95=2,'[1]Equivalencia BH-BMPT'!$D$3,IF(J95=3,'[1]Equivalencia BH-BMPT'!$D$4,IF(J95=4,'[1]Equivalencia BH-BMPT'!$D$5,IF(J95=5,'[1]Equivalencia BH-BMPT'!$D$6,IF(J95=6,'[1]Equivalencia BH-BMPT'!$D$7,IF(J95=7,'[1]Equivalencia BH-BMPT'!$D$8,IF(J95=8,'[1]Equivalencia BH-BMPT'!$D$9,IF(J95=9,'[1]Equivalencia BH-BMPT'!$D$10,IF(J95=10,'[1]Equivalencia BH-BMPT'!$D$11,IF(J95=11,'[1]Equivalencia BH-BMPT'!$D$12,IF(J95=12,'[1]Equivalencia BH-BMPT'!$D$13,IF(J95=13,'[1]Equivalencia BH-BMPT'!$D$14,IF(J95=14,'[1]Equivalencia BH-BMPT'!$D$15,IF(J95=15,'[1]Equivalencia BH-BMPT'!$D$16,IF(J95=16,'[1]Equivalencia BH-BMPT'!$D$17,IF(J95=17,'[1]Equivalencia BH-BMPT'!$D$18,IF(J95=18,'[1]Equivalencia BH-BMPT'!$D$19,IF(J95=19,'[1]Equivalencia BH-BMPT'!$D$20,IF(J95=20,'[1]Equivalencia BH-BMPT'!$D$21,IF(J95=21,'[1]Equivalencia BH-BMPT'!$D$22,IF(J95=22,'[1]Equivalencia BH-BMPT'!$D$23,IF(J95=23,'[1]Equivalencia BH-BMPT'!#REF!,IF(J95=24,'[1]Equivalencia BH-BMPT'!$D$25,IF(J95=25,'[1]Equivalencia BH-BMPT'!$D$26,IF(J95=26,'[1]Equivalencia BH-BMPT'!$D$27,IF(J95=27,'[1]Equivalencia BH-BMPT'!$D$28,IF(J95=28,'[1]Equivalencia BH-BMPT'!$D$29,IF(J95=29,'[1]Equivalencia BH-BMPT'!$D$30,IF(J95=30,'[1]Equivalencia BH-BMPT'!$D$31,IF(J95=31,'[1]Equivalencia BH-BMPT'!$D$32,IF(J95=32,'[1]Equivalencia BH-BMPT'!$D$33,IF(J95=33,'[1]Equivalencia BH-BMPT'!$D$34,IF(J95=34,'[1]Equivalencia BH-BMPT'!$D$35,IF(J95=35,'[1]Equivalencia BH-BMPT'!$D$36,IF(J95=36,'[1]Equivalencia BH-BMPT'!$D$37,IF(J95=37,'[1]Equivalencia BH-BMPT'!$D$38,IF(J95=38,'[1]Equivalencia BH-BMPT'!#REF!,IF(J95=39,'[1]Equivalencia BH-BMPT'!$D$40,IF(J95=40,'[1]Equivalencia BH-BMPT'!$D$41,IF(J95=41,'[1]Equivalencia BH-BMPT'!$D$42,IF(J95=42,'[1]Equivalencia BH-BMPT'!$D$43,IF(J95=43,'[1]Equivalencia BH-BMPT'!$D$44,IF(J95=44,'[1]Equivalencia BH-BMPT'!$D$45,IF(J95=45,'[1]Equivalencia BH-BMPT'!$D$46,\"No ha seleccionado un número de programa\")))))))))))))))))))))))))))))))))))))))))))))","v":"Mejor movilidad para todos"},1338,80858244,"LUIS EVELIO RODRIGUEZ MENDEZ",4821600,null,null,null,0,4821600,2558400,"2017-09-22","2017-10-23","2018-01-30",{"$f":"8+90","v":98},0,null,null,"X",null,null,0.53061224489795922]
[73,2017,"CPS 073 2017 ",5,{"$f":"IF(D96=1,'[1]Tipo '!$B$2,IF(D96=2,'[1]Tipo '!$B$3,IF(D96=3,'[1]Tipo '!$B$4,IF(D96=4,'[1]Tipo '!$B$5,IF(D96=5,'[1]Tipo '!$B$6,IF(D96=6,'[1]Tipo '!$B$7,IF(D96=7,'[1]Tipo '!$B$8,IF(D96=8,'[1]Tipo '!$B$9,IF(D96=9,'[1]Tipo '!$B$10,IF(D96=10,'[1]Tipo '!$B$11,IF(D96=11,'[1]Tipo '!$B$12,IF(D96=12,'[1]Tipo '!$B$13,IF(D96=13,'[1]Tipo '!$B$14,IF(D96=14,'[1]Tipo '!$B$15,IF(D96=15,'[1]Tipo '!$B$16,IF(D96=16,'[1]Tipo '!$B$17,IF(D96=17,'[1]Tipo '!$B$18,IF(D96=18,'[1]Tipo '!$B$19,IF(D96=19,'[1]Tipo '!$B$20,\"No ha seleccionado un tipo de contrato válido\")))))))))))))))))))","v":"CONTRATOS DE PRESTACIÓN DE SERVICIOS PROFESIONALES Y DE APOYO A LA GESTIÓN"},"CONTRATACIÓN DIRECTA","Prestación de servicios profesionales y de apoyo a la gestión, o para la ejecución de trabajos artísticos que sólo puedan encomendarse a determinadas personas naturales;","Prestación de servicios profesionales al Área de Gestión de Desarrollo Local de Teusaquillo, en la formulación, evaluación, y seguimiento del proyecto 1333 en sus componentes de recreación y deporte y acompañamiento en las instancias de participación relacionadas con deportes y juventud","INVERSIÓN",45,{"$f":"IF(J96=1,'[1]Equivalencia BH-BMPT'!$D$2,IF(J96=2,'[1]Equivalencia BH-BMPT'!$D$3,IF(J96=3,'[1]Equivalencia BH-BMPT'!$D$4,IF(J96=4,'[1]Equivalencia BH-BMPT'!$D$5,IF(J96=5,'[1]Equivalencia BH-BMPT'!$D$6,IF(J96=6,'[1]Equivalencia BH-BMPT'!$D$7,IF(J96=7,'[1]Equivalencia BH-BMPT'!$D$8,IF(J96=8,'[1]Equivalencia BH-BMPT'!$D$9,IF(J96=9,'[1]Equivalencia BH-BMPT'!$D$10,IF(J96=10,'[1]Equivalencia BH-BMPT'!$D$11,IF(J96=11,'[1]Equivalencia BH-BMPT'!$D$12,IF(J96=12,'[1]Equivalencia BH-BMPT'!$D$13,IF(J96=13,'[1]Equivalencia BH-BMPT'!$D$14,IF(J96=14,'[1]Equivalencia BH-BMPT'!$D$15,IF(J96=15,'[1]Equivalencia BH-BMPT'!$D$16,IF(J96=16,'[1]Equivalencia BH-BMPT'!$D$17,IF(J96=17,'[1]Equivalencia BH-BMPT'!$D$18,IF(J96=18,'[1]Equivalencia BH-BMPT'!$D$19,IF(J96=19,'[1]Equivalencia BH-BMPT'!$D$20,IF(J96=20,'[1]Equivalencia BH-BMPT'!$D$21,IF(J96=21,'[1]Equivalencia BH-BMPT'!$D$22,IF(J96=22,'[1]Equivalencia BH-BMPT'!$D$23,IF(J96=23,'[1]Equivalencia BH-BMPT'!#REF!,IF(J96=24,'[1]Equivalencia BH-BMPT'!$D$25,IF(J96=25,'[1]Equivalencia BH-BMPT'!$D$26,IF(J96=26,'[1]Equivalencia BH-BMPT'!$D$27,IF(J96=27,'[1]Equivalencia BH-BMPT'!$D$28,IF(J96=28,'[1]Equivalencia BH-BMPT'!$D$29,IF(J96=29,'[1]Equivalencia BH-BMPT'!$D$30,IF(J96=30,'[1]Equivalencia BH-BMPT'!$D$31,IF(J96=31,'[1]Equivalencia BH-BMPT'!$D$32,IF(J96=32,'[1]Equivalencia BH-BMPT'!$D$33,IF(J96=33,'[1]Equivalencia BH-BMPT'!$D$34,IF(J96=34,'[1]Equivalencia BH-BMPT'!$D$35,IF(J96=35,'[1]Equivalencia BH-BMPT'!$D$36,IF(J96=36,'[1]Equivalencia BH-BMPT'!$D$37,IF(J96=37,'[1]Equivalencia BH-BMPT'!$D$38,IF(J96=38,'[1]Equivalencia BH-BMPT'!#REF!,IF(J96=39,'[1]Equivalencia BH-BMPT'!$D$40,IF(J96=40,'[1]Equivalencia BH-BMPT'!$D$41,IF(J96=41,'[1]Equivalencia BH-BMPT'!$D$42,IF(J96=42,'[1]Equivalencia BH-BMPT'!$D$43,IF(J96=43,'[1]Equivalencia BH-BMPT'!$D$44,IF(J96=44,'[1]Equivalencia BH-BMPT'!$D$45,IF(J96=45,'[1]Equivalencia BH-BMPT'!$D$46,\"No ha seleccionado un número de programa\")))))))))))))))))))))))))))))))))))))))))))))","v":"Gobernanza e influencia local, regional e internacional"},1329,1144037315,"JACOBO PARDEY ROZO",14373333,null,null,null,0,14373333,11733333,"2017-09-22","2017-09-22","2017-12-29",98,0,null,null,null,null,"X",0.81632652635265601]
[74,2017,"CPS  074 2017 ",5,{"$f":"IF(D97=1,'[1]Tipo '!$B$2,IF(D97=2,'[1]Tipo '!$B$3,IF(D97=3,'[1]Tipo '!$B$4,IF(D97=4,'[1]Tipo '!$B$5,IF(D97=5,'[1]Tipo '!$B$6,IF(D97=6,'[1]Tipo '!$B$7,IF(D97=7,'[1]Tipo '!$B$8,IF(D97=8,'[1]Tipo '!$B$9,IF(D97=9,'[1]Tipo '!$B$10,IF(D97=10,'[1]Tipo '!$B$11,IF(D97=11,'[1]Tipo '!$B$12,IF(D97=12,'[1]Tipo '!$B$13,IF(D97=13,'[1]Tipo '!$B$14,IF(D97=14,'[1]Tipo '!$B$15,IF(D97=15,'[1]Tipo '!$B$16,IF(D97=16,'[1]Tipo '!$B$17,IF(D97=17,'[1]Tipo '!$B$18,IF(D97=18,'[1]Tipo '!$B$19,IF(D97=19,'[1]Tipo '!$B$20,\"No ha seleccionado un tipo de contrato válido\")))))))))))))))))))","v":"CONTRATOS DE PRESTACIÓN DE SERVICIOS PROFESIONALES Y DE APOYO A LA GESTIÓN"},"CONTRATACIÓN DIRECTA","Prestación de servicios profesionales y de apoyo a la gestión, o para la ejecución de trabajos artísticos que sólo puedan encomendarse a determinadas personas naturales;","¿Prestación de servicios de apoyo de logística que se requieran en el desarrollo de las actividades relativas a recuperación y embellecimiento del espacio público dentro del proyecto 1338 Teusaquillo Mejor para la conservación de la malla vial local y Espacio Público Peatonal¿.","INVERSIÓN",18,{"$f":"IF(J97=1,'[1]Equivalencia BH-BMPT'!$D$2,IF(J97=2,'[1]Equivalencia BH-BMPT'!$D$3,IF(J97=3,'[1]Equivalencia BH-BMPT'!$D$4,IF(J97=4,'[1]Equivalencia BH-BMPT'!$D$5,IF(J97=5,'[1]Equivalencia BH-BMPT'!$D$6,IF(J97=6,'[1]Equivalencia BH-BMPT'!$D$7,IF(J97=7,'[1]Equivalencia BH-BMPT'!$D$8,IF(J97=8,'[1]Equivalencia BH-BMPT'!$D$9,IF(J97=9,'[1]Equivalencia BH-BMPT'!$D$10,IF(J97=10,'[1]Equivalencia BH-BMPT'!$D$11,IF(J97=11,'[1]Equivalencia BH-BMPT'!$D$12,IF(J97=12,'[1]Equivalencia BH-BMPT'!$D$13,IF(J97=13,'[1]Equivalencia BH-BMPT'!$D$14,IF(J97=14,'[1]Equivalencia BH-BMPT'!$D$15,IF(J97=15,'[1]Equivalencia BH-BMPT'!$D$16,IF(J97=16,'[1]Equivalencia BH-BMPT'!$D$17,IF(J97=17,'[1]Equivalencia BH-BMPT'!$D$18,IF(J97=18,'[1]Equivalencia BH-BMPT'!$D$19,IF(J97=19,'[1]Equivalencia BH-BMPT'!$D$20,IF(J97=20,'[1]Equivalencia BH-BMPT'!$D$21,IF(J97=21,'[1]Equivalencia BH-BMPT'!$D$22,IF(J97=22,'[1]Equivalencia BH-BMPT'!$D$23,IF(J97=23,'[1]Equivalencia BH-BMPT'!#REF!,IF(J97=24,'[1]Equivalencia BH-BMPT'!$D$25,IF(J97=25,'[1]Equivalencia BH-BMPT'!$D$26,IF(J97=26,'[1]Equivalencia BH-BMPT'!$D$27,IF(J97=27,'[1]Equivalencia BH-BMPT'!$D$28,IF(J97=28,'[1]Equivalencia BH-BMPT'!$D$29,IF(J97=29,'[1]Equivalencia BH-BMPT'!$D$30,IF(J97=30,'[1]Equivalencia BH-BMPT'!$D$31,IF(J97=31,'[1]Equivalencia BH-BMPT'!$D$32,IF(J97=32,'[1]Equivalencia BH-BMPT'!$D$33,IF(J97=33,'[1]Equivalencia BH-BMPT'!$D$34,IF(J97=34,'[1]Equivalencia BH-BMPT'!$D$35,IF(J97=35,'[1]Equivalencia BH-BMPT'!$D$36,IF(J97=36,'[1]Equivalencia BH-BMPT'!$D$37,IF(J97=37,'[1]Equivalencia BH-BMPT'!$D$38,IF(J97=38,'[1]Equivalencia BH-BMPT'!#REF!,IF(J97=39,'[1]Equivalencia BH-BMPT'!$D$40,IF(J97=40,'[1]Equivalencia BH-BMPT'!$D$41,IF(J97=41,'[1]Equivalencia BH-BMPT'!$D$42,IF(J97=42,'[1]Equivalencia BH-BMPT'!$D$43,IF(J97=43,'[1]Equivalencia BH-BMPT'!$D$44,IF(J97=44,'[1]Equivalencia BH-BMPT'!$D$45,IF(J97=45,'[1]Equivalencia BH-BMPT'!$D$46,\"No ha seleccionado un número de programa\")))))))))))))))))))))))))))))))))))))))))))))","v":"Mejor movilidad para todos"},1338,1020818420,"SERGIO  ESPINEL ORJUELA",4821600,null,null,null,0,4821600,2558400,"2017-09-24","2017-10-23","2018-01-30",98,0,null,null,"X",null,null,0.53061224489795922]
[75,2017,"CPS 075 2017 ",5,{"$f":"IF(D98=1,'[1]Tipo '!$B$2,IF(D98=2,'[1]Tipo '!$B$3,IF(D98=3,'[1]Tipo '!$B$4,IF(D98=4,'[1]Tipo '!$B$5,IF(D98=5,'[1]Tipo '!$B$6,IF(D98=6,'[1]Tipo '!$B$7,IF(D98=7,'[1]Tipo '!$B$8,IF(D98=8,'[1]Tipo '!$B$9,IF(D98=9,'[1]Tipo '!$B$10,IF(D98=10,'[1]Tipo '!$B$11,IF(D98=11,'[1]Tipo '!$B$12,IF(D98=12,'[1]Tipo '!$B$13,IF(D98=13,'[1]Tipo '!$B$14,IF(D98=14,'[1]Tipo '!$B$15,IF(D98=15,'[1]Tipo '!$B$16,IF(D98=16,'[1]Tipo '!$B$17,IF(D98=17,'[1]Tipo '!$B$18,IF(D98=18,'[1]Tipo '!$B$19,IF(D98=19,'[1]Tipo '!$B$20,\"No ha seleccionado un tipo de contrato válido\")))))))))))))))))))","v":"CONTRATOS DE PRESTACIÓN DE SERVICIOS PROFESIONALES Y DE APOYO A LA GESTIÓN"},"CONTRATACIÓN DIRECTA","Prestación de servicios profesionales y de apoyo a la gestión, o para la ejecución de trabajos artísticos que sólo puedan encomendarse a determinadas personas naturales;","OBJETO: El contrato que se pretende celebrar, tendrá por objeto ¿Prestación de servicios de apoyo de logística que se requieran en el desarrollo de las actividades relativas a recuperación y embellecimiento del espacio público dentro del proyecto 1338 Teusaquillo Mejor para la conservación de la malla vial local y Espacio Público Peatonal¿.","INVERSIÓN",18,{"$f":"IF(J98=1,'[1]Equivalencia BH-BMPT'!$D$2,IF(J98=2,'[1]Equivalencia BH-BMPT'!$D$3,IF(J98=3,'[1]Equivalencia BH-BMPT'!$D$4,IF(J98=4,'[1]Equivalencia BH-BMPT'!$D$5,IF(J98=5,'[1]Equivalencia BH-BMPT'!$D$6,IF(J98=6,'[1]Equivalencia BH-BMPT'!$D$7,IF(J98=7,'[1]Equivalencia BH-BMPT'!$D$8,IF(J98=8,'[1]Equivalencia BH-BMPT'!$D$9,IF(J98=9,'[1]Equivalencia BH-BMPT'!$D$10,IF(J98=10,'[1]Equivalencia BH-BMPT'!$D$11,IF(J98=11,'[1]Equivalencia BH-BMPT'!$D$12,IF(J98=12,'[1]Equivalencia BH-BMPT'!$D$13,IF(J98=13,'[1]Equivalencia BH-BMPT'!$D$14,IF(J98=14,'[1]Equivalencia BH-BMPT'!$D$15,IF(J98=15,'[1]Equivalencia BH-BMPT'!$D$16,IF(J98=16,'[1]Equivalencia BH-BMPT'!$D$17,IF(J98=17,'[1]Equivalencia BH-BMPT'!$D$18,IF(J98=18,'[1]Equivalencia BH-BMPT'!$D$19,IF(J98=19,'[1]Equivalencia BH-BMPT'!$D$20,IF(J98=20,'[1]Equivalencia BH-BMPT'!$D$21,IF(J98=21,'[1]Equivalencia BH-BMPT'!$D$22,IF(J98=22,'[1]Equivalencia BH-BMPT'!$D$23,IF(J98=23,'[1]Equivalencia BH-BMPT'!#REF!,IF(J98=24,'[1]Equivalencia BH-BMPT'!$D$25,IF(J98=25,'[1]Equivalencia BH-BMPT'!$D$26,IF(J98=26,'[1]Equivalencia BH-BMPT'!$D$27,IF(J98=27,'[1]Equivalencia BH-BMPT'!$D$28,IF(J98=28,'[1]Equivalencia BH-BMPT'!$D$29,IF(J98=29,'[1]Equivalencia BH-BMPT'!$D$30,IF(J98=30,'[1]Equivalencia BH-BMPT'!$D$31,IF(J98=31,'[1]Equivalencia BH-BMPT'!$D$32,IF(J98=32,'[1]Equivalencia BH-BMPT'!$D$33,IF(J98=33,'[1]Equivalencia BH-BMPT'!$D$34,IF(J98=34,'[1]Equivalencia BH-BMPT'!$D$35,IF(J98=35,'[1]Equivalencia BH-BMPT'!$D$36,IF(J98=36,'[1]Equivalencia BH-BMPT'!$D$37,IF(J98=37,'[1]Equivalencia BH-BMPT'!$D$38,IF(J98=38,'[1]Equivalencia BH-BMPT'!#REF!,IF(J98=39,'[1]Equivalencia BH-BMPT'!$D$40,IF(J98=40,'[1]Equivalencia BH-BMPT'!$D$41,IF(J98=41,'[1]Equivalencia BH-BMPT'!$D$42,IF(J98=42,'[1]Equivalencia BH-BMPT'!$D$43,IF(J98=43,'[1]Equivalencia BH-BMPT'!$D$44,IF(J98=44,'[1]Equivalencia BH-BMPT'!$D$45,IF(J98=45,'[1]Equivalencia BH-BMPT'!$D$46,\"No ha seleccionado un número de programa\")))))))))))))))))))))))))))))))))))))))))))))","v":"Mejor movilidad para todos"},1338,16289948,"EDWAR ENRIQUE MEJIA YANGUAS",4821600,null,null,null,0,4821600,2558400,"2017-09-24","2017-10-23","2018-01-30",98,0,null,null,"X",null,null,0.53061224489795922]
[76,2016,null,4,{"$f":"IF(D99=1,'[1]Tipo '!$B$2,IF(D99=2,'[1]Tipo '!$B$3,IF(D99=3,'[1]Tipo '!$B$4,IF(D99=4,'[1]Tipo '!$B$5,IF(D99=5,'[1]Tipo '!$B$6,IF(D99=6,'[1]Tipo '!$B$7,IF(D99=7,'[1]Tipo '!$B$8,IF(D99=8,'[1]Tipo '!$B$9,IF(D99=9,'[1]Tipo '!$B$10,IF(D99=10,'[1]Tipo '!$B$11,IF(D99=11,'[1]Tipo '!$B$12,IF(D99=12,'[1]Tipo '!$B$13,IF(D99=13,'[1]Tipo '!$B$14,IF(D99=14,'[1]Tipo '!$B$15,IF(D99=15,'[1]Tipo '!$B$16,IF(D99=16,'[1]Tipo '!$B$17,IF(D99=17,'[1]Tipo '!$B$18,IF(D99=18,'[1]Tipo '!$B$19,IF(D99=19,'[1]Tipo '!$B$20,\"No ha seleccionado un tipo de contrato válido\")))))))))))))))))))","v":"CONTRATOS DE PRESTACIÓN DE SERVICIOS"},"CONTRATACIÓN DIRECTA","Cuando no exista pluralidad de oferentes en el mercado","Adición N° 1 del Contrato N° 076-2016 ¿Prestación del Servicio de Comunicación de AVANTEL de radio y telefonía por el sistema IDEN para la Alcaldía Local de Teusaquillo las 24 horas de manera confidencial, permanente e interrumpida, así como la renovación tecnológica para los 16 (Dieciséis) equipos actuales pertenecientes al FDL.","FUNCIONAMIENTO",null,{"$f":"IF(J99=1,'[1]Equivalencia BH-BMPT'!$D$2,IF(J99=2,'[1]Equivalencia BH-BMPT'!$D$3,IF(J99=3,'[1]Equivalencia BH-BMPT'!$D$4,IF(J99=4,'[1]Equivalencia BH-BMPT'!$D$5,IF(J99=5,'[1]Equivalencia BH-BMPT'!$D$6,IF(J99=6,'[1]Equivalencia BH-BMPT'!$D$7,IF(J99=7,'[1]Equivalencia BH-BMPT'!$D$8,IF(J99=8,'[1]Equivalencia BH-BMPT'!$D$9,IF(J99=9,'[1]Equivalencia BH-BMPT'!$D$10,IF(J99=10,'[1]Equivalencia BH-BMPT'!$D$11,IF(J99=11,'[1]Equivalencia BH-BMPT'!$D$12,IF(J99=12,'[1]Equivalencia BH-BMPT'!$D$13,IF(J99=13,'[1]Equivalencia BH-BMPT'!$D$14,IF(J99=14,'[1]Equivalencia BH-BMPT'!$D$15,IF(J99=15,'[1]Equivalencia BH-BMPT'!$D$16,IF(J99=16,'[1]Equivalencia BH-BMPT'!$D$17,IF(J99=17,'[1]Equivalencia BH-BMPT'!$D$18,IF(J99=18,'[1]Equivalencia BH-BMPT'!$D$19,IF(J99=19,'[1]Equivalencia BH-BMPT'!$D$20,IF(J99=20,'[1]Equivalencia BH-BMPT'!$D$21,IF(J99=21,'[1]Equivalencia BH-BMPT'!$D$22,IF(J99=22,'[1]Equivalencia BH-BMPT'!$D$23,IF(J99=23,'[1]Equivalencia BH-BMPT'!#REF!,IF(J99=24,'[1]Equivalencia BH-BMPT'!$D$25,IF(J99=25,'[1]Equivalencia BH-BMPT'!$D$26,IF(J99=26,'[1]Equivalencia BH-BMPT'!$D$27,IF(J99=27,'[1]Equivalencia BH-BMPT'!$D$28,IF(J99=28,'[1]Equivalencia BH-BMPT'!$D$29,IF(J99=29,'[1]Equivalencia BH-BMPT'!$D$30,IF(J99=30,'[1]Equivalencia BH-BMPT'!$D$31,IF(J99=31,'[1]Equivalencia BH-BMPT'!$D$32,IF(J99=32,'[1]Equivalencia BH-BMPT'!$D$33,IF(J99=33,'[1]Equivalencia BH-BMPT'!$D$34,IF(J99=34,'[1]Equivalencia BH-BMPT'!$D$35,IF(J99=35,'[1]Equivalencia BH-BMPT'!$D$36,IF(J99=36,'[1]Equivalencia BH-BMPT'!$D$37,IF(J99=37,'[1]Equivalencia BH-BMPT'!$D$38,IF(J99=38,'[1]Equivalencia BH-BMPT'!#REF!,IF(J99=39,'[1]Equivalencia BH-BMPT'!$D$40,IF(J99=40,'[1]Equivalencia BH-BMPT'!$D$41,IF(J99=41,'[1]Equivalencia BH-BMPT'!$D$42,IF(J99=42,'[1]Equivalencia BH-BMPT'!$D$43,IF(J99=43,'[1]Equivalencia BH-BMPT'!$D$44,IF(J99=44,'[1]Equivalencia BH-BMPT'!$D$45,IF(J99=45,'[1]Equivalencia BH-BMPT'!$D$46,\"No ha seleccionado un número de programa\")))))))))))))))))))))))))))))))))))))))))))))","v":"No ha seleccionado un número de programa"},null,830016046,"AVANTEL S A S",null,null,null,null,4500000,4500000,0,"2016-12-15","2016-12-16","2018-03-15",306,90,null,null,"X",null,null,0]
[76,2017,"CPS 076 2017 ",5,{"$f":"IF(D100=1,'[1]Tipo '!$B$2,IF(D100=2,'[1]Tipo '!$B$3,IF(D100=3,'[1]Tipo '!$B$4,IF(D100=4,'[1]Tipo '!$B$5,IF(D100=5,'[1]Tipo '!$B$6,IF(D100=6,'[1]Tipo '!$B$7,IF(D100=7,'[1]Tipo '!$B$8,IF(D100=8,'[1]Tipo '!$B$9,IF(D100=9,'[1]Tipo '!$B$10,IF(D100=10,'[1]Tipo '!$B$11,IF(D100=11,'[1]Tipo '!$B$12,IF(D100=12,'[1]Tipo '!$B$13,IF(D100=13,'[1]Tipo '!$B$14,IF(D100=14,'[1]Tipo '!$B$15,IF(D100=15,'[1]Tipo '!$B$16,IF(D100=16,'[1]Tipo '!$B$17,IF(D100=17,'[1]Tipo '!$B$18,IF(D100=18,'[1]Tipo '!$B$19,IF(D100=19,'[1]Tipo '!$B$20,\"No ha seleccionado un tipo de contrato válido\")))))))))))))))))))","v":"CONTRATOS DE PRESTACIÓN DE SERVICIOS PROFESIONALES Y DE APOYO A LA GESTIÓN"},"CONTRATACIÓN DIRECTA","Prestación de servicios profesionales y de apoyo a la gestión, o para la ejecución de trabajos artísticos que sólo puedan encomendarse a determinadas personas naturales;","El contrato que se pretende celebrar, tendrá por objeto ¿Prestación de servicios de apoyo de logística que se requieran en el desarrollo de las actividades relativas a recuperación y embellecimiento del espacio público dentro del proyecto 1338 Teusaquillo Mejor para la conservación de la malla vial local y Espacio Público Peatonal¿.","INVERSIÓN",18,{"$f":"IF(J100=1,'[1]Equivalencia BH-BMPT'!$D$2,IF(J100=2,'[1]Equivalencia BH-BMPT'!$D$3,IF(J100=3,'[1]Equivalencia BH-BMPT'!$D$4,IF(J100=4,'[1]Equivalencia BH-BMPT'!$D$5,IF(J100=5,'[1]Equivalencia BH-BMPT'!$D$6,IF(J100=6,'[1]Equivalencia BH-BMPT'!$D$7,IF(J100=7,'[1]Equivalencia BH-BMPT'!$D$8,IF(J100=8,'[1]Equivalencia BH-BMPT'!$D$9,IF(J100=9,'[1]Equivalencia BH-BMPT'!$D$10,IF(J100=10,'[1]Equivalencia BH-BMPT'!$D$11,IF(J100=11,'[1]Equivalencia BH-BMPT'!$D$12,IF(J100=12,'[1]Equivalencia BH-BMPT'!$D$13,IF(J100=13,'[1]Equivalencia BH-BMPT'!$D$14,IF(J100=14,'[1]Equivalencia BH-BMPT'!$D$15,IF(J100=15,'[1]Equivalencia BH-BMPT'!$D$16,IF(J100=16,'[1]Equivalencia BH-BMPT'!$D$17,IF(J100=17,'[1]Equivalencia BH-BMPT'!$D$18,IF(J100=18,'[1]Equivalencia BH-BMPT'!$D$19,IF(J100=19,'[1]Equivalencia BH-BMPT'!$D$20,IF(J100=20,'[1]Equivalencia BH-BMPT'!$D$21,IF(J100=21,'[1]Equivalencia BH-BMPT'!$D$22,IF(J100=22,'[1]Equivalencia BH-BMPT'!$D$23,IF(J100=23,'[1]Equivalencia BH-BMPT'!#REF!,IF(J100=24,'[1]Equivalencia BH-BMPT'!$D$25,IF(J100=25,'[1]Equivalencia BH-BMPT'!$D$26,IF(J100=26,'[1]Equivalencia BH-BMPT'!$D$27,IF(J100=27,'[1]Equivalencia BH-BMPT'!$D$28,IF(J100=28,'[1]Equivalencia BH-BMPT'!$D$29,IF(J100=29,'[1]Equivalencia BH-BMPT'!$D$30,IF(J100=30,'[1]Equivalencia BH-BMPT'!$D$31,IF(J100=31,'[1]Equivalencia BH-BMPT'!$D$32,IF(J100=32,'[1]Equivalencia BH-BMPT'!$D$33,IF(J100=33,'[1]Equivalencia BH-BMPT'!$D$34,IF(J100=34,'[1]Equivalencia BH-BMPT'!$D$35,IF(J100=35,'[1]Equivalencia BH-BMPT'!$D$36,IF(J100=36,'[1]Equivalencia BH-BMPT'!$D$37,IF(J100=37,'[1]Equivalencia BH-BMPT'!$D$38,IF(J100=38,'[1]Equivalencia BH-BMPT'!#REF!,IF(J100=39,'[1]Equivalencia BH-BMPT'!$D$40,IF(J100=40,'[1]Equivalencia BH-BMPT'!$D$41,IF(J100=41,'[1]Equivalencia BH-BMPT'!$D$42,IF(J100=42,'[1]Equivalencia BH-BMPT'!$D$43,IF(J100=43,'[1]Equivalencia BH-BMPT'!$D$44,IF(J100=44,'[1]Equivalencia BH-BMPT'!$D$45,IF(J100=45,'[1]Equivalencia BH-BMPT'!$D$46,\"No ha seleccionado un número de programa\")))))))))))))))))))))))))))))))))))))))))))))","v":"Mejor movilidad para todos"},1338,1049605658,"ROBERTO CARLOS DAZA DAZA",4821600,null,null,null,0,4821600,2558400,"2017-09-24","2017-10-23","2018-01-30",{"$f":"8+90","v":98},0,null,null,"X",null,null,0.53061224489795922]
[77,2017,"CPS 077 2017 ",5,{"$f":"IF(D101=1,'[1]Tipo '!$B$2,IF(D101=2,'[1]Tipo '!$B$3,IF(D101=3,'[1]Tipo '!$B$4,IF(D101=4,'[1]Tipo '!$B$5,IF(D101=5,'[1]Tipo '!$B$6,IF(D101=6,'[1]Tipo '!$B$7,IF(D101=7,'[1]Tipo '!$B$8,IF(D101=8,'[1]Tipo '!$B$9,IF(D101=9,'[1]Tipo '!$B$10,IF(D101=10,'[1]Tipo '!$B$11,IF(D101=11,'[1]Tipo '!$B$12,IF(D101=12,'[1]Tipo '!$B$13,IF(D101=13,'[1]Tipo '!$B$14,IF(D101=14,'[1]Tipo '!$B$15,IF(D101=15,'[1]Tipo '!$B$16,IF(D101=16,'[1]Tipo '!$B$17,IF(D101=17,'[1]Tipo '!$B$18,IF(D101=18,'[1]Tipo '!$B$19,IF(D101=19,'[1]Tipo '!$B$20,\"No ha seleccionado un tipo de contrato válido\")))))))))))))))))))","v":"CONTRATOS DE PRESTACIÓN DE SERVICIOS PROFESIONALES Y DE APOYO A LA GESTIÓN"},"CONTRATACIÓN DIRECTA","Prestación de servicios profesionales y de apoyo a la gestión, o para la ejecución de trabajos artísticos que sólo puedan encomendarse a determinadas personas naturales;","¿Prestación de servicios para coordinar las acciones que se requieran en el desarrollo de las actividades relativas a recuperación y embellecimiento del espacio público dentro del Proyecto 1338 Teusaquillo Mejor para la conservación de la Malla Vial Local y Espacio Público Peatonal¿.","INVERSIÓN",18,{"$f":"IF(J101=1,'[1]Equivalencia BH-BMPT'!$D$2,IF(J101=2,'[1]Equivalencia BH-BMPT'!$D$3,IF(J101=3,'[1]Equivalencia BH-BMPT'!$D$4,IF(J101=4,'[1]Equivalencia BH-BMPT'!$D$5,IF(J101=5,'[1]Equivalencia BH-BMPT'!$D$6,IF(J101=6,'[1]Equivalencia BH-BMPT'!$D$7,IF(J101=7,'[1]Equivalencia BH-BMPT'!$D$8,IF(J101=8,'[1]Equivalencia BH-BMPT'!$D$9,IF(J101=9,'[1]Equivalencia BH-BMPT'!$D$10,IF(J101=10,'[1]Equivalencia BH-BMPT'!$D$11,IF(J101=11,'[1]Equivalencia BH-BMPT'!$D$12,IF(J101=12,'[1]Equivalencia BH-BMPT'!$D$13,IF(J101=13,'[1]Equivalencia BH-BMPT'!$D$14,IF(J101=14,'[1]Equivalencia BH-BMPT'!$D$15,IF(J101=15,'[1]Equivalencia BH-BMPT'!$D$16,IF(J101=16,'[1]Equivalencia BH-BMPT'!$D$17,IF(J101=17,'[1]Equivalencia BH-BMPT'!$D$18,IF(J101=18,'[1]Equivalencia BH-BMPT'!$D$19,IF(J101=19,'[1]Equivalencia BH-BMPT'!$D$20,IF(J101=20,'[1]Equivalencia BH-BMPT'!$D$21,IF(J101=21,'[1]Equivalencia BH-BMPT'!$D$22,IF(J101=22,'[1]Equivalencia BH-BMPT'!$D$23,IF(J101=23,'[1]Equivalencia BH-BMPT'!#REF!,IF(J101=24,'[1]Equivalencia BH-BMPT'!$D$25,IF(J101=25,'[1]Equivalencia BH-BMPT'!$D$26,IF(J101=26,'[1]Equivalencia BH-BMPT'!$D$27,IF(J101=27,'[1]Equivalencia BH-BMPT'!$D$28,IF(J101=28,'[1]Equivalencia BH-BMPT'!$D$29,IF(J101=29,'[1]Equivalencia BH-BMPT'!$D$30,IF(J101=30,'[1]Equivalencia BH-BMPT'!$D$31,IF(J101=31,'[1]Equivalencia BH-BMPT'!$D$32,IF(J101=32,'[1]Equivalencia BH-BMPT'!$D$33,IF(J101=33,'[1]Equivalencia BH-BMPT'!$D$34,IF(J101=34,'[1]Equivalencia BH-BMPT'!$D$35,IF(J101=35,'[1]Equivalencia BH-BMPT'!$D$36,IF(J101=36,'[1]Equivalencia BH-BMPT'!$D$37,IF(J101=37,'[1]Equivalencia BH-BMPT'!$D$38,IF(J101=38,'[1]Equivalencia BH-BMPT'!#REF!,IF(J101=39,'[1]Equivalencia BH-BMPT'!$D$40,IF(J101=40,'[1]Equivalencia BH-BMPT'!$D$41,IF(J101=41,'[1]Equivalencia BH-BMPT'!$D$42,IF(J101=42,'[1]Equivalencia BH-BMPT'!$D$43,IF(J101=43,'[1]Equivalencia BH-BMPT'!$D$44,IF(J101=44,'[1]Equivalencia BH-BMPT'!$D$45,IF(J101=45,'[1]Equivalencia BH-BMPT'!$D$46,\"No ha seleccionado un número de programa\")))))))))))))))))))))))))))))))))))))))))))))","v":"Mejor movilidad para todos"},1338,17387532,"JOSE VICENTE ESCOBAR HIGUERA",6984133,null,null,null,0,6984133,3705867,"2017-09-22","2017-10-23","2018-01-30",98,0,null,null,"X",null,null,0.53061231794984431]
[78,2017,"CPS 078 2017 ",5,{"$f":"IF(D102=1,'[1]Tipo '!$B$2,IF(D102=2,'[1]Tipo '!$B$3,IF(D102=3,'[1]Tipo '!$B$4,IF(D102=4,'[1]Tipo '!$B$5,IF(D102=5,'[1]Tipo '!$B$6,IF(D102=6,'[1]Tipo '!$B$7,IF(D102=7,'[1]Tipo '!$B$8,IF(D102=8,'[1]Tipo '!$B$9,IF(D102=9,'[1]Tipo '!$B$10,IF(D102=10,'[1]Tipo '!$B$11,IF(D102=11,'[1]Tipo '!$B$12,IF(D102=12,'[1]Tipo '!$B$13,IF(D102=13,'[1]Tipo '!$B$14,IF(D102=14,'[1]Tipo '!$B$15,IF(D102=15,'[1]Tipo '!$B$16,IF(D102=16,'[1]Tipo '!$B$17,IF(D102=17,'[1]Tipo '!$B$18,IF(D102=18,'[1]Tipo '!$B$19,IF(D102=19,'[1]Tipo '!$B$20,\"No ha seleccionado un tipo de contrato válido\")))))))))))))))))))","v":"CONTRATOS DE PRESTACIÓN DE SERVICIOS PROFESIONALES Y DE APOYO A LA GESTIÓN"},"CONTRATACIÓN DIRECTA","Prestación de servicios profesionales y de apoyo a la gestión, o para la ejecución de trabajos artísticos que sólo puedan encomendarse a determinadas personas naturales;","OBJETO: El contrato que se pretende celebrar, tendrá por objeto ¿Apoyar las labores de entrega y recibo de las comunicaciones emitidas o recibidas por la Alcaldía Local de Teusaquillo¿.","INVERSIÓN",45,{"$f":"IF(J102=1,'[1]Equivalencia BH-BMPT'!$D$2,IF(J102=2,'[1]Equivalencia BH-BMPT'!$D$3,IF(J102=3,'[1]Equivalencia BH-BMPT'!$D$4,IF(J102=4,'[1]Equivalencia BH-BMPT'!$D$5,IF(J102=5,'[1]Equivalencia BH-BMPT'!$D$6,IF(J102=6,'[1]Equivalencia BH-BMPT'!$D$7,IF(J102=7,'[1]Equivalencia BH-BMPT'!$D$8,IF(J102=8,'[1]Equivalencia BH-BMPT'!$D$9,IF(J102=9,'[1]Equivalencia BH-BMPT'!$D$10,IF(J102=10,'[1]Equivalencia BH-BMPT'!$D$11,IF(J102=11,'[1]Equivalencia BH-BMPT'!$D$12,IF(J102=12,'[1]Equivalencia BH-BMPT'!$D$13,IF(J102=13,'[1]Equivalencia BH-BMPT'!$D$14,IF(J102=14,'[1]Equivalencia BH-BMPT'!$D$15,IF(J102=15,'[1]Equivalencia BH-BMPT'!$D$16,IF(J102=16,'[1]Equivalencia BH-BMPT'!$D$17,IF(J102=17,'[1]Equivalencia BH-BMPT'!$D$18,IF(J102=18,'[1]Equivalencia BH-BMPT'!$D$19,IF(J102=19,'[1]Equivalencia BH-BMPT'!$D$20,IF(J102=20,'[1]Equivalencia BH-BMPT'!$D$21,IF(J102=21,'[1]Equivalencia BH-BMPT'!$D$22,IF(J102=22,'[1]Equivalencia BH-BMPT'!$D$23,IF(J102=23,'[1]Equivalencia BH-BMPT'!#REF!,IF(J102=24,'[1]Equivalencia BH-BMPT'!$D$25,IF(J102=25,'[1]Equivalencia BH-BMPT'!$D$26,IF(J102=26,'[1]Equivalencia BH-BMPT'!$D$27,IF(J102=27,'[1]Equivalencia BH-BMPT'!$D$28,IF(J102=28,'[1]Equivalencia BH-BMPT'!$D$29,IF(J102=29,'[1]Equivalencia BH-BMPT'!$D$30,IF(J102=30,'[1]Equivalencia BH-BMPT'!$D$31,IF(J102=31,'[1]Equivalencia BH-BMPT'!$D$32,IF(J102=32,'[1]Equivalencia BH-BMPT'!$D$33,IF(J102=33,'[1]Equivalencia BH-BMPT'!$D$34,IF(J102=34,'[1]Equivalencia BH-BMPT'!$D$35,IF(J102=35,'[1]Equivalencia BH-BMPT'!$D$36,IF(J102=36,'[1]Equivalencia BH-BMPT'!$D$37,IF(J102=37,'[1]Equivalencia BH-BMPT'!$D$38,IF(J102=38,'[1]Equivalencia BH-BMPT'!#REF!,IF(J102=39,'[1]Equivalencia BH-BMPT'!$D$40,IF(J102=40,'[1]Equivalencia BH-BMPT'!$D$41,IF(J102=41,'[1]Equivalencia BH-BMPT'!$D$42,IF(J102=42,'[1]Equivalencia BH-BMPT'!$D$43,IF(J102=43,'[1]Equivalencia BH-BMPT'!$D$44,IF(J102=44,'[1]Equivalencia BH-BMPT'!$D$45,IF(J102=45,'[1]Equivalencia BH-BMPT'!$D$46,\"No ha seleccionado un número de programa\")))))))))))))))))))))))))))))))))))))))))))))","v":"Gobernanza e influencia local, regional e internacional"},1329,51985575,"MARTHA ISABEL BLANCO JURADO",6266667,null,null,null,733333,7000000,5200000,"2017-09-27","2017-09-27","2018-01-10",94,11,null,null,"X",null,null,0.74285714285714288,null,null,null,null,0.74285714285714288]
[79,2017,"SAMC 010 2017 ",10,{"$f":"IF(D103=1,'[1]Tipo '!$B$2,IF(D103=2,'[1]Tipo '!$B$3,IF(D103=3,'[1]Tipo '!$B$4,IF(D103=4,'[1]Tipo '!$B$5,IF(D103=5,'[1]Tipo '!$B$6,IF(D103=6,'[1]Tipo '!$B$7,IF(D103=7,'[1]Tipo '!$B$8,IF(D103=8,'[1]Tipo '!$B$9,IF(D103=9,'[1]Tipo '!$B$10,IF(D103=10,'[1]Tipo '!$B$11,IF(D103=11,'[1]Tipo '!$B$12,IF(D103=12,'[1]Tipo '!$B$13,IF(D103=13,'[1]Tipo '!$B$14,IF(D103=14,'[1]Tipo '!$B$15,IF(D103=15,'[1]Tipo '!$B$16,IF(D103=16,'[1]Tipo '!$B$17,IF(D103=17,'[1]Tipo '!$B$18,IF(D103=18,'[1]Tipo '!$B$19,IF(D103=19,'[1]Tipo '!$B$20,\"No ha seleccionado un tipo de contrato válido\")))))))))))))))))))","v":"SEGUROS"},"Selección abreviada ","Selección abreviada por menor cuantía ","Adquirir la póliza de vida grupo de ediles de la Localidad de Teusaquillo, con compañías de seguros generales y/o de vida legalmente constituidas en Colombia, de acuerdo a los presentes estudios previos y pliego de condiciones¿","FUNCIONAMIENTO",null,{"$f":"IF(J103=1,'[1]Equivalencia BH-BMPT'!$D$2,IF(J103=2,'[1]Equivalencia BH-BMPT'!$D$3,IF(J103=3,'[1]Equivalencia BH-BMPT'!$D$4,IF(J103=4,'[1]Equivalencia BH-BMPT'!$D$5,IF(J103=5,'[1]Equivalencia BH-BMPT'!$D$6,IF(J103=6,'[1]Equivalencia BH-BMPT'!$D$7,IF(J103=7,'[1]Equivalencia BH-BMPT'!$D$8,IF(J103=8,'[1]Equivalencia BH-BMPT'!$D$9,IF(J103=9,'[1]Equivalencia BH-BMPT'!$D$10,IF(J103=10,'[1]Equivalencia BH-BMPT'!$D$11,IF(J103=11,'[1]Equivalencia BH-BMPT'!$D$12,IF(J103=12,'[1]Equivalencia BH-BMPT'!$D$13,IF(J103=13,'[1]Equivalencia BH-BMPT'!$D$14,IF(J103=14,'[1]Equivalencia BH-BMPT'!$D$15,IF(J103=15,'[1]Equivalencia BH-BMPT'!$D$16,IF(J103=16,'[1]Equivalencia BH-BMPT'!$D$17,IF(J103=17,'[1]Equivalencia BH-BMPT'!$D$18,IF(J103=18,'[1]Equivalencia BH-BMPT'!$D$19,IF(J103=19,'[1]Equivalencia BH-BMPT'!$D$20,IF(J103=20,'[1]Equivalencia BH-BMPT'!$D$21,IF(J103=21,'[1]Equivalencia BH-BMPT'!$D$22,IF(J103=22,'[1]Equivalencia BH-BMPT'!$D$23,IF(J103=23,'[1]Equivalencia BH-BMPT'!#REF!,IF(J103=24,'[1]Equivalencia BH-BMPT'!$D$25,IF(J103=25,'[1]Equivalencia BH-BMPT'!$D$26,IF(J103=26,'[1]Equivalencia BH-BMPT'!$D$27,IF(J103=27,'[1]Equivalencia BH-BMPT'!$D$28,IF(J103=28,'[1]Equivalencia BH-BMPT'!$D$29,IF(J103=29,'[1]Equivalencia BH-BMPT'!$D$30,IF(J103=30,'[1]Equivalencia BH-BMPT'!$D$31,IF(J103=31,'[1]Equivalencia BH-BMPT'!$D$32,IF(J103=32,'[1]Equivalencia BH-BMPT'!$D$33,IF(J103=33,'[1]Equivalencia BH-BMPT'!$D$34,IF(J103=34,'[1]Equivalencia BH-BMPT'!$D$35,IF(J103=35,'[1]Equivalencia BH-BMPT'!$D$36,IF(J103=36,'[1]Equivalencia BH-BMPT'!$D$37,IF(J103=37,'[1]Equivalencia BH-BMPT'!$D$38,IF(J103=38,'[1]Equivalencia BH-BMPT'!#REF!,IF(J103=39,'[1]Equivalencia BH-BMPT'!$D$40,IF(J103=40,'[1]Equivalencia BH-BMPT'!$D$41,IF(J103=41,'[1]Equivalencia BH-BMPT'!$D$42,IF(J103=42,'[1]Equivalencia BH-BMPT'!$D$43,IF(J103=43,'[1]Equivalencia BH-BMPT'!$D$44,IF(J103=44,'[1]Equivalencia BH-BMPT'!$D$45,IF(J103=45,'[1]Equivalencia BH-BMPT'!$D$46,\"No ha seleccionado un número de programa\")))))))))))))))))))))))))))))))))))))))))))))","v":"No ha seleccionado un número de programa"},null,860002400,"LA PREVISORA S A COMPAÑIA DE SEGUROS",5200000,null,null,null,0,5200000,5200000,"2017-09-27","2017-10-04","2018-07-03",270,0,null,null,"X",null,null,1,null,null,null,null,1]
[80,2017,"SAMC 009 2017 ",4,{"$f":"IF(D104=1,'[1]Tipo '!$B$2,IF(D104=2,'[1]Tipo '!$B$3,IF(D104=3,'[1]Tipo '!$B$4,IF(D104=4,'[1]Tipo '!$B$5,IF(D104=5,'[1]Tipo '!$B$6,IF(D104=6,'[1]Tipo '!$B$7,IF(D104=7,'[1]Tipo '!$B$8,IF(D104=8,'[1]Tipo '!$B$9,IF(D104=9,'[1]Tipo '!$B$10,IF(D104=10,'[1]Tipo '!$B$11,IF(D104=11,'[1]Tipo '!$B$12,IF(D104=12,'[1]Tipo '!$B$13,IF(D104=13,'[1]Tipo '!$B$14,IF(D104=14,'[1]Tipo '!$B$15,IF(D104=15,'[1]Tipo '!$B$16,IF(D104=16,'[1]Tipo '!$B$17,IF(D104=17,'[1]Tipo '!$B$18,IF(D104=18,'[1]Tipo '!$B$19,IF(D104=19,'[1]Tipo '!$B$20,\"No ha seleccionado un tipo de contrato válido\")))))))))))))))))))","v":"CONTRATOS DE PRESTACIÓN DE SERVICIOS"},"Selección abreviada ","Selección abreviada por menor cuantía ","OBJETO: El contrato que se pretende celebrar, tendrá por objeto: ¿Realizar actividades en torno a la primera Infancia con el desarrollo de acciones de buen trato con un enfoque integral donde se incluyan acciones educativas, de acuerdo a los presentes estudios previos, anexo técnico y pliego de condiciones¿","INVERSIÓN",2,{"$f":"IF(J104=1,'[1]Equivalencia BH-BMPT'!$D$2,IF(J104=2,'[1]Equivalencia BH-BMPT'!$D$3,IF(J104=3,'[1]Equivalencia BH-BMPT'!$D$4,IF(J104=4,'[1]Equivalencia BH-BMPT'!$D$5,IF(J104=5,'[1]Equivalencia BH-BMPT'!$D$6,IF(J104=6,'[1]Equivalencia BH-BMPT'!$D$7,IF(J104=7,'[1]Equivalencia BH-BMPT'!$D$8,IF(J104=8,'[1]Equivalencia BH-BMPT'!$D$9,IF(J104=9,'[1]Equivalencia BH-BMPT'!$D$10,IF(J104=10,'[1]Equivalencia BH-BMPT'!$D$11,IF(J104=11,'[1]Equivalencia BH-BMPT'!$D$12,IF(J104=12,'[1]Equivalencia BH-BMPT'!$D$13,IF(J104=13,'[1]Equivalencia BH-BMPT'!$D$14,IF(J104=14,'[1]Equivalencia BH-BMPT'!$D$15,IF(J104=15,'[1]Equivalencia BH-BMPT'!$D$16,IF(J104=16,'[1]Equivalencia BH-BMPT'!$D$17,IF(J104=17,'[1]Equivalencia BH-BMPT'!$D$18,IF(J104=18,'[1]Equivalencia BH-BMPT'!$D$19,IF(J104=19,'[1]Equivalencia BH-BMPT'!$D$20,IF(J104=20,'[1]Equivalencia BH-BMPT'!$D$21,IF(J104=21,'[1]Equivalencia BH-BMPT'!$D$22,IF(J104=22,'[1]Equivalencia BH-BMPT'!$D$23,IF(J104=23,'[1]Equivalencia BH-BMPT'!#REF!,IF(J104=24,'[1]Equivalencia BH-BMPT'!$D$25,IF(J104=25,'[1]Equivalencia BH-BMPT'!$D$26,IF(J104=26,'[1]Equivalencia BH-BMPT'!$D$27,IF(J104=27,'[1]Equivalencia BH-BMPT'!$D$28,IF(J104=28,'[1]Equivalencia BH-BMPT'!$D$29,IF(J104=29,'[1]Equivalencia BH-BMPT'!$D$30,IF(J104=30,'[1]Equivalencia BH-BMPT'!$D$31,IF(J104=31,'[1]Equivalencia BH-BMPT'!$D$32,IF(J104=32,'[1]Equivalencia BH-BMPT'!$D$33,IF(J104=33,'[1]Equivalencia BH-BMPT'!$D$34,IF(J104=34,'[1]Equivalencia BH-BMPT'!$D$35,IF(J104=35,'[1]Equivalencia BH-BMPT'!$D$36,IF(J104=36,'[1]Equivalencia BH-BMPT'!$D$37,IF(J104=37,'[1]Equivalencia BH-BMPT'!$D$38,IF(J104=38,'[1]Equivalencia BH-BMPT'!#REF!,IF(J104=39,'[1]Equivalencia BH-BMPT'!$D$40,IF(J104=40,'[1]Equivalencia BH-BMPT'!$D$41,IF(J104=41,'[1]Equivalencia BH-BMPT'!$D$42,IF(J104=42,'[1]Equivalencia BH-BMPT'!$D$43,IF(J104=43,'[1]Equivalencia BH-BMPT'!$D$44,IF(J104=44,'[1]Equivalencia BH-BMPT'!$D$45,IF(J104=45,'[1]Equivalencia BH-BMPT'!$D$46,\"No ha seleccionado un número de programa\")))))))))))))))))))))))))))))))))))))))))))))","v":"Desarrollo integral desde la gestación hasta la adolescencia"},1335,900094963,"FUNDACION PARA EL DESARROLLO INFANTIL SOCIAL Y CULTURAL IWOKE",38000000,null,null,null,0,38000000,0,"2017-09-25","2017-10-17","2017-12-16",60,0,null,null,null,"X",null,0,null,null,null,null,0]
[81,2017,"CPS 081 2017 ",5,{"$f":"IF(D105=1,'[1]Tipo '!$B$2,IF(D105=2,'[1]Tipo '!$B$3,IF(D105=3,'[1]Tipo '!$B$4,IF(D105=4,'[1]Tipo '!$B$5,IF(D105=5,'[1]Tipo '!$B$6,IF(D105=6,'[1]Tipo '!$B$7,IF(D105=7,'[1]Tipo '!$B$8,IF(D105=8,'[1]Tipo '!$B$9,IF(D105=9,'[1]Tipo '!$B$10,IF(D105=10,'[1]Tipo '!$B$11,IF(D105=11,'[1]Tipo '!$B$12,IF(D105=12,'[1]Tipo '!$B$13,IF(D105=13,'[1]Tipo '!$B$14,IF(D105=14,'[1]Tipo '!$B$15,IF(D105=15,'[1]Tipo '!$B$16,IF(D105=16,'[1]Tipo '!$B$17,IF(D105=17,'[1]Tipo '!$B$18,IF(D105=18,'[1]Tipo '!$B$19,IF(D105=19,'[1]Tipo '!$B$20,\"No ha seleccionado un tipo de contrato válido\")))))))))))))))))))","v":"CONTRATOS DE PRESTACIÓN DE SERVICIOS PROFESIONALES Y DE APOYO A LA GESTIÓN"},"CONTRATACIÓN DIRECTA","Prestación de servicios profesionales y de apoyo a la gestión, o para la ejecución de trabajos artísticos que sólo puedan encomendarse a determinadas personas naturales;","El contrato que se pretende celebrar, tendrá por objeto: ¿Apoyar jurídicamente la ejecución de las acciones requeridas para la depuración de las actuaciones administrativas que cursan en la Alcaldía Local de Teusaquillo ¿.","INVERSIÓN",45,{"$f":"IF(J105=1,'[1]Equivalencia BH-BMPT'!$D$2,IF(J105=2,'[1]Equivalencia BH-BMPT'!$D$3,IF(J105=3,'[1]Equivalencia BH-BMPT'!$D$4,IF(J105=4,'[1]Equivalencia BH-BMPT'!$D$5,IF(J105=5,'[1]Equivalencia BH-BMPT'!$D$6,IF(J105=6,'[1]Equivalencia BH-BMPT'!$D$7,IF(J105=7,'[1]Equivalencia BH-BMPT'!$D$8,IF(J105=8,'[1]Equivalencia BH-BMPT'!$D$9,IF(J105=9,'[1]Equivalencia BH-BMPT'!$D$10,IF(J105=10,'[1]Equivalencia BH-BMPT'!$D$11,IF(J105=11,'[1]Equivalencia BH-BMPT'!$D$12,IF(J105=12,'[1]Equivalencia BH-BMPT'!$D$13,IF(J105=13,'[1]Equivalencia BH-BMPT'!$D$14,IF(J105=14,'[1]Equivalencia BH-BMPT'!$D$15,IF(J105=15,'[1]Equivalencia BH-BMPT'!$D$16,IF(J105=16,'[1]Equivalencia BH-BMPT'!$D$17,IF(J105=17,'[1]Equivalencia BH-BMPT'!$D$18,IF(J105=18,'[1]Equivalencia BH-BMPT'!$D$19,IF(J105=19,'[1]Equivalencia BH-BMPT'!$D$20,IF(J105=20,'[1]Equivalencia BH-BMPT'!$D$21,IF(J105=21,'[1]Equivalencia BH-BMPT'!$D$22,IF(J105=22,'[1]Equivalencia BH-BMPT'!$D$23,IF(J105=23,'[1]Equivalencia BH-BMPT'!#REF!,IF(J105=24,'[1]Equivalencia BH-BMPT'!$D$25,IF(J105=25,'[1]Equivalencia BH-BMPT'!$D$26,IF(J105=26,'[1]Equivalencia BH-BMPT'!$D$27,IF(J105=27,'[1]Equivalencia BH-BMPT'!$D$28,IF(J105=28,'[1]Equivalencia BH-BMPT'!$D$29,IF(J105=29,'[1]Equivalencia BH-BMPT'!$D$30,IF(J105=30,'[1]Equivalencia BH-BMPT'!$D$31,IF(J105=31,'[1]Equivalencia BH-BMPT'!$D$32,IF(J105=32,'[1]Equivalencia BH-BMPT'!$D$33,IF(J105=33,'[1]Equivalencia BH-BMPT'!$D$34,IF(J105=34,'[1]Equivalencia BH-BMPT'!$D$35,IF(J105=35,'[1]Equivalencia BH-BMPT'!$D$36,IF(J105=36,'[1]Equivalencia BH-BMPT'!$D$37,IF(J105=37,'[1]Equivalencia BH-BMPT'!$D$38,IF(J105=38,'[1]Equivalencia BH-BMPT'!#REF!,IF(J105=39,'[1]Equivalencia BH-BMPT'!$D$40,IF(J105=40,'[1]Equivalencia BH-BMPT'!$D$41,IF(J105=41,'[1]Equivalencia BH-BMPT'!$D$42,IF(J105=42,'[1]Equivalencia BH-BMPT'!$D$43,IF(J105=43,'[1]Equivalencia BH-BMPT'!$D$44,IF(J105=44,'[1]Equivalencia BH-BMPT'!$D$45,IF(J105=45,'[1]Equivalencia BH-BMPT'!$D$46,\"No ha seleccionado un número de programa\")))))))))))))))))))))))))))))))))))))))))))))","v":"Gobernanza e influencia local, regional e internacional"},1329,1016016305,"JHONATAN  DUCUARA CAITA",13500000,null,null,null,0,13500000,11400000,"2017-09-29","2017-09-29","2017-12-18",90,0,null,null,null,"X",null,0.84444444444444444,null,null,null,null,0.84444444444444444]
[82,2017,"CPS 082 2017",5,{"$f":"IF(D106=1,'[1]Tipo '!$B$2,IF(D106=2,'[1]Tipo '!$B$3,IF(D106=3,'[1]Tipo '!$B$4,IF(D106=4,'[1]Tipo '!$B$5,IF(D106=5,'[1]Tipo '!$B$6,IF(D106=6,'[1]Tipo '!$B$7,IF(D106=7,'[1]Tipo '!$B$8,IF(D106=8,'[1]Tipo '!$B$9,IF(D106=9,'[1]Tipo '!$B$10,IF(D106=10,'[1]Tipo '!$B$11,IF(D106=11,'[1]Tipo '!$B$12,IF(D106=12,'[1]Tipo '!$B$13,IF(D106=13,'[1]Tipo '!$B$14,IF(D106=14,'[1]Tipo '!$B$15,IF(D106=15,'[1]Tipo '!$B$16,IF(D106=16,'[1]Tipo '!$B$17,IF(D106=17,'[1]Tipo '!$B$18,IF(D106=18,'[1]Tipo '!$B$19,IF(D106=19,'[1]Tipo '!$B$20,\"No ha seleccionado un tipo de contrato válido\")))))))))))))))))))","v":"CONTRATOS DE PRESTACIÓN DE SERVICIOS PROFESIONALES Y DE APOYO A LA GESTIÓN"},"CONTRATACIÓN DIRECTA","Prestación de servicios profesionales y de apoyo a la gestión, o para la ejecución de trabajos artísticos que sólo puedan encomendarse a determinadas personas naturales;","OBJETO: El contrato que se pretende celebrar, tendrá por objeto: ¿Apoyar administrativa y asistencialmente a la coordinación del Área Gestión de Desarrollo Local ¿.","INVERSIÓN",45,{"$f":"IF(J106=1,'[1]Equivalencia BH-BMPT'!$D$2,IF(J106=2,'[1]Equivalencia BH-BMPT'!$D$3,IF(J106=3,'[1]Equivalencia BH-BMPT'!$D$4,IF(J106=4,'[1]Equivalencia BH-BMPT'!$D$5,IF(J106=5,'[1]Equivalencia BH-BMPT'!$D$6,IF(J106=6,'[1]Equivalencia BH-BMPT'!$D$7,IF(J106=7,'[1]Equivalencia BH-BMPT'!$D$8,IF(J106=8,'[1]Equivalencia BH-BMPT'!$D$9,IF(J106=9,'[1]Equivalencia BH-BMPT'!$D$10,IF(J106=10,'[1]Equivalencia BH-BMPT'!$D$11,IF(J106=11,'[1]Equivalencia BH-BMPT'!$D$12,IF(J106=12,'[1]Equivalencia BH-BMPT'!$D$13,IF(J106=13,'[1]Equivalencia BH-BMPT'!$D$14,IF(J106=14,'[1]Equivalencia BH-BMPT'!$D$15,IF(J106=15,'[1]Equivalencia BH-BMPT'!$D$16,IF(J106=16,'[1]Equivalencia BH-BMPT'!$D$17,IF(J106=17,'[1]Equivalencia BH-BMPT'!$D$18,IF(J106=18,'[1]Equivalencia BH-BMPT'!$D$19,IF(J106=19,'[1]Equivalencia BH-BMPT'!$D$20,IF(J106=20,'[1]Equivalencia BH-BMPT'!$D$21,IF(J106=21,'[1]Equivalencia BH-BMPT'!$D$22,IF(J106=22,'[1]Equivalencia BH-BMPT'!$D$23,IF(J106=23,'[1]Equivalencia BH-BMPT'!#REF!,IF(J106=24,'[1]Equivalencia BH-BMPT'!$D$25,IF(J106=25,'[1]Equivalencia BH-BMPT'!$D$26,IF(J106=26,'[1]Equivalencia BH-BMPT'!$D$27,IF(J106=27,'[1]Equivalencia BH-BMPT'!$D$28,IF(J106=28,'[1]Equivalencia BH-BMPT'!$D$29,IF(J106=29,'[1]Equivalencia BH-BMPT'!$D$30,IF(J106=30,'[1]Equivalencia BH-BMPT'!$D$31,IF(J106=31,'[1]Equivalencia BH-BMPT'!$D$32,IF(J106=32,'[1]Equivalencia BH-BMPT'!$D$33,IF(J106=33,'[1]Equivalencia BH-BMPT'!$D$34,IF(J106=34,'[1]Equivalencia BH-BMPT'!$D$35,IF(J106=35,'[1]Equivalencia BH-BMPT'!$D$36,IF(J106=36,'[1]Equivalencia BH-BMPT'!$D$37,IF(J106=37,'[1]Equivalencia BH-BMPT'!$D$38,IF(J106=38,'[1]Equivalencia BH-BMPT'!#REF!,IF(J106=39,'[1]Equivalencia BH-BMPT'!$D$40,IF(J106=40,'[1]Equivalencia BH-BMPT'!$D$41,IF(J106=41,'[1]Equivalencia BH-BMPT'!$D$42,IF(J106=42,'[1]Equivalencia BH-BMPT'!$D$43,IF(J106=43,'[1]Equivalencia BH-BMPT'!$D$44,IF(J106=44,'[1]Equivalencia BH-BMPT'!$D$45,IF(J106=45,'[1]Equivalencia BH-BMPT'!$D$46,\"No ha seleccionado un número de programa\")))))))))))))))))))))))))))))))))))))))))))))","v":"Gobernanza e influencia local, regional e internacional"},1329,1022957446,"ALEXANDRA MOJICA MOJICA",8100000,null,null,null,953333,9053333,5573333,"2017-09-29","2017-09-29","2018-01-10",90,13,null,null,"X",null,null,0.61561117877802574,null,null,null,null,0.61561117877802574]
[83,2017,"CPS 083  2017 ",5,{"$f":"IF(D107=1,'[1]Tipo '!$B$2,IF(D107=2,'[1]Tipo '!$B$3,IF(D107=3,'[1]Tipo '!$B$4,IF(D107=4,'[1]Tipo '!$B$5,IF(D107=5,'[1]Tipo '!$B$6,IF(D107=6,'[1]Tipo '!$B$7,IF(D107=7,'[1]Tipo '!$B$8,IF(D107=8,'[1]Tipo '!$B$9,IF(D107=9,'[1]Tipo '!$B$10,IF(D107=10,'[1]Tipo '!$B$11,IF(D107=11,'[1]Tipo '!$B$12,IF(D107=12,'[1]Tipo '!$B$13,IF(D107=13,'[1]Tipo '!$B$14,IF(D107=14,'[1]Tipo '!$B$15,IF(D107=15,'[1]Tipo '!$B$16,IF(D107=16,'[1]Tipo '!$B$17,IF(D107=17,'[1]Tipo '!$B$18,IF(D107=18,'[1]Tipo '!$B$19,IF(D107=19,'[1]Tipo '!$B$20,\"No ha seleccionado un tipo de contrato válido\")))))))))))))))))))","v":"CONTRATOS DE PRESTACIÓN DE SERVICIOS PROFESIONALES Y DE APOYO A LA GESTIÓN"},"CONTRATACIÓN DIRECTA","Prestación de servicios profesionales y de apoyo a la gestión, o para la ejecución de trabajos artísticos que sólo puedan encomendarse a determinadas personas naturales;","OBJETO: El contrato que se pretende celebrar, tendrá por objeto ¿Prestación de servicios profesionales al Área de Gestión Policiva a través de visitas a terreno y emisión de conceptos técnicos, para verificar el cumplimiento de la normatividad relativa a establecimientos de comercio y espacio público.¿","INVERSIÓN",45,{"$f":"IF(J107=1,'[1]Equivalencia BH-BMPT'!$D$2,IF(J107=2,'[1]Equivalencia BH-BMPT'!$D$3,IF(J107=3,'[1]Equivalencia BH-BMPT'!$D$4,IF(J107=4,'[1]Equivalencia BH-BMPT'!$D$5,IF(J107=5,'[1]Equivalencia BH-BMPT'!$D$6,IF(J107=6,'[1]Equivalencia BH-BMPT'!$D$7,IF(J107=7,'[1]Equivalencia BH-BMPT'!$D$8,IF(J107=8,'[1]Equivalencia BH-BMPT'!$D$9,IF(J107=9,'[1]Equivalencia BH-BMPT'!$D$10,IF(J107=10,'[1]Equivalencia BH-BMPT'!$D$11,IF(J107=11,'[1]Equivalencia BH-BMPT'!$D$12,IF(J107=12,'[1]Equivalencia BH-BMPT'!$D$13,IF(J107=13,'[1]Equivalencia BH-BMPT'!$D$14,IF(J107=14,'[1]Equivalencia BH-BMPT'!$D$15,IF(J107=15,'[1]Equivalencia BH-BMPT'!$D$16,IF(J107=16,'[1]Equivalencia BH-BMPT'!$D$17,IF(J107=17,'[1]Equivalencia BH-BMPT'!$D$18,IF(J107=18,'[1]Equivalencia BH-BMPT'!$D$19,IF(J107=19,'[1]Equivalencia BH-BMPT'!$D$20,IF(J107=20,'[1]Equivalencia BH-BMPT'!$D$21,IF(J107=21,'[1]Equivalencia BH-BMPT'!$D$22,IF(J107=22,'[1]Equivalencia BH-BMPT'!$D$23,IF(J107=23,'[1]Equivalencia BH-BMPT'!#REF!,IF(J107=24,'[1]Equivalencia BH-BMPT'!$D$25,IF(J107=25,'[1]Equivalencia BH-BMPT'!$D$26,IF(J107=26,'[1]Equivalencia BH-BMPT'!$D$27,IF(J107=27,'[1]Equivalencia BH-BMPT'!$D$28,IF(J107=28,'[1]Equivalencia BH-BMPT'!$D$29,IF(J107=29,'[1]Equivalencia BH-BMPT'!$D$30,IF(J107=30,'[1]Equivalencia BH-BMPT'!$D$31,IF(J107=31,'[1]Equivalencia BH-BMPT'!$D$32,IF(J107=32,'[1]Equivalencia BH-BMPT'!$D$33,IF(J107=33,'[1]Equivalencia BH-BMPT'!$D$34,IF(J107=34,'[1]Equivalencia BH-BMPT'!$D$35,IF(J107=35,'[1]Equivalencia BH-BMPT'!$D$36,IF(J107=36,'[1]Equivalencia BH-BMPT'!$D$37,IF(J107=37,'[1]Equivalencia BH-BMPT'!$D$38,IF(J107=38,'[1]Equivalencia BH-BMPT'!#REF!,IF(J107=39,'[1]Equivalencia BH-BMPT'!$D$40,IF(J107=40,'[1]Equivalencia BH-BMPT'!$D$41,IF(J107=41,'[1]Equivalencia BH-BMPT'!$D$42,IF(J107=42,'[1]Equivalencia BH-BMPT'!$D$43,IF(J107=43,'[1]Equivalencia BH-BMPT'!$D$44,IF(J107=44,'[1]Equivalencia BH-BMPT'!$D$45,IF(J107=45,'[1]Equivalencia BH-BMPT'!$D$46,\"No ha seleccionado un número de programa\")))))))))))))))))))))))))))))))))))))))))))))","v":"Gobernanza e influencia local, regional e internacional"},1329,1121897846,"TANIA PAOLA RONCANCIO RODRIGUEZ",12180000,null,null,null,0,12180000,10080000,"2017-10-02","2017-10-03","2017-12-29",87,0,null,null,null,"X",null,0.82758620689655171,null,null,null,null,0.82758620689655171]
[83,2017,null,11,{"$f":"IF(D108=1,'[1]Tipo '!$B$2,IF(D108=2,'[1]Tipo '!$B$3,IF(D108=3,'[1]Tipo '!$B$4,IF(D108=4,'[1]Tipo '!$B$5,IF(D108=5,'[1]Tipo '!$B$6,IF(D108=6,'[1]Tipo '!$B$7,IF(D108=7,'[1]Tipo '!$B$8,IF(D108=8,'[1]Tipo '!$B$9,IF(D108=9,'[1]Tipo '!$B$10,IF(D108=10,'[1]Tipo '!$B$11,IF(D108=11,'[1]Tipo '!$B$12,IF(D108=12,'[1]Tipo '!$B$13,IF(D108=13,'[1]Tipo '!$B$14,IF(D108=14,'[1]Tipo '!$B$15,IF(D108=15,'[1]Tipo '!$B$16,IF(D108=16,'[1]Tipo '!$B$17,IF(D108=17,'[1]Tipo '!$B$18,IF(D108=18,'[1]Tipo '!$B$19,IF(D108=19,'[1]Tipo '!$B$20,\"No ha seleccionado un tipo de contrato válido\")))))))))))))))))))","v":"SUMINISTRO"},"Contratación mínima cuantia ","No aplica","El contrato que se pretende celebrar, tendrá por objeto Contratar el suministro y preparación de refrigerios, menús, bebidas, y/o alimentos que permitan el fortalecimiento de las instancias de participación: Técnica, logística y operativamente y el fortalecimiento técnico y operativo para la toma de decisiones a las organizaciones sociales y comunitarias, de acuerdo a los estudios previos pliego de condiciones y anexos técnicos\".","INVERSIÓN",45,{"$f":"IF(J108=1,'[1]Equivalencia BH-BMPT'!$D$2,IF(J108=2,'[1]Equivalencia BH-BMPT'!$D$3,IF(J108=3,'[1]Equivalencia BH-BMPT'!$D$4,IF(J108=4,'[1]Equivalencia BH-BMPT'!$D$5,IF(J108=5,'[1]Equivalencia BH-BMPT'!$D$6,IF(J108=6,'[1]Equivalencia BH-BMPT'!$D$7,IF(J108=7,'[1]Equivalencia BH-BMPT'!$D$8,IF(J108=8,'[1]Equivalencia BH-BMPT'!$D$9,IF(J108=9,'[1]Equivalencia BH-BMPT'!$D$10,IF(J108=10,'[1]Equivalencia BH-BMPT'!$D$11,IF(J108=11,'[1]Equivalencia BH-BMPT'!$D$12,IF(J108=12,'[1]Equivalencia BH-BMPT'!$D$13,IF(J108=13,'[1]Equivalencia BH-BMPT'!$D$14,IF(J108=14,'[1]Equivalencia BH-BMPT'!$D$15,IF(J108=15,'[1]Equivalencia BH-BMPT'!$D$16,IF(J108=16,'[1]Equivalencia BH-BMPT'!$D$17,IF(J108=17,'[1]Equivalencia BH-BMPT'!$D$18,IF(J108=18,'[1]Equivalencia BH-BMPT'!$D$19,IF(J108=19,'[1]Equivalencia BH-BMPT'!$D$20,IF(J108=20,'[1]Equivalencia BH-BMPT'!$D$21,IF(J108=21,'[1]Equivalencia BH-BMPT'!$D$22,IF(J108=22,'[1]Equivalencia BH-BMPT'!$D$23,IF(J108=23,'[1]Equivalencia BH-BMPT'!#REF!,IF(J108=24,'[1]Equivalencia BH-BMPT'!$D$25,IF(J108=25,'[1]Equivalencia BH-BMPT'!$D$26,IF(J108=26,'[1]Equivalencia BH-BMPT'!$D$27,IF(J108=27,'[1]Equivalencia BH-BMPT'!$D$28,IF(J108=28,'[1]Equivalencia BH-BMPT'!$D$29,IF(J108=29,'[1]Equivalencia BH-BMPT'!$D$30,IF(J108=30,'[1]Equivalencia BH-BMPT'!$D$31,IF(J108=31,'[1]Equivalencia BH-BMPT'!$D$32,IF(J108=32,'[1]Equivalencia BH-BMPT'!$D$33,IF(J108=33,'[1]Equivalencia BH-BMPT'!$D$34,IF(J108=34,'[1]Equivalencia BH-BMPT'!$D$35,IF(J108=35,'[1]Equivalencia BH-BMPT'!$D$36,IF(J108=36,'[1]Equivalencia BH-BMPT'!$D$37,IF(J108=37,'[1]Equivalencia BH-BMPT'!$D$38,IF(J108=38,'[1]Equivalencia BH-BMPT'!#REF!,IF(J108=39,'[1]Equivalencia BH-BMPT'!$D$40,IF(J108=40,'[1]Equivalencia BH-BMPT'!$D$41,IF(J108=41,'[1]Equivalencia BH-BMPT'!$D$42,IF(J108=42,'[1]Equivalencia BH-BMPT'!$D$43,IF(J108=43,'[1]Equivalencia BH-BMPT'!$D$44,IF(J108=44,'[1]Equivalencia BH-BMPT'!$D$45,IF(J108=45,'[1]Equivalencia BH-BMPT'!$D$46,\"No ha seleccionado un número de programa\")))))))))))))))))))))))))))))))))))))))))))))","v":"Gobernanza e influencia local, regional e internacional"},1351,900001632,"PRODUCCIONES VENGOECHEA EVENTOS EMPRESARIALES SAS",null,null,null,null,7500000,7500000,7500000,"2016-12-19","2017-01-16","2017-06-15",150,0,null,null,null,null,"X",1,null,null,null,null,1]
[84,2017," CPS 084 2017 ",4,{"$f":"IF(D109=1,'[1]Tipo '!$B$2,IF(D109=2,'[1]Tipo '!$B$3,IF(D109=3,'[1]Tipo '!$B$4,IF(D109=4,'[1]Tipo '!$B$5,IF(D109=5,'[1]Tipo '!$B$6,IF(D109=6,'[1]Tipo '!$B$7,IF(D109=7,'[1]Tipo '!$B$8,IF(D109=8,'[1]Tipo '!$B$9,IF(D109=9,'[1]Tipo '!$B$10,IF(D109=10,'[1]Tipo '!$B$11,IF(D109=11,'[1]Tipo '!$B$12,IF(D109=12,'[1]Tipo '!$B$13,IF(D109=13,'[1]Tipo '!$B$14,IF(D109=14,'[1]Tipo '!$B$15,IF(D109=15,'[1]Tipo '!$B$16,IF(D109=16,'[1]Tipo '!$B$17,IF(D109=17,'[1]Tipo '!$B$18,IF(D109=18,'[1]Tipo '!$B$19,IF(D109=19,'[1]Tipo '!$B$20,\"No ha seleccionado un tipo de contrato válido\")))))))))))))))))))","v":"CONTRATOS DE PRESTACIÓN DE SERVICIOS"},"Selección abreviada ","Selección abreviada por menor cuantía ","OBJETO: El contrato que se pretende celebrar, tendrá por objeto ¿Realizar el avalúo técnico y valoración de los bienes muebles e inmuebles de Propiedad del Fondo de Desarrollo Local de Teusaquillo, de acuerdo a la normatividad vigente y al Nuevo Marco Normativo Contable cuya aplicación rige a partir del primero de enero del 2018¿.","INVERSIÓN",45,{"$f":"IF(J109=1,'[1]Equivalencia BH-BMPT'!$D$2,IF(J109=2,'[1]Equivalencia BH-BMPT'!$D$3,IF(J109=3,'[1]Equivalencia BH-BMPT'!$D$4,IF(J109=4,'[1]Equivalencia BH-BMPT'!$D$5,IF(J109=5,'[1]Equivalencia BH-BMPT'!$D$6,IF(J109=6,'[1]Equivalencia BH-BMPT'!$D$7,IF(J109=7,'[1]Equivalencia BH-BMPT'!$D$8,IF(J109=8,'[1]Equivalencia BH-BMPT'!$D$9,IF(J109=9,'[1]Equivalencia BH-BMPT'!$D$10,IF(J109=10,'[1]Equivalencia BH-BMPT'!$D$11,IF(J109=11,'[1]Equivalencia BH-BMPT'!$D$12,IF(J109=12,'[1]Equivalencia BH-BMPT'!$D$13,IF(J109=13,'[1]Equivalencia BH-BMPT'!$D$14,IF(J109=14,'[1]Equivalencia BH-BMPT'!$D$15,IF(J109=15,'[1]Equivalencia BH-BMPT'!$D$16,IF(J109=16,'[1]Equivalencia BH-BMPT'!$D$17,IF(J109=17,'[1]Equivalencia BH-BMPT'!$D$18,IF(J109=18,'[1]Equivalencia BH-BMPT'!$D$19,IF(J109=19,'[1]Equivalencia BH-BMPT'!$D$20,IF(J109=20,'[1]Equivalencia BH-BMPT'!$D$21,IF(J109=21,'[1]Equivalencia BH-BMPT'!$D$22,IF(J109=22,'[1]Equivalencia BH-BMPT'!$D$23,IF(J109=23,'[1]Equivalencia BH-BMPT'!#REF!,IF(J109=24,'[1]Equivalencia BH-BMPT'!$D$25,IF(J109=25,'[1]Equivalencia BH-BMPT'!$D$26,IF(J109=26,'[1]Equivalencia BH-BMPT'!$D$27,IF(J109=27,'[1]Equivalencia BH-BMPT'!$D$28,IF(J109=28,'[1]Equivalencia BH-BMPT'!$D$29,IF(J109=29,'[1]Equivalencia BH-BMPT'!$D$30,IF(J109=30,'[1]Equivalencia BH-BMPT'!$D$31,IF(J109=31,'[1]Equivalencia BH-BMPT'!$D$32,IF(J109=32,'[1]Equivalencia BH-BMPT'!$D$33,IF(J109=33,'[1]Equivalencia BH-BMPT'!$D$34,IF(J109=34,'[1]Equivalencia BH-BMPT'!$D$35,IF(J109=35,'[1]Equivalencia BH-BMPT'!$D$36,IF(J109=36,'[1]Equivalencia BH-BMPT'!$D$37,IF(J109=37,'[1]Equivalencia BH-BMPT'!$D$38,IF(J109=38,'[1]Equivalencia BH-BMPT'!#REF!,IF(J109=39,'[1]Equivalencia BH-BMPT'!$D$40,IF(J109=40,'[1]Equivalencia BH-BMPT'!$D$41,IF(J109=41,'[1]Equivalencia BH-BMPT'!$D$42,IF(J109=42,'[1]Equivalencia BH-BMPT'!$D$43,IF(J109=43,'[1]Equivalencia BH-BMPT'!$D$44,IF(J109=44,'[1]Equivalencia BH-BMPT'!$D$45,IF(J109=45,'[1]Equivalencia BH-BMPT'!$D$46,\"No ha seleccionado un número de programa\")))))))))))))))))))))))))))))))))))))))))))))","v":"Gobernanza e influencia local, regional e internacional"},1329,900094086,"FILFER SOCIEDAD DE INVERSIONES S A S",9520000,null,null,null,0,9520000,9520000,"2017-10-03","2017-10-18","2017-12-02",30,15,null,null,null,"X",null,1,null,null,null,null,1]
[85,2017,"CPS 085 2017 ",5,{"$f":"IF(D110=1,'[1]Tipo '!$B$2,IF(D110=2,'[1]Tipo '!$B$3,IF(D110=3,'[1]Tipo '!$B$4,IF(D110=4,'[1]Tipo '!$B$5,IF(D110=5,'[1]Tipo '!$B$6,IF(D110=6,'[1]Tipo '!$B$7,IF(D110=7,'[1]Tipo '!$B$8,IF(D110=8,'[1]Tipo '!$B$9,IF(D110=9,'[1]Tipo '!$B$10,IF(D110=10,'[1]Tipo '!$B$11,IF(D110=11,'[1]Tipo '!$B$12,IF(D110=12,'[1]Tipo '!$B$13,IF(D110=13,'[1]Tipo '!$B$14,IF(D110=14,'[1]Tipo '!$B$15,IF(D110=15,'[1]Tipo '!$B$16,IF(D110=16,'[1]Tipo '!$B$17,IF(D110=17,'[1]Tipo '!$B$18,IF(D110=18,'[1]Tipo '!$B$19,IF(D110=19,'[1]Tipo '!$B$20,\"No ha seleccionado un tipo de contrato válido\")))))))))))))))))))","v":"CONTRATOS DE PRESTACIÓN DE SERVICIOS PROFESIONALES Y DE APOYO A LA GESTIÓN"},"CONTRATACIÓN DIRECTA","Prestación de servicios profesionales y de apoyo a la gestión, o para la ejecución de trabajos artísticos que sólo puedan encomendarse a determinadas personas naturales;","OBJETO: El contrato que se pretende celebrar, tendrá por objeto ¿Prestación de servicios de apoyo a la gestión al Área de Gestión Policiva de la Alcaldía Local de Teusaquillo, en las actividades concernientes a la recepción de correspondencia, registro, digitalización y seguimiento a los trámites administrativos del área, así como el manejo de agenda y elaboración de actas de reuniones¿.","INVERSIÓN",45,{"$f":"IF(J110=1,'[1]Equivalencia BH-BMPT'!$D$2,IF(J110=2,'[1]Equivalencia BH-BMPT'!$D$3,IF(J110=3,'[1]Equivalencia BH-BMPT'!$D$4,IF(J110=4,'[1]Equivalencia BH-BMPT'!$D$5,IF(J110=5,'[1]Equivalencia BH-BMPT'!$D$6,IF(J110=6,'[1]Equivalencia BH-BMPT'!$D$7,IF(J110=7,'[1]Equivalencia BH-BMPT'!$D$8,IF(J110=8,'[1]Equivalencia BH-BMPT'!$D$9,IF(J110=9,'[1]Equivalencia BH-BMPT'!$D$10,IF(J110=10,'[1]Equivalencia BH-BMPT'!$D$11,IF(J110=11,'[1]Equivalencia BH-BMPT'!$D$12,IF(J110=12,'[1]Equivalencia BH-BMPT'!$D$13,IF(J110=13,'[1]Equivalencia BH-BMPT'!$D$14,IF(J110=14,'[1]Equivalencia BH-BMPT'!$D$15,IF(J110=15,'[1]Equivalencia BH-BMPT'!$D$16,IF(J110=16,'[1]Equivalencia BH-BMPT'!$D$17,IF(J110=17,'[1]Equivalencia BH-BMPT'!$D$18,IF(J110=18,'[1]Equivalencia BH-BMPT'!$D$19,IF(J110=19,'[1]Equivalencia BH-BMPT'!$D$20,IF(J110=20,'[1]Equivalencia BH-BMPT'!$D$21,IF(J110=21,'[1]Equivalencia BH-BMPT'!$D$22,IF(J110=22,'[1]Equivalencia BH-BMPT'!$D$23,IF(J110=23,'[1]Equivalencia BH-BMPT'!#REF!,IF(J110=24,'[1]Equivalencia BH-BMPT'!$D$25,IF(J110=25,'[1]Equivalencia BH-BMPT'!$D$26,IF(J110=26,'[1]Equivalencia BH-BMPT'!$D$27,IF(J110=27,'[1]Equivalencia BH-BMPT'!$D$28,IF(J110=28,'[1]Equivalencia BH-BMPT'!$D$29,IF(J110=29,'[1]Equivalencia BH-BMPT'!$D$30,IF(J110=30,'[1]Equivalencia BH-BMPT'!$D$31,IF(J110=31,'[1]Equivalencia BH-BMPT'!$D$32,IF(J110=32,'[1]Equivalencia BH-BMPT'!$D$33,IF(J110=33,'[1]Equivalencia BH-BMPT'!$D$34,IF(J110=34,'[1]Equivalencia BH-BMPT'!$D$35,IF(J110=35,'[1]Equivalencia BH-BMPT'!$D$36,IF(J110=36,'[1]Equivalencia BH-BMPT'!$D$37,IF(J110=37,'[1]Equivalencia BH-BMPT'!$D$38,IF(J110=38,'[1]Equivalencia BH-BMPT'!#REF!,IF(J110=39,'[1]Equivalencia BH-BMPT'!$D$40,IF(J110=40,'[1]Equivalencia BH-BMPT'!$D$41,IF(J110=41,'[1]Equivalencia BH-BMPT'!$D$42,IF(J110=42,'[1]Equivalencia BH-BMPT'!$D$43,IF(J110=43,'[1]Equivalencia BH-BMPT'!$D$44,IF(J110=44,'[1]Equivalencia BH-BMPT'!$D$45,IF(J110=45,'[1]Equivalencia BH-BMPT'!$D$46,\"No ha seleccionado un número de programa\")))))))))))))))))))))))))))))))))))))))))))))","v":"Gobernanza e influencia local, regional e internacional"},1329,1030673686,"KAREN LORENA RUIZ RUGE",4060000,null,null,null,0,4060000,3360000,"2017-10-02","2017-10-03","2017-12-29",87,0,null,null,null,"X",null,0.82758620689655171,null,null,null,null,0.82758620689655171]
[86,2017,"CPS 086 2017 ",5,{"$f":"IF(D111=1,'[1]Tipo '!$B$2,IF(D111=2,'[1]Tipo '!$B$3,IF(D111=3,'[1]Tipo '!$B$4,IF(D111=4,'[1]Tipo '!$B$5,IF(D111=5,'[1]Tipo '!$B$6,IF(D111=6,'[1]Tipo '!$B$7,IF(D111=7,'[1]Tipo '!$B$8,IF(D111=8,'[1]Tipo '!$B$9,IF(D111=9,'[1]Tipo '!$B$10,IF(D111=10,'[1]Tipo '!$B$11,IF(D111=11,'[1]Tipo '!$B$12,IF(D111=12,'[1]Tipo '!$B$13,IF(D111=13,'[1]Tipo '!$B$14,IF(D111=14,'[1]Tipo '!$B$15,IF(D111=15,'[1]Tipo '!$B$16,IF(D111=16,'[1]Tipo '!$B$17,IF(D111=17,'[1]Tipo '!$B$18,IF(D111=18,'[1]Tipo '!$B$19,IF(D111=19,'[1]Tipo '!$B$20,\"No ha seleccionado un tipo de contrato válido\")))))))))))))))))))","v":"CONTRATOS DE PRESTACIÓN DE SERVICIOS PROFESIONALES Y DE APOYO A LA GESTIÓN"},"CONTRATACIÓN DIRECTA","Prestación de servicios profesionales y de apoyo a la gestión, o para la ejecución de trabajos artísticos que sólo puedan encomendarse a determinadas personas naturales;","El contrato que se pretende celebrar, tendrá por objeto ¿Apoyar jurídicamente la ejecución de las acciones requeridas para el trámite e impulso procesal de las actuaciones contravencionales y/o querellas que cursen en las Inspecciones de Policía 13 A, 13 B y 13 E de la Localidad¿.","INVERSIÓN",45,{"$f":"IF(J111=1,'[1]Equivalencia BH-BMPT'!$D$2,IF(J111=2,'[1]Equivalencia BH-BMPT'!$D$3,IF(J111=3,'[1]Equivalencia BH-BMPT'!$D$4,IF(J111=4,'[1]Equivalencia BH-BMPT'!$D$5,IF(J111=5,'[1]Equivalencia BH-BMPT'!$D$6,IF(J111=6,'[1]Equivalencia BH-BMPT'!$D$7,IF(J111=7,'[1]Equivalencia BH-BMPT'!$D$8,IF(J111=8,'[1]Equivalencia BH-BMPT'!$D$9,IF(J111=9,'[1]Equivalencia BH-BMPT'!$D$10,IF(J111=10,'[1]Equivalencia BH-BMPT'!$D$11,IF(J111=11,'[1]Equivalencia BH-BMPT'!$D$12,IF(J111=12,'[1]Equivalencia BH-BMPT'!$D$13,IF(J111=13,'[1]Equivalencia BH-BMPT'!$D$14,IF(J111=14,'[1]Equivalencia BH-BMPT'!$D$15,IF(J111=15,'[1]Equivalencia BH-BMPT'!$D$16,IF(J111=16,'[1]Equivalencia BH-BMPT'!$D$17,IF(J111=17,'[1]Equivalencia BH-BMPT'!$D$18,IF(J111=18,'[1]Equivalencia BH-BMPT'!$D$19,IF(J111=19,'[1]Equivalencia BH-BMPT'!$D$20,IF(J111=20,'[1]Equivalencia BH-BMPT'!$D$21,IF(J111=21,'[1]Equivalencia BH-BMPT'!$D$22,IF(J111=22,'[1]Equivalencia BH-BMPT'!$D$23,IF(J111=23,'[1]Equivalencia BH-BMPT'!#REF!,IF(J111=24,'[1]Equivalencia BH-BMPT'!$D$25,IF(J111=25,'[1]Equivalencia BH-BMPT'!$D$26,IF(J111=26,'[1]Equivalencia BH-BMPT'!$D$27,IF(J111=27,'[1]Equivalencia BH-BMPT'!$D$28,IF(J111=28,'[1]Equivalencia BH-BMPT'!$D$29,IF(J111=29,'[1]Equivalencia BH-BMPT'!$D$30,IF(J111=30,'[1]Equivalencia BH-BMPT'!$D$31,IF(J111=31,'[1]Equivalencia BH-BMPT'!$D$32,IF(J111=32,'[1]Equivalencia BH-BMPT'!$D$33,IF(J111=33,'[1]Equivalencia BH-BMPT'!$D$34,IF(J111=34,'[1]Equivalencia BH-BMPT'!$D$35,IF(J111=35,'[1]Equivalencia BH-BMPT'!$D$36,IF(J111=36,'[1]Equivalencia BH-BMPT'!$D$37,IF(J111=37,'[1]Equivalencia BH-BMPT'!$D$38,IF(J111=38,'[1]Equivalencia BH-BMPT'!#REF!,IF(J111=39,'[1]Equivalencia BH-BMPT'!$D$40,IF(J111=40,'[1]Equivalencia BH-BMPT'!$D$41,IF(J111=41,'[1]Equivalencia BH-BMPT'!$D$42,IF(J111=42,'[1]Equivalencia BH-BMPT'!$D$43,IF(J111=43,'[1]Equivalencia BH-BMPT'!$D$44,IF(J111=44,'[1]Equivalencia BH-BMPT'!$D$45,IF(J111=45,'[1]Equivalencia BH-BMPT'!$D$46,\"No ha seleccionado un número de programa\")))))))))))))))))))))))))))))))))))))))))))))","v":"Gobernanza e influencia local, regional e internacional"},1329,10772968,"LUIS FERNANDO DELGADO JIMENEZ",12000000,null,null,null,0,12000000,9600000,"2017-10-09","2017-10-11","2017-12-30",80,0,null,null,null,"X",null,0.8,null,null,null,null,0.8]
[87,2017," CPS 087 2017 ",5,{"$f":"IF(D112=1,'[1]Tipo '!$B$2,IF(D112=2,'[1]Tipo '!$B$3,IF(D112=3,'[1]Tipo '!$B$4,IF(D112=4,'[1]Tipo '!$B$5,IF(D112=5,'[1]Tipo '!$B$6,IF(D112=6,'[1]Tipo '!$B$7,IF(D112=7,'[1]Tipo '!$B$8,IF(D112=8,'[1]Tipo '!$B$9,IF(D112=9,'[1]Tipo '!$B$10,IF(D112=10,'[1]Tipo '!$B$11,IF(D112=11,'[1]Tipo '!$B$12,IF(D112=12,'[1]Tipo '!$B$13,IF(D112=13,'[1]Tipo '!$B$14,IF(D112=14,'[1]Tipo '!$B$15,IF(D112=15,'[1]Tipo '!$B$16,IF(D112=16,'[1]Tipo '!$B$17,IF(D112=17,'[1]Tipo '!$B$18,IF(D112=18,'[1]Tipo '!$B$19,IF(D112=19,'[1]Tipo '!$B$20,\"No ha seleccionado un tipo de contrato válido\")))))))))))))))))))","v":"CONTRATOS DE PRESTACIÓN DE SERVICIOS PROFESIONALES Y DE APOYO A LA GESTIÓN"},"CONTRATACIÓN DIRECTA","Prestación de servicios profesionales y de apoyo a la gestión, o para la ejecución de trabajos artísticos que sólo puedan encomendarse a determinadas personas naturales;","El contrato que se pretende celebrar, tendrá por objeto ¿Prestar servicios de apoyo, para la operación, seguimiento y cumplimiento de los procesos y procedimientos del servicio social y para la Seguridad Económica Tipo C, requeridos para el oportuno y adecuado registro, cruce y reporte de los datos en el Sistema de Información y Registro de Beneficiarios ¿ SIRBE, en el Distrito Capital a cargo de la Alcaldía Local de Teusaquillo¿.","INVERSIÓN",3,{"$f":"IF(J112=1,'[1]Equivalencia BH-BMPT'!$D$2,IF(J112=2,'[1]Equivalencia BH-BMPT'!$D$3,IF(J112=3,'[1]Equivalencia BH-BMPT'!$D$4,IF(J112=4,'[1]Equivalencia BH-BMPT'!$D$5,IF(J112=5,'[1]Equivalencia BH-BMPT'!$D$6,IF(J112=6,'[1]Equivalencia BH-BMPT'!$D$7,IF(J112=7,'[1]Equivalencia BH-BMPT'!$D$8,IF(J112=8,'[1]Equivalencia BH-BMPT'!$D$9,IF(J112=9,'[1]Equivalencia BH-BMPT'!$D$10,IF(J112=10,'[1]Equivalencia BH-BMPT'!$D$11,IF(J112=11,'[1]Equivalencia BH-BMPT'!$D$12,IF(J112=12,'[1]Equivalencia BH-BMPT'!$D$13,IF(J112=13,'[1]Equivalencia BH-BMPT'!$D$14,IF(J112=14,'[1]Equivalencia BH-BMPT'!$D$15,IF(J112=15,'[1]Equivalencia BH-BMPT'!$D$16,IF(J112=16,'[1]Equivalencia BH-BMPT'!$D$17,IF(J112=17,'[1]Equivalencia BH-BMPT'!$D$18,IF(J112=18,'[1]Equivalencia BH-BMPT'!$D$19,IF(J112=19,'[1]Equivalencia BH-BMPT'!$D$20,IF(J112=20,'[1]Equivalencia BH-BMPT'!$D$21,IF(J112=21,'[1]Equivalencia BH-BMPT'!$D$22,IF(J112=22,'[1]Equivalencia BH-BMPT'!$D$23,IF(J112=23,'[1]Equivalencia BH-BMPT'!#REF!,IF(J112=24,'[1]Equivalencia BH-BMPT'!$D$25,IF(J112=25,'[1]Equivalencia BH-BMPT'!$D$26,IF(J112=26,'[1]Equivalencia BH-BMPT'!$D$27,IF(J112=27,'[1]Equivalencia BH-BMPT'!$D$28,IF(J112=28,'[1]Equivalencia BH-BMPT'!$D$29,IF(J112=29,'[1]Equivalencia BH-BMPT'!$D$30,IF(J112=30,'[1]Equivalencia BH-BMPT'!$D$31,IF(J112=31,'[1]Equivalencia BH-BMPT'!$D$32,IF(J112=32,'[1]Equivalencia BH-BMPT'!$D$33,IF(J112=33,'[1]Equivalencia BH-BMPT'!$D$34,IF(J112=34,'[1]Equivalencia BH-BMPT'!$D$35,IF(J112=35,'[1]Equivalencia BH-BMPT'!$D$36,IF(J112=36,'[1]Equivalencia BH-BMPT'!$D$37,IF(J112=37,'[1]Equivalencia BH-BMPT'!$D$38,IF(J112=38,'[1]Equivalencia BH-BMPT'!#REF!,IF(J112=39,'[1]Equivalencia BH-BMPT'!$D$40,IF(J112=40,'[1]Equivalencia BH-BMPT'!$D$41,IF(J112=41,'[1]Equivalencia BH-BMPT'!$D$42,IF(J112=42,'[1]Equivalencia BH-BMPT'!$D$43,IF(J112=43,'[1]Equivalencia BH-BMPT'!$D$44,IF(J112=44,'[1]Equivalencia BH-BMPT'!$D$45,IF(J112=45,'[1]Equivalencia BH-BMPT'!$D$46,\"No ha seleccionado un número de programa\")))))))))))))))))))))))))))))))))))))))))))))","v":"Igualdad y autonomía para una Bogotá incluyente"},1357,1031141363,"GERALDINE  MONTENEGRO LOZADA",5134509,null,null,null,0,5134509,3922195,"2017-10-18","2017-10-20","2017-12-31",72,0,null,null,null,"X",null,0.7638890106142574,null,null,null,null,0.7638890106142574]
[88,2017,"FDLT 006 2017 ",1,{"$f":"IF(D113=1,'[1]Tipo '!$B$2,IF(D113=2,'[1]Tipo '!$B$3,IF(D113=3,'[1]Tipo '!$B$4,IF(D113=4,'[1]Tipo '!$B$5,IF(D113=5,'[1]Tipo '!$B$6,IF(D113=6,'[1]Tipo '!$B$7,IF(D113=7,'[1]Tipo '!$B$8,IF(D113=8,'[1]Tipo '!$B$9,IF(D113=9,'[1]Tipo '!$B$10,IF(D113=10,'[1]Tipo '!$B$11,IF(D113=11,'[1]Tipo '!$B$12,IF(D113=12,'[1]Tipo '!$B$13,IF(D113=13,'[1]Tipo '!$B$14,IF(D113=14,'[1]Tipo '!$B$15,IF(D113=15,'[1]Tipo '!$B$16,IF(D113=16,'[1]Tipo '!$B$17,IF(D113=17,'[1]Tipo '!$B$18,IF(D113=18,'[1]Tipo '!$B$19,IF(D113=19,'[1]Tipo '!$B$20,\"No ha seleccionado un tipo de contrato válido\")))))))))))))))))))","v":"OBRA PÚBLICA"},"LICITACIÓN PÚBLICA","No aplica","Ejecutar a precios unitarios y a monto agotable, las obras y actividades necesarias para la conservación de la malla vial local e intermedia y Espacio Público de la Localidad de Teusaquillo, en la ciudad de Bogotá D.C. de conformidad con los estudios previos, anexo técnico y apéndices.","INVERSIÓN",18,{"$f":"IF(J113=1,'[1]Equivalencia BH-BMPT'!$D$2,IF(J113=2,'[1]Equivalencia BH-BMPT'!$D$3,IF(J113=3,'[1]Equivalencia BH-BMPT'!$D$4,IF(J113=4,'[1]Equivalencia BH-BMPT'!$D$5,IF(J113=5,'[1]Equivalencia BH-BMPT'!$D$6,IF(J113=6,'[1]Equivalencia BH-BMPT'!$D$7,IF(J113=7,'[1]Equivalencia BH-BMPT'!$D$8,IF(J113=8,'[1]Equivalencia BH-BMPT'!$D$9,IF(J113=9,'[1]Equivalencia BH-BMPT'!$D$10,IF(J113=10,'[1]Equivalencia BH-BMPT'!$D$11,IF(J113=11,'[1]Equivalencia BH-BMPT'!$D$12,IF(J113=12,'[1]Equivalencia BH-BMPT'!$D$13,IF(J113=13,'[1]Equivalencia BH-BMPT'!$D$14,IF(J113=14,'[1]Equivalencia BH-BMPT'!$D$15,IF(J113=15,'[1]Equivalencia BH-BMPT'!$D$16,IF(J113=16,'[1]Equivalencia BH-BMPT'!$D$17,IF(J113=17,'[1]Equivalencia BH-BMPT'!$D$18,IF(J113=18,'[1]Equivalencia BH-BMPT'!$D$19,IF(J113=19,'[1]Equivalencia BH-BMPT'!$D$20,IF(J113=20,'[1]Equivalencia BH-BMPT'!$D$21,IF(J113=21,'[1]Equivalencia BH-BMPT'!$D$22,IF(J113=22,'[1]Equivalencia BH-BMPT'!$D$23,IF(J113=23,'[1]Equivalencia BH-BMPT'!#REF!,IF(J113=24,'[1]Equivalencia BH-BMPT'!$D$25,IF(J113=25,'[1]Equivalencia BH-BMPT'!$D$26,IF(J113=26,'[1]Equivalencia BH-BMPT'!$D$27,IF(J113=27,'[1]Equivalencia BH-BMPT'!$D$28,IF(J113=28,'[1]Equivalencia BH-BMPT'!$D$29,IF(J113=29,'[1]Equivalencia BH-BMPT'!$D$30,IF(J113=30,'[1]Equivalencia BH-BMPT'!$D$31,IF(J113=31,'[1]Equivalencia BH-BMPT'!$D$32,IF(J113=32,'[1]Equivalencia BH-BMPT'!$D$33,IF(J113=33,'[1]Equivalencia BH-BMPT'!$D$34,IF(J113=34,'[1]Equivalencia BH-BMPT'!$D$35,IF(J113=35,'[1]Equivalencia BH-BMPT'!$D$36,IF(J113=36,'[1]Equivalencia BH-BMPT'!$D$37,IF(J113=37,'[1]Equivalencia BH-BMPT'!$D$38,IF(J113=38,'[1]Equivalencia BH-BMPT'!#REF!,IF(J113=39,'[1]Equivalencia BH-BMPT'!$D$40,IF(J113=40,'[1]Equivalencia BH-BMPT'!$D$41,IF(J113=41,'[1]Equivalencia BH-BMPT'!$D$42,IF(J113=42,'[1]Equivalencia BH-BMPT'!$D$43,IF(J113=43,'[1]Equivalencia BH-BMPT'!$D$44,IF(J113=44,'[1]Equivalencia BH-BMPT'!$D$45,IF(J113=45,'[1]Equivalencia BH-BMPT'!$D$46,\"No ha seleccionado un número de programa\")))))))))))))))))))))))))))))))))))))))))))))","v":"Mejor movilidad para todos"},1338,900283268,"INTER INGENIERIA S A S",5216531922,null,null,null,0,5216531922,0,"2017-10-19",null,null,240,0,null,"X",null,null,null,0,null,null,null,null,0]
[89,2017,"CPS 089 2017 ",5,{"$f":"IF(D114=1,'[1]Tipo '!$B$2,IF(D114=2,'[1]Tipo '!$B$3,IF(D114=3,'[1]Tipo '!$B$4,IF(D114=4,'[1]Tipo '!$B$5,IF(D114=5,'[1]Tipo '!$B$6,IF(D114=6,'[1]Tipo '!$B$7,IF(D114=7,'[1]Tipo '!$B$8,IF(D114=8,'[1]Tipo '!$B$9,IF(D114=9,'[1]Tipo '!$B$10,IF(D114=10,'[1]Tipo '!$B$11,IF(D114=11,'[1]Tipo '!$B$12,IF(D114=12,'[1]Tipo '!$B$13,IF(D114=13,'[1]Tipo '!$B$14,IF(D114=14,'[1]Tipo '!$B$15,IF(D114=15,'[1]Tipo '!$B$16,IF(D114=16,'[1]Tipo '!$B$17,IF(D114=17,'[1]Tipo '!$B$18,IF(D114=18,'[1]Tipo '!$B$19,IF(D114=19,'[1]Tipo '!$B$20,\"No ha seleccionado un tipo de contrato válido\")))))))))))))))))))","v":"CONTRATOS DE PRESTACIÓN DE SERVICIOS PROFESIONALES Y DE APOYO A LA GESTIÓN"},"CONTRATACIÓN DIRECTA","Prestación de servicios profesionales y de apoyo a la gestión, o para la ejecución de trabajos artísticos que sólo puedan encomendarse a determinadas personas naturales;","El contrato que se pretende celebrar, tendrá por objeto ¿Prestación de servicios profesionales al Área de Gestión Policiva a través de visitas a terreno y emisión de conceptos técnicos, para verificar el cumplimiento de la normatividad relativa a establecimientos de comercio, espacio público y obras.","INVERSIÓN",45,{"$f":"IF(J114=1,'[1]Equivalencia BH-BMPT'!$D$2,IF(J114=2,'[1]Equivalencia BH-BMPT'!$D$3,IF(J114=3,'[1]Equivalencia BH-BMPT'!$D$4,IF(J114=4,'[1]Equivalencia BH-BMPT'!$D$5,IF(J114=5,'[1]Equivalencia BH-BMPT'!$D$6,IF(J114=6,'[1]Equivalencia BH-BMPT'!$D$7,IF(J114=7,'[1]Equivalencia BH-BMPT'!$D$8,IF(J114=8,'[1]Equivalencia BH-BMPT'!$D$9,IF(J114=9,'[1]Equivalencia BH-BMPT'!$D$10,IF(J114=10,'[1]Equivalencia BH-BMPT'!$D$11,IF(J114=11,'[1]Equivalencia BH-BMPT'!$D$12,IF(J114=12,'[1]Equivalencia BH-BMPT'!$D$13,IF(J114=13,'[1]Equivalencia BH-BMPT'!$D$14,IF(J114=14,'[1]Equivalencia BH-BMPT'!$D$15,IF(J114=15,'[1]Equivalencia BH-BMPT'!$D$16,IF(J114=16,'[1]Equivalencia BH-BMPT'!$D$17,IF(J114=17,'[1]Equivalencia BH-BMPT'!$D$18,IF(J114=18,'[1]Equivalencia BH-BMPT'!$D$19,IF(J114=19,'[1]Equivalencia BH-BMPT'!$D$20,IF(J114=20,'[1]Equivalencia BH-BMPT'!$D$21,IF(J114=21,'[1]Equivalencia BH-BMPT'!$D$22,IF(J114=22,'[1]Equivalencia BH-BMPT'!$D$23,IF(J114=23,'[1]Equivalencia BH-BMPT'!#REF!,IF(J114=24,'[1]Equivalencia BH-BMPT'!$D$25,IF(J114=25,'[1]Equivalencia BH-BMPT'!$D$26,IF(J114=26,'[1]Equivalencia BH-BMPT'!$D$27,IF(J114=27,'[1]Equivalencia BH-BMPT'!$D$28,IF(J114=28,'[1]Equivalencia BH-BMPT'!$D$29,IF(J114=29,'[1]Equivalencia BH-BMPT'!$D$30,IF(J114=30,'[1]Equivalencia BH-BMPT'!$D$31,IF(J114=31,'[1]Equivalencia BH-BMPT'!$D$32,IF(J114=32,'[1]Equivalencia BH-BMPT'!$D$33,IF(J114=33,'[1]Equivalencia BH-BMPT'!$D$34,IF(J114=34,'[1]Equivalencia BH-BMPT'!$D$35,IF(J114=35,'[1]Equivalencia BH-BMPT'!$D$36,IF(J114=36,'[1]Equivalencia BH-BMPT'!$D$37,IF(J114=37,'[1]Equivalencia BH-BMPT'!$D$38,IF(J114=38,'[1]Equivalencia BH-BMPT'!#REF!,IF(J114=39,'[1]Equivalencia BH-BMPT'!$D$40,IF(J114=40,'[1]Equivalencia BH-BMPT'!$D$41,IF(J114=41,'[1]Equivalencia BH-BMPT'!$D$42,IF(J114=42,'[1]Equivalencia BH-BMPT'!$D$43,IF(J114=43,'[1]Equivalencia BH-BMPT'!$D$44,IF(J114=44,'[1]Equivalencia BH-BMPT'!$D$45,IF(J114=45,'[1]Equivalencia BH-BMPT'!$D$46,\"No ha seleccionado un número de programa\")))))))))))))))))))))))))))))))))))))))))))))","v":"Gobernanza e influencia local, regional e internacional"},1329,52104732,"DIANA MAYERLY LARROTA RAMIREZ",9660000,null,null,null,0,9660000,7280000,"2017-10-20","2017-10-23","2017-12-31",69,0,null,null,null,"X",null,0.75362318840579712,null,null,null,null,0.75362318840579712]
[90,2017,"CPS 090 2017 ",5,{"$f":"IF(D115=1,'[1]Tipo '!$B$2,IF(D115=2,'[1]Tipo '!$B$3,IF(D115=3,'[1]Tipo '!$B$4,IF(D115=4,'[1]Tipo '!$B$5,IF(D115=5,'[1]Tipo '!$B$6,IF(D115=6,'[1]Tipo '!$B$7,IF(D115=7,'[1]Tipo '!$B$8,IF(D115=8,'[1]Tipo '!$B$9,IF(D115=9,'[1]Tipo '!$B$10,IF(D115=10,'[1]Tipo '!$B$11,IF(D115=11,'[1]Tipo '!$B$12,IF(D115=12,'[1]Tipo '!$B$13,IF(D115=13,'[1]Tipo '!$B$14,IF(D115=14,'[1]Tipo '!$B$15,IF(D115=15,'[1]Tipo '!$B$16,IF(D115=16,'[1]Tipo '!$B$17,IF(D115=17,'[1]Tipo '!$B$18,IF(D115=18,'[1]Tipo '!$B$19,IF(D115=19,'[1]Tipo '!$B$20,\"No ha seleccionado un tipo de contrato válido\")))))))))))))))))))","v":"CONTRATOS DE PRESTACIÓN DE SERVICIOS PROFESIONALES Y DE APOYO A LA GESTIÓN"},"CONTRATACIÓN DIRECTA","Prestación de servicios profesionales y de apoyo a la gestión, o para la ejecución de trabajos artísticos que sólo puedan encomendarse a determinadas personas naturales;","OBJETO: El contrato que se pretende celebrar, tendrá por objeto ¿Apoyar jurídicamente la ejecución de las acciones requeridas para el trámite e impulso procesal de las actuaciones contravencionales y/o querellas que cursen en las Inspecciones de Policía 13 A, 13 B y 13 E de la Localidad¿.","INVERSIÓN",45,{"$f":"IF(J115=1,'[1]Equivalencia BH-BMPT'!$D$2,IF(J115=2,'[1]Equivalencia BH-BMPT'!$D$3,IF(J115=3,'[1]Equivalencia BH-BMPT'!$D$4,IF(J115=4,'[1]Equivalencia BH-BMPT'!$D$5,IF(J115=5,'[1]Equivalencia BH-BMPT'!$D$6,IF(J115=6,'[1]Equivalencia BH-BMPT'!$D$7,IF(J115=7,'[1]Equivalencia BH-BMPT'!$D$8,IF(J115=8,'[1]Equivalencia BH-BMPT'!$D$9,IF(J115=9,'[1]Equivalencia BH-BMPT'!$D$10,IF(J115=10,'[1]Equivalencia BH-BMPT'!$D$11,IF(J115=11,'[1]Equivalencia BH-BMPT'!$D$12,IF(J115=12,'[1]Equivalencia BH-BMPT'!$D$13,IF(J115=13,'[1]Equivalencia BH-BMPT'!$D$14,IF(J115=14,'[1]Equivalencia BH-BMPT'!$D$15,IF(J115=15,'[1]Equivalencia BH-BMPT'!$D$16,IF(J115=16,'[1]Equivalencia BH-BMPT'!$D$17,IF(J115=17,'[1]Equivalencia BH-BMPT'!$D$18,IF(J115=18,'[1]Equivalencia BH-BMPT'!$D$19,IF(J115=19,'[1]Equivalencia BH-BMPT'!$D$20,IF(J115=20,'[1]Equivalencia BH-BMPT'!$D$21,IF(J115=21,'[1]Equivalencia BH-BMPT'!$D$22,IF(J115=22,'[1]Equivalencia BH-BMPT'!$D$23,IF(J115=23,'[1]Equivalencia BH-BMPT'!#REF!,IF(J115=24,'[1]Equivalencia BH-BMPT'!$D$25,IF(J115=25,'[1]Equivalencia BH-BMPT'!$D$26,IF(J115=26,'[1]Equivalencia BH-BMPT'!$D$27,IF(J115=27,'[1]Equivalencia BH-BMPT'!$D$28,IF(J115=28,'[1]Equivalencia BH-BMPT'!$D$29,IF(J115=29,'[1]Equivalencia BH-BMPT'!$D$30,IF(J115=30,'[1]Equivalencia BH-BMPT'!$D$31,IF(J115=31,'[1]Equivalencia BH-BMPT'!$D$32,IF(J115=32,'[1]Equivalencia BH-BMPT'!$D$33,IF(J115=33,'[1]Equivalencia BH-BMPT'!$D$34,IF(J115=34,'[1]Equivalencia BH-BMPT'!$D$35,IF(J115=35,'[1]Equivalencia BH-BMPT'!$D$36,IF(J115=36,'[1]Equivalencia BH-BMPT'!$D$37,IF(J115=37,'[1]Equivalencia BH-BMPT'!$D$38,IF(J115=38,'[1]Equivalencia BH-BMPT'!#REF!,IF(J115=39,'[1]Equivalencia BH-BMPT'!$D$40,IF(J115=40,'[1]Equivalencia BH-BMPT'!$D$41,IF(J115=41,'[1]Equivalencia BH-BMPT'!$D$42,IF(J115=42,'[1]Equivalencia BH-BMPT'!$D$43,IF(J115=43,'[1]Equivalencia BH-BMPT'!$D$44,IF(J115=44,'[1]Equivalencia BH-BMPT'!$D$45,IF(J115=45,'[1]Equivalencia BH-BMPT'!$D$46,\"No ha seleccionado un número de programa\")))))))))))))))))))))))))))))))))))))))))))))","v":"Gobernanza e influencia local, regional e internacional"},1329,13449017,"VICTOR MANUEL HERNANDEZ FUENTES",9450000,null,null,null,0,9450000,6750000,"2017-10-27","2017-10-31","2018-01-02",63,0,null,null,"X",null,null,0.7142857142857143,null,null,null,null,0.7142857142857143]
[91,2017,"CPS 091 2017",5,{"$f":"IF(D116=1,'[1]Tipo '!$B$2,IF(D116=2,'[1]Tipo '!$B$3,IF(D116=3,'[1]Tipo '!$B$4,IF(D116=4,'[1]Tipo '!$B$5,IF(D116=5,'[1]Tipo '!$B$6,IF(D116=6,'[1]Tipo '!$B$7,IF(D116=7,'[1]Tipo '!$B$8,IF(D116=8,'[1]Tipo '!$B$9,IF(D116=9,'[1]Tipo '!$B$10,IF(D116=10,'[1]Tipo '!$B$11,IF(D116=11,'[1]Tipo '!$B$12,IF(D116=12,'[1]Tipo '!$B$13,IF(D116=13,'[1]Tipo '!$B$14,IF(D116=14,'[1]Tipo '!$B$15,IF(D116=15,'[1]Tipo '!$B$16,IF(D116=16,'[1]Tipo '!$B$17,IF(D116=17,'[1]Tipo '!$B$18,IF(D116=18,'[1]Tipo '!$B$19,IF(D116=19,'[1]Tipo '!$B$20,\"No ha seleccionado un tipo de contrato válido\")))))))))))))))))))","v":"CONTRATOS DE PRESTACIÓN DE SERVICIOS PROFESIONALES Y DE APOYO A LA GESTIÓN"},"CONTRATACIÓN DIRECTA","Prestación de servicios profesionales y de apoyo a la gestión, o para la ejecución de trabajos artísticos que sólo puedan encomendarse a determinadas personas naturales;","El contrato que se pretende celebrar, tendrá por objeto ¿Prestación de servicios profesionales como apoyo al Área de Gestión de Desarrollo Local de Teusaquillo ¿ planeación, realizando las actividades concernientes al desarrollo de los proyectos de inversión de la Alcaldía Local de Teusaquillo, en cumplimiento al Plan de Desarrollo Local 2017-2020¿.","INVERSIÓN",45,{"$f":"IF(J116=1,'[1]Equivalencia BH-BMPT'!$D$2,IF(J116=2,'[1]Equivalencia BH-BMPT'!$D$3,IF(J116=3,'[1]Equivalencia BH-BMPT'!$D$4,IF(J116=4,'[1]Equivalencia BH-BMPT'!$D$5,IF(J116=5,'[1]Equivalencia BH-BMPT'!$D$6,IF(J116=6,'[1]Equivalencia BH-BMPT'!$D$7,IF(J116=7,'[1]Equivalencia BH-BMPT'!$D$8,IF(J116=8,'[1]Equivalencia BH-BMPT'!$D$9,IF(J116=9,'[1]Equivalencia BH-BMPT'!$D$10,IF(J116=10,'[1]Equivalencia BH-BMPT'!$D$11,IF(J116=11,'[1]Equivalencia BH-BMPT'!$D$12,IF(J116=12,'[1]Equivalencia BH-BMPT'!$D$13,IF(J116=13,'[1]Equivalencia BH-BMPT'!$D$14,IF(J116=14,'[1]Equivalencia BH-BMPT'!$D$15,IF(J116=15,'[1]Equivalencia BH-BMPT'!$D$16,IF(J116=16,'[1]Equivalencia BH-BMPT'!$D$17,IF(J116=17,'[1]Equivalencia BH-BMPT'!$D$18,IF(J116=18,'[1]Equivalencia BH-BMPT'!$D$19,IF(J116=19,'[1]Equivalencia BH-BMPT'!$D$20,IF(J116=20,'[1]Equivalencia BH-BMPT'!$D$21,IF(J116=21,'[1]Equivalencia BH-BMPT'!$D$22,IF(J116=22,'[1]Equivalencia BH-BMPT'!$D$23,IF(J116=23,'[1]Equivalencia BH-BMPT'!#REF!,IF(J116=24,'[1]Equivalencia BH-BMPT'!$D$25,IF(J116=25,'[1]Equivalencia BH-BMPT'!$D$26,IF(J116=26,'[1]Equivalencia BH-BMPT'!$D$27,IF(J116=27,'[1]Equivalencia BH-BMPT'!$D$28,IF(J116=28,'[1]Equivalencia BH-BMPT'!$D$29,IF(J116=29,'[1]Equivalencia BH-BMPT'!$D$30,IF(J116=30,'[1]Equivalencia BH-BMPT'!$D$31,IF(J116=31,'[1]Equivalencia BH-BMPT'!$D$32,IF(J116=32,'[1]Equivalencia BH-BMPT'!$D$33,IF(J116=33,'[1]Equivalencia BH-BMPT'!$D$34,IF(J116=34,'[1]Equivalencia BH-BMPT'!$D$35,IF(J116=35,'[1]Equivalencia BH-BMPT'!$D$36,IF(J116=36,'[1]Equivalencia BH-BMPT'!$D$37,IF(J116=37,'[1]Equivalencia BH-BMPT'!$D$38,IF(J116=38,'[1]Equivalencia BH-BMPT'!#REF!,IF(J116=39,'[1]Equivalencia BH-BMPT'!$D$40,IF(J116=40,'[1]Equivalencia BH-BMPT'!$D$41,IF(J116=41,'[1]Equivalencia BH-BMPT'!$D$42,IF(J116=42,'[1]Equivalencia BH-BMPT'!$D$43,IF(J116=43,'[1]Equivalencia BH-BMPT'!$D$44,IF(J116=44,'[1]Equivalencia BH-BMPT'!$D$45,IF(J116=45,'[1]Equivalencia BH-BMPT'!$D$46,\"No ha seleccionado un número de programa\")))))))))))))))))))))))))))))))))))))))))))))","v":"Gobernanza e influencia local, regional e internacional"},1329,80090976,"JHOAN MAURICIO BUSTOS ROMERO",8610000,null,null,null,0,8610000,0,"2017-10-27","2017-10-31","2018-01-11",null,0,null,null,"X",null,null,0,null,null,null,null,0]
[92,2017,"Cps 092 2017",5,{"$f":"IF(D117=1,'[1]Tipo '!$B$2,IF(D117=2,'[1]Tipo '!$B$3,IF(D117=3,'[1]Tipo '!$B$4,IF(D117=4,'[1]Tipo '!$B$5,IF(D117=5,'[1]Tipo '!$B$6,IF(D117=6,'[1]Tipo '!$B$7,IF(D117=7,'[1]Tipo '!$B$8,IF(D117=8,'[1]Tipo '!$B$9,IF(D117=9,'[1]Tipo '!$B$10,IF(D117=10,'[1]Tipo '!$B$11,IF(D117=11,'[1]Tipo '!$B$12,IF(D117=12,'[1]Tipo '!$B$13,IF(D117=13,'[1]Tipo '!$B$14,IF(D117=14,'[1]Tipo '!$B$15,IF(D117=15,'[1]Tipo '!$B$16,IF(D117=16,'[1]Tipo '!$B$17,IF(D117=17,'[1]Tipo '!$B$18,IF(D117=18,'[1]Tipo '!$B$19,IF(D117=19,'[1]Tipo '!$B$20,\"No ha seleccionado un tipo de contrato válido\")))))))))))))))))))","v":"CONTRATOS DE PRESTACIÓN DE SERVICIOS PROFESIONALES Y DE APOYO A LA GESTIÓN"},"CONTRATACIÓN DIRECTA","Prestación de servicios profesionales y de apoyo a la gestión, o para la ejecución de trabajos artísticos que sólo puedan encomendarse a determinadas personas naturales;","OBJETO: El contrato que se pretende celebrar, tendrá por objeto ¿Apoyar jurídicamente la ejecución de las acciones requeridas para el trámite e impulso procesal de las actuaciones contravencionales y/o querellas que cursen en las Inspecciones de Policía 13 A, 13 B y 13 E de la Localidad¿.","INVERSIÓN",45,{"$f":"IF(J117=1,'[1]Equivalencia BH-BMPT'!$D$2,IF(J117=2,'[1]Equivalencia BH-BMPT'!$D$3,IF(J117=3,'[1]Equivalencia BH-BMPT'!$D$4,IF(J117=4,'[1]Equivalencia BH-BMPT'!$D$5,IF(J117=5,'[1]Equivalencia BH-BMPT'!$D$6,IF(J117=6,'[1]Equivalencia BH-BMPT'!$D$7,IF(J117=7,'[1]Equivalencia BH-BMPT'!$D$8,IF(J117=8,'[1]Equivalencia BH-BMPT'!$D$9,IF(J117=9,'[1]Equivalencia BH-BMPT'!$D$10,IF(J117=10,'[1]Equivalencia BH-BMPT'!$D$11,IF(J117=11,'[1]Equivalencia BH-BMPT'!$D$12,IF(J117=12,'[1]Equivalencia BH-BMPT'!$D$13,IF(J117=13,'[1]Equivalencia BH-BMPT'!$D$14,IF(J117=14,'[1]Equivalencia BH-BMPT'!$D$15,IF(J117=15,'[1]Equivalencia BH-BMPT'!$D$16,IF(J117=16,'[1]Equivalencia BH-BMPT'!$D$17,IF(J117=17,'[1]Equivalencia BH-BMPT'!$D$18,IF(J117=18,'[1]Equivalencia BH-BMPT'!$D$19,IF(J117=19,'[1]Equivalencia BH-BMPT'!$D$20,IF(J117=20,'[1]Equivalencia BH-BMPT'!$D$21,IF(J117=21,'[1]Equivalencia BH-BMPT'!$D$22,IF(J117=22,'[1]Equivalencia BH-BMPT'!$D$23,IF(J117=23,'[1]Equivalencia BH-BMPT'!#REF!,IF(J117=24,'[1]Equivalencia BH-BMPT'!$D$25,IF(J117=25,'[1]Equivalencia BH-BMPT'!$D$26,IF(J117=26,'[1]Equivalencia BH-BMPT'!$D$27,IF(J117=27,'[1]Equivalencia BH-BMPT'!$D$28,IF(J117=28,'[1]Equivalencia BH-BMPT'!$D$29,IF(J117=29,'[1]Equivalencia BH-BMPT'!$D$30,IF(J117=30,'[1]Equivalencia BH-BMPT'!$D$31,IF(J117=31,'[1]Equivalencia BH-BMPT'!$D$32,IF(J117=32,'[1]Equivalencia BH-BMPT'!$D$33,IF(J117=33,'[1]Equivalencia BH-BMPT'!$D$34,IF(J117=34,'[1]Equivalencia BH-BMPT'!$D$35,IF(J117=35,'[1]Equivalencia BH-BMPT'!$D$36,IF(J117=36,'[1]Equivalencia BH-BMPT'!$D$37,IF(J117=37,'[1]Equivalencia BH-BMPT'!$D$38,IF(J117=38,'[1]Equivalencia BH-BMPT'!#REF!,IF(J117=39,'[1]Equivalencia BH-BMPT'!$D$40,IF(J117=40,'[1]Equivalencia BH-BMPT'!$D$41,IF(J117=41,'[1]Equivalencia BH-BMPT'!$D$42,IF(J117=42,'[1]Equivalencia BH-BMPT'!$D$43,IF(J117=43,'[1]Equivalencia BH-BMPT'!$D$44,IF(J117=44,'[1]Equivalencia BH-BMPT'!$D$45,IF(J117=45,'[1]Equivalencia BH-BMPT'!$D$46,\"No ha seleccionado un número de programa\")))))))))))))))))))))))))))))))))))))))))))))","v":"Gobernanza e influencia local, regional e internacional"},1329,1032449032,"JAIME RENE BARAJAS GARCIA",8550000,null,null,null,0,8550000,5250000,"2017-11-03","2017-11-10","2018-01-05",57,0,null,null,"X",null,null,0.61403508771929827]
[93,2017,"SASI 013 2017 ",6,{"$f":"IF(D118=1,'[1]Tipo '!$B$2,IF(D118=2,'[1]Tipo '!$B$3,IF(D118=3,'[1]Tipo '!$B$4,IF(D118=4,'[1]Tipo '!$B$5,IF(D118=5,'[1]Tipo '!$B$6,IF(D118=6,'[1]Tipo '!$B$7,IF(D118=7,'[1]Tipo '!$B$8,IF(D118=8,'[1]Tipo '!$B$9,IF(D118=9,'[1]Tipo '!$B$10,IF(D118=10,'[1]Tipo '!$B$11,IF(D118=11,'[1]Tipo '!$B$12,IF(D118=12,'[1]Tipo '!$B$13,IF(D118=13,'[1]Tipo '!$B$14,IF(D118=14,'[1]Tipo '!$B$15,IF(D118=15,'[1]Tipo '!$B$16,IF(D118=16,'[1]Tipo '!$B$17,IF(D118=17,'[1]Tipo '!$B$18,IF(D118=18,'[1]Tipo '!$B$19,IF(D118=19,'[1]Tipo '!$B$20,\"No ha seleccionado un tipo de contrato válido\")))))))))))))))))))","v":"COMPRAVENTA DE BIENES MUEBLES"},"Selección abreviada ","Subasta inversa ","¿LA ADQUISICION DE EQUIPOS Y ELEMENTOS TECNOLOGICOS (COMPUTADORES, IMPRESORAS, ESTACION DE TRABAJO (WORKSTATION), SUITE DE ADOBE 2017 SUSCRIPCION POR DOS (2) AÑOS ENTRE OTROS), PARA LA ALCALDIA LOCAL DE TEUSAQUILLO Y PARA LA DOTACIÓN DE COLEGIOS DE LA LOCALIDAD DE TEUSAQUILLO, DE CONFORMIDAD CON LAS ESPECIFICACIONES TECNICAS Y CONDICIONES ESTABLECIDAS EN LOS PRESENTES ESTUDIOS PREVIOS Y ANEXO TECNICO¿.","FUNCIONAMIENTO",null,{"$f":"IF(J118=1,'[1]Equivalencia BH-BMPT'!$D$2,IF(J118=2,'[1]Equivalencia BH-BMPT'!$D$3,IF(J118=3,'[1]Equivalencia BH-BMPT'!$D$4,IF(J118=4,'[1]Equivalencia BH-BMPT'!$D$5,IF(J118=5,'[1]Equivalencia BH-BMPT'!$D$6,IF(J118=6,'[1]Equivalencia BH-BMPT'!$D$7,IF(J118=7,'[1]Equivalencia BH-BMPT'!$D$8,IF(J118=8,'[1]Equivalencia BH-BMPT'!$D$9,IF(J118=9,'[1]Equivalencia BH-BMPT'!$D$10,IF(J118=10,'[1]Equivalencia BH-BMPT'!$D$11,IF(J118=11,'[1]Equivalencia BH-BMPT'!$D$12,IF(J118=12,'[1]Equivalencia BH-BMPT'!$D$13,IF(J118=13,'[1]Equivalencia BH-BMPT'!$D$14,IF(J118=14,'[1]Equivalencia BH-BMPT'!$D$15,IF(J118=15,'[1]Equivalencia BH-BMPT'!$D$16,IF(J118=16,'[1]Equivalencia BH-BMPT'!$D$17,IF(J118=17,'[1]Equivalencia BH-BMPT'!$D$18,IF(J118=18,'[1]Equivalencia BH-BMPT'!$D$19,IF(J118=19,'[1]Equivalencia BH-BMPT'!$D$20,IF(J118=20,'[1]Equivalencia BH-BMPT'!$D$21,IF(J118=21,'[1]Equivalencia BH-BMPT'!$D$22,IF(J118=22,'[1]Equivalencia BH-BMPT'!$D$23,IF(J118=23,'[1]Equivalencia BH-BMPT'!#REF!,IF(J118=24,'[1]Equivalencia BH-BMPT'!$D$25,IF(J118=25,'[1]Equivalencia BH-BMPT'!$D$26,IF(J118=26,'[1]Equivalencia BH-BMPT'!$D$27,IF(J118=27,'[1]Equivalencia BH-BMPT'!$D$28,IF(J118=28,'[1]Equivalencia BH-BMPT'!$D$29,IF(J118=29,'[1]Equivalencia BH-BMPT'!$D$30,IF(J118=30,'[1]Equivalencia BH-BMPT'!$D$31,IF(J118=31,'[1]Equivalencia BH-BMPT'!$D$32,IF(J118=32,'[1]Equivalencia BH-BMPT'!$D$33,IF(J118=33,'[1]Equivalencia BH-BMPT'!$D$34,IF(J118=34,'[1]Equivalencia BH-BMPT'!$D$35,IF(J118=35,'[1]Equivalencia BH-BMPT'!$D$36,IF(J118=36,'[1]Equivalencia BH-BMPT'!$D$37,IF(J118=37,'[1]Equivalencia BH-BMPT'!$D$38,IF(J118=38,'[1]Equivalencia BH-BMPT'!#REF!,IF(J118=39,'[1]Equivalencia BH-BMPT'!$D$40,IF(J118=40,'[1]Equivalencia BH-BMPT'!$D$41,IF(J118=41,'[1]Equivalencia BH-BMPT'!$D$42,IF(J118=42,'[1]Equivalencia BH-BMPT'!$D$43,IF(J118=43,'[1]Equivalencia BH-BMPT'!$D$44,IF(J118=44,'[1]Equivalencia BH-BMPT'!$D$45,IF(J118=45,'[1]Equivalencia BH-BMPT'!$D$46,\"No ha seleccionado un número de programa\")))))))))))))))))))))))))))))))))))))))))))))","v":"No ha seleccionado un número de programa"},null,830110570,"NEX COMPUTER S A",30000000,null,null,null,0,30000000,0,"2017-11-16","2017-11-27","2018-01-10",30,15,null,null,"X",null,null,0]
[93,2017,"SASI 013 2017 ",6,{"$f":"IF(D119=1,'[1]Tipo '!$B$2,IF(D119=2,'[1]Tipo '!$B$3,IF(D119=3,'[1]Tipo '!$B$4,IF(D119=4,'[1]Tipo '!$B$5,IF(D119=5,'[1]Tipo '!$B$6,IF(D119=6,'[1]Tipo '!$B$7,IF(D119=7,'[1]Tipo '!$B$8,IF(D119=8,'[1]Tipo '!$B$9,IF(D119=9,'[1]Tipo '!$B$10,IF(D119=10,'[1]Tipo '!$B$11,IF(D119=11,'[1]Tipo '!$B$12,IF(D119=12,'[1]Tipo '!$B$13,IF(D119=13,'[1]Tipo '!$B$14,IF(D119=14,'[1]Tipo '!$B$15,IF(D119=15,'[1]Tipo '!$B$16,IF(D119=16,'[1]Tipo '!$B$17,IF(D119=17,'[1]Tipo '!$B$18,IF(D119=18,'[1]Tipo '!$B$19,IF(D119=19,'[1]Tipo '!$B$20,\"No ha seleccionado un tipo de contrato válido\")))))))))))))))))))","v":"COMPRAVENTA DE BIENES MUEBLES"},"Selección abreviada ","Subasta inversa ","LA ADQUISICION DE EQUIPOS Y ELEMENTOS TECNOLOGICOS (COMPUTADORES, IMPRESORAS, ESTACION DE TRABAJO (WORKSTATION), SUITE DE ADOBE 2017 SUSCRIPCION POR DOS (2) AÑOS ENTRE OTROS), PARA LA ALCALDIA LOCAL DE TEUSAQUILLO Y PARA LA DOTACIÓN DE COLEGIOS DE LA LOCALIDAD DE TEUSAQUILLO, DE CONFORMIDAD CON LAS ESPECIFICACIONES TECNICAS Y CONDICIONES ESTABLECIDAS EN LOS PRESENTES ESTUDIOS PREVIOS Y ANEXO TECNICO¿.","INVERSIÓN",7,{"$f":"IF(J119=1,'[1]Equivalencia BH-BMPT'!$D$2,IF(J119=2,'[1]Equivalencia BH-BMPT'!$D$3,IF(J119=3,'[1]Equivalencia BH-BMPT'!$D$4,IF(J119=4,'[1]Equivalencia BH-BMPT'!$D$5,IF(J119=5,'[1]Equivalencia BH-BMPT'!$D$6,IF(J119=6,'[1]Equivalencia BH-BMPT'!$D$7,IF(J119=7,'[1]Equivalencia BH-BMPT'!$D$8,IF(J119=8,'[1]Equivalencia BH-BMPT'!$D$9,IF(J119=9,'[1]Equivalencia BH-BMPT'!$D$10,IF(J119=10,'[1]Equivalencia BH-BMPT'!$D$11,IF(J119=11,'[1]Equivalencia BH-BMPT'!$D$12,IF(J119=12,'[1]Equivalencia BH-BMPT'!$D$13,IF(J119=13,'[1]Equivalencia BH-BMPT'!$D$14,IF(J119=14,'[1]Equivalencia BH-BMPT'!$D$15,IF(J119=15,'[1]Equivalencia BH-BMPT'!$D$16,IF(J119=16,'[1]Equivalencia BH-BMPT'!$D$17,IF(J119=17,'[1]Equivalencia BH-BMPT'!$D$18,IF(J119=18,'[1]Equivalencia BH-BMPT'!$D$19,IF(J119=19,'[1]Equivalencia BH-BMPT'!$D$20,IF(J119=20,'[1]Equivalencia BH-BMPT'!$D$21,IF(J119=21,'[1]Equivalencia BH-BMPT'!$D$22,IF(J119=22,'[1]Equivalencia BH-BMPT'!$D$23,IF(J119=23,'[1]Equivalencia BH-BMPT'!#REF!,IF(J119=24,'[1]Equivalencia BH-BMPT'!$D$25,IF(J119=25,'[1]Equivalencia BH-BMPT'!$D$26,IF(J119=26,'[1]Equivalencia BH-BMPT'!$D$27,IF(J119=27,'[1]Equivalencia BH-BMPT'!$D$28,IF(J119=28,'[1]Equivalencia BH-BMPT'!$D$29,IF(J119=29,'[1]Equivalencia BH-BMPT'!$D$30,IF(J119=30,'[1]Equivalencia BH-BMPT'!$D$31,IF(J119=31,'[1]Equivalencia BH-BMPT'!$D$32,IF(J119=32,'[1]Equivalencia BH-BMPT'!$D$33,IF(J119=33,'[1]Equivalencia BH-BMPT'!$D$34,IF(J119=34,'[1]Equivalencia BH-BMPT'!$D$35,IF(J119=35,'[1]Equivalencia BH-BMPT'!$D$36,IF(J119=36,'[1]Equivalencia BH-BMPT'!$D$37,IF(J119=37,'[1]Equivalencia BH-BMPT'!$D$38,IF(J119=38,'[1]Equivalencia BH-BMPT'!#REF!,IF(J119=39,'[1]Equivalencia BH-BMPT'!$D$40,IF(J119=40,'[1]Equivalencia BH-BMPT'!$D$41,IF(J119=41,'[1]Equivalencia BH-BMPT'!$D$42,IF(J119=42,'[1]Equivalencia BH-BMPT'!$D$43,IF(J119=43,'[1]Equivalencia BH-BMPT'!$D$44,IF(J119=44,'[1]Equivalencia BH-BMPT'!$D$45,IF(J119=45,'[1]Equivalencia BH-BMPT'!$D$46,\"No ha seleccionado un número de programa\")))))))))))))))))))))))))))))))))))))))))))))","v":"Inclusión educativa para la equidad"},1332,830110570,"NEX COMPUTER S A",38000000,null,null,null,0,38000000,0,"2017-11-16","2017-11-27","2018-01-10",30,15,null,null,"X",null,null,0]
[94,2017,"CPS 094 2017 ",5,{"$f":"IF(D120=1,'[1]Tipo '!$B$2,IF(D120=2,'[1]Tipo '!$B$3,IF(D120=3,'[1]Tipo '!$B$4,IF(D120=4,'[1]Tipo '!$B$5,IF(D120=5,'[1]Tipo '!$B$6,IF(D120=6,'[1]Tipo '!$B$7,IF(D120=7,'[1]Tipo '!$B$8,IF(D120=8,'[1]Tipo '!$B$9,IF(D120=9,'[1]Tipo '!$B$10,IF(D120=10,'[1]Tipo '!$B$11,IF(D120=11,'[1]Tipo '!$B$12,IF(D120=12,'[1]Tipo '!$B$13,IF(D120=13,'[1]Tipo '!$B$14,IF(D120=14,'[1]Tipo '!$B$15,IF(D120=15,'[1]Tipo '!$B$16,IF(D120=16,'[1]Tipo '!$B$17,IF(D120=17,'[1]Tipo '!$B$18,IF(D120=18,'[1]Tipo '!$B$19,IF(D120=19,'[1]Tipo '!$B$20,\"No ha seleccionado un tipo de contrato válido\")))))))))))))))))))","v":"CONTRATOS DE PRESTACIÓN DE SERVICIOS PROFESIONALES Y DE APOYO A LA GESTIÓN"},"CONTRATACIÓN DIRECTA","Prestación de servicios profesionales y de apoyo a la gestión, o para la ejecución de trabajos artísticos que sólo puedan encomendarse a determinadas personas naturales;","OBJETO: El contrato que se pretende celebrar, tendrá por objeto: ¿El contratista se obliga para con el Despacho de la Alcaldía Local de Teusaquillo a prestar sus servicios profesionales, en todo lo concerniente al manejo de las comunicaciones internas y externas de conformidad con las directrices de la oficina Asesora de Comunicaciones de la  Secretaría Distrital de Gobierno, en cumplimiento al Plan de Comunicaciones, Plan de Desarrollo Local 2017-2020 y plan de gestión de la Alcaldía Local de Teusaquillo ¿","INVERSIÓN",45,{"$f":"IF(J120=1,'[1]Equivalencia BH-BMPT'!$D$2,IF(J120=2,'[1]Equivalencia BH-BMPT'!$D$3,IF(J120=3,'[1]Equivalencia BH-BMPT'!$D$4,IF(J120=4,'[1]Equivalencia BH-BMPT'!$D$5,IF(J120=5,'[1]Equivalencia BH-BMPT'!$D$6,IF(J120=6,'[1]Equivalencia BH-BMPT'!$D$7,IF(J120=7,'[1]Equivalencia BH-BMPT'!$D$8,IF(J120=8,'[1]Equivalencia BH-BMPT'!$D$9,IF(J120=9,'[1]Equivalencia BH-BMPT'!$D$10,IF(J120=10,'[1]Equivalencia BH-BMPT'!$D$11,IF(J120=11,'[1]Equivalencia BH-BMPT'!$D$12,IF(J120=12,'[1]Equivalencia BH-BMPT'!$D$13,IF(J120=13,'[1]Equivalencia BH-BMPT'!$D$14,IF(J120=14,'[1]Equivalencia BH-BMPT'!$D$15,IF(J120=15,'[1]Equivalencia BH-BMPT'!$D$16,IF(J120=16,'[1]Equivalencia BH-BMPT'!$D$17,IF(J120=17,'[1]Equivalencia BH-BMPT'!$D$18,IF(J120=18,'[1]Equivalencia BH-BMPT'!$D$19,IF(J120=19,'[1]Equivalencia BH-BMPT'!$D$20,IF(J120=20,'[1]Equivalencia BH-BMPT'!$D$21,IF(J120=21,'[1]Equivalencia BH-BMPT'!$D$22,IF(J120=22,'[1]Equivalencia BH-BMPT'!$D$23,IF(J120=23,'[1]Equivalencia BH-BMPT'!#REF!,IF(J120=24,'[1]Equivalencia BH-BMPT'!$D$25,IF(J120=25,'[1]Equivalencia BH-BMPT'!$D$26,IF(J120=26,'[1]Equivalencia BH-BMPT'!$D$27,IF(J120=27,'[1]Equivalencia BH-BMPT'!$D$28,IF(J120=28,'[1]Equivalencia BH-BMPT'!$D$29,IF(J120=29,'[1]Equivalencia BH-BMPT'!$D$30,IF(J120=30,'[1]Equivalencia BH-BMPT'!$D$31,IF(J120=31,'[1]Equivalencia BH-BMPT'!$D$32,IF(J120=32,'[1]Equivalencia BH-BMPT'!$D$33,IF(J120=33,'[1]Equivalencia BH-BMPT'!$D$34,IF(J120=34,'[1]Equivalencia BH-BMPT'!$D$35,IF(J120=35,'[1]Equivalencia BH-BMPT'!$D$36,IF(J120=36,'[1]Equivalencia BH-BMPT'!$D$37,IF(J120=37,'[1]Equivalencia BH-BMPT'!$D$38,IF(J120=38,'[1]Equivalencia BH-BMPT'!#REF!,IF(J120=39,'[1]Equivalencia BH-BMPT'!$D$40,IF(J120=40,'[1]Equivalencia BH-BMPT'!$D$41,IF(J120=41,'[1]Equivalencia BH-BMPT'!$D$42,IF(J120=42,'[1]Equivalencia BH-BMPT'!$D$43,IF(J120=43,'[1]Equivalencia BH-BMPT'!$D$44,IF(J120=44,'[1]Equivalencia BH-BMPT'!$D$45,IF(J120=45,'[1]Equivalencia BH-BMPT'!$D$46,\"No ha seleccionado un número de programa\")))))))))))))))))))))))))))))))))))))))))))))","v":"Gobernanza e influencia local, regional e internacional"},1329,23781808,"ALEXANDRA  MOJICA MOJICA",10600000,null,null,null,0,10600000,7400000,"2017-11-07","2017-11-08","2017-12-30",53,0,null,null,null,"X",null,0.69811320754716977]
[95,2017,"SASI  2017 ",6,{"$f":"IF(D121=1,'[1]Tipo '!$B$2,IF(D121=2,'[1]Tipo '!$B$3,IF(D121=3,'[1]Tipo '!$B$4,IF(D121=4,'[1]Tipo '!$B$5,IF(D121=5,'[1]Tipo '!$B$6,IF(D121=6,'[1]Tipo '!$B$7,IF(D121=7,'[1]Tipo '!$B$8,IF(D121=8,'[1]Tipo '!$B$9,IF(D121=9,'[1]Tipo '!$B$10,IF(D121=10,'[1]Tipo '!$B$11,IF(D121=11,'[1]Tipo '!$B$12,IF(D121=12,'[1]Tipo '!$B$13,IF(D121=13,'[1]Tipo '!$B$14,IF(D121=14,'[1]Tipo '!$B$15,IF(D121=15,'[1]Tipo '!$B$16,IF(D121=16,'[1]Tipo '!$B$17,IF(D121=17,'[1]Tipo '!$B$18,IF(D121=18,'[1]Tipo '!$B$19,IF(D121=19,'[1]Tipo '!$B$20,\"No ha seleccionado un tipo de contrato válido\")))))))))))))))))))","v":"COMPRAVENTA DE BIENES MUEBLES"},"Selección abreviada ","Acuerdo marco de precios ","ADQUISICION DE MATERIAL PEDAGOGICO PARA LOS HOGARES DE BINESTAR FAMILIAR QUE FUNCIONAN EN LA LOCALIDAD DE TEUSAQUILLO.","INVERSIÓN",2,{"$f":"IF(J121=1,'[1]Equivalencia BH-BMPT'!$D$2,IF(J121=2,'[1]Equivalencia BH-BMPT'!$D$3,IF(J121=3,'[1]Equivalencia BH-BMPT'!$D$4,IF(J121=4,'[1]Equivalencia BH-BMPT'!$D$5,IF(J121=5,'[1]Equivalencia BH-BMPT'!$D$6,IF(J121=6,'[1]Equivalencia BH-BMPT'!$D$7,IF(J121=7,'[1]Equivalencia BH-BMPT'!$D$8,IF(J121=8,'[1]Equivalencia BH-BMPT'!$D$9,IF(J121=9,'[1]Equivalencia BH-BMPT'!$D$10,IF(J121=10,'[1]Equivalencia BH-BMPT'!$D$11,IF(J121=11,'[1]Equivalencia BH-BMPT'!$D$12,IF(J121=12,'[1]Equivalencia BH-BMPT'!$D$13,IF(J121=13,'[1]Equivalencia BH-BMPT'!$D$14,IF(J121=14,'[1]Equivalencia BH-BMPT'!$D$15,IF(J121=15,'[1]Equivalencia BH-BMPT'!$D$16,IF(J121=16,'[1]Equivalencia BH-BMPT'!$D$17,IF(J121=17,'[1]Equivalencia BH-BMPT'!$D$18,IF(J121=18,'[1]Equivalencia BH-BMPT'!$D$19,IF(J121=19,'[1]Equivalencia BH-BMPT'!$D$20,IF(J121=20,'[1]Equivalencia BH-BMPT'!$D$21,IF(J121=21,'[1]Equivalencia BH-BMPT'!$D$22,IF(J121=22,'[1]Equivalencia BH-BMPT'!$D$23,IF(J121=23,'[1]Equivalencia BH-BMPT'!#REF!,IF(J121=24,'[1]Equivalencia BH-BMPT'!$D$25,IF(J121=25,'[1]Equivalencia BH-BMPT'!$D$26,IF(J121=26,'[1]Equivalencia BH-BMPT'!$D$27,IF(J121=27,'[1]Equivalencia BH-BMPT'!$D$28,IF(J121=28,'[1]Equivalencia BH-BMPT'!$D$29,IF(J121=29,'[1]Equivalencia BH-BMPT'!$D$30,IF(J121=30,'[1]Equivalencia BH-BMPT'!$D$31,IF(J121=31,'[1]Equivalencia BH-BMPT'!$D$32,IF(J121=32,'[1]Equivalencia BH-BMPT'!$D$33,IF(J121=33,'[1]Equivalencia BH-BMPT'!$D$34,IF(J121=34,'[1]Equivalencia BH-BMPT'!$D$35,IF(J121=35,'[1]Equivalencia BH-BMPT'!$D$36,IF(J121=36,'[1]Equivalencia BH-BMPT'!$D$37,IF(J121=37,'[1]Equivalencia BH-BMPT'!$D$38,IF(J121=38,'[1]Equivalencia BH-BMPT'!#REF!,IF(J121=39,'[1]Equivalencia BH-BMPT'!$D$40,IF(J121=40,'[1]Equivalencia BH-BMPT'!$D$41,IF(J121=41,'[1]Equivalencia BH-BMPT'!$D$42,IF(J121=42,'[1]Equivalencia BH-BMPT'!$D$43,IF(J121=43,'[1]Equivalencia BH-BMPT'!$D$44,IF(J121=44,'[1]Equivalencia BH-BMPT'!$D$45,IF(J121=45,'[1]Equivalencia BH-BMPT'!$D$46,\"No ha seleccionado un número de programa\")))))))))))))))))))))))))))))))))))))))))))))","v":"Desarrollo integral desde la gestación hasta la adolescencia"},1335,830078349,"INDUSTRIAS DIDACTICAS URANIA LTDA",15000000,null,null,null,0,15000000,0,"2017-11-08","2017-11-21","2017-12-20",30,0,null,null,null,"X",null,0]
[96,2017,"CPS 096 2017 ",4,{"$f":"IF(D122=1,'[1]Tipo '!$B$2,IF(D122=2,'[1]Tipo '!$B$3,IF(D122=3,'[1]Tipo '!$B$4,IF(D122=4,'[1]Tipo '!$B$5,IF(D122=5,'[1]Tipo '!$B$6,IF(D122=6,'[1]Tipo '!$B$7,IF(D122=7,'[1]Tipo '!$B$8,IF(D122=8,'[1]Tipo '!$B$9,IF(D122=9,'[1]Tipo '!$B$10,IF(D122=10,'[1]Tipo '!$B$11,IF(D122=11,'[1]Tipo '!$B$12,IF(D122=12,'[1]Tipo '!$B$13,IF(D122=13,'[1]Tipo '!$B$14,IF(D122=14,'[1]Tipo '!$B$15,IF(D122=15,'[1]Tipo '!$B$16,IF(D122=16,'[1]Tipo '!$B$17,IF(D122=17,'[1]Tipo '!$B$18,IF(D122=18,'[1]Tipo '!$B$19,IF(D122=19,'[1]Tipo '!$B$20,\"No ha seleccionado un tipo de contrato válido\")))))))))))))))))))","v":"CONTRATOS DE PRESTACIÓN DE SERVICIOS"},"Contratación mínima cuantia ","No aplica","El contrato que se pretende celebrar, tendrá por objeto el SUMINISTRO DE REFRIGERIOS, MENÚS, BEBIDAS Y/O ALIMENTOS ENCAMINADOS A APOYAR LAS DIFERENTES ACTIVIDADES DESARROLLADAS POR LAS INSTANCIAS DE PARTICIPACION DE LA LOCALIDAD DE TEUSAQUILLO.","INVERSIÓN",45,{"$f":"IF(J122=1,'[1]Equivalencia BH-BMPT'!$D$2,IF(J122=2,'[1]Equivalencia BH-BMPT'!$D$3,IF(J122=3,'[1]Equivalencia BH-BMPT'!$D$4,IF(J122=4,'[1]Equivalencia BH-BMPT'!$D$5,IF(J122=5,'[1]Equivalencia BH-BMPT'!$D$6,IF(J122=6,'[1]Equivalencia BH-BMPT'!$D$7,IF(J122=7,'[1]Equivalencia BH-BMPT'!$D$8,IF(J122=8,'[1]Equivalencia BH-BMPT'!$D$9,IF(J122=9,'[1]Equivalencia BH-BMPT'!$D$10,IF(J122=10,'[1]Equivalencia BH-BMPT'!$D$11,IF(J122=11,'[1]Equivalencia BH-BMPT'!$D$12,IF(J122=12,'[1]Equivalencia BH-BMPT'!$D$13,IF(J122=13,'[1]Equivalencia BH-BMPT'!$D$14,IF(J122=14,'[1]Equivalencia BH-BMPT'!$D$15,IF(J122=15,'[1]Equivalencia BH-BMPT'!$D$16,IF(J122=16,'[1]Equivalencia BH-BMPT'!$D$17,IF(J122=17,'[1]Equivalencia BH-BMPT'!$D$18,IF(J122=18,'[1]Equivalencia BH-BMPT'!$D$19,IF(J122=19,'[1]Equivalencia BH-BMPT'!$D$20,IF(J122=20,'[1]Equivalencia BH-BMPT'!$D$21,IF(J122=21,'[1]Equivalencia BH-BMPT'!$D$22,IF(J122=22,'[1]Equivalencia BH-BMPT'!$D$23,IF(J122=23,'[1]Equivalencia BH-BMPT'!#REF!,IF(J122=24,'[1]Equivalencia BH-BMPT'!$D$25,IF(J122=25,'[1]Equivalencia BH-BMPT'!$D$26,IF(J122=26,'[1]Equivalencia BH-BMPT'!$D$27,IF(J122=27,'[1]Equivalencia BH-BMPT'!$D$28,IF(J122=28,'[1]Equivalencia BH-BMPT'!$D$29,IF(J122=29,'[1]Equivalencia BH-BMPT'!$D$30,IF(J122=30,'[1]Equivalencia BH-BMPT'!$D$31,IF(J122=31,'[1]Equivalencia BH-BMPT'!$D$32,IF(J122=32,'[1]Equivalencia BH-BMPT'!$D$33,IF(J122=33,'[1]Equivalencia BH-BMPT'!$D$34,IF(J122=34,'[1]Equivalencia BH-BMPT'!$D$35,IF(J122=35,'[1]Equivalencia BH-BMPT'!$D$36,IF(J122=36,'[1]Equivalencia BH-BMPT'!$D$37,IF(J122=37,'[1]Equivalencia BH-BMPT'!$D$38,IF(J122=38,'[1]Equivalencia BH-BMPT'!#REF!,IF(J122=39,'[1]Equivalencia BH-BMPT'!$D$40,IF(J122=40,'[1]Equivalencia BH-BMPT'!$D$41,IF(J122=41,'[1]Equivalencia BH-BMPT'!$D$42,IF(J122=42,'[1]Equivalencia BH-BMPT'!$D$43,IF(J122=43,'[1]Equivalencia BH-BMPT'!$D$44,IF(J122=44,'[1]Equivalencia BH-BMPT'!$D$45,IF(J122=45,'[1]Equivalencia BH-BMPT'!$D$46,\"No ha seleccionado un número de programa\")))))))))))))))))))))))))))))))))))))))))))))","v":"Gobernanza e influencia local, regional e internacional"},1351,800081700,"FRUPYS LTDA",20000000,null,null,null,10000000,30000000,6373000,"2017-11-10","2017-11-10","2018-04-09",150,0,null,null,"X",null,null,0.21243333333333334]
[97,2017,"Cps 097 2017 ",5,{"$f":"IF(D123=1,'[1]Tipo '!$B$2,IF(D123=2,'[1]Tipo '!$B$3,IF(D123=3,'[1]Tipo '!$B$4,IF(D123=4,'[1]Tipo '!$B$5,IF(D123=5,'[1]Tipo '!$B$6,IF(D123=6,'[1]Tipo '!$B$7,IF(D123=7,'[1]Tipo '!$B$8,IF(D123=8,'[1]Tipo '!$B$9,IF(D123=9,'[1]Tipo '!$B$10,IF(D123=10,'[1]Tipo '!$B$11,IF(D123=11,'[1]Tipo '!$B$12,IF(D123=12,'[1]Tipo '!$B$13,IF(D123=13,'[1]Tipo '!$B$14,IF(D123=14,'[1]Tipo '!$B$15,IF(D123=15,'[1]Tipo '!$B$16,IF(D123=16,'[1]Tipo '!$B$17,IF(D123=17,'[1]Tipo '!$B$18,IF(D123=18,'[1]Tipo '!$B$19,IF(D123=19,'[1]Tipo '!$B$20,\"No ha seleccionado un tipo de contrato válido\")))))))))))))))))))","v":"CONTRATOS DE PRESTACIÓN DE SERVICIOS PROFESIONALES Y DE APOYO A LA GESTIÓN"},"CONTRATACIÓN DIRECTA","Prestación de servicios profesionales y de apoyo a la gestión, o para la ejecución de trabajos artísticos que sólo puedan encomendarse a determinadas personas naturales;","El contrato que se pretende celebrar, tendrá por objeto: \"Prestación de servicios profesionales con el fin de gestionar el proceso de cobro persuasivo dentro de las Actuaciones Administrativas que se adelantan en el Área de Gestión Policiva, así como dar trámite a las actuaciones administrativas relacionadas con establecimientos de comercio y/ o espacio público, peticiones, quejas y requerimientos","INVERSIÓN",45,{"$f":"IF(J123=1,'[1]Equivalencia BH-BMPT'!$D$2,IF(J123=2,'[1]Equivalencia BH-BMPT'!$D$3,IF(J123=3,'[1]Equivalencia BH-BMPT'!$D$4,IF(J123=4,'[1]Equivalencia BH-BMPT'!$D$5,IF(J123=5,'[1]Equivalencia BH-BMPT'!$D$6,IF(J123=6,'[1]Equivalencia BH-BMPT'!$D$7,IF(J123=7,'[1]Equivalencia BH-BMPT'!$D$8,IF(J123=8,'[1]Equivalencia BH-BMPT'!$D$9,IF(J123=9,'[1]Equivalencia BH-BMPT'!$D$10,IF(J123=10,'[1]Equivalencia BH-BMPT'!$D$11,IF(J123=11,'[1]Equivalencia BH-BMPT'!$D$12,IF(J123=12,'[1]Equivalencia BH-BMPT'!$D$13,IF(J123=13,'[1]Equivalencia BH-BMPT'!$D$14,IF(J123=14,'[1]Equivalencia BH-BMPT'!$D$15,IF(J123=15,'[1]Equivalencia BH-BMPT'!$D$16,IF(J123=16,'[1]Equivalencia BH-BMPT'!$D$17,IF(J123=17,'[1]Equivalencia BH-BMPT'!$D$18,IF(J123=18,'[1]Equivalencia BH-BMPT'!$D$19,IF(J123=19,'[1]Equivalencia BH-BMPT'!$D$20,IF(J123=20,'[1]Equivalencia BH-BMPT'!$D$21,IF(J123=21,'[1]Equivalencia BH-BMPT'!$D$22,IF(J123=22,'[1]Equivalencia BH-BMPT'!$D$23,IF(J123=23,'[1]Equivalencia BH-BMPT'!#REF!,IF(J123=24,'[1]Equivalencia BH-BMPT'!$D$25,IF(J123=25,'[1]Equivalencia BH-BMPT'!$D$26,IF(J123=26,'[1]Equivalencia BH-BMPT'!$D$27,IF(J123=27,'[1]Equivalencia BH-BMPT'!$D$28,IF(J123=28,'[1]Equivalencia BH-BMPT'!$D$29,IF(J123=29,'[1]Equivalencia BH-BMPT'!$D$30,IF(J123=30,'[1]Equivalencia BH-BMPT'!$D$31,IF(J123=31,'[1]Equivalencia BH-BMPT'!$D$32,IF(J123=32,'[1]Equivalencia BH-BMPT'!$D$33,IF(J123=33,'[1]Equivalencia BH-BMPT'!$D$34,IF(J123=34,'[1]Equivalencia BH-BMPT'!$D$35,IF(J123=35,'[1]Equivalencia BH-BMPT'!$D$36,IF(J123=36,'[1]Equivalencia BH-BMPT'!$D$37,IF(J123=37,'[1]Equivalencia BH-BMPT'!$D$38,IF(J123=38,'[1]Equivalencia BH-BMPT'!#REF!,IF(J123=39,'[1]Equivalencia BH-BMPT'!$D$40,IF(J123=40,'[1]Equivalencia BH-BMPT'!$D$41,IF(J123=41,'[1]Equivalencia BH-BMPT'!$D$42,IF(J123=42,'[1]Equivalencia BH-BMPT'!$D$43,IF(J123=43,'[1]Equivalencia BH-BMPT'!$D$44,IF(J123=44,'[1]Equivalencia BH-BMPT'!$D$45,IF(J123=45,'[1]Equivalencia BH-BMPT'!$D$46,\"No ha seleccionado un número de programa\")))))))))))))))))))))))))))))))))))))))))))))","v":"Gobernanza e influencia local, regional e internacional"},1329,1018407386,"KAREN GIULIANA JARA RIVEROS",5600000,null,null,null,0,5600000,3360000,"2017-11-20","2017-11-21","2017-12-30",40,0,null,null,null,"X",null,0.6]
[98,2017,"Cps 098 2017 ",5,{"$f":"IF(D124=1,'[1]Tipo '!$B$2,IF(D124=2,'[1]Tipo '!$B$3,IF(D124=3,'[1]Tipo '!$B$4,IF(D124=4,'[1]Tipo '!$B$5,IF(D124=5,'[1]Tipo '!$B$6,IF(D124=6,'[1]Tipo '!$B$7,IF(D124=7,'[1]Tipo '!$B$8,IF(D124=8,'[1]Tipo '!$B$9,IF(D124=9,'[1]Tipo '!$B$10,IF(D124=10,'[1]Tipo '!$B$11,IF(D124=11,'[1]Tipo '!$B$12,IF(D124=12,'[1]Tipo '!$B$13,IF(D124=13,'[1]Tipo '!$B$14,IF(D124=14,'[1]Tipo '!$B$15,IF(D124=15,'[1]Tipo '!$B$16,IF(D124=16,'[1]Tipo '!$B$17,IF(D124=17,'[1]Tipo '!$B$18,IF(D124=18,'[1]Tipo '!$B$19,IF(D124=19,'[1]Tipo '!$B$20,\"No ha seleccionado un tipo de contrato válido\")))))))))))))))))))","v":"CONTRATOS DE PRESTACIÓN DE SERVICIOS PROFESIONALES Y DE APOYO A LA GESTIÓN"},"CONTRATACIÓN DIRECTA","Prestación de servicios profesionales y de apoyo a la gestión, o para la ejecución de trabajos artísticos que sólo puedan encomendarse a determinadas personas naturales;","OBJETO: El contrato que se pretende celebrar, tendrá por objeto ¿Apoyar jurídicamente la ejecución de las acciones requeridas para la depuración de las actuaciones administrativas que cursan en la Alcaldía Local de Teusaquillo¿.","INVERSIÓN",45,{"$f":"IF(J124=1,'[1]Equivalencia BH-BMPT'!$D$2,IF(J124=2,'[1]Equivalencia BH-BMPT'!$D$3,IF(J124=3,'[1]Equivalencia BH-BMPT'!$D$4,IF(J124=4,'[1]Equivalencia BH-BMPT'!$D$5,IF(J124=5,'[1]Equivalencia BH-BMPT'!$D$6,IF(J124=6,'[1]Equivalencia BH-BMPT'!$D$7,IF(J124=7,'[1]Equivalencia BH-BMPT'!$D$8,IF(J124=8,'[1]Equivalencia BH-BMPT'!$D$9,IF(J124=9,'[1]Equivalencia BH-BMPT'!$D$10,IF(J124=10,'[1]Equivalencia BH-BMPT'!$D$11,IF(J124=11,'[1]Equivalencia BH-BMPT'!$D$12,IF(J124=12,'[1]Equivalencia BH-BMPT'!$D$13,IF(J124=13,'[1]Equivalencia BH-BMPT'!$D$14,IF(J124=14,'[1]Equivalencia BH-BMPT'!$D$15,IF(J124=15,'[1]Equivalencia BH-BMPT'!$D$16,IF(J124=16,'[1]Equivalencia BH-BMPT'!$D$17,IF(J124=17,'[1]Equivalencia BH-BMPT'!$D$18,IF(J124=18,'[1]Equivalencia BH-BMPT'!$D$19,IF(J124=19,'[1]Equivalencia BH-BMPT'!$D$20,IF(J124=20,'[1]Equivalencia BH-BMPT'!$D$21,IF(J124=21,'[1]Equivalencia BH-BMPT'!$D$22,IF(J124=22,'[1]Equivalencia BH-BMPT'!$D$23,IF(J124=23,'[1]Equivalencia BH-BMPT'!#REF!,IF(J124=24,'[1]Equivalencia BH-BMPT'!$D$25,IF(J124=25,'[1]Equivalencia BH-BMPT'!$D$26,IF(J124=26,'[1]Equivalencia BH-BMPT'!$D$27,IF(J124=27,'[1]Equivalencia BH-BMPT'!$D$28,IF(J124=28,'[1]Equivalencia BH-BMPT'!$D$29,IF(J124=29,'[1]Equivalencia BH-BMPT'!$D$30,IF(J124=30,'[1]Equivalencia BH-BMPT'!$D$31,IF(J124=31,'[1]Equivalencia BH-BMPT'!$D$32,IF(J124=32,'[1]Equivalencia BH-BMPT'!$D$33,IF(J124=33,'[1]Equivalencia BH-BMPT'!$D$34,IF(J124=34,'[1]Equivalencia BH-BMPT'!$D$35,IF(J124=35,'[1]Equivalencia BH-BMPT'!$D$36,IF(J124=36,'[1]Equivalencia BH-BMPT'!$D$37,IF(J124=37,'[1]Equivalencia BH-BMPT'!$D$38,IF(J124=38,'[1]Equivalencia BH-BMPT'!#REF!,IF(J124=39,'[1]Equivalencia BH-BMPT'!$D$40,IF(J124=40,'[1]Equivalencia BH-BMPT'!$D$41,IF(J124=41,'[1]Equivalencia BH-BMPT'!$D$42,IF(J124=42,'[1]Equivalencia BH-BMPT'!$D$43,IF(J124=43,'[1]Equivalencia BH-BMPT'!$D$44,IF(J124=44,'[1]Equivalencia BH-BMPT'!$D$45,IF(J124=45,'[1]Equivalencia BH-BMPT'!$D$46,\"No ha seleccionado un número de programa\")))))))))))))))))))))))))))))))))))))))))))))","v":"Gobernanza e influencia local, regional e internacional"},1329,79634980,"YEISON  ZARATE YAGUARA",5700000,null,null,null,0,5700000,0,"2017-11-23","2017-11-23","2017-12-30",38,0,null,null,null,"X",null,0]
[99,2017,"FDLT CM 007 2017",3,{"$f":"IF(D125=1,'[1]Tipo '!$B$2,IF(D125=2,'[1]Tipo '!$B$3,IF(D125=3,'[1]Tipo '!$B$4,IF(D125=4,'[1]Tipo '!$B$5,IF(D125=5,'[1]Tipo '!$B$6,IF(D125=6,'[1]Tipo '!$B$7,IF(D125=7,'[1]Tipo '!$B$8,IF(D125=8,'[1]Tipo '!$B$9,IF(D125=9,'[1]Tipo '!$B$10,IF(D125=10,'[1]Tipo '!$B$11,IF(D125=11,'[1]Tipo '!$B$12,IF(D125=12,'[1]Tipo '!$B$13,IF(D125=13,'[1]Tipo '!$B$14,IF(D125=14,'[1]Tipo '!$B$15,IF(D125=15,'[1]Tipo '!$B$16,IF(D125=16,'[1]Tipo '!$B$17,IF(D125=17,'[1]Tipo '!$B$18,IF(D125=18,'[1]Tipo '!$B$19,IF(D125=19,'[1]Tipo '!$B$20,\"No ha seleccionado un tipo de contrato válido\")))))))))))))))))))","v":"INTERVENTORÍA"},"CONCURSO DE MÉRITOS",null,"Realizar la Interventoría Técnica, Administrativa, Legal, Financiera, Social, Ambiental y de Seguridad y Salud en el Trabajo para la ejecución a monto agotable, de las obras y actividades necesarias para la conservación de la malla vial local e intermedia y espacio público de la localidad de Teusaquillo, en la ciudad de Bogotá D.C.. de conformidad con los estudios previos, anexo técnico y apéndices","INVERSIÓN",18,{"$f":"IF(J125=1,'[1]Equivalencia BH-BMPT'!$D$2,IF(J125=2,'[1]Equivalencia BH-BMPT'!$D$3,IF(J125=3,'[1]Equivalencia BH-BMPT'!$D$4,IF(J125=4,'[1]Equivalencia BH-BMPT'!$D$5,IF(J125=5,'[1]Equivalencia BH-BMPT'!$D$6,IF(J125=6,'[1]Equivalencia BH-BMPT'!$D$7,IF(J125=7,'[1]Equivalencia BH-BMPT'!$D$8,IF(J125=8,'[1]Equivalencia BH-BMPT'!$D$9,IF(J125=9,'[1]Equivalencia BH-BMPT'!$D$10,IF(J125=10,'[1]Equivalencia BH-BMPT'!$D$11,IF(J125=11,'[1]Equivalencia BH-BMPT'!$D$12,IF(J125=12,'[1]Equivalencia BH-BMPT'!$D$13,IF(J125=13,'[1]Equivalencia BH-BMPT'!$D$14,IF(J125=14,'[1]Equivalencia BH-BMPT'!$D$15,IF(J125=15,'[1]Equivalencia BH-BMPT'!$D$16,IF(J125=16,'[1]Equivalencia BH-BMPT'!$D$17,IF(J125=17,'[1]Equivalencia BH-BMPT'!$D$18,IF(J125=18,'[1]Equivalencia BH-BMPT'!$D$19,IF(J125=19,'[1]Equivalencia BH-BMPT'!$D$20,IF(J125=20,'[1]Equivalencia BH-BMPT'!$D$21,IF(J125=21,'[1]Equivalencia BH-BMPT'!$D$22,IF(J125=22,'[1]Equivalencia BH-BMPT'!$D$23,IF(J125=23,'[1]Equivalencia BH-BMPT'!#REF!,IF(J125=24,'[1]Equivalencia BH-BMPT'!$D$25,IF(J125=25,'[1]Equivalencia BH-BMPT'!$D$26,IF(J125=26,'[1]Equivalencia BH-BMPT'!$D$27,IF(J125=27,'[1]Equivalencia BH-BMPT'!$D$28,IF(J125=28,'[1]Equivalencia BH-BMPT'!$D$29,IF(J125=29,'[1]Equivalencia BH-BMPT'!$D$30,IF(J125=30,'[1]Equivalencia BH-BMPT'!$D$31,IF(J125=31,'[1]Equivalencia BH-BMPT'!$D$32,IF(J125=32,'[1]Equivalencia BH-BMPT'!$D$33,IF(J125=33,'[1]Equivalencia BH-BMPT'!$D$34,IF(J125=34,'[1]Equivalencia BH-BMPT'!$D$35,IF(J125=35,'[1]Equivalencia BH-BMPT'!$D$36,IF(J125=36,'[1]Equivalencia BH-BMPT'!$D$37,IF(J125=37,'[1]Equivalencia BH-BMPT'!$D$38,IF(J125=38,'[1]Equivalencia BH-BMPT'!#REF!,IF(J125=39,'[1]Equivalencia BH-BMPT'!$D$40,IF(J125=40,'[1]Equivalencia BH-BMPT'!$D$41,IF(J125=41,'[1]Equivalencia BH-BMPT'!$D$42,IF(J125=42,'[1]Equivalencia BH-BMPT'!$D$43,IF(J125=43,'[1]Equivalencia BH-BMPT'!$D$44,IF(J125=44,'[1]Equivalencia BH-BMPT'!$D$45,IF(J125=45,'[1]Equivalencia BH-BMPT'!$D$46,\"No ha seleccionado un número de programa\")))))))))))))))))))))))))))))))))))))))))))))","v":"Mejor movilidad para todos"},1338,900045355,"CIVILE LTDA",549161676,null,null,null,0,549161676,0,"2017-11-24","2017-11-24",null,240,0,null,"X",null,null,null,0]
[100,2017,"FDLT SASI 020  2017",6,{"$f":"IF(D126=1,'[1]Tipo '!$B$2,IF(D126=2,'[1]Tipo '!$B$3,IF(D126=3,'[1]Tipo '!$B$4,IF(D126=4,'[1]Tipo '!$B$5,IF(D126=5,'[1]Tipo '!$B$6,IF(D126=6,'[1]Tipo '!$B$7,IF(D126=7,'[1]Tipo '!$B$8,IF(D126=8,'[1]Tipo '!$B$9,IF(D126=9,'[1]Tipo '!$B$10,IF(D126=10,'[1]Tipo '!$B$11,IF(D126=11,'[1]Tipo '!$B$12,IF(D126=12,'[1]Tipo '!$B$13,IF(D126=13,'[1]Tipo '!$B$14,IF(D126=14,'[1]Tipo '!$B$15,IF(D126=15,'[1]Tipo '!$B$16,IF(D126=16,'[1]Tipo '!$B$17,IF(D126=17,'[1]Tipo '!$B$18,IF(D126=18,'[1]Tipo '!$B$19,IF(D126=19,'[1]Tipo '!$B$20,\"No ha seleccionado un tipo de contrato válido\")))))))))))))))))))","v":"COMPRAVENTA DE BIENES MUEBLES"},"Selección abreviada ","Subasta inversa ","El contrato que se pretende celebrar, tendrá por objeto: ¿Adquirir Instrumentos Musicales y accesorios para el Centro Orquestal Local de Teusaquillo, de acuerdo a los presentes estudios previos y anexo técnico¿.","INVERSIÓN",11,{"$f":"IF(J126=1,'[1]Equivalencia BH-BMPT'!$D$2,IF(J126=2,'[1]Equivalencia BH-BMPT'!$D$3,IF(J126=3,'[1]Equivalencia BH-BMPT'!$D$4,IF(J126=4,'[1]Equivalencia BH-BMPT'!$D$5,IF(J126=5,'[1]Equivalencia BH-BMPT'!$D$6,IF(J126=6,'[1]Equivalencia BH-BMPT'!$D$7,IF(J126=7,'[1]Equivalencia BH-BMPT'!$D$8,IF(J126=8,'[1]Equivalencia BH-BMPT'!$D$9,IF(J126=9,'[1]Equivalencia BH-BMPT'!$D$10,IF(J126=10,'[1]Equivalencia BH-BMPT'!$D$11,IF(J126=11,'[1]Equivalencia BH-BMPT'!$D$12,IF(J126=12,'[1]Equivalencia BH-BMPT'!$D$13,IF(J126=13,'[1]Equivalencia BH-BMPT'!$D$14,IF(J126=14,'[1]Equivalencia BH-BMPT'!$D$15,IF(J126=15,'[1]Equivalencia BH-BMPT'!$D$16,IF(J126=16,'[1]Equivalencia BH-BMPT'!$D$17,IF(J126=17,'[1]Equivalencia BH-BMPT'!$D$18,IF(J126=18,'[1]Equivalencia BH-BMPT'!$D$19,IF(J126=19,'[1]Equivalencia BH-BMPT'!$D$20,IF(J126=20,'[1]Equivalencia BH-BMPT'!$D$21,IF(J126=21,'[1]Equivalencia BH-BMPT'!$D$22,IF(J126=22,'[1]Equivalencia BH-BMPT'!$D$23,IF(J126=23,'[1]Equivalencia BH-BMPT'!#REF!,IF(J126=24,'[1]Equivalencia BH-BMPT'!$D$25,IF(J126=25,'[1]Equivalencia BH-BMPT'!$D$26,IF(J126=26,'[1]Equivalencia BH-BMPT'!$D$27,IF(J126=27,'[1]Equivalencia BH-BMPT'!$D$28,IF(J126=28,'[1]Equivalencia BH-BMPT'!$D$29,IF(J126=29,'[1]Equivalencia BH-BMPT'!$D$30,IF(J126=30,'[1]Equivalencia BH-BMPT'!$D$31,IF(J126=31,'[1]Equivalencia BH-BMPT'!$D$32,IF(J126=32,'[1]Equivalencia BH-BMPT'!$D$33,IF(J126=33,'[1]Equivalencia BH-BMPT'!$D$34,IF(J126=34,'[1]Equivalencia BH-BMPT'!$D$35,IF(J126=35,'[1]Equivalencia BH-BMPT'!$D$36,IF(J126=36,'[1]Equivalencia BH-BMPT'!$D$37,IF(J126=37,'[1]Equivalencia BH-BMPT'!$D$38,IF(J126=38,'[1]Equivalencia BH-BMPT'!#REF!,IF(J126=39,'[1]Equivalencia BH-BMPT'!$D$40,IF(J126=40,'[1]Equivalencia BH-BMPT'!$D$41,IF(J126=41,'[1]Equivalencia BH-BMPT'!$D$42,IF(J126=42,'[1]Equivalencia BH-BMPT'!$D$43,IF(J126=43,'[1]Equivalencia BH-BMPT'!$D$44,IF(J126=44,'[1]Equivalencia BH-BMPT'!$D$45,IF(J126=45,'[1]Equivalencia BH-BMPT'!$D$46,\"No ha seleccionado un número de programa\")))))))))))))))))))))))))))))))))))))))))))))","v":"Mejores oportunidades para el desarrollo a través de la cultura, la recreación y el deporte"},1333,900131139,"COMERCIALIZADORA SERDAN LTDA",145000000,null,null,null,0,145000000,0,"2017-12-07","2017-12-15","2018-03-14",90,0,null,null,"X",null,null,0]
[101,2017,"Fdlt MINC 024 2017",4,{"$f":"IF(D127=1,'[1]Tipo '!$B$2,IF(D127=2,'[1]Tipo '!$B$3,IF(D127=3,'[1]Tipo '!$B$4,IF(D127=4,'[1]Tipo '!$B$5,IF(D127=5,'[1]Tipo '!$B$6,IF(D127=6,'[1]Tipo '!$B$7,IF(D127=7,'[1]Tipo '!$B$8,IF(D127=8,'[1]Tipo '!$B$9,IF(D127=9,'[1]Tipo '!$B$10,IF(D127=10,'[1]Tipo '!$B$11,IF(D127=11,'[1]Tipo '!$B$12,IF(D127=12,'[1]Tipo '!$B$13,IF(D127=13,'[1]Tipo '!$B$14,IF(D127=14,'[1]Tipo '!$B$15,IF(D127=15,'[1]Tipo '!$B$16,IF(D127=16,'[1]Tipo '!$B$17,IF(D127=17,'[1]Tipo '!$B$18,IF(D127=18,'[1]Tipo '!$B$19,IF(D127=19,'[1]Tipo '!$B$20,\"No ha seleccionado un tipo de contrato válido\")))))))))))))))))))","v":"CONTRATOS DE PRESTACIÓN DE SERVICIOS"},"Selección abreviada ","Selección abreviada por menor cuantía ","EL SERVICIO DE MANTENIMIENTO PREVENTIVO Y CORRECTIVO DE LOS SISTEMAS TELEFONICOS DE LAS SEDES DE LA ALCALDIA LOCAL DE TEUSAQUILLO CON SOPORTE PRESENCIAL Y BOLSA DE REPUESTOS AGOTABLE SEGÚN NECESIDADES DE LA ENTIDAD DE ACUERDO A LOS ESTUDIOS PREVIOS","FUNCIONAMIENTO",null,{"$f":"IF(J127=1,'[1]Equivalencia BH-BMPT'!$D$2,IF(J127=2,'[1]Equivalencia BH-BMPT'!$D$3,IF(J127=3,'[1]Equivalencia BH-BMPT'!$D$4,IF(J127=4,'[1]Equivalencia BH-BMPT'!$D$5,IF(J127=5,'[1]Equivalencia BH-BMPT'!$D$6,IF(J127=6,'[1]Equivalencia BH-BMPT'!$D$7,IF(J127=7,'[1]Equivalencia BH-BMPT'!$D$8,IF(J127=8,'[1]Equivalencia BH-BMPT'!$D$9,IF(J127=9,'[1]Equivalencia BH-BMPT'!$D$10,IF(J127=10,'[1]Equivalencia BH-BMPT'!$D$11,IF(J127=11,'[1]Equivalencia BH-BMPT'!$D$12,IF(J127=12,'[1]Equivalencia BH-BMPT'!$D$13,IF(J127=13,'[1]Equivalencia BH-BMPT'!$D$14,IF(J127=14,'[1]Equivalencia BH-BMPT'!$D$15,IF(J127=15,'[1]Equivalencia BH-BMPT'!$D$16,IF(J127=16,'[1]Equivalencia BH-BMPT'!$D$17,IF(J127=17,'[1]Equivalencia BH-BMPT'!$D$18,IF(J127=18,'[1]Equivalencia BH-BMPT'!$D$19,IF(J127=19,'[1]Equivalencia BH-BMPT'!$D$20,IF(J127=20,'[1]Equivalencia BH-BMPT'!$D$21,IF(J127=21,'[1]Equivalencia BH-BMPT'!$D$22,IF(J127=22,'[1]Equivalencia BH-BMPT'!$D$23,IF(J127=23,'[1]Equivalencia BH-BMPT'!#REF!,IF(J127=24,'[1]Equivalencia BH-BMPT'!$D$25,IF(J127=25,'[1]Equivalencia BH-BMPT'!$D$26,IF(J127=26,'[1]Equivalencia BH-BMPT'!$D$27,IF(J127=27,'[1]Equivalencia BH-BMPT'!$D$28,IF(J127=28,'[1]Equivalencia BH-BMPT'!$D$29,IF(J127=29,'[1]Equivalencia BH-BMPT'!$D$30,IF(J127=30,'[1]Equivalencia BH-BMPT'!$D$31,IF(J127=31,'[1]Equivalencia BH-BMPT'!$D$32,IF(J127=32,'[1]Equivalencia BH-BMPT'!$D$33,IF(J127=33,'[1]Equivalencia BH-BMPT'!$D$34,IF(J127=34,'[1]Equivalencia BH-BMPT'!$D$35,IF(J127=35,'[1]Equivalencia BH-BMPT'!$D$36,IF(J127=36,'[1]Equivalencia BH-BMPT'!$D$37,IF(J127=37,'[1]Equivalencia BH-BMPT'!$D$38,IF(J127=38,'[1]Equivalencia BH-BMPT'!#REF!,IF(J127=39,'[1]Equivalencia BH-BMPT'!$D$40,IF(J127=40,'[1]Equivalencia BH-BMPT'!$D$41,IF(J127=41,'[1]Equivalencia BH-BMPT'!$D$42,IF(J127=42,'[1]Equivalencia BH-BMPT'!$D$43,IF(J127=43,'[1]Equivalencia BH-BMPT'!$D$44,IF(J127=44,'[1]Equivalencia BH-BMPT'!$D$45,IF(J127=45,'[1]Equivalencia BH-BMPT'!$D$46,\"No ha seleccionado un número de programa\")))))))))))))))))))))))))))))))))))))))))))))","v":"No ha seleccionado un número de programa"},null,830079122,"COLOMBIANA DE TELEFONOS Y SISTEMAS LIMITADA",12000000,null,null,null,0,12000000,0,"2017-12-11","2017-12-29","2018-06-28",180,0,null,null,"X",null,null,0]
[102,2017,"FDLT Minc 026 2017",3,{"$f":"IF(D128=1,'[1]Tipo '!$B$2,IF(D128=2,'[1]Tipo '!$B$3,IF(D128=3,'[1]Tipo '!$B$4,IF(D128=4,'[1]Tipo '!$B$5,IF(D128=5,'[1]Tipo '!$B$6,IF(D128=6,'[1]Tipo '!$B$7,IF(D128=7,'[1]Tipo '!$B$8,IF(D128=8,'[1]Tipo '!$B$9,IF(D128=9,'[1]Tipo '!$B$10,IF(D128=10,'[1]Tipo '!$B$11,IF(D128=11,'[1]Tipo '!$B$12,IF(D128=12,'[1]Tipo '!$B$13,IF(D128=13,'[1]Tipo '!$B$14,IF(D128=14,'[1]Tipo '!$B$15,IF(D128=15,'[1]Tipo '!$B$16,IF(D128=16,'[1]Tipo '!$B$17,IF(D128=17,'[1]Tipo '!$B$18,IF(D128=18,'[1]Tipo '!$B$19,IF(D128=19,'[1]Tipo '!$B$20,\"No ha seleccionado un tipo de contrato válido\")))))))))))))))))))","v":"INTERVENTORÍA"},"CONCURSO DE MÉRITOS",null,"¿Realizar la interventoría técnica, administrativa, financiera, legal, social y ambiental del contrato resultante del proceso FDLT-LIC-017-2017, cuyo objeto es: Desarrollar las actividades enmarcadas en el proyecto 1333, a través de procesos de formación y eventos culturales y artísticos en la localidad ¿ ¿ARTEUSAQUILLO 2017¿.","INVERSIÓN",11,{"$f":"IF(J128=1,'[1]Equivalencia BH-BMPT'!$D$2,IF(J128=2,'[1]Equivalencia BH-BMPT'!$D$3,IF(J128=3,'[1]Equivalencia BH-BMPT'!$D$4,IF(J128=4,'[1]Equivalencia BH-BMPT'!$D$5,IF(J128=5,'[1]Equivalencia BH-BMPT'!$D$6,IF(J128=6,'[1]Equivalencia BH-BMPT'!$D$7,IF(J128=7,'[1]Equivalencia BH-BMPT'!$D$8,IF(J128=8,'[1]Equivalencia BH-BMPT'!$D$9,IF(J128=9,'[1]Equivalencia BH-BMPT'!$D$10,IF(J128=10,'[1]Equivalencia BH-BMPT'!$D$11,IF(J128=11,'[1]Equivalencia BH-BMPT'!$D$12,IF(J128=12,'[1]Equivalencia BH-BMPT'!$D$13,IF(J128=13,'[1]Equivalencia BH-BMPT'!$D$14,IF(J128=14,'[1]Equivalencia BH-BMPT'!$D$15,IF(J128=15,'[1]Equivalencia BH-BMPT'!$D$16,IF(J128=16,'[1]Equivalencia BH-BMPT'!$D$17,IF(J128=17,'[1]Equivalencia BH-BMPT'!$D$18,IF(J128=18,'[1]Equivalencia BH-BMPT'!$D$19,IF(J128=19,'[1]Equivalencia BH-BMPT'!$D$20,IF(J128=20,'[1]Equivalencia BH-BMPT'!$D$21,IF(J128=21,'[1]Equivalencia BH-BMPT'!$D$22,IF(J128=22,'[1]Equivalencia BH-BMPT'!$D$23,IF(J128=23,'[1]Equivalencia BH-BMPT'!#REF!,IF(J128=24,'[1]Equivalencia BH-BMPT'!$D$25,IF(J128=25,'[1]Equivalencia BH-BMPT'!$D$26,IF(J128=26,'[1]Equivalencia BH-BMPT'!$D$27,IF(J128=27,'[1]Equivalencia BH-BMPT'!$D$28,IF(J128=28,'[1]Equivalencia BH-BMPT'!$D$29,IF(J128=29,'[1]Equivalencia BH-BMPT'!$D$30,IF(J128=30,'[1]Equivalencia BH-BMPT'!$D$31,IF(J128=31,'[1]Equivalencia BH-BMPT'!$D$32,IF(J128=32,'[1]Equivalencia BH-BMPT'!$D$33,IF(J128=33,'[1]Equivalencia BH-BMPT'!$D$34,IF(J128=34,'[1]Equivalencia BH-BMPT'!$D$35,IF(J128=35,'[1]Equivalencia BH-BMPT'!$D$36,IF(J128=36,'[1]Equivalencia BH-BMPT'!$D$37,IF(J128=37,'[1]Equivalencia BH-BMPT'!$D$38,IF(J128=38,'[1]Equivalencia BH-BMPT'!#REF!,IF(J128=39,'[1]Equivalencia BH-BMPT'!$D$40,IF(J128=40,'[1]Equivalencia BH-BMPT'!$D$41,IF(J128=41,'[1]Equivalencia BH-BMPT'!$D$42,IF(J128=42,'[1]Equivalencia BH-BMPT'!$D$43,IF(J128=43,'[1]Equivalencia BH-BMPT'!$D$44,IF(J128=44,'[1]Equivalencia BH-BMPT'!$D$45,IF(J128=45,'[1]Equivalencia BH-BMPT'!$D$46,\"No ha seleccionado un número de programa\")))))))))))))))))))))))))))))))))))))))))))))","v":"Mejores oportunidades para el desarrollo a través de la cultura, la recreación y el deporte"},1333,1014180831,"ADRIANA KATHERINE GUTIERREZ TORRES",8392000,null,null,null,0,8392000,0,"2017-12-07","2017-12-14","2018-05-13",150,0,null,null,"X",null,null,0]
[103,2017,"CPS 103 2017 ",5,{"$f":"IF(D129=1,'[1]Tipo '!$B$2,IF(D129=2,'[1]Tipo '!$B$3,IF(D129=3,'[1]Tipo '!$B$4,IF(D129=4,'[1]Tipo '!$B$5,IF(D129=5,'[1]Tipo '!$B$6,IF(D129=6,'[1]Tipo '!$B$7,IF(D129=7,'[1]Tipo '!$B$8,IF(D129=8,'[1]Tipo '!$B$9,IF(D129=9,'[1]Tipo '!$B$10,IF(D129=10,'[1]Tipo '!$B$11,IF(D129=11,'[1]Tipo '!$B$12,IF(D129=12,'[1]Tipo '!$B$13,IF(D129=13,'[1]Tipo '!$B$14,IF(D129=14,'[1]Tipo '!$B$15,IF(D129=15,'[1]Tipo '!$B$16,IF(D129=16,'[1]Tipo '!$B$17,IF(D129=17,'[1]Tipo '!$B$18,IF(D129=18,'[1]Tipo '!$B$19,IF(D129=19,'[1]Tipo '!$B$20,\"No ha seleccionado un tipo de contrato válido\")))))))))))))))))))","v":"CONTRATOS DE PRESTACIÓN DE SERVICIOS PROFESIONALES Y DE APOYO A LA GESTIÓN"},"CONTRATACIÓN DIRECTA","Prestación de servicios profesionales y de apoyo a la gestión, o para la ejecución de trabajos artísticos que sólo puedan encomendarse a determinadas personas naturales;","El contrato que se pretende celebrar, tendrá por objeto ¿Prestar los servicios de apoyo al Área de Gestión Policiva de la Alcaldía Local de Teusaquillo en la actualización de la base de datos necesarias para la elaboración de informes solicitados por las diferentes entidades relacionadas con establecimientos de comercio y espacio público, de las actuaciones administrativas y preliminares llevadas en el área, así como el apoyo jurídico al trámite de peticiones, quejas y reclamos¿.","INVERSIÓN",45,{"$f":"IF(J129=1,'[1]Equivalencia BH-BMPT'!$D$2,IF(J129=2,'[1]Equivalencia BH-BMPT'!$D$3,IF(J129=3,'[1]Equivalencia BH-BMPT'!$D$4,IF(J129=4,'[1]Equivalencia BH-BMPT'!$D$5,IF(J129=5,'[1]Equivalencia BH-BMPT'!$D$6,IF(J129=6,'[1]Equivalencia BH-BMPT'!$D$7,IF(J129=7,'[1]Equivalencia BH-BMPT'!$D$8,IF(J129=8,'[1]Equivalencia BH-BMPT'!$D$9,IF(J129=9,'[1]Equivalencia BH-BMPT'!$D$10,IF(J129=10,'[1]Equivalencia BH-BMPT'!$D$11,IF(J129=11,'[1]Equivalencia BH-BMPT'!$D$12,IF(J129=12,'[1]Equivalencia BH-BMPT'!$D$13,IF(J129=13,'[1]Equivalencia BH-BMPT'!$D$14,IF(J129=14,'[1]Equivalencia BH-BMPT'!$D$15,IF(J129=15,'[1]Equivalencia BH-BMPT'!$D$16,IF(J129=16,'[1]Equivalencia BH-BMPT'!$D$17,IF(J129=17,'[1]Equivalencia BH-BMPT'!$D$18,IF(J129=18,'[1]Equivalencia BH-BMPT'!$D$19,IF(J129=19,'[1]Equivalencia BH-BMPT'!$D$20,IF(J129=20,'[1]Equivalencia BH-BMPT'!$D$21,IF(J129=21,'[1]Equivalencia BH-BMPT'!$D$22,IF(J129=22,'[1]Equivalencia BH-BMPT'!$D$23,IF(J129=23,'[1]Equivalencia BH-BMPT'!#REF!,IF(J129=24,'[1]Equivalencia BH-BMPT'!$D$25,IF(J129=25,'[1]Equivalencia BH-BMPT'!$D$26,IF(J129=26,'[1]Equivalencia BH-BMPT'!$D$27,IF(J129=27,'[1]Equivalencia BH-BMPT'!$D$28,IF(J129=28,'[1]Equivalencia BH-BMPT'!$D$29,IF(J129=29,'[1]Equivalencia BH-BMPT'!$D$30,IF(J129=30,'[1]Equivalencia BH-BMPT'!$D$31,IF(J129=31,'[1]Equivalencia BH-BMPT'!$D$32,IF(J129=32,'[1]Equivalencia BH-BMPT'!$D$33,IF(J129=33,'[1]Equivalencia BH-BMPT'!$D$34,IF(J129=34,'[1]Equivalencia BH-BMPT'!$D$35,IF(J129=35,'[1]Equivalencia BH-BMPT'!$D$36,IF(J129=36,'[1]Equivalencia BH-BMPT'!$D$37,IF(J129=37,'[1]Equivalencia BH-BMPT'!$D$38,IF(J129=38,'[1]Equivalencia BH-BMPT'!#REF!,IF(J129=39,'[1]Equivalencia BH-BMPT'!$D$40,IF(J129=40,'[1]Equivalencia BH-BMPT'!$D$41,IF(J129=41,'[1]Equivalencia BH-BMPT'!$D$42,IF(J129=42,'[1]Equivalencia BH-BMPT'!$D$43,IF(J129=43,'[1]Equivalencia BH-BMPT'!$D$44,IF(J129=44,'[1]Equivalencia BH-BMPT'!$D$45,IF(J129=45,'[1]Equivalencia BH-BMPT'!$D$46,\"No ha seleccionado un número de programa\")))))))))))))))))))))))))))))))))))))))))))))","v":"Gobernanza e influencia local, regional e internacional"},1329,1014194232,"MARIA PAULA FIGUEROA BAYONA",1239000,null,null,null,0,1239000,0,"2017-12-11","2017-12-11","2017-12-31",21,0,null,null,null,"X",null,0]
[104,2017,"CPS 104 2017 ",5,{"$f":"IF(D130=1,'[1]Tipo '!$B$2,IF(D130=2,'[1]Tipo '!$B$3,IF(D130=3,'[1]Tipo '!$B$4,IF(D130=4,'[1]Tipo '!$B$5,IF(D130=5,'[1]Tipo '!$B$6,IF(D130=6,'[1]Tipo '!$B$7,IF(D130=7,'[1]Tipo '!$B$8,IF(D130=8,'[1]Tipo '!$B$9,IF(D130=9,'[1]Tipo '!$B$10,IF(D130=10,'[1]Tipo '!$B$11,IF(D130=11,'[1]Tipo '!$B$12,IF(D130=12,'[1]Tipo '!$B$13,IF(D130=13,'[1]Tipo '!$B$14,IF(D130=14,'[1]Tipo '!$B$15,IF(D130=15,'[1]Tipo '!$B$16,IF(D130=16,'[1]Tipo '!$B$17,IF(D130=17,'[1]Tipo '!$B$18,IF(D130=18,'[1]Tipo '!$B$19,IF(D130=19,'[1]Tipo '!$B$20,\"No ha seleccionado un tipo de contrato válido\")))))))))))))))))))","v":"CONTRATOS DE PRESTACIÓN DE SERVICIOS PROFESIONALES Y DE APOYO A LA GESTIÓN"},"CONTRATACIÓN DIRECTA","Prestación de servicios profesionales y de apoyo a la gestión, o para la ejecución de trabajos artísticos que sólo puedan encomendarse a determinadas personas naturales;","OBJETO: El contrato que se pretende celebrar, tendrá por objeto ¿El contratista se obliga para con la Alcaldía Local de Teusaquillo a prestar sus servicios profesionales como apoyo a la oficina de prensa en todo lo concerniente a la actualización de la página web en cumplimiento de la normatividad vigente en materia de Transparencia y del Derecho de Acceso a la Información Pública Nacional y demás actividades que conlleven al cumplimiento del plan de comunicaciones, de conformidad con las directrices de la oficina de prensa de la Secretaria Distrital de Gobierno, Plan de Desarrollo Local 2017-2020 y plan de gestión de la Alcaldía Local de Teusaquillo¿.","INVERSIÓN",45,{"$f":"IF(J130=1,'[1]Equivalencia BH-BMPT'!$D$2,IF(J130=2,'[1]Equivalencia BH-BMPT'!$D$3,IF(J130=3,'[1]Equivalencia BH-BMPT'!$D$4,IF(J130=4,'[1]Equivalencia BH-BMPT'!$D$5,IF(J130=5,'[1]Equivalencia BH-BMPT'!$D$6,IF(J130=6,'[1]Equivalencia BH-BMPT'!$D$7,IF(J130=7,'[1]Equivalencia BH-BMPT'!$D$8,IF(J130=8,'[1]Equivalencia BH-BMPT'!$D$9,IF(J130=9,'[1]Equivalencia BH-BMPT'!$D$10,IF(J130=10,'[1]Equivalencia BH-BMPT'!$D$11,IF(J130=11,'[1]Equivalencia BH-BMPT'!$D$12,IF(J130=12,'[1]Equivalencia BH-BMPT'!$D$13,IF(J130=13,'[1]Equivalencia BH-BMPT'!$D$14,IF(J130=14,'[1]Equivalencia BH-BMPT'!$D$15,IF(J130=15,'[1]Equivalencia BH-BMPT'!$D$16,IF(J130=16,'[1]Equivalencia BH-BMPT'!$D$17,IF(J130=17,'[1]Equivalencia BH-BMPT'!$D$18,IF(J130=18,'[1]Equivalencia BH-BMPT'!$D$19,IF(J130=19,'[1]Equivalencia BH-BMPT'!$D$20,IF(J130=20,'[1]Equivalencia BH-BMPT'!$D$21,IF(J130=21,'[1]Equivalencia BH-BMPT'!$D$22,IF(J130=22,'[1]Equivalencia BH-BMPT'!$D$23,IF(J130=23,'[1]Equivalencia BH-BMPT'!#REF!,IF(J130=24,'[1]Equivalencia BH-BMPT'!$D$25,IF(J130=25,'[1]Equivalencia BH-BMPT'!$D$26,IF(J130=26,'[1]Equivalencia BH-BMPT'!$D$27,IF(J130=27,'[1]Equivalencia BH-BMPT'!$D$28,IF(J130=28,'[1]Equivalencia BH-BMPT'!$D$29,IF(J130=29,'[1]Equivalencia BH-BMPT'!$D$30,IF(J130=30,'[1]Equivalencia BH-BMPT'!$D$31,IF(J130=31,'[1]Equivalencia BH-BMPT'!$D$32,IF(J130=32,'[1]Equivalencia BH-BMPT'!$D$33,IF(J130=33,'[1]Equivalencia BH-BMPT'!$D$34,IF(J130=34,'[1]Equivalencia BH-BMPT'!$D$35,IF(J130=35,'[1]Equivalencia BH-BMPT'!$D$36,IF(J130=36,'[1]Equivalencia BH-BMPT'!$D$37,IF(J130=37,'[1]Equivalencia BH-BMPT'!$D$38,IF(J130=38,'[1]Equivalencia BH-BMPT'!#REF!,IF(J130=39,'[1]Equivalencia BH-BMPT'!$D$40,IF(J130=40,'[1]Equivalencia BH-BMPT'!$D$41,IF(J130=41,'[1]Equivalencia BH-BMPT'!$D$42,IF(J130=42,'[1]Equivalencia BH-BMPT'!$D$43,IF(J130=43,'[1]Equivalencia BH-BMPT'!$D$44,IF(J130=44,'[1]Equivalencia BH-BMPT'!$D$45,IF(J130=45,'[1]Equivalencia BH-BMPT'!$D$46,\"No ha seleccionado un número de programa\")))))))))))))))))))))))))))))))))))))))))))))","v":"Gobernanza e influencia local, regional e internacional"},1329,40326729,"YINETH PAOLA GOMEZ SANTACOLOMA",3143333,null,null,null,0,3143333,0,"2017-12-07","2017-12-11","2018-01-02",23,0,null,null,"X",null,null,0]
[105,2016,"FDLT LP 017  2017",4,{"$f":"IF(D131=1,'[1]Tipo '!$B$2,IF(D131=2,'[1]Tipo '!$B$3,IF(D131=3,'[1]Tipo '!$B$4,IF(D131=4,'[1]Tipo '!$B$5,IF(D131=5,'[1]Tipo '!$B$6,IF(D131=6,'[1]Tipo '!$B$7,IF(D131=7,'[1]Tipo '!$B$8,IF(D131=8,'[1]Tipo '!$B$9,IF(D131=9,'[1]Tipo '!$B$10,IF(D131=10,'[1]Tipo '!$B$11,IF(D131=11,'[1]Tipo '!$B$12,IF(D131=12,'[1]Tipo '!$B$13,IF(D131=13,'[1]Tipo '!$B$14,IF(D131=14,'[1]Tipo '!$B$15,IF(D131=15,'[1]Tipo '!$B$16,IF(D131=16,'[1]Tipo '!$B$17,IF(D131=17,'[1]Tipo '!$B$18,IF(D131=18,'[1]Tipo '!$B$19,IF(D131=19,'[1]Tipo '!$B$20,\"No ha seleccionado un tipo de contrato válido\")))))))))))))))))))","v":"CONTRATOS DE PRESTACIÓN DE SERVICIOS"},"LICITACIÓN PÚBLICA","No aplica","Desarrollar las actividades enmarcadas en el proyecto 1333, a través de procesos de formación y eventos culturales y artísticos en la localidad ¿ ¿ARTEUSAQUILLO 2017¿","INVERSIÓN",11,{"$f":"IF(J131=1,'[1]Equivalencia BH-BMPT'!$D$2,IF(J131=2,'[1]Equivalencia BH-BMPT'!$D$3,IF(J131=3,'[1]Equivalencia BH-BMPT'!$D$4,IF(J131=4,'[1]Equivalencia BH-BMPT'!$D$5,IF(J131=5,'[1]Equivalencia BH-BMPT'!$D$6,IF(J131=6,'[1]Equivalencia BH-BMPT'!$D$7,IF(J131=7,'[1]Equivalencia BH-BMPT'!$D$8,IF(J131=8,'[1]Equivalencia BH-BMPT'!$D$9,IF(J131=9,'[1]Equivalencia BH-BMPT'!$D$10,IF(J131=10,'[1]Equivalencia BH-BMPT'!$D$11,IF(J131=11,'[1]Equivalencia BH-BMPT'!$D$12,IF(J131=12,'[1]Equivalencia BH-BMPT'!$D$13,IF(J131=13,'[1]Equivalencia BH-BMPT'!$D$14,IF(J131=14,'[1]Equivalencia BH-BMPT'!$D$15,IF(J131=15,'[1]Equivalencia BH-BMPT'!$D$16,IF(J131=16,'[1]Equivalencia BH-BMPT'!$D$17,IF(J131=17,'[1]Equivalencia BH-BMPT'!$D$18,IF(J131=18,'[1]Equivalencia BH-BMPT'!$D$19,IF(J131=19,'[1]Equivalencia BH-BMPT'!$D$20,IF(J131=20,'[1]Equivalencia BH-BMPT'!$D$21,IF(J131=21,'[1]Equivalencia BH-BMPT'!$D$22,IF(J131=22,'[1]Equivalencia BH-BMPT'!$D$23,IF(J131=23,'[1]Equivalencia BH-BMPT'!#REF!,IF(J131=24,'[1]Equivalencia BH-BMPT'!$D$25,IF(J131=25,'[1]Equivalencia BH-BMPT'!$D$26,IF(J131=26,'[1]Equivalencia BH-BMPT'!$D$27,IF(J131=27,'[1]Equivalencia BH-BMPT'!$D$28,IF(J131=28,'[1]Equivalencia BH-BMPT'!$D$29,IF(J131=29,'[1]Equivalencia BH-BMPT'!$D$30,IF(J131=30,'[1]Equivalencia BH-BMPT'!$D$31,IF(J131=31,'[1]Equivalencia BH-BMPT'!$D$32,IF(J131=32,'[1]Equivalencia BH-BMPT'!$D$33,IF(J131=33,'[1]Equivalencia BH-BMPT'!$D$34,IF(J131=34,'[1]Equivalencia BH-BMPT'!$D$35,IF(J131=35,'[1]Equivalencia BH-BMPT'!$D$36,IF(J131=36,'[1]Equivalencia BH-BMPT'!$D$37,IF(J131=37,'[1]Equivalencia BH-BMPT'!$D$38,IF(J131=38,'[1]Equivalencia BH-BMPT'!#REF!,IF(J131=39,'[1]Equivalencia BH-BMPT'!$D$40,IF(J131=40,'[1]Equivalencia BH-BMPT'!$D$41,IF(J131=41,'[1]Equivalencia BH-BMPT'!$D$42,IF(J131=42,'[1]Equivalencia BH-BMPT'!$D$43,IF(J131=43,'[1]Equivalencia BH-BMPT'!$D$44,IF(J131=44,'[1]Equivalencia BH-BMPT'!$D$45,IF(J131=45,'[1]Equivalencia BH-BMPT'!$D$46,\"No ha seleccionado un número de programa\")))))))))))))))))))))))))))))))))))))))))))))","v":"Mejores oportunidades para el desarrollo a través de la cultura, la recreación y el deporte"},1333,900175374,"ASOCIACION DE HOGARES SI A LA VIDA",301562541,null,null,null,0,301562541,0,"2017-12-12","2017-12-14","2017-05-13",150,0,null,null,"X",null,null,0]
[106,2016,"LP 018 2017",1,{"$f":"IF(D132=1,'[1]Tipo '!$B$2,IF(D132=2,'[1]Tipo '!$B$3,IF(D132=3,'[1]Tipo '!$B$4,IF(D132=4,'[1]Tipo '!$B$5,IF(D132=5,'[1]Tipo '!$B$6,IF(D132=6,'[1]Tipo '!$B$7,IF(D132=7,'[1]Tipo '!$B$8,IF(D132=8,'[1]Tipo '!$B$9,IF(D132=9,'[1]Tipo '!$B$10,IF(D132=10,'[1]Tipo '!$B$11,IF(D132=11,'[1]Tipo '!$B$12,IF(D132=12,'[1]Tipo '!$B$13,IF(D132=13,'[1]Tipo '!$B$14,IF(D132=14,'[1]Tipo '!$B$15,IF(D132=15,'[1]Tipo '!$B$16,IF(D132=16,'[1]Tipo '!$B$17,IF(D132=17,'[1]Tipo '!$B$18,IF(D132=18,'[1]Tipo '!$B$19,IF(D132=19,'[1]Tipo '!$B$20,\"No ha seleccionado un tipo de contrato válido\")))))))))))))))))))","v":"OBRA PÚBLICA"},"LICITACIÓN PÚBLICA","No aplica","Ejecutar a monto agotable las actividades de mejoramiento integral de parques de la Localidad de Teusaquillo en la Ciudad de Bogotá D.C de conformidad con los estudios previos, anexo técnico y apéndices.","INVERSIÓN",17,{"$f":"IF(J132=1,'[1]Equivalencia BH-BMPT'!$D$2,IF(J132=2,'[1]Equivalencia BH-BMPT'!$D$3,IF(J132=3,'[1]Equivalencia BH-BMPT'!$D$4,IF(J132=4,'[1]Equivalencia BH-BMPT'!$D$5,IF(J132=5,'[1]Equivalencia BH-BMPT'!$D$6,IF(J132=6,'[1]Equivalencia BH-BMPT'!$D$7,IF(J132=7,'[1]Equivalencia BH-BMPT'!$D$8,IF(J132=8,'[1]Equivalencia BH-BMPT'!$D$9,IF(J132=9,'[1]Equivalencia BH-BMPT'!$D$10,IF(J132=10,'[1]Equivalencia BH-BMPT'!$D$11,IF(J132=11,'[1]Equivalencia BH-BMPT'!$D$12,IF(J132=12,'[1]Equivalencia BH-BMPT'!$D$13,IF(J132=13,'[1]Equivalencia BH-BMPT'!$D$14,IF(J132=14,'[1]Equivalencia BH-BMPT'!$D$15,IF(J132=15,'[1]Equivalencia BH-BMPT'!$D$16,IF(J132=16,'[1]Equivalencia BH-BMPT'!$D$17,IF(J132=17,'[1]Equivalencia BH-BMPT'!$D$18,IF(J132=18,'[1]Equivalencia BH-BMPT'!$D$19,IF(J132=19,'[1]Equivalencia BH-BMPT'!$D$20,IF(J132=20,'[1]Equivalencia BH-BMPT'!$D$21,IF(J132=21,'[1]Equivalencia BH-BMPT'!$D$22,IF(J132=22,'[1]Equivalencia BH-BMPT'!$D$23,IF(J132=23,'[1]Equivalencia BH-BMPT'!#REF!,IF(J132=24,'[1]Equivalencia BH-BMPT'!$D$25,IF(J132=25,'[1]Equivalencia BH-BMPT'!$D$26,IF(J132=26,'[1]Equivalencia BH-BMPT'!$D$27,IF(J132=27,'[1]Equivalencia BH-BMPT'!$D$28,IF(J132=28,'[1]Equivalencia BH-BMPT'!$D$29,IF(J132=29,'[1]Equivalencia BH-BMPT'!$D$30,IF(J132=30,'[1]Equivalencia BH-BMPT'!$D$31,IF(J132=31,'[1]Equivalencia BH-BMPT'!$D$32,IF(J132=32,'[1]Equivalencia BH-BMPT'!$D$33,IF(J132=33,'[1]Equivalencia BH-BMPT'!$D$34,IF(J132=34,'[1]Equivalencia BH-BMPT'!$D$35,IF(J132=35,'[1]Equivalencia BH-BMPT'!$D$36,IF(J132=36,'[1]Equivalencia BH-BMPT'!$D$37,IF(J132=37,'[1]Equivalencia BH-BMPT'!$D$38,IF(J132=38,'[1]Equivalencia BH-BMPT'!#REF!,IF(J132=39,'[1]Equivalencia BH-BMPT'!$D$40,IF(J132=40,'[1]Equivalencia BH-BMPT'!$D$41,IF(J132=41,'[1]Equivalencia BH-BMPT'!$D$42,IF(J132=42,'[1]Equivalencia BH-BMPT'!$D$43,IF(J132=43,'[1]Equivalencia BH-BMPT'!$D$44,IF(J132=44,'[1]Equivalencia BH-BMPT'!$D$45,IF(J132=45,'[1]Equivalencia BH-BMPT'!$D$46,\"No ha seleccionado un número de programa\")))))))))))))))))))))))))))))))))))))))))))))","v":"Espacio público, derecho de todos"},1348,901138676,"CONSORCIO PARQUES TEUSAQUILLO 2017",1081421777,null,null,null,0,1081421777,0,"2017-12-15",null,null,180,0,null,"X",null,null,null,0]
[107,2016,null,6,{"$f":"IF(D133=1,'[1]Tipo '!$B$2,IF(D133=2,'[1]Tipo '!$B$3,IF(D133=3,'[1]Tipo '!$B$4,IF(D133=4,'[1]Tipo '!$B$5,IF(D133=5,'[1]Tipo '!$B$6,IF(D133=6,'[1]Tipo '!$B$7,IF(D133=7,'[1]Tipo '!$B$8,IF(D133=8,'[1]Tipo '!$B$9,IF(D133=9,'[1]Tipo '!$B$10,IF(D133=10,'[1]Tipo '!$B$11,IF(D133=11,'[1]Tipo '!$B$12,IF(D133=12,'[1]Tipo '!$B$13,IF(D133=13,'[1]Tipo '!$B$14,IF(D133=14,'[1]Tipo '!$B$15,IF(D133=15,'[1]Tipo '!$B$16,IF(D133=16,'[1]Tipo '!$B$17,IF(D133=17,'[1]Tipo '!$B$18,IF(D133=18,'[1]Tipo '!$B$19,IF(D133=19,'[1]Tipo '!$B$20,\"No ha seleccionado un tipo de contrato válido\")))))))))))))))))))","v":"COMPRAVENTA DE BIENES MUEBLES"},"Selección abreviada ","Selección abreviada por menor cuantía ","¿Adquirir elementos de dotación para el apoyo logístico y modernización tecnológica de las Juntas de Acción Comunal de la Localidad de Teusaquillo, de acuerdo con los estudios previos¿.","INVERSIÓN",45,{"$f":"IF(J133=1,'[1]Equivalencia BH-BMPT'!$D$2,IF(J133=2,'[1]Equivalencia BH-BMPT'!$D$3,IF(J133=3,'[1]Equivalencia BH-BMPT'!$D$4,IF(J133=4,'[1]Equivalencia BH-BMPT'!$D$5,IF(J133=5,'[1]Equivalencia BH-BMPT'!$D$6,IF(J133=6,'[1]Equivalencia BH-BMPT'!$D$7,IF(J133=7,'[1]Equivalencia BH-BMPT'!$D$8,IF(J133=8,'[1]Equivalencia BH-BMPT'!$D$9,IF(J133=9,'[1]Equivalencia BH-BMPT'!$D$10,IF(J133=10,'[1]Equivalencia BH-BMPT'!$D$11,IF(J133=11,'[1]Equivalencia BH-BMPT'!$D$12,IF(J133=12,'[1]Equivalencia BH-BMPT'!$D$13,IF(J133=13,'[1]Equivalencia BH-BMPT'!$D$14,IF(J133=14,'[1]Equivalencia BH-BMPT'!$D$15,IF(J133=15,'[1]Equivalencia BH-BMPT'!$D$16,IF(J133=16,'[1]Equivalencia BH-BMPT'!$D$17,IF(J133=17,'[1]Equivalencia BH-BMPT'!$D$18,IF(J133=18,'[1]Equivalencia BH-BMPT'!$D$19,IF(J133=19,'[1]Equivalencia BH-BMPT'!$D$20,IF(J133=20,'[1]Equivalencia BH-BMPT'!$D$21,IF(J133=21,'[1]Equivalencia BH-BMPT'!$D$22,IF(J133=22,'[1]Equivalencia BH-BMPT'!$D$23,IF(J133=23,'[1]Equivalencia BH-BMPT'!#REF!,IF(J133=24,'[1]Equivalencia BH-BMPT'!$D$25,IF(J133=25,'[1]Equivalencia BH-BMPT'!$D$26,IF(J133=26,'[1]Equivalencia BH-BMPT'!$D$27,IF(J133=27,'[1]Equivalencia BH-BMPT'!$D$28,IF(J133=28,'[1]Equivalencia BH-BMPT'!$D$29,IF(J133=29,'[1]Equivalencia BH-BMPT'!$D$30,IF(J133=30,'[1]Equivalencia BH-BMPT'!$D$31,IF(J133=31,'[1]Equivalencia BH-BMPT'!$D$32,IF(J133=32,'[1]Equivalencia BH-BMPT'!$D$33,IF(J133=33,'[1]Equivalencia BH-BMPT'!$D$34,IF(J133=34,'[1]Equivalencia BH-BMPT'!$D$35,IF(J133=35,'[1]Equivalencia BH-BMPT'!$D$36,IF(J133=36,'[1]Equivalencia BH-BMPT'!$D$37,IF(J133=37,'[1]Equivalencia BH-BMPT'!$D$38,IF(J133=38,'[1]Equivalencia BH-BMPT'!#REF!,IF(J133=39,'[1]Equivalencia BH-BMPT'!$D$40,IF(J133=40,'[1]Equivalencia BH-BMPT'!$D$41,IF(J133=41,'[1]Equivalencia BH-BMPT'!$D$42,IF(J133=42,'[1]Equivalencia BH-BMPT'!$D$43,IF(J133=43,'[1]Equivalencia BH-BMPT'!$D$44,IF(J133=44,'[1]Equivalencia BH-BMPT'!$D$45,IF(J133=45,'[1]Equivalencia BH-BMPT'!$D$46,\"No ha seleccionado un número de programa\")))))))))))))))))))))))))))))))))))))))))))))","v":"Gobernanza e influencia local, regional e internacional"},1351,900080875,"INTERNACIONAL DE CAMARAS Y LENTES S A S",15170600,null,null,null,0,15170600,0,"2017-12-15",null,null,60,0,null,"X",null,null,null,0]
[108,2017,null,3,{"$f":"IF(D134=1,'[1]Tipo '!$B$2,IF(D134=2,'[1]Tipo '!$B$3,IF(D134=3,'[1]Tipo '!$B$4,IF(D134=4,'[1]Tipo '!$B$5,IF(D134=5,'[1]Tipo '!$B$6,IF(D134=6,'[1]Tipo '!$B$7,IF(D134=7,'[1]Tipo '!$B$8,IF(D134=8,'[1]Tipo '!$B$9,IF(D134=9,'[1]Tipo '!$B$10,IF(D134=10,'[1]Tipo '!$B$11,IF(D134=11,'[1]Tipo '!$B$12,IF(D134=12,'[1]Tipo '!$B$13,IF(D134=13,'[1]Tipo '!$B$14,IF(D134=14,'[1]Tipo '!$B$15,IF(D134=15,'[1]Tipo '!$B$16,IF(D134=16,'[1]Tipo '!$B$17,IF(D134=17,'[1]Tipo '!$B$18,IF(D134=18,'[1]Tipo '!$B$19,IF(D134=19,'[1]Tipo '!$B$20,\"No ha seleccionado un tipo de contrato válido\")))))))))))))))))))","v":"INTERVENTORÍA"},"CONCURSO DE MÉRITOS",null,"Realizar la interventoría técnica, administrativa, legal, financiera, social, ambiental y de seguridad y salud en el trabajo para la ejecución a monto agotable, de las actividades de mejoramiento integral de parques de la localidad de Teusaquillo, en la ciudad de Bogotá D.C al contrato de obra pública que se derive del proceso licitatorio FDLT-LP-014-2017, de conformidad con los estudios previos, anexo técnico y apéndices.","INVERSIÓN",17,{"$f":"IF(J134=1,'[1]Equivalencia BH-BMPT'!$D$2,IF(J134=2,'[1]Equivalencia BH-BMPT'!$D$3,IF(J134=3,'[1]Equivalencia BH-BMPT'!$D$4,IF(J134=4,'[1]Equivalencia BH-BMPT'!$D$5,IF(J134=5,'[1]Equivalencia BH-BMPT'!$D$6,IF(J134=6,'[1]Equivalencia BH-BMPT'!$D$7,IF(J134=7,'[1]Equivalencia BH-BMPT'!$D$8,IF(J134=8,'[1]Equivalencia BH-BMPT'!$D$9,IF(J134=9,'[1]Equivalencia BH-BMPT'!$D$10,IF(J134=10,'[1]Equivalencia BH-BMPT'!$D$11,IF(J134=11,'[1]Equivalencia BH-BMPT'!$D$12,IF(J134=12,'[1]Equivalencia BH-BMPT'!$D$13,IF(J134=13,'[1]Equivalencia BH-BMPT'!$D$14,IF(J134=14,'[1]Equivalencia BH-BMPT'!$D$15,IF(J134=15,'[1]Equivalencia BH-BMPT'!$D$16,IF(J134=16,'[1]Equivalencia BH-BMPT'!$D$17,IF(J134=17,'[1]Equivalencia BH-BMPT'!$D$18,IF(J134=18,'[1]Equivalencia BH-BMPT'!$D$19,IF(J134=19,'[1]Equivalencia BH-BMPT'!$D$20,IF(J134=20,'[1]Equivalencia BH-BMPT'!$D$21,IF(J134=21,'[1]Equivalencia BH-BMPT'!$D$22,IF(J134=22,'[1]Equivalencia BH-BMPT'!$D$23,IF(J134=23,'[1]Equivalencia BH-BMPT'!#REF!,IF(J134=24,'[1]Equivalencia BH-BMPT'!$D$25,IF(J134=25,'[1]Equivalencia BH-BMPT'!$D$26,IF(J134=26,'[1]Equivalencia BH-BMPT'!$D$27,IF(J134=27,'[1]Equivalencia BH-BMPT'!$D$28,IF(J134=28,'[1]Equivalencia BH-BMPT'!$D$29,IF(J134=29,'[1]Equivalencia BH-BMPT'!$D$30,IF(J134=30,'[1]Equivalencia BH-BMPT'!$D$31,IF(J134=31,'[1]Equivalencia BH-BMPT'!$D$32,IF(J134=32,'[1]Equivalencia BH-BMPT'!$D$33,IF(J134=33,'[1]Equivalencia BH-BMPT'!$D$34,IF(J134=34,'[1]Equivalencia BH-BMPT'!$D$35,IF(J134=35,'[1]Equivalencia BH-BMPT'!$D$36,IF(J134=36,'[1]Equivalencia BH-BMPT'!$D$37,IF(J134=37,'[1]Equivalencia BH-BMPT'!$D$38,IF(J134=38,'[1]Equivalencia BH-BMPT'!#REF!,IF(J134=39,'[1]Equivalencia BH-BMPT'!$D$40,IF(J134=40,'[1]Equivalencia BH-BMPT'!$D$41,IF(J134=41,'[1]Equivalencia BH-BMPT'!$D$42,IF(J134=42,'[1]Equivalencia BH-BMPT'!$D$43,IF(J134=43,'[1]Equivalencia BH-BMPT'!$D$44,IF(J134=44,'[1]Equivalencia BH-BMPT'!$D$45,IF(J134=45,'[1]Equivalencia BH-BMPT'!$D$46,\"No ha seleccionado un número de programa\")))))))))))))))))))))))))))))))))))))))))))))","v":"Espacio público, derecho de todos"},1348,830515117,"GNG INGENIERIA S A S",132275212,null,null,null,0,132275212,0,"2017-12-26",null,null,180,0,null,"X",null,null,null,0]
[109,2017,"CPS 109 2017 ",5,{"$f":"IF(D135=1,'[1]Tipo '!$B$2,IF(D135=2,'[1]Tipo '!$B$3,IF(D135=3,'[1]Tipo '!$B$4,IF(D135=4,'[1]Tipo '!$B$5,IF(D135=5,'[1]Tipo '!$B$6,IF(D135=6,'[1]Tipo '!$B$7,IF(D135=7,'[1]Tipo '!$B$8,IF(D135=8,'[1]Tipo '!$B$9,IF(D135=9,'[1]Tipo '!$B$10,IF(D135=10,'[1]Tipo '!$B$11,IF(D135=11,'[1]Tipo '!$B$12,IF(D135=12,'[1]Tipo '!$B$13,IF(D135=13,'[1]Tipo '!$B$14,IF(D135=14,'[1]Tipo '!$B$15,IF(D135=15,'[1]Tipo '!$B$16,IF(D135=16,'[1]Tipo '!$B$17,IF(D135=17,'[1]Tipo '!$B$18,IF(D135=18,'[1]Tipo '!$B$19,IF(D135=19,'[1]Tipo '!$B$20,\"No ha seleccionado un tipo de contrato válido\")))))))))))))))))))","v":"CONTRATOS DE PRESTACIÓN DE SERVICIOS PROFESIONALES Y DE APOYO A LA GESTIÓN"},"CONTRATACIÓN DIRECTA","Prestación de servicios profesionales y de apoyo a la gestión, o para la ejecución de trabajos artísticos que sólo puedan encomendarse a determinadas personas naturales;","EL CONTRATO QUE SE PRETENDE CELEBRAR, TENDRÁ POR OBJETO ¿APOYAR LA FORMULACIÓN, EJECUCIÓN, SEGUIMIENTO Y MEJORA CONTINUA DE LAS HERRAMIENTAS QUE CONFORMAN LA GESTIÓN AMBIENTAL INSTITUCIONAL DE LA ALCALDÍA LOCAL.¿","INVERSIÓN",45,{"$f":"IF(J135=1,'[1]Equivalencia BH-BMPT'!$D$2,IF(J135=2,'[1]Equivalencia BH-BMPT'!$D$3,IF(J135=3,'[1]Equivalencia BH-BMPT'!$D$4,IF(J135=4,'[1]Equivalencia BH-BMPT'!$D$5,IF(J135=5,'[1]Equivalencia BH-BMPT'!$D$6,IF(J135=6,'[1]Equivalencia BH-BMPT'!$D$7,IF(J135=7,'[1]Equivalencia BH-BMPT'!$D$8,IF(J135=8,'[1]Equivalencia BH-BMPT'!$D$9,IF(J135=9,'[1]Equivalencia BH-BMPT'!$D$10,IF(J135=10,'[1]Equivalencia BH-BMPT'!$D$11,IF(J135=11,'[1]Equivalencia BH-BMPT'!$D$12,IF(J135=12,'[1]Equivalencia BH-BMPT'!$D$13,IF(J135=13,'[1]Equivalencia BH-BMPT'!$D$14,IF(J135=14,'[1]Equivalencia BH-BMPT'!$D$15,IF(J135=15,'[1]Equivalencia BH-BMPT'!$D$16,IF(J135=16,'[1]Equivalencia BH-BMPT'!$D$17,IF(J135=17,'[1]Equivalencia BH-BMPT'!$D$18,IF(J135=18,'[1]Equivalencia BH-BMPT'!$D$19,IF(J135=19,'[1]Equivalencia BH-BMPT'!$D$20,IF(J135=20,'[1]Equivalencia BH-BMPT'!$D$21,IF(J135=21,'[1]Equivalencia BH-BMPT'!$D$22,IF(J135=22,'[1]Equivalencia BH-BMPT'!$D$23,IF(J135=23,'[1]Equivalencia BH-BMPT'!#REF!,IF(J135=24,'[1]Equivalencia BH-BMPT'!$D$25,IF(J135=25,'[1]Equivalencia BH-BMPT'!$D$26,IF(J135=26,'[1]Equivalencia BH-BMPT'!$D$27,IF(J135=27,'[1]Equivalencia BH-BMPT'!$D$28,IF(J135=28,'[1]Equivalencia BH-BMPT'!$D$29,IF(J135=29,'[1]Equivalencia BH-BMPT'!$D$30,IF(J135=30,'[1]Equivalencia BH-BMPT'!$D$31,IF(J135=31,'[1]Equivalencia BH-BMPT'!$D$32,IF(J135=32,'[1]Equivalencia BH-BMPT'!$D$33,IF(J135=33,'[1]Equivalencia BH-BMPT'!$D$34,IF(J135=34,'[1]Equivalencia BH-BMPT'!$D$35,IF(J135=35,'[1]Equivalencia BH-BMPT'!$D$36,IF(J135=36,'[1]Equivalencia BH-BMPT'!$D$37,IF(J135=37,'[1]Equivalencia BH-BMPT'!$D$38,IF(J135=38,'[1]Equivalencia BH-BMPT'!#REF!,IF(J135=39,'[1]Equivalencia BH-BMPT'!$D$40,IF(J135=40,'[1]Equivalencia BH-BMPT'!$D$41,IF(J135=41,'[1]Equivalencia BH-BMPT'!$D$42,IF(J135=42,'[1]Equivalencia BH-BMPT'!$D$43,IF(J135=43,'[1]Equivalencia BH-BMPT'!$D$44,IF(J135=44,'[1]Equivalencia BH-BMPT'!$D$45,IF(J135=45,'[1]Equivalencia BH-BMPT'!$D$46,\"No ha seleccionado un número de programa\")))))))))))))))))))))))))))))))))))))))))))))","v":"Gobernanza e influencia local, regional e internacional"},1329,80772758,"CAMILO ANDRES ACUÑA CARO",1820000,null,null,null,0,1820000,0,"2017-12-19","2017-12-20","2018-01-01",13,0,null,null,"X",null,null,0]
[110,2017,"LP 018 2017",4,{"$f":"IF(D136=1,'[1]Tipo '!$B$2,IF(D136=2,'[1]Tipo '!$B$3,IF(D136=3,'[1]Tipo '!$B$4,IF(D136=4,'[1]Tipo '!$B$5,IF(D136=5,'[1]Tipo '!$B$6,IF(D136=6,'[1]Tipo '!$B$7,IF(D136=7,'[1]Tipo '!$B$8,IF(D136=8,'[1]Tipo '!$B$9,IF(D136=9,'[1]Tipo '!$B$10,IF(D136=10,'[1]Tipo '!$B$11,IF(D136=11,'[1]Tipo '!$B$12,IF(D136=12,'[1]Tipo '!$B$13,IF(D136=13,'[1]Tipo '!$B$14,IF(D136=14,'[1]Tipo '!$B$15,IF(D136=15,'[1]Tipo '!$B$16,IF(D136=16,'[1]Tipo '!$B$17,IF(D136=17,'[1]Tipo '!$B$18,IF(D136=18,'[1]Tipo '!$B$19,IF(D136=19,'[1]Tipo '!$B$20,\"No ha seleccionado un tipo de contrato válido\")))))))))))))))))))","v":"CONTRATOS DE PRESTACIÓN DE SERVICIOS"},"LICITACIÓN PÚBLICA","No aplica","REALIZAR EVENTOS DE RECREACIÓN Y DEPORTE Y FORMACIÓN DEPORTIVA EN EL MARCO DEL PROYECTO 1333 ¿TEUSAQUILLO MEJOR PARA LA CULTURA, LA RECREACIÓN Y EL DEPORTE¿, DE ACUERDO A LOS ESTUDIOS PREVIOS Y ANEXO TÉCNICO¿.","INVERSIÓN",11,{"$f":"IF(J136=1,'[1]Equivalencia BH-BMPT'!$D$2,IF(J136=2,'[1]Equivalencia BH-BMPT'!$D$3,IF(J136=3,'[1]Equivalencia BH-BMPT'!$D$4,IF(J136=4,'[1]Equivalencia BH-BMPT'!$D$5,IF(J136=5,'[1]Equivalencia BH-BMPT'!$D$6,IF(J136=6,'[1]Equivalencia BH-BMPT'!$D$7,IF(J136=7,'[1]Equivalencia BH-BMPT'!$D$8,IF(J136=8,'[1]Equivalencia BH-BMPT'!$D$9,IF(J136=9,'[1]Equivalencia BH-BMPT'!$D$10,IF(J136=10,'[1]Equivalencia BH-BMPT'!$D$11,IF(J136=11,'[1]Equivalencia BH-BMPT'!$D$12,IF(J136=12,'[1]Equivalencia BH-BMPT'!$D$13,IF(J136=13,'[1]Equivalencia BH-BMPT'!$D$14,IF(J136=14,'[1]Equivalencia BH-BMPT'!$D$15,IF(J136=15,'[1]Equivalencia BH-BMPT'!$D$16,IF(J136=16,'[1]Equivalencia BH-BMPT'!$D$17,IF(J136=17,'[1]Equivalencia BH-BMPT'!$D$18,IF(J136=18,'[1]Equivalencia BH-BMPT'!$D$19,IF(J136=19,'[1]Equivalencia BH-BMPT'!$D$20,IF(J136=20,'[1]Equivalencia BH-BMPT'!$D$21,IF(J136=21,'[1]Equivalencia BH-BMPT'!$D$22,IF(J136=22,'[1]Equivalencia BH-BMPT'!$D$23,IF(J136=23,'[1]Equivalencia BH-BMPT'!#REF!,IF(J136=24,'[1]Equivalencia BH-BMPT'!$D$25,IF(J136=25,'[1]Equivalencia BH-BMPT'!$D$26,IF(J136=26,'[1]Equivalencia BH-BMPT'!$D$27,IF(J136=27,'[1]Equivalencia BH-BMPT'!$D$28,IF(J136=28,'[1]Equivalencia BH-BMPT'!$D$29,IF(J136=29,'[1]Equivalencia BH-BMPT'!$D$30,IF(J136=30,'[1]Equivalencia BH-BMPT'!$D$31,IF(J136=31,'[1]Equivalencia BH-BMPT'!$D$32,IF(J136=32,'[1]Equivalencia BH-BMPT'!$D$33,IF(J136=33,'[1]Equivalencia BH-BMPT'!$D$34,IF(J136=34,'[1]Equivalencia BH-BMPT'!$D$35,IF(J136=35,'[1]Equivalencia BH-BMPT'!$D$36,IF(J136=36,'[1]Equivalencia BH-BMPT'!$D$37,IF(J136=37,'[1]Equivalencia BH-BMPT'!$D$38,IF(J136=38,'[1]Equivalencia BH-BMPT'!#REF!,IF(J136=39,'[1]Equivalencia BH-BMPT'!$D$40,IF(J136=40,'[1]Equivalencia BH-BMPT'!$D$41,IF(J136=41,'[1]Equivalencia BH-BMPT'!$D$42,IF(J136=42,'[1]Equivalencia BH-BMPT'!$D$43,IF(J136=43,'[1]Equivalencia BH-BMPT'!$D$44,IF(J136=44,'[1]Equivalencia BH-BMPT'!$D$45,IF(J136=45,'[1]Equivalencia BH-BMPT'!$D$46,\"No ha seleccionado un número de programa\")))))))))))))))))))))))))))))))))))))))))))))","v":"Mejores oportunidades para el desarrollo a través de la cultura, la recreación y el deporte"},1333,900332118,"FUNDACION SOCIAL COLOMBIA ACTIVA   ",412932177,null,null,null,0,412932177,0,"2017-12-26","2017-12-26",null,240,0,null,"X",null,null,null,0]
[111,2017,"FDLTMINC 028",3,{"$f":"IF(D137=1,'[1]Tipo '!$B$2,IF(D137=2,'[1]Tipo '!$B$3,IF(D137=3,'[1]Tipo '!$B$4,IF(D137=4,'[1]Tipo '!$B$5,IF(D137=5,'[1]Tipo '!$B$6,IF(D137=6,'[1]Tipo '!$B$7,IF(D137=7,'[1]Tipo '!$B$8,IF(D137=8,'[1]Tipo '!$B$9,IF(D137=9,'[1]Tipo '!$B$10,IF(D137=10,'[1]Tipo '!$B$11,IF(D137=11,'[1]Tipo '!$B$12,IF(D137=12,'[1]Tipo '!$B$13,IF(D137=13,'[1]Tipo '!$B$14,IF(D137=14,'[1]Tipo '!$B$15,IF(D137=15,'[1]Tipo '!$B$16,IF(D137=16,'[1]Tipo '!$B$17,IF(D137=17,'[1]Tipo '!$B$18,IF(D137=18,'[1]Tipo '!$B$19,IF(D137=19,'[1]Tipo '!$B$20,\"No ha seleccionado un tipo de contrato válido\")))))))))))))))))))","v":"INTERVENTORÍA"},"CONCURSO DE MÉRITOS",null,"Realizar la interventoría técnica, administrativa, financiera, legal, social y ambiental del contrato resultante del proceso FDLT-LP-018-2017, cuyo objeto es ¿Realizar eventos de recreación y deporte y formación deportiva en el marco del proyecto 1333 ¿Teusaquillo mejor para la cultura, la recreación y el deporte¿, de acuerdo a los estudios previos y anexo técnico¿.","INVERSIÓN",11,{"$f":"IF(J137=1,'[1]Equivalencia BH-BMPT'!$D$2,IF(J137=2,'[1]Equivalencia BH-BMPT'!$D$3,IF(J137=3,'[1]Equivalencia BH-BMPT'!$D$4,IF(J137=4,'[1]Equivalencia BH-BMPT'!$D$5,IF(J137=5,'[1]Equivalencia BH-BMPT'!$D$6,IF(J137=6,'[1]Equivalencia BH-BMPT'!$D$7,IF(J137=7,'[1]Equivalencia BH-BMPT'!$D$8,IF(J137=8,'[1]Equivalencia BH-BMPT'!$D$9,IF(J137=9,'[1]Equivalencia BH-BMPT'!$D$10,IF(J137=10,'[1]Equivalencia BH-BMPT'!$D$11,IF(J137=11,'[1]Equivalencia BH-BMPT'!$D$12,IF(J137=12,'[1]Equivalencia BH-BMPT'!$D$13,IF(J137=13,'[1]Equivalencia BH-BMPT'!$D$14,IF(J137=14,'[1]Equivalencia BH-BMPT'!$D$15,IF(J137=15,'[1]Equivalencia BH-BMPT'!$D$16,IF(J137=16,'[1]Equivalencia BH-BMPT'!$D$17,IF(J137=17,'[1]Equivalencia BH-BMPT'!$D$18,IF(J137=18,'[1]Equivalencia BH-BMPT'!$D$19,IF(J137=19,'[1]Equivalencia BH-BMPT'!$D$20,IF(J137=20,'[1]Equivalencia BH-BMPT'!$D$21,IF(J137=21,'[1]Equivalencia BH-BMPT'!$D$22,IF(J137=22,'[1]Equivalencia BH-BMPT'!$D$23,IF(J137=23,'[1]Equivalencia BH-BMPT'!#REF!,IF(J137=24,'[1]Equivalencia BH-BMPT'!$D$25,IF(J137=25,'[1]Equivalencia BH-BMPT'!$D$26,IF(J137=26,'[1]Equivalencia BH-BMPT'!$D$27,IF(J137=27,'[1]Equivalencia BH-BMPT'!$D$28,IF(J137=28,'[1]Equivalencia BH-BMPT'!$D$29,IF(J137=29,'[1]Equivalencia BH-BMPT'!$D$30,IF(J137=30,'[1]Equivalencia BH-BMPT'!$D$31,IF(J137=31,'[1]Equivalencia BH-BMPT'!$D$32,IF(J137=32,'[1]Equivalencia BH-BMPT'!$D$33,IF(J137=33,'[1]Equivalencia BH-BMPT'!$D$34,IF(J137=34,'[1]Equivalencia BH-BMPT'!$D$35,IF(J137=35,'[1]Equivalencia BH-BMPT'!$D$36,IF(J137=36,'[1]Equivalencia BH-BMPT'!$D$37,IF(J137=37,'[1]Equivalencia BH-BMPT'!$D$38,IF(J137=38,'[1]Equivalencia BH-BMPT'!#REF!,IF(J137=39,'[1]Equivalencia BH-BMPT'!$D$40,IF(J137=40,'[1]Equivalencia BH-BMPT'!$D$41,IF(J137=41,'[1]Equivalencia BH-BMPT'!$D$42,IF(J137=42,'[1]Equivalencia BH-BMPT'!$D$43,IF(J137=43,'[1]Equivalencia BH-BMPT'!$D$44,IF(J137=44,'[1]Equivalencia BH-BMPT'!$D$45,IF(J137=45,'[1]Equivalencia BH-BMPT'!$D$46,\"No ha seleccionado un número de programa\")))))))))))))))))))))))))))))))))))))))))))))","v":"Mejores oportunidades para el desarrollo a través de la cultura, la recreación y el deporte"},1333,80220338,"FRANCISCO ALBERTO ROZO TORRES",13600000,null,null,null,0,13600000,0,"2017-12-26","2017-12-26",null,240,0,null,"X",null,null,null,0]
[112,2017,"FDLT-SAMC-006-2016",4,{"$f":"IF(D138=1,'[1]Tipo '!$B$2,IF(D138=2,'[1]Tipo '!$B$3,IF(D138=3,'[1]Tipo '!$B$4,IF(D138=4,'[1]Tipo '!$B$5,IF(D138=5,'[1]Tipo '!$B$6,IF(D138=6,'[1]Tipo '!$B$7,IF(D138=7,'[1]Tipo '!$B$8,IF(D138=8,'[1]Tipo '!$B$9,IF(D138=9,'[1]Tipo '!$B$10,IF(D138=10,'[1]Tipo '!$B$11,IF(D138=11,'[1]Tipo '!$B$12,IF(D138=12,'[1]Tipo '!$B$13,IF(D138=13,'[1]Tipo '!$B$14,IF(D138=14,'[1]Tipo '!$B$15,IF(D138=15,'[1]Tipo '!$B$16,IF(D138=16,'[1]Tipo '!$B$17,IF(D138=17,'[1]Tipo '!$B$18,IF(D138=18,'[1]Tipo '!$B$19,IF(D138=19,'[1]Tipo '!$B$20,\"No ha seleccionado un tipo de contrato válido\")))))))))))))))))))","v":"CONTRATOS DE PRESTACIÓN DE SERVICIOS"},"Selección abreviada ","Selección abreviada por menor cuantía ","OBJETO: Contratar la prestación de servicios para el desarrollo del intercambio de saberes y experiencias entre líderes comunales de la localidad de Teusaquillo y sus pares de Boyacá, en el marco del proceso de vinculación en procesos de formación y exaltación por sus méritos y laboriosidad, de acuerdo con los presentes estudios previos y anexo técnico.","INVERSIÓN",45,{"$f":"IF(J138=1,'[1]Equivalencia BH-BMPT'!$D$2,IF(J138=2,'[1]Equivalencia BH-BMPT'!$D$3,IF(J138=3,'[1]Equivalencia BH-BMPT'!$D$4,IF(J138=4,'[1]Equivalencia BH-BMPT'!$D$5,IF(J138=5,'[1]Equivalencia BH-BMPT'!$D$6,IF(J138=6,'[1]Equivalencia BH-BMPT'!$D$7,IF(J138=7,'[1]Equivalencia BH-BMPT'!$D$8,IF(J138=8,'[1]Equivalencia BH-BMPT'!$D$9,IF(J138=9,'[1]Equivalencia BH-BMPT'!$D$10,IF(J138=10,'[1]Equivalencia BH-BMPT'!$D$11,IF(J138=11,'[1]Equivalencia BH-BMPT'!$D$12,IF(J138=12,'[1]Equivalencia BH-BMPT'!$D$13,IF(J138=13,'[1]Equivalencia BH-BMPT'!$D$14,IF(J138=14,'[1]Equivalencia BH-BMPT'!$D$15,IF(J138=15,'[1]Equivalencia BH-BMPT'!$D$16,IF(J138=16,'[1]Equivalencia BH-BMPT'!$D$17,IF(J138=17,'[1]Equivalencia BH-BMPT'!$D$18,IF(J138=18,'[1]Equivalencia BH-BMPT'!$D$19,IF(J138=19,'[1]Equivalencia BH-BMPT'!$D$20,IF(J138=20,'[1]Equivalencia BH-BMPT'!$D$21,IF(J138=21,'[1]Equivalencia BH-BMPT'!$D$22,IF(J138=22,'[1]Equivalencia BH-BMPT'!$D$23,IF(J138=23,'[1]Equivalencia BH-BMPT'!#REF!,IF(J138=24,'[1]Equivalencia BH-BMPT'!$D$25,IF(J138=25,'[1]Equivalencia BH-BMPT'!$D$26,IF(J138=26,'[1]Equivalencia BH-BMPT'!$D$27,IF(J138=27,'[1]Equivalencia BH-BMPT'!$D$28,IF(J138=28,'[1]Equivalencia BH-BMPT'!$D$29,IF(J138=29,'[1]Equivalencia BH-BMPT'!$D$30,IF(J138=30,'[1]Equivalencia BH-BMPT'!$D$31,IF(J138=31,'[1]Equivalencia BH-BMPT'!$D$32,IF(J138=32,'[1]Equivalencia BH-BMPT'!$D$33,IF(J138=33,'[1]Equivalencia BH-BMPT'!$D$34,IF(J138=34,'[1]Equivalencia BH-BMPT'!$D$35,IF(J138=35,'[1]Equivalencia BH-BMPT'!$D$36,IF(J138=36,'[1]Equivalencia BH-BMPT'!$D$37,IF(J138=37,'[1]Equivalencia BH-BMPT'!$D$38,IF(J138=38,'[1]Equivalencia BH-BMPT'!#REF!,IF(J138=39,'[1]Equivalencia BH-BMPT'!$D$40,IF(J138=40,'[1]Equivalencia BH-BMPT'!$D$41,IF(J138=41,'[1]Equivalencia BH-BMPT'!$D$42,IF(J138=42,'[1]Equivalencia BH-BMPT'!$D$43,IF(J138=43,'[1]Equivalencia BH-BMPT'!$D$44,IF(J138=44,'[1]Equivalencia BH-BMPT'!$D$45,IF(J138=45,'[1]Equivalencia BH-BMPT'!$D$46,\"No ha seleccionado un número de programa\")))))))))))))))))))))))))))))))))))))))))))))","v":"Gobernanza e influencia local, regional e internacional"},1351,830083016,"PROFESIONALES EN LOGISTICA DEPORTES Y EVENTOS LTDA",60767015,null,null,null,0,60767015,0,"2017-12-22",null,null,60,0,null,"X",null,null,null,0]
["FDLT-PS-MIN-003-2016",2017,"FDLT-PS-MIN-003-2016",17,{"$f":"IF(D139=1,'[1]Tipo '!$B$2,IF(D139=2,'[1]Tipo '!$B$3,IF(D139=3,'[1]Tipo '!$B$4,IF(D139=4,'[1]Tipo '!$B$5,IF(D139=5,'[1]Tipo '!$B$6,IF(D139=6,'[1]Tipo '!$B$7,IF(D139=7,'[1]Tipo '!$B$8,IF(D139=8,'[1]Tipo '!$B$9,IF(D139=9,'[1]Tipo '!$B$10,IF(D139=10,'[1]Tipo '!$B$11,IF(D139=11,'[1]Tipo '!$B$12,IF(D139=12,'[1]Tipo '!$B$13,IF(D139=13,'[1]Tipo '!$B$14,IF(D139=14,'[1]Tipo '!$B$15,IF(D139=15,'[1]Tipo '!$B$16,IF(D139=16,'[1]Tipo '!$B$17,IF(D139=17,'[1]Tipo '!$B$18,IF(D139=18,'[1]Tipo '!$B$19,IF(D139=19,'[1]Tipo '!$B$20,\"No ha seleccionado un tipo de contrato válido\")))))))))))))))))))","v":"CONVENIOS DE APOYO Y/O CONVENIOS DE ASOCIACIÓN "},"CONTRATACIÓN DIRECTA","Contratos interadministrativos","AUNAR RECURSOS TÉCNICOS Y ADMINISTRATIVOS PARA GARANTIZAR LA ENTREGA DEL SUBSIDIO ECONÓMICO TIPO C A LAS PERSONAS MAYORES BENEFICIARIAS DEL SERVICIO SOCIAL SUBSIDIOS ECONÓMICOS QUE SON ATENDIDAS CON RECURSOS DE LOS FONDOS DE DESARROLLO LOCAL EN EL MARCO DE LA POLÍTICA PÚBLICA SOCIAL PARA EL ENVEJECIMIENTO Y LA VEJEZ EN EL DISTRITO CAPITAL. SEGUN RESOLUCION 050 DE FEBRERO 16 DE 2017 DEL ALCALDE LOCAL DE TEUSAQUILLO - DR. RODRIGO BERNAL BALMES.","INVERSIÓN",3,{"$f":"IF(J139=1,'[1]Equivalencia BH-BMPT'!$D$2,IF(J139=2,'[1]Equivalencia BH-BMPT'!$D$3,IF(J139=3,'[1]Equivalencia BH-BMPT'!$D$4,IF(J139=4,'[1]Equivalencia BH-BMPT'!$D$5,IF(J139=5,'[1]Equivalencia BH-BMPT'!$D$6,IF(J139=6,'[1]Equivalencia BH-BMPT'!$D$7,IF(J139=7,'[1]Equivalencia BH-BMPT'!$D$8,IF(J139=8,'[1]Equivalencia BH-BMPT'!$D$9,IF(J139=9,'[1]Equivalencia BH-BMPT'!$D$10,IF(J139=10,'[1]Equivalencia BH-BMPT'!$D$11,IF(J139=11,'[1]Equivalencia BH-BMPT'!$D$12,IF(J139=12,'[1]Equivalencia BH-BMPT'!$D$13,IF(J139=13,'[1]Equivalencia BH-BMPT'!$D$14,IF(J139=14,'[1]Equivalencia BH-BMPT'!$D$15,IF(J139=15,'[1]Equivalencia BH-BMPT'!$D$16,IF(J139=16,'[1]Equivalencia BH-BMPT'!$D$17,IF(J139=17,'[1]Equivalencia BH-BMPT'!$D$18,IF(J139=18,'[1]Equivalencia BH-BMPT'!$D$19,IF(J139=19,'[1]Equivalencia BH-BMPT'!$D$20,IF(J139=20,'[1]Equivalencia BH-BMPT'!$D$21,IF(J139=21,'[1]Equivalencia BH-BMPT'!$D$22,IF(J139=22,'[1]Equivalencia BH-BMPT'!$D$23,IF(J139=23,'[1]Equivalencia BH-BMPT'!#REF!,IF(J139=24,'[1]Equivalencia BH-BMPT'!$D$25,IF(J139=25,'[1]Equivalencia BH-BMPT'!$D$26,IF(J139=26,'[1]Equivalencia BH-BMPT'!$D$27,IF(J139=27,'[1]Equivalencia BH-BMPT'!$D$28,IF(J139=28,'[1]Equivalencia BH-BMPT'!$D$29,IF(J139=29,'[1]Equivalencia BH-BMPT'!$D$30,IF(J139=30,'[1]Equivalencia BH-BMPT'!$D$31,IF(J139=31,'[1]Equivalencia BH-BMPT'!$D$32,IF(J139=32,'[1]Equivalencia BH-BMPT'!$D$33,IF(J139=33,'[1]Equivalencia BH-BMPT'!$D$34,IF(J139=34,'[1]Equivalencia BH-BMPT'!$D$35,IF(J139=35,'[1]Equivalencia BH-BMPT'!$D$36,IF(J139=36,'[1]Equivalencia BH-BMPT'!$D$37,IF(J139=37,'[1]Equivalencia BH-BMPT'!$D$38,IF(J139=38,'[1]Equivalencia BH-BMPT'!#REF!,IF(J139=39,'[1]Equivalencia BH-BMPT'!$D$40,IF(J139=40,'[1]Equivalencia BH-BMPT'!$D$41,IF(J139=41,'[1]Equivalencia BH-BMPT'!$D$42,IF(J139=42,'[1]Equivalencia BH-BMPT'!$D$43,IF(J139=43,'[1]Equivalencia BH-BMPT'!$D$44,IF(J139=44,'[1]Equivalencia BH-BMPT'!$D$45,IF(J139=45,'[1]Equivalencia BH-BMPT'!$D$46,\"No ha seleccionado un número de programa\")))))))))))))))))))))))))))))))))))))))))))))","v":"Igualdad y autonomía para una Bogotá incluyente"},1357,860066942,"CAJA DE COMPENSACION FAMILIAR - COMPENSAR",null,null,null,null,354895852,354895852,324299044,"2011-12-19","2011-12-21","2018-04-01",360,1931,null,null,"X",null,null,0.91378651560007529]
[6104,2017,"Orden de compra 6104",4,{"$f":"IF(D140=1,'[1]Tipo '!$B$2,IF(D140=2,'[1]Tipo '!$B$3,IF(D140=3,'[1]Tipo '!$B$4,IF(D140=4,'[1]Tipo '!$B$5,IF(D140=5,'[1]Tipo '!$B$6,IF(D140=6,'[1]Tipo '!$B$7,IF(D140=7,'[1]Tipo '!$B$8,IF(D140=8,'[1]Tipo '!$B$9,IF(D140=9,'[1]Tipo '!$B$10,IF(D140=10,'[1]Tipo '!$B$11,IF(D140=11,'[1]Tipo '!$B$12,IF(D140=12,'[1]Tipo '!$B$13,IF(D140=13,'[1]Tipo '!$B$14,IF(D140=14,'[1]Tipo '!$B$15,IF(D140=15,'[1]Tipo '!$B$16,IF(D140=16,'[1]Tipo '!$B$17,IF(D140=17,'[1]Tipo '!$B$18,IF(D140=18,'[1]Tipo '!$B$19,IF(D140=19,'[1]Tipo '!$B$20,\"No ha seleccionado un tipo de contrato válido\")))))))))))))))))))","v":"CONTRATOS DE PRESTACIÓN DE SERVICIOS"},"Selección abreviada ","Acuerdo marco de precios ","Adición y Prorroga No 1 al CSU 091-2015Contratar el servicio integral y continuo de combustible, para los    vehículos que conforman el parque automotor de la Alcaldía Local de Teusaquillo a través de Colombia Compra Eficiente acogiéndonos al acuerdo marco CCE-290-1-2015-1","FUNCIONAMIENTO",null,{"$f":"IF(J140=1,'[1]Equivalencia BH-BMPT'!$D$2,IF(J140=2,'[1]Equivalencia BH-BMPT'!$D$3,IF(J140=3,'[1]Equivalencia BH-BMPT'!$D$4,IF(J140=4,'[1]Equivalencia BH-BMPT'!$D$5,IF(J140=5,'[1]Equivalencia BH-BMPT'!$D$6,IF(J140=6,'[1]Equivalencia BH-BMPT'!$D$7,IF(J140=7,'[1]Equivalencia BH-BMPT'!$D$8,IF(J140=8,'[1]Equivalencia BH-BMPT'!$D$9,IF(J140=9,'[1]Equivalencia BH-BMPT'!$D$10,IF(J140=10,'[1]Equivalencia BH-BMPT'!$D$11,IF(J140=11,'[1]Equivalencia BH-BMPT'!$D$12,IF(J140=12,'[1]Equivalencia BH-BMPT'!$D$13,IF(J140=13,'[1]Equivalencia BH-BMPT'!$D$14,IF(J140=14,'[1]Equivalencia BH-BMPT'!$D$15,IF(J140=15,'[1]Equivalencia BH-BMPT'!$D$16,IF(J140=16,'[1]Equivalencia BH-BMPT'!$D$17,IF(J140=17,'[1]Equivalencia BH-BMPT'!$D$18,IF(J140=18,'[1]Equivalencia BH-BMPT'!$D$19,IF(J140=19,'[1]Equivalencia BH-BMPT'!$D$20,IF(J140=20,'[1]Equivalencia BH-BMPT'!$D$21,IF(J140=21,'[1]Equivalencia BH-BMPT'!$D$22,IF(J140=22,'[1]Equivalencia BH-BMPT'!$D$23,IF(J140=23,'[1]Equivalencia BH-BMPT'!#REF!,IF(J140=24,'[1]Equivalencia BH-BMPT'!$D$25,IF(J140=25,'[1]Equivalencia BH-BMPT'!$D$26,IF(J140=26,'[1]Equivalencia BH-BMPT'!$D$27,IF(J140=27,'[1]Equivalencia BH-BMPT'!$D$28,IF(J140=28,'[1]Equivalencia BH-BMPT'!$D$29,IF(J140=29,'[1]Equivalencia BH-BMPT'!$D$30,IF(J140=30,'[1]Equivalencia BH-BMPT'!$D$31,IF(J140=31,'[1]Equivalencia BH-BMPT'!$D$32,IF(J140=32,'[1]Equivalencia BH-BMPT'!$D$33,IF(J140=33,'[1]Equivalencia BH-BMPT'!$D$34,IF(J140=34,'[1]Equivalencia BH-BMPT'!$D$35,IF(J140=35,'[1]Equivalencia BH-BMPT'!$D$36,IF(J140=36,'[1]Equivalencia BH-BMPT'!$D$37,IF(J140=37,'[1]Equivalencia BH-BMPT'!$D$38,IF(J140=38,'[1]Equivalencia BH-BMPT'!#REF!,IF(J140=39,'[1]Equivalencia BH-BMPT'!$D$40,IF(J140=40,'[1]Equivalencia BH-BMPT'!$D$41,IF(J140=41,'[1]Equivalencia BH-BMPT'!$D$42,IF(J140=42,'[1]Equivalencia BH-BMPT'!$D$43,IF(J140=43,'[1]Equivalencia BH-BMPT'!$D$44,IF(J140=44,'[1]Equivalencia BH-BMPT'!$D$45,IF(J140=45,'[1]Equivalencia BH-BMPT'!$D$46,\"No ha seleccionado un número de programa\")))))))))))))))))))))))))))))))))))))))))))))","v":"No ha seleccionado un número de programa"},null,830095213,"ORGANIZACION TERPEL S A",null,null,null,null,10800000,10800000,4826959,"2015-12-28","2016-01-01","2018-02-28",{"$f":"16*30","v":480},330,null,null,"X",null,null,0.44694064814814816]
[9967,2017,null,4,{"$f":"IF(D141=1,'[1]Tipo '!$B$2,IF(D141=2,'[1]Tipo '!$B$3,IF(D141=3,'[1]Tipo '!$B$4,IF(D141=4,'[1]Tipo '!$B$5,IF(D141=5,'[1]Tipo '!$B$6,IF(D141=6,'[1]Tipo '!$B$7,IF(D141=7,'[1]Tipo '!$B$8,IF(D141=8,'[1]Tipo '!$B$9,IF(D141=9,'[1]Tipo '!$B$10,IF(D141=10,'[1]Tipo '!$B$11,IF(D141=11,'[1]Tipo '!$B$12,IF(D141=12,'[1]Tipo '!$B$13,IF(D141=13,'[1]Tipo '!$B$14,IF(D141=14,'[1]Tipo '!$B$15,IF(D141=15,'[1]Tipo '!$B$16,IF(D141=16,'[1]Tipo '!$B$17,IF(D141=17,'[1]Tipo '!$B$18,IF(D141=18,'[1]Tipo '!$B$19,IF(D141=19,'[1]Tipo '!$B$20,\"No ha seleccionado un tipo de contrato válido\")))))))))))))))))))","v":"CONTRATOS DE PRESTACIÓN DE SERVICIOS"},"Selección abreviada ","Acuerdo marco de precios ","Adición No 1 a la orden de compra 9967 que tiene por objeto ¿ Contratar el Servicio integral de aseo, cafetería y mantenimiento para las instalaciones de la Alcaldía Local de Teusaquillo, incluida la Junta Administradora Local, de conformidad con el Acuerdo Marco de Precios por parte de entidades compradoras No. CCE-146-1-AMP-2014¿.","FUNCIONAMIENTO",null,{"$f":"IF(J141=1,'[1]Equivalencia BH-BMPT'!$D$2,IF(J141=2,'[1]Equivalencia BH-BMPT'!$D$3,IF(J141=3,'[1]Equivalencia BH-BMPT'!$D$4,IF(J141=4,'[1]Equivalencia BH-BMPT'!$D$5,IF(J141=5,'[1]Equivalencia BH-BMPT'!$D$6,IF(J141=6,'[1]Equivalencia BH-BMPT'!$D$7,IF(J141=7,'[1]Equivalencia BH-BMPT'!$D$8,IF(J141=8,'[1]Equivalencia BH-BMPT'!$D$9,IF(J141=9,'[1]Equivalencia BH-BMPT'!$D$10,IF(J141=10,'[1]Equivalencia BH-BMPT'!$D$11,IF(J141=11,'[1]Equivalencia BH-BMPT'!$D$12,IF(J141=12,'[1]Equivalencia BH-BMPT'!$D$13,IF(J141=13,'[1]Equivalencia BH-BMPT'!$D$14,IF(J141=14,'[1]Equivalencia BH-BMPT'!$D$15,IF(J141=15,'[1]Equivalencia BH-BMPT'!$D$16,IF(J141=16,'[1]Equivalencia BH-BMPT'!$D$17,IF(J141=17,'[1]Equivalencia BH-BMPT'!$D$18,IF(J141=18,'[1]Equivalencia BH-BMPT'!$D$19,IF(J141=19,'[1]Equivalencia BH-BMPT'!$D$20,IF(J141=20,'[1]Equivalencia BH-BMPT'!$D$21,IF(J141=21,'[1]Equivalencia BH-BMPT'!$D$22,IF(J141=22,'[1]Equivalencia BH-BMPT'!$D$23,IF(J141=23,'[1]Equivalencia BH-BMPT'!#REF!,IF(J141=24,'[1]Equivalencia BH-BMPT'!$D$25,IF(J141=25,'[1]Equivalencia BH-BMPT'!$D$26,IF(J141=26,'[1]Equivalencia BH-BMPT'!$D$27,IF(J141=27,'[1]Equivalencia BH-BMPT'!$D$28,IF(J141=28,'[1]Equivalencia BH-BMPT'!$D$29,IF(J141=29,'[1]Equivalencia BH-BMPT'!$D$30,IF(J141=30,'[1]Equivalencia BH-BMPT'!$D$31,IF(J141=31,'[1]Equivalencia BH-BMPT'!$D$32,IF(J141=32,'[1]Equivalencia BH-BMPT'!$D$33,IF(J141=33,'[1]Equivalencia BH-BMPT'!$D$34,IF(J141=34,'[1]Equivalencia BH-BMPT'!$D$35,IF(J141=35,'[1]Equivalencia BH-BMPT'!$D$36,IF(J141=36,'[1]Equivalencia BH-BMPT'!$D$37,IF(J141=37,'[1]Equivalencia BH-BMPT'!$D$38,IF(J141=38,'[1]Equivalencia BH-BMPT'!#REF!,IF(J141=39,'[1]Equivalencia BH-BMPT'!$D$40,IF(J141=40,'[1]Equivalencia BH-BMPT'!$D$41,IF(J141=41,'[1]Equivalencia BH-BMPT'!$D$42,IF(J141=42,'[1]Equivalencia BH-BMPT'!$D$43,IF(J141=43,'[1]Equivalencia BH-BMPT'!$D$44,IF(J141=44,'[1]Equivalencia BH-BMPT'!$D$45,IF(J141=45,'[1]Equivalencia BH-BMPT'!$D$46,\"No ha seleccionado un número de programa\")))))))))))))))))))))))))))))))))))))))))))))","v":"No ha seleccionado un número de programa"},null,860522931,"EASYCLEAN G&E SAS   .",null,null,null,null,1895158,{"$f":"+O141+S141","v":1895158},1895158,"2016-08-18","2016-08-18","2017-04-28",240,11,null,null,null,null,"X",1]
[24288,2017,null,19,{"$f":"IF(D142=1,'[1]Tipo '!$B$2,IF(D142=2,'[1]Tipo '!$B$3,IF(D142=3,'[1]Tipo '!$B$4,IF(D142=4,'[1]Tipo '!$B$5,IF(D142=5,'[1]Tipo '!$B$6,IF(D142=6,'[1]Tipo '!$B$7,IF(D142=7,'[1]Tipo '!$B$8,IF(D142=8,'[1]Tipo '!$B$9,IF(D142=9,'[1]Tipo '!$B$10,IF(D142=10,'[1]Tipo '!$B$11,IF(D142=11,'[1]Tipo '!$B$12,IF(D142=12,'[1]Tipo '!$B$13,IF(D142=13,'[1]Tipo '!$B$14,IF(D142=14,'[1]Tipo '!$B$15,IF(D142=15,'[1]Tipo '!$B$16,IF(D142=16,'[1]Tipo '!$B$17,IF(D142=17,'[1]Tipo '!$B$18,IF(D142=18,'[1]Tipo '!$B$19,IF(D142=19,'[1]Tipo '!$B$20,\"No ha seleccionado un tipo de contrato válido\")))))))))))))))))))","v":"OTROS"},"Selección abreviada ","Acuerdo marco de precios ","OBJETO: ¿Adquisición, instalación y puesta en funcionamiento del sistema de Video Vigilancia del Distrito a través de la Operación Secundaria del Instrumento de Agregación de Demanda LP-151-AG-2017 de Colombia Compra Eficiente para la localidad de Teusaquillo¿.","INVERSIÓN",19,{"$f":"IF(J142=1,'[1]Equivalencia BH-BMPT'!$D$2,IF(J142=2,'[1]Equivalencia BH-BMPT'!$D$3,IF(J142=3,'[1]Equivalencia BH-BMPT'!$D$4,IF(J142=4,'[1]Equivalencia BH-BMPT'!$D$5,IF(J142=5,'[1]Equivalencia BH-BMPT'!$D$6,IF(J142=6,'[1]Equivalencia BH-BMPT'!$D$7,IF(J142=7,'[1]Equivalencia BH-BMPT'!$D$8,IF(J142=8,'[1]Equivalencia BH-BMPT'!$D$9,IF(J142=9,'[1]Equivalencia BH-BMPT'!$D$10,IF(J142=10,'[1]Equivalencia BH-BMPT'!$D$11,IF(J142=11,'[1]Equivalencia BH-BMPT'!$D$12,IF(J142=12,'[1]Equivalencia BH-BMPT'!$D$13,IF(J142=13,'[1]Equivalencia BH-BMPT'!$D$14,IF(J142=14,'[1]Equivalencia BH-BMPT'!$D$15,IF(J142=15,'[1]Equivalencia BH-BMPT'!$D$16,IF(J142=16,'[1]Equivalencia BH-BMPT'!$D$17,IF(J142=17,'[1]Equivalencia BH-BMPT'!$D$18,IF(J142=18,'[1]Equivalencia BH-BMPT'!$D$19,IF(J142=19,'[1]Equivalencia BH-BMPT'!$D$20,IF(J142=20,'[1]Equivalencia BH-BMPT'!$D$21,IF(J142=21,'[1]Equivalencia BH-BMPT'!$D$22,IF(J142=22,'[1]Equivalencia BH-BMPT'!$D$23,IF(J142=23,'[1]Equivalencia BH-BMPT'!#REF!,IF(J142=24,'[1]Equivalencia BH-BMPT'!$D$25,IF(J142=25,'[1]Equivalencia BH-BMPT'!$D$26,IF(J142=26,'[1]Equivalencia BH-BMPT'!$D$27,IF(J142=27,'[1]Equivalencia BH-BMPT'!$D$28,IF(J142=28,'[1]Equivalencia BH-BMPT'!$D$29,IF(J142=29,'[1]Equivalencia BH-BMPT'!$D$30,IF(J142=30,'[1]Equivalencia BH-BMPT'!$D$31,IF(J142=31,'[1]Equivalencia BH-BMPT'!$D$32,IF(J142=32,'[1]Equivalencia BH-BMPT'!$D$33,IF(J142=33,'[1]Equivalencia BH-BMPT'!$D$34,IF(J142=34,'[1]Equivalencia BH-BMPT'!$D$35,IF(J142=35,'[1]Equivalencia BH-BMPT'!$D$36,IF(J142=36,'[1]Equivalencia BH-BMPT'!$D$37,IF(J142=37,'[1]Equivalencia BH-BMPT'!$D$38,IF(J142=38,'[1]Equivalencia BH-BMPT'!#REF!,IF(J142=39,'[1]Equivalencia BH-BMPT'!$D$40,IF(J142=40,'[1]Equivalencia BH-BMPT'!$D$41,IF(J142=41,'[1]Equivalencia BH-BMPT'!$D$42,IF(J142=42,'[1]Equivalencia BH-BMPT'!$D$43,IF(J142=43,'[1]Equivalencia BH-BMPT'!$D$44,IF(J142=44,'[1]Equivalencia BH-BMPT'!$D$45,IF(J142=45,'[1]Equivalencia BH-BMPT'!$D$46,\"No ha seleccionado un número de programa\")))))))))))))))))))))))))))))))))))))))))))))","v":"Seguridad y convivencia para todos"},1355,901134817,"UT BOGOTA ALCALDIAS SEGURIDAD CIUDADANA",622599000,null,null,null,0,622599000,0,"2017-12-27","2017-12-27","2019-05-26",480,0,null,null,"X",null,null,0]
[30023607,2017,30023607,11,{"$f":"IF(D143=1,'[1]Tipo '!$B$2,IF(D143=2,'[1]Tipo '!$B$3,IF(D143=3,'[1]Tipo '!$B$4,IF(D143=4,'[1]Tipo '!$B$5,IF(D143=5,'[1]Tipo '!$B$6,IF(D143=6,'[1]Tipo '!$B$7,IF(D143=7,'[1]Tipo '!$B$8,IF(D143=8,'[1]Tipo '!$B$9,IF(D143=9,'[1]Tipo '!$B$10,IF(D143=10,'[1]Tipo '!$B$11,IF(D143=11,'[1]Tipo '!$B$12,IF(D143=12,'[1]Tipo '!$B$13,IF(D143=13,'[1]Tipo '!$B$14,IF(D143=14,'[1]Tipo '!$B$15,IF(D143=15,'[1]Tipo '!$B$16,IF(D143=16,'[1]Tipo '!$B$17,IF(D143=17,'[1]Tipo '!$B$18,IF(D143=18,'[1]Tipo '!$B$19,IF(D143=19,'[1]Tipo '!$B$20,\"No ha seleccionado un tipo de contrato válido\")))))))))))))))))))","v":"SUMINISTRO"},"Selección abreviada ","Bolsas de productos","El contrato que se pretende celebrar, tendrá por objeto ¿Servicios de comisionista comprador para el suministro de equipos tecnológicos, licencias (software), materiales, elementos, insumos, consumibles y servicios para las diferentes necesidades de la Alcaldía Local de Teusaquillo de conformidad con el procedimiento establecido en el reglamento de funcionamiento y operación de la Bolsa Mercantil de Colombia.¿ALCANCE AL OBJETO: ¿ADQUIRIR EL SERVICIO DE TRANSPORTE TERRESTRE AUTOMOTOR ESPECIAL REQUERIDO PARA EL TRASLADO DEL PERSONAL DE APOYO Y USUARIOS EN EL MARCO DE LA MISIONALIDAD DE LA ALCALDIA LOCAL DE TEUSAQUILLO.¿","FUNCIONAMIENTO",null,{"$f":"IF(J143=1,'[1]Equivalencia BH-BMPT'!$D$2,IF(J143=2,'[1]Equivalencia BH-BMPT'!$D$3,IF(J143=3,'[1]Equivalencia BH-BMPT'!$D$4,IF(J143=4,'[1]Equivalencia BH-BMPT'!$D$5,IF(J143=5,'[1]Equivalencia BH-BMPT'!$D$6,IF(J143=6,'[1]Equivalencia BH-BMPT'!$D$7,IF(J143=7,'[1]Equivalencia BH-BMPT'!$D$8,IF(J143=8,'[1]Equivalencia BH-BMPT'!$D$9,IF(J143=9,'[1]Equivalencia BH-BMPT'!$D$10,IF(J143=10,'[1]Equivalencia BH-BMPT'!$D$11,IF(J143=11,'[1]Equivalencia BH-BMPT'!$D$12,IF(J143=12,'[1]Equivalencia BH-BMPT'!$D$13,IF(J143=13,'[1]Equivalencia BH-BMPT'!$D$14,IF(J143=14,'[1]Equivalencia BH-BMPT'!$D$15,IF(J143=15,'[1]Equivalencia BH-BMPT'!$D$16,IF(J143=16,'[1]Equivalencia BH-BMPT'!$D$17,IF(J143=17,'[1]Equivalencia BH-BMPT'!$D$18,IF(J143=18,'[1]Equivalencia BH-BMPT'!$D$19,IF(J143=19,'[1]Equivalencia BH-BMPT'!$D$20,IF(J143=20,'[1]Equivalencia BH-BMPT'!$D$21,IF(J143=21,'[1]Equivalencia BH-BMPT'!$D$22,IF(J143=22,'[1]Equivalencia BH-BMPT'!$D$23,IF(J143=23,'[1]Equivalencia BH-BMPT'!#REF!,IF(J143=24,'[1]Equivalencia BH-BMPT'!$D$25,IF(J143=25,'[1]Equivalencia BH-BMPT'!$D$26,IF(J143=26,'[1]Equivalencia BH-BMPT'!$D$27,IF(J143=27,'[1]Equivalencia BH-BMPT'!$D$28,IF(J143=28,'[1]Equivalencia BH-BMPT'!$D$29,IF(J143=29,'[1]Equivalencia BH-BMPT'!$D$30,IF(J143=30,'[1]Equivalencia BH-BMPT'!$D$31,IF(J143=31,'[1]Equivalencia BH-BMPT'!$D$32,IF(J143=32,'[1]Equivalencia BH-BMPT'!$D$33,IF(J143=33,'[1]Equivalencia BH-BMPT'!$D$34,IF(J143=34,'[1]Equivalencia BH-BMPT'!$D$35,IF(J143=35,'[1]Equivalencia BH-BMPT'!$D$36,IF(J143=36,'[1]Equivalencia BH-BMPT'!$D$37,IF(J143=37,'[1]Equivalencia BH-BMPT'!$D$38,IF(J143=38,'[1]Equivalencia BH-BMPT'!#REF!,IF(J143=39,'[1]Equivalencia BH-BMPT'!$D$40,IF(J143=40,'[1]Equivalencia BH-BMPT'!$D$41,IF(J143=41,'[1]Equivalencia BH-BMPT'!$D$42,IF(J143=42,'[1]Equivalencia BH-BMPT'!$D$43,IF(J143=43,'[1]Equivalencia BH-BMPT'!$D$44,IF(J143=44,'[1]Equivalencia BH-BMPT'!$D$45,IF(J143=45,'[1]Equivalencia BH-BMPT'!$D$46,\"No ha seleccionado un número de programa\")))))))))))))))))))))))))))))))))))))))))))))","v":"No ha seleccionado un número de programa"},null,830103828,"AGROBOLSA S A COMISIONISTA DE BOLSA",457436,null,null,null,0,457436,228718,"2017-10-09","2017-10-24","2018-03-31",{"$f":"23+150","v":173},0,null,null,"X",null,null,0.5]
[30023607,2017,30023607,11,{"$f":"IF(D144=1,'[1]Tipo '!$B$2,IF(D144=2,'[1]Tipo '!$B$3,IF(D144=3,'[1]Tipo '!$B$4,IF(D144=4,'[1]Tipo '!$B$5,IF(D144=5,'[1]Tipo '!$B$6,IF(D144=6,'[1]Tipo '!$B$7,IF(D144=7,'[1]Tipo '!$B$8,IF(D144=8,'[1]Tipo '!$B$9,IF(D144=9,'[1]Tipo '!$B$10,IF(D144=10,'[1]Tipo '!$B$11,IF(D144=11,'[1]Tipo '!$B$12,IF(D144=12,'[1]Tipo '!$B$13,IF(D144=13,'[1]Tipo '!$B$14,IF(D144=14,'[1]Tipo '!$B$15,IF(D144=15,'[1]Tipo '!$B$16,IF(D144=16,'[1]Tipo '!$B$17,IF(D144=17,'[1]Tipo '!$B$18,IF(D144=18,'[1]Tipo '!$B$19,IF(D144=19,'[1]Tipo '!$B$20,\"No ha seleccionado un tipo de contrato válido\")))))))))))))))))))","v":"SUMINISTRO"},"Selección abreviada ","Bolsas de productos","El contrato que se pretende celebrar, tendrá por objeto ¿Servicios de comisionista comprador para el suministro de equipos tecnológicos, licencias (software), materiales, elementos, insumos, consumibles y servicios para las diferentes necesidades de la Alcaldía Local de Teusaquillo de conformidad con el procedimiento establecido en el reglamento de funcionamiento y operación de la Bolsa Mercantil de Colombia.¿ALCANCE AL OBJETO: ¿ADQUIRIR EL SERVICIO DE TRANSPORTE TERRESTRE AUTOMOTOR ESPECIAL REQUERIDO PARA EL TRASLADO DEL PERSONAL DE APOYO Y USUARIOS EN EL MARCO DE LA MISIONALIDAD DE LA ALCALDIA LOCAL DE TEUSAQUILLO.¿","FUNCIONAMIENTO",null,{"$f":"IF(J144=1,'[1]Equivalencia BH-BMPT'!$D$2,IF(J144=2,'[1]Equivalencia BH-BMPT'!$D$3,IF(J144=3,'[1]Equivalencia BH-BMPT'!$D$4,IF(J144=4,'[1]Equivalencia BH-BMPT'!$D$5,IF(J144=5,'[1]Equivalencia BH-BMPT'!$D$6,IF(J144=6,'[1]Equivalencia BH-BMPT'!$D$7,IF(J144=7,'[1]Equivalencia BH-BMPT'!$D$8,IF(J144=8,'[1]Equivalencia BH-BMPT'!$D$9,IF(J144=9,'[1]Equivalencia BH-BMPT'!$D$10,IF(J144=10,'[1]Equivalencia BH-BMPT'!$D$11,IF(J144=11,'[1]Equivalencia BH-BMPT'!$D$12,IF(J144=12,'[1]Equivalencia BH-BMPT'!$D$13,IF(J144=13,'[1]Equivalencia BH-BMPT'!$D$14,IF(J144=14,'[1]Equivalencia BH-BMPT'!$D$15,IF(J144=15,'[1]Equivalencia BH-BMPT'!$D$16,IF(J144=16,'[1]Equivalencia BH-BMPT'!$D$17,IF(J144=17,'[1]Equivalencia BH-BMPT'!$D$18,IF(J144=18,'[1]Equivalencia BH-BMPT'!$D$19,IF(J144=19,'[1]Equivalencia BH-BMPT'!$D$20,IF(J144=20,'[1]Equivalencia BH-BMPT'!$D$21,IF(J144=21,'[1]Equivalencia BH-BMPT'!$D$22,IF(J144=22,'[1]Equivalencia BH-BMPT'!$D$23,IF(J144=23,'[1]Equivalencia BH-BMPT'!#REF!,IF(J144=24,'[1]Equivalencia BH-BMPT'!$D$25,IF(J144=25,'[1]Equivalencia BH-BMPT'!$D$26,IF(J144=26,'[1]Equivalencia BH-BMPT'!$D$27,IF(J144=27,'[1]Equivalencia BH-BMPT'!$D$28,IF(J144=28,'[1]Equivalencia BH-BMPT'!$D$29,IF(J144=29,'[1]Equivalencia BH-BMPT'!$D$30,IF(J144=30,'[1]Equivalencia BH-BMPT'!$D$31,IF(J144=31,'[1]Equivalencia BH-BMPT'!$D$32,IF(J144=32,'[1]Equivalencia BH-BMPT'!$D$33,IF(J144=33,'[1]Equivalencia BH-BMPT'!$D$34,IF(J144=34,'[1]Equivalencia BH-BMPT'!$D$35,IF(J144=35,'[1]Equivalencia BH-BMPT'!$D$36,IF(J144=36,'[1]Equivalencia BH-BMPT'!$D$37,IF(J144=37,'[1]Equivalencia BH-BMPT'!$D$38,IF(J144=38,'[1]Equivalencia BH-BMPT'!#REF!,IF(J144=39,'[1]Equivalencia BH-BMPT'!$D$40,IF(J144=40,'[1]Equivalencia BH-BMPT'!$D$41,IF(J144=41,'[1]Equivalencia BH-BMPT'!$D$42,IF(J144=42,'[1]Equivalencia BH-BMPT'!$D$43,IF(J144=43,'[1]Equivalencia BH-BMPT'!$D$44,IF(J144=44,'[1]Equivalencia BH-BMPT'!$D$45,IF(J144=45,'[1]Equivalencia BH-BMPT'!$D$46,\"No ha seleccionado un número de programa\")))))))))))))))))))))))))))))))))))))))))))))","v":"No ha seleccionado un número de programa"},null,825000461,"SESUMAN SAS",29512000,null,null,null,0,29512000,5902400,"2017-10-09","2017-10-24","2018-03-31",{"$f":"23+150","v":173},0,null,null,"X",null,null,0.2]
[30023607,2017,30023607,11,{"$f":"IF(D145=1,'[1]Tipo '!$B$2,IF(D145=2,'[1]Tipo '!$B$3,IF(D145=3,'[1]Tipo '!$B$4,IF(D145=4,'[1]Tipo '!$B$5,IF(D145=5,'[1]Tipo '!$B$6,IF(D145=6,'[1]Tipo '!$B$7,IF(D145=7,'[1]Tipo '!$B$8,IF(D145=8,'[1]Tipo '!$B$9,IF(D145=9,'[1]Tipo '!$B$10,IF(D145=10,'[1]Tipo '!$B$11,IF(D145=11,'[1]Tipo '!$B$12,IF(D145=12,'[1]Tipo '!$B$13,IF(D145=13,'[1]Tipo '!$B$14,IF(D145=14,'[1]Tipo '!$B$15,IF(D145=15,'[1]Tipo '!$B$16,IF(D145=16,'[1]Tipo '!$B$17,IF(D145=17,'[1]Tipo '!$B$18,IF(D145=18,'[1]Tipo '!$B$19,IF(D145=19,'[1]Tipo '!$B$20,\"No ha seleccionado un tipo de contrato válido\")))))))))))))))))))","v":"SUMINISTRO"},"Selección abreviada ","Bolsas de productos","El contrato que se pretende celebrar, tendrá por objeto ¿Servicios de comisionista comprador para el suministro de equipos tecnológicos, licencias (software), materiales, elementos, insumos, consumibles y servicios para las diferentes necesidades de la Alcaldía Local de Teusaquillo de conformidad con el procedimiento establecido en el reglamento de funcionamiento y operación de la Bolsa Mercantil de Colombia.¿ALCANCE AL OBJETO: ¿ADQUIRIR EL SERVICIO DE TRANSPORTE TERRESTRE AUTOMOTOR ESPECIAL REQUERIDO PARA EL TRASLADO DEL PERSONAL DE APOYO Y USUARIOS EN EL MARCO DE LA MISIONALIDAD DE LA ALCALDIA LOCAL DE TEUSAQUILLO.¿","FUNCIONAMIENTO",null,{"$f":"IF(J145=1,'[1]Equivalencia BH-BMPT'!$D$2,IF(J145=2,'[1]Equivalencia BH-BMPT'!$D$3,IF(J145=3,'[1]Equivalencia BH-BMPT'!$D$4,IF(J145=4,'[1]Equivalencia BH-BMPT'!$D$5,IF(J145=5,'[1]Equivalencia BH-BMPT'!$D$6,IF(J145=6,'[1]Equivalencia BH-BMPT'!$D$7,IF(J145=7,'[1]Equivalencia BH-BMPT'!$D$8,IF(J145=8,'[1]Equivalencia BH-BMPT'!$D$9,IF(J145=9,'[1]Equivalencia BH-BMPT'!$D$10,IF(J145=10,'[1]Equivalencia BH-BMPT'!$D$11,IF(J145=11,'[1]Equivalencia BH-BMPT'!$D$12,IF(J145=12,'[1]Equivalencia BH-BMPT'!$D$13,IF(J145=13,'[1]Equivalencia BH-BMPT'!$D$14,IF(J145=14,'[1]Equivalencia BH-BMPT'!$D$15,IF(J145=15,'[1]Equivalencia BH-BMPT'!$D$16,IF(J145=16,'[1]Equivalencia BH-BMPT'!$D$17,IF(J145=17,'[1]Equivalencia BH-BMPT'!$D$18,IF(J145=18,'[1]Equivalencia BH-BMPT'!$D$19,IF(J145=19,'[1]Equivalencia BH-BMPT'!$D$20,IF(J145=20,'[1]Equivalencia BH-BMPT'!$D$21,IF(J145=21,'[1]Equivalencia BH-BMPT'!$D$22,IF(J145=22,'[1]Equivalencia BH-BMPT'!$D$23,IF(J145=23,'[1]Equivalencia BH-BMPT'!#REF!,IF(J145=24,'[1]Equivalencia BH-BMPT'!$D$25,IF(J145=25,'[1]Equivalencia BH-BMPT'!$D$26,IF(J145=26,'[1]Equivalencia BH-BMPT'!$D$27,IF(J145=27,'[1]Equivalencia BH-BMPT'!$D$28,IF(J145=28,'[1]Equivalencia BH-BMPT'!$D$29,IF(J145=29,'[1]Equivalencia BH-BMPT'!$D$30,IF(J145=30,'[1]Equivalencia BH-BMPT'!$D$31,IF(J145=31,'[1]Equivalencia BH-BMPT'!$D$32,IF(J145=32,'[1]Equivalencia BH-BMPT'!$D$33,IF(J145=33,'[1]Equivalencia BH-BMPT'!$D$34,IF(J145=34,'[1]Equivalencia BH-BMPT'!$D$35,IF(J145=35,'[1]Equivalencia BH-BMPT'!$D$36,IF(J145=36,'[1]Equivalencia BH-BMPT'!$D$37,IF(J145=37,'[1]Equivalencia BH-BMPT'!$D$38,IF(J145=38,'[1]Equivalencia BH-BMPT'!#REF!,IF(J145=39,'[1]Equivalencia BH-BMPT'!$D$40,IF(J145=40,'[1]Equivalencia BH-BMPT'!$D$41,IF(J145=41,'[1]Equivalencia BH-BMPT'!$D$42,IF(J145=42,'[1]Equivalencia BH-BMPT'!$D$43,IF(J145=43,'[1]Equivalencia BH-BMPT'!$D$44,IF(J145=44,'[1]Equivalencia BH-BMPT'!$D$45,IF(J145=45,'[1]Equivalencia BH-BMPT'!$D$46,\"No ha seleccionado un número de programa\")))))))))))))))))))))))))))))))))))))))))))))","v":"No ha seleccionado un número de programa"},null,860071250,"BMC BOLSA MERCANTIL DE COLOMBIA S.A.",138739,null,null,null,0,138739,138739,"2017-10-09","2017-10-24","2018-03-31",173,0,null,null,"X",null,null,1]
[30057221,2017,30057221,11,{"$f":"IF(D146=1,'[1]Tipo '!$B$2,IF(D146=2,'[1]Tipo '!$B$3,IF(D146=3,'[1]Tipo '!$B$4,IF(D146=4,'[1]Tipo '!$B$5,IF(D146=5,'[1]Tipo '!$B$6,IF(D146=6,'[1]Tipo '!$B$7,IF(D146=7,'[1]Tipo '!$B$8,IF(D146=8,'[1]Tipo '!$B$9,IF(D146=9,'[1]Tipo '!$B$10,IF(D146=10,'[1]Tipo '!$B$11,IF(D146=11,'[1]Tipo '!$B$12,IF(D146=12,'[1]Tipo '!$B$13,IF(D146=13,'[1]Tipo '!$B$14,IF(D146=14,'[1]Tipo '!$B$15,IF(D146=15,'[1]Tipo '!$B$16,IF(D146=16,'[1]Tipo '!$B$17,IF(D146=17,'[1]Tipo '!$B$18,IF(D146=18,'[1]Tipo '!$B$19,IF(D146=19,'[1]Tipo '!$B$20,\"No ha seleccionado un tipo de contrato válido\")))))))))))))))))))","v":"SUMINISTRO"},"Selección abreviada ","Bolsas de productos","OBJETO: SUMINISTRO DE MATERIALES, ELEMENTOS Y CONSUMIBLES CON EL ÁNIMO DE REALIZAR ACCIONES DE EMBELLECIMIENTO DE ESPACIO PÚBLICO EN LA LOCALIDAD DE TEUSAQUILLO","INVERSIÓN",18,{"$f":"IF(J146=1,'[1]Equivalencia BH-BMPT'!$D$2,IF(J146=2,'[1]Equivalencia BH-BMPT'!$D$3,IF(J146=3,'[1]Equivalencia BH-BMPT'!$D$4,IF(J146=4,'[1]Equivalencia BH-BMPT'!$D$5,IF(J146=5,'[1]Equivalencia BH-BMPT'!$D$6,IF(J146=6,'[1]Equivalencia BH-BMPT'!$D$7,IF(J146=7,'[1]Equivalencia BH-BMPT'!$D$8,IF(J146=8,'[1]Equivalencia BH-BMPT'!$D$9,IF(J146=9,'[1]Equivalencia BH-BMPT'!$D$10,IF(J146=10,'[1]Equivalencia BH-BMPT'!$D$11,IF(J146=11,'[1]Equivalencia BH-BMPT'!$D$12,IF(J146=12,'[1]Equivalencia BH-BMPT'!$D$13,IF(J146=13,'[1]Equivalencia BH-BMPT'!$D$14,IF(J146=14,'[1]Equivalencia BH-BMPT'!$D$15,IF(J146=15,'[1]Equivalencia BH-BMPT'!$D$16,IF(J146=16,'[1]Equivalencia BH-BMPT'!$D$17,IF(J146=17,'[1]Equivalencia BH-BMPT'!$D$18,IF(J146=18,'[1]Equivalencia BH-BMPT'!$D$19,IF(J146=19,'[1]Equivalencia BH-BMPT'!$D$20,IF(J146=20,'[1]Equivalencia BH-BMPT'!$D$21,IF(J146=21,'[1]Equivalencia BH-BMPT'!$D$22,IF(J146=22,'[1]Equivalencia BH-BMPT'!$D$23,IF(J146=23,'[1]Equivalencia BH-BMPT'!#REF!,IF(J146=24,'[1]Equivalencia BH-BMPT'!$D$25,IF(J146=25,'[1]Equivalencia BH-BMPT'!$D$26,IF(J146=26,'[1]Equivalencia BH-BMPT'!$D$27,IF(J146=27,'[1]Equivalencia BH-BMPT'!$D$28,IF(J146=28,'[1]Equivalencia BH-BMPT'!$D$29,IF(J146=29,'[1]Equivalencia BH-BMPT'!$D$30,IF(J146=30,'[1]Equivalencia BH-BMPT'!$D$31,IF(J146=31,'[1]Equivalencia BH-BMPT'!$D$32,IF(J146=32,'[1]Equivalencia BH-BMPT'!$D$33,IF(J146=33,'[1]Equivalencia BH-BMPT'!$D$34,IF(J146=34,'[1]Equivalencia BH-BMPT'!$D$35,IF(J146=35,'[1]Equivalencia BH-BMPT'!$D$36,IF(J146=36,'[1]Equivalencia BH-BMPT'!$D$37,IF(J146=37,'[1]Equivalencia BH-BMPT'!$D$38,IF(J146=38,'[1]Equivalencia BH-BMPT'!#REF!,IF(J146=39,'[1]Equivalencia BH-BMPT'!$D$40,IF(J146=40,'[1]Equivalencia BH-BMPT'!$D$41,IF(J146=41,'[1]Equivalencia BH-BMPT'!$D$42,IF(J146=42,'[1]Equivalencia BH-BMPT'!$D$43,IF(J146=43,'[1]Equivalencia BH-BMPT'!$D$44,IF(J146=44,'[1]Equivalencia BH-BMPT'!$D$45,IF(J146=45,'[1]Equivalencia BH-BMPT'!$D$46,\"No ha seleccionado un número de programa\")))))))))))))))))))))))))))))))))))))))))))))","v":"Mejor movilidad para todos"},1338,900404431,"MULTIREPUESTOS BOSA INTERNACIONAL S.A.S.",146456448,null,null,null,0,146456448,26589337,"2017-10-25","2017-10-30","2017-12-31",62,0,null,null,null,"X",null,0.18155115300898189]
[30057221,2017,30057221,11,{"$f":"IF(D147=1,'[1]Tipo '!$B$2,IF(D147=2,'[1]Tipo '!$B$3,IF(D147=3,'[1]Tipo '!$B$4,IF(D147=4,'[1]Tipo '!$B$5,IF(D147=5,'[1]Tipo '!$B$6,IF(D147=6,'[1]Tipo '!$B$7,IF(D147=7,'[1]Tipo '!$B$8,IF(D147=8,'[1]Tipo '!$B$9,IF(D147=9,'[1]Tipo '!$B$10,IF(D147=10,'[1]Tipo '!$B$11,IF(D147=11,'[1]Tipo '!$B$12,IF(D147=12,'[1]Tipo '!$B$13,IF(D147=13,'[1]Tipo '!$B$14,IF(D147=14,'[1]Tipo '!$B$15,IF(D147=15,'[1]Tipo '!$B$16,IF(D147=16,'[1]Tipo '!$B$17,IF(D147=17,'[1]Tipo '!$B$18,IF(D147=18,'[1]Tipo '!$B$19,IF(D147=19,'[1]Tipo '!$B$20,\"No ha seleccionado un tipo de contrato válido\")))))))))))))))))))","v":"SUMINISTRO"},"Selección abreviada ","Bolsas de productos","OBJETO: SUMINISTRO DE MATERIALES, ELEMENTOS Y CONSUMIBLES CON EL ÁNIMO DE REALIZAR ACCIONES DE EMBELLECIMIENTO DE ESPACIO PÚBLICO EN LA LOCALIDAD DE TEUSAQUILLO","INVERSIÓN",18,{"$f":"IF(J147=1,'[1]Equivalencia BH-BMPT'!$D$2,IF(J147=2,'[1]Equivalencia BH-BMPT'!$D$3,IF(J147=3,'[1]Equivalencia BH-BMPT'!$D$4,IF(J147=4,'[1]Equivalencia BH-BMPT'!$D$5,IF(J147=5,'[1]Equivalencia BH-BMPT'!$D$6,IF(J147=6,'[1]Equivalencia BH-BMPT'!$D$7,IF(J147=7,'[1]Equivalencia BH-BMPT'!$D$8,IF(J147=8,'[1]Equivalencia BH-BMPT'!$D$9,IF(J147=9,'[1]Equivalencia BH-BMPT'!$D$10,IF(J147=10,'[1]Equivalencia BH-BMPT'!$D$11,IF(J147=11,'[1]Equivalencia BH-BMPT'!$D$12,IF(J147=12,'[1]Equivalencia BH-BMPT'!$D$13,IF(J147=13,'[1]Equivalencia BH-BMPT'!$D$14,IF(J147=14,'[1]Equivalencia BH-BMPT'!$D$15,IF(J147=15,'[1]Equivalencia BH-BMPT'!$D$16,IF(J147=16,'[1]Equivalencia BH-BMPT'!$D$17,IF(J147=17,'[1]Equivalencia BH-BMPT'!$D$18,IF(J147=18,'[1]Equivalencia BH-BMPT'!$D$19,IF(J147=19,'[1]Equivalencia BH-BMPT'!$D$20,IF(J147=20,'[1]Equivalencia BH-BMPT'!$D$21,IF(J147=21,'[1]Equivalencia BH-BMPT'!$D$22,IF(J147=22,'[1]Equivalencia BH-BMPT'!$D$23,IF(J147=23,'[1]Equivalencia BH-BMPT'!#REF!,IF(J147=24,'[1]Equivalencia BH-BMPT'!$D$25,IF(J147=25,'[1]Equivalencia BH-BMPT'!$D$26,IF(J147=26,'[1]Equivalencia BH-BMPT'!$D$27,IF(J147=27,'[1]Equivalencia BH-BMPT'!$D$28,IF(J147=28,'[1]Equivalencia BH-BMPT'!$D$29,IF(J147=29,'[1]Equivalencia BH-BMPT'!$D$30,IF(J147=30,'[1]Equivalencia BH-BMPT'!$D$31,IF(J147=31,'[1]Equivalencia BH-BMPT'!$D$32,IF(J147=32,'[1]Equivalencia BH-BMPT'!$D$33,IF(J147=33,'[1]Equivalencia BH-BMPT'!$D$34,IF(J147=34,'[1]Equivalencia BH-BMPT'!$D$35,IF(J147=35,'[1]Equivalencia BH-BMPT'!$D$36,IF(J147=36,'[1]Equivalencia BH-BMPT'!$D$37,IF(J147=37,'[1]Equivalencia BH-BMPT'!$D$38,IF(J147=38,'[1]Equivalencia BH-BMPT'!#REF!,IF(J147=39,'[1]Equivalencia BH-BMPT'!$D$40,IF(J147=40,'[1]Equivalencia BH-BMPT'!$D$41,IF(J147=41,'[1]Equivalencia BH-BMPT'!$D$42,IF(J147=42,'[1]Equivalencia BH-BMPT'!$D$43,IF(J147=43,'[1]Equivalencia BH-BMPT'!$D$44,IF(J147=44,'[1]Equivalencia BH-BMPT'!$D$45,IF(J147=45,'[1]Equivalencia BH-BMPT'!$D$46,\"No ha seleccionado un número de programa\")))))))))))))))))))))))))))))))))))))))))))))","v":"Mejor movilidad para todos"},1338,860071250,"BMC BOLSA MERCANTIL DE COLOMBIA S.A.",688379,null,null,null,0,688379,688379,"2017-10-25","2017-10-30","2017-12-31",62,0,null,null,null,"X",null,1]
[300572210,2017,null,11,{"$f":"IF(D148=1,'[1]Tipo '!$B$2,IF(D148=2,'[1]Tipo '!$B$3,IF(D148=3,'[1]Tipo '!$B$4,IF(D148=4,'[1]Tipo '!$B$5,IF(D148=5,'[1]Tipo '!$B$6,IF(D148=6,'[1]Tipo '!$B$7,IF(D148=7,'[1]Tipo '!$B$8,IF(D148=8,'[1]Tipo '!$B$9,IF(D148=9,'[1]Tipo '!$B$10,IF(D148=10,'[1]Tipo '!$B$11,IF(D148=11,'[1]Tipo '!$B$12,IF(D148=12,'[1]Tipo '!$B$13,IF(D148=13,'[1]Tipo '!$B$14,IF(D148=14,'[1]Tipo '!$B$15,IF(D148=15,'[1]Tipo '!$B$16,IF(D148=16,'[1]Tipo '!$B$17,IF(D148=17,'[1]Tipo '!$B$18,IF(D148=18,'[1]Tipo '!$B$19,IF(D148=19,'[1]Tipo '!$B$20,\"No ha seleccionado un tipo de contrato válido\")))))))))))))))))))","v":"SUMINISTRO"},"Selección abreviada ","Bolsas de productos","OBJETO: SUMINISTRO DE MATERIALES, ELEMENTOS Y CONSUMIBLES CON EL ÁNIMO DE REALIZAR ACCIONES DE EMBELLECIMIENTO DE ESPACIO PÚBLICO EN LA LOCALIDAD DE TEUSAQUILLO","INVERSIÓN",18,{"$f":"IF(J148=1,'[1]Equivalencia BH-BMPT'!$D$2,IF(J148=2,'[1]Equivalencia BH-BMPT'!$D$3,IF(J148=3,'[1]Equivalencia BH-BMPT'!$D$4,IF(J148=4,'[1]Equivalencia BH-BMPT'!$D$5,IF(J148=5,'[1]Equivalencia BH-BMPT'!$D$6,IF(J148=6,'[1]Equivalencia BH-BMPT'!$D$7,IF(J148=7,'[1]Equivalencia BH-BMPT'!$D$8,IF(J148=8,'[1]Equivalencia BH-BMPT'!$D$9,IF(J148=9,'[1]Equivalencia BH-BMPT'!$D$10,IF(J148=10,'[1]Equivalencia BH-BMPT'!$D$11,IF(J148=11,'[1]Equivalencia BH-BMPT'!$D$12,IF(J148=12,'[1]Equivalencia BH-BMPT'!$D$13,IF(J148=13,'[1]Equivalencia BH-BMPT'!$D$14,IF(J148=14,'[1]Equivalencia BH-BMPT'!$D$15,IF(J148=15,'[1]Equivalencia BH-BMPT'!$D$16,IF(J148=16,'[1]Equivalencia BH-BMPT'!$D$17,IF(J148=17,'[1]Equivalencia BH-BMPT'!$D$18,IF(J148=18,'[1]Equivalencia BH-BMPT'!$D$19,IF(J148=19,'[1]Equivalencia BH-BMPT'!$D$20,IF(J148=20,'[1]Equivalencia BH-BMPT'!$D$21,IF(J148=21,'[1]Equivalencia BH-BMPT'!$D$22,IF(J148=22,'[1]Equivalencia BH-BMPT'!$D$23,IF(J148=23,'[1]Equivalencia BH-BMPT'!#REF!,IF(J148=24,'[1]Equivalencia BH-BMPT'!$D$25,IF(J148=25,'[1]Equivalencia BH-BMPT'!$D$26,IF(J148=26,'[1]Equivalencia BH-BMPT'!$D$27,IF(J148=27,'[1]Equivalencia BH-BMPT'!$D$28,IF(J148=28,'[1]Equivalencia BH-BMPT'!$D$29,IF(J148=29,'[1]Equivalencia BH-BMPT'!$D$30,IF(J148=30,'[1]Equivalencia BH-BMPT'!$D$31,IF(J148=31,'[1]Equivalencia BH-BMPT'!$D$32,IF(J148=32,'[1]Equivalencia BH-BMPT'!$D$33,IF(J148=33,'[1]Equivalencia BH-BMPT'!$D$34,IF(J148=34,'[1]Equivalencia BH-BMPT'!$D$35,IF(J148=35,'[1]Equivalencia BH-BMPT'!$D$36,IF(J148=36,'[1]Equivalencia BH-BMPT'!$D$37,IF(J148=37,'[1]Equivalencia BH-BMPT'!$D$38,IF(J148=38,'[1]Equivalencia BH-BMPT'!#REF!,IF(J148=39,'[1]Equivalencia BH-BMPT'!$D$40,IF(J148=40,'[1]Equivalencia BH-BMPT'!$D$41,IF(J148=41,'[1]Equivalencia BH-BMPT'!$D$42,IF(J148=42,'[1]Equivalencia BH-BMPT'!$D$43,IF(J148=43,'[1]Equivalencia BH-BMPT'!$D$44,IF(J148=44,'[1]Equivalencia BH-BMPT'!$D$45,IF(J148=45,'[1]Equivalencia BH-BMPT'!$D$46,\"No ha seleccionado un número de programa\")))))))))))))))))))))))))))))))))))))))))))))","v":"Mejor movilidad para todos"},1338,830103828,"AGROBOLSA S A COMISIONISTA DE BOLSA",2270075,null,null,null,0,2270075,1135038,"2017-10-25","2017-10-30","2017-12-31",62,0,null,null,null,"X",null,0.50000022025703994]
["21 A",2017,"CPS21A 2017",5,{"$f":"IF(D149=1,'[1]Tipo '!$B$2,IF(D149=2,'[1]Tipo '!$B$3,IF(D149=3,'[1]Tipo '!$B$4,IF(D149=4,'[1]Tipo '!$B$5,IF(D149=5,'[1]Tipo '!$B$6,IF(D149=6,'[1]Tipo '!$B$7,IF(D149=7,'[1]Tipo '!$B$8,IF(D149=8,'[1]Tipo '!$B$9,IF(D149=9,'[1]Tipo '!$B$10,IF(D149=10,'[1]Tipo '!$B$11,IF(D149=11,'[1]Tipo '!$B$12,IF(D149=12,'[1]Tipo '!$B$13,IF(D149=13,'[1]Tipo '!$B$14,IF(D149=14,'[1]Tipo '!$B$15,IF(D149=15,'[1]Tipo '!$B$16,IF(D149=16,'[1]Tipo '!$B$17,IF(D149=17,'[1]Tipo '!$B$18,IF(D149=18,'[1]Tipo '!$B$19,IF(D149=19,'[1]Tipo '!$B$20,\"No ha seleccionado un tipo de contrato válido\")))))))))))))))))))","v":"CONTRATOS DE PRESTACIÓN DE SERVICIOS PROFESIONALES Y DE APOYO A LA GESTIÓN"},"CONTRATACIÓN DIRECTA","Prestación de servicios profesionales y de apoyo a la gestión, o para la ejecución de trabajos artísticos que sólo puedan encomendarse a determinadas personas naturales;","El contrato que se pretende celebrar, tendrá por objeto ¿Prestación de servicios de apoyo al Aérea de Gestión de Desarrollo Local de la Alcaldía Local de Teusaquillo realizando las actividades operativas relacionadas con la Administración de Red de Voz y Datos ¿.","INVERSIÓN",45,{"$f":"IF(J149=1,'[1]Equivalencia BH-BMPT'!$D$2,IF(J149=2,'[1]Equivalencia BH-BMPT'!$D$3,IF(J149=3,'[1]Equivalencia BH-BMPT'!$D$4,IF(J149=4,'[1]Equivalencia BH-BMPT'!$D$5,IF(J149=5,'[1]Equivalencia BH-BMPT'!$D$6,IF(J149=6,'[1]Equivalencia BH-BMPT'!$D$7,IF(J149=7,'[1]Equivalencia BH-BMPT'!$D$8,IF(J149=8,'[1]Equivalencia BH-BMPT'!$D$9,IF(J149=9,'[1]Equivalencia BH-BMPT'!$D$10,IF(J149=10,'[1]Equivalencia BH-BMPT'!$D$11,IF(J149=11,'[1]Equivalencia BH-BMPT'!$D$12,IF(J149=12,'[1]Equivalencia BH-BMPT'!$D$13,IF(J149=13,'[1]Equivalencia BH-BMPT'!$D$14,IF(J149=14,'[1]Equivalencia BH-BMPT'!$D$15,IF(J149=15,'[1]Equivalencia BH-BMPT'!$D$16,IF(J149=16,'[1]Equivalencia BH-BMPT'!$D$17,IF(J149=17,'[1]Equivalencia BH-BMPT'!$D$18,IF(J149=18,'[1]Equivalencia BH-BMPT'!$D$19,IF(J149=19,'[1]Equivalencia BH-BMPT'!$D$20,IF(J149=20,'[1]Equivalencia BH-BMPT'!$D$21,IF(J149=21,'[1]Equivalencia BH-BMPT'!$D$22,IF(J149=22,'[1]Equivalencia BH-BMPT'!$D$23,IF(J149=23,'[1]Equivalencia BH-BMPT'!#REF!,IF(J149=24,'[1]Equivalencia BH-BMPT'!$D$25,IF(J149=25,'[1]Equivalencia BH-BMPT'!$D$26,IF(J149=26,'[1]Equivalencia BH-BMPT'!$D$27,IF(J149=27,'[1]Equivalencia BH-BMPT'!$D$28,IF(J149=28,'[1]Equivalencia BH-BMPT'!$D$29,IF(J149=29,'[1]Equivalencia BH-BMPT'!$D$30,IF(J149=30,'[1]Equivalencia BH-BMPT'!$D$31,IF(J149=31,'[1]Equivalencia BH-BMPT'!$D$32,IF(J149=32,'[1]Equivalencia BH-BMPT'!$D$33,IF(J149=33,'[1]Equivalencia BH-BMPT'!$D$34,IF(J149=34,'[1]Equivalencia BH-BMPT'!$D$35,IF(J149=35,'[1]Equivalencia BH-BMPT'!$D$36,IF(J149=36,'[1]Equivalencia BH-BMPT'!$D$37,IF(J149=37,'[1]Equivalencia BH-BMPT'!$D$38,IF(J149=38,'[1]Equivalencia BH-BMPT'!#REF!,IF(J149=39,'[1]Equivalencia BH-BMPT'!$D$40,IF(J149=40,'[1]Equivalencia BH-BMPT'!$D$41,IF(J149=41,'[1]Equivalencia BH-BMPT'!$D$42,IF(J149=42,'[1]Equivalencia BH-BMPT'!$D$43,IF(J149=43,'[1]Equivalencia BH-BMPT'!$D$44,IF(J149=44,'[1]Equivalencia BH-BMPT'!$D$45,IF(J149=45,'[1]Equivalencia BH-BMPT'!$D$46,\"No ha seleccionado un número de programa\")))))))))))))))))))))))))))))))))))))))))))))","v":"Gobernanza e influencia local, regional e internacional"},1329,80041124,"JOHN ALEJANDRO HERMOSO FORERO",12000000,null,null,null,6000000,18000000,18000000,"2017-02-16","2017-02-17","2017-08-16",120,60,null,null,null,null,"X",1]
["N/A",null,null,19,"Otros","N/A",null,"PAGO EDILES","INVERSIÓN",45,{"$f":"IF(J150=1,'[1]Equivalencia BH-BMPT'!$D$2,IF(J150=2,'[1]Equivalencia BH-BMPT'!$D$3,IF(J150=3,'[1]Equivalencia BH-BMPT'!$D$4,IF(J150=4,'[1]Equivalencia BH-BMPT'!$D$5,IF(J150=5,'[1]Equivalencia BH-BMPT'!$D$6,IF(J150=6,'[1]Equivalencia BH-BMPT'!$D$7,IF(J150=7,'[1]Equivalencia BH-BMPT'!$D$8,IF(J150=8,'[1]Equivalencia BH-BMPT'!$D$9,IF(J150=9,'[1]Equivalencia BH-BMPT'!$D$10,IF(J150=10,'[1]Equivalencia BH-BMPT'!$D$11,IF(J150=11,'[1]Equivalencia BH-BMPT'!$D$12,IF(J150=12,'[1]Equivalencia BH-BMPT'!$D$13,IF(J150=13,'[1]Equivalencia BH-BMPT'!$D$14,IF(J150=14,'[1]Equivalencia BH-BMPT'!$D$15,IF(J150=15,'[1]Equivalencia BH-BMPT'!$D$16,IF(J150=16,'[1]Equivalencia BH-BMPT'!$D$17,IF(J150=17,'[1]Equivalencia BH-BMPT'!$D$18,IF(J150=18,'[1]Equivalencia BH-BMPT'!$D$19,IF(J150=19,'[1]Equivalencia BH-BMPT'!$D$20,IF(J150=20,'[1]Equivalencia BH-BMPT'!$D$21,IF(J150=21,'[1]Equivalencia BH-BMPT'!$D$22,IF(J150=22,'[1]Equivalencia BH-BMPT'!$D$23,IF(J150=23,'[1]Equivalencia BH-BMPT'!#REF!,IF(J150=24,'[1]Equivalencia BH-BMPT'!$D$25,IF(J150=25,'[1]Equivalencia BH-BMPT'!$D$26,IF(J150=26,'[1]Equivalencia BH-BMPT'!$D$27,IF(J150=27,'[1]Equivalencia BH-BMPT'!$D$28,IF(J150=28,'[1]Equivalencia BH-BMPT'!$D$29,IF(J150=29,'[1]Equivalencia BH-BMPT'!$D$30,IF(J150=30,'[1]Equivalencia BH-BMPT'!$D$31,IF(J150=31,'[1]Equivalencia BH-BMPT'!$D$32,IF(J150=32,'[1]Equivalencia BH-BMPT'!$D$33,IF(J150=33,'[1]Equivalencia BH-BMPT'!$D$34,IF(J150=34,'[1]Equivalencia BH-BMPT'!$D$35,IF(J150=35,'[1]Equivalencia BH-BMPT'!$D$36,IF(J150=36,'[1]Equivalencia BH-BMPT'!$D$37,IF(J150=37,'[1]Equivalencia BH-BMPT'!$D$38,IF(J150=38,'[1]Equivalencia BH-BMPT'!#REF!,IF(J150=39,'[1]Equivalencia BH-BMPT'!$D$40,IF(J150=40,'[1]Equivalencia BH-BMPT'!$D$41,IF(J150=41,'[1]Equivalencia BH-BMPT'!$D$42,IF(J150=42,'[1]Equivalencia BH-BMPT'!$D$43,IF(J150=43,'[1]Equivalencia BH-BMPT'!$D$44,IF(J150=44,'[1]Equivalencia BH-BMPT'!$D$45,IF(J150=45,'[1]Equivalencia BH-BMPT'!$D$46,\"No ha seleccionado un número de programa\")))))))))))))))))))))))))))))))))))))))))))))","v":"Gobernanza e influencia local, regional e internacional"},1329,"N/A","N/A",664194600,null,null,null,null,664194600,null,"2017-01-01","2017-01-01","2017-12-31",360,null,null,null,null,"X",null,1]
["N/A",null,null,19,"Otros","N/A",null,"PAGO SEGURIDAD SOCIAL EDILES","FUNCIONAMIENTO",null,{"$f":"IF(J151=1,'[1]Equivalencia BH-BMPT'!$D$2,IF(J151=2,'[1]Equivalencia BH-BMPT'!$D$3,IF(J151=3,'[1]Equivalencia BH-BMPT'!$D$4,IF(J151=4,'[1]Equivalencia BH-BMPT'!$D$5,IF(J151=5,'[1]Equivalencia BH-BMPT'!$D$6,IF(J151=6,'[1]Equivalencia BH-BMPT'!$D$7,IF(J151=7,'[1]Equivalencia BH-BMPT'!$D$8,IF(J151=8,'[1]Equivalencia BH-BMPT'!$D$9,IF(J151=9,'[1]Equivalencia BH-BMPT'!$D$10,IF(J151=10,'[1]Equivalencia BH-BMPT'!$D$11,IF(J151=11,'[1]Equivalencia BH-BMPT'!$D$12,IF(J151=12,'[1]Equivalencia BH-BMPT'!$D$13,IF(J151=13,'[1]Equivalencia BH-BMPT'!$D$14,IF(J151=14,'[1]Equivalencia BH-BMPT'!$D$15,IF(J151=15,'[1]Equivalencia BH-BMPT'!$D$16,IF(J151=16,'[1]Equivalencia BH-BMPT'!$D$17,IF(J151=17,'[1]Equivalencia BH-BMPT'!$D$18,IF(J151=18,'[1]Equivalencia BH-BMPT'!$D$19,IF(J151=19,'[1]Equivalencia BH-BMPT'!$D$20,IF(J151=20,'[1]Equivalencia BH-BMPT'!$D$21,IF(J151=21,'[1]Equivalencia BH-BMPT'!$D$22,IF(J151=22,'[1]Equivalencia BH-BMPT'!$D$23,IF(J151=23,'[1]Equivalencia BH-BMPT'!#REF!,IF(J151=24,'[1]Equivalencia BH-BMPT'!$D$25,IF(J151=25,'[1]Equivalencia BH-BMPT'!$D$26,IF(J151=26,'[1]Equivalencia BH-BMPT'!$D$27,IF(J151=27,'[1]Equivalencia BH-BMPT'!$D$28,IF(J151=28,'[1]Equivalencia BH-BMPT'!$D$29,IF(J151=29,'[1]Equivalencia BH-BMPT'!$D$30,IF(J151=30,'[1]Equivalencia BH-BMPT'!$D$31,IF(J151=31,'[1]Equivalencia BH-BMPT'!$D$32,IF(J151=32,'[1]Equivalencia BH-BMPT'!$D$33,IF(J151=33,'[1]Equivalencia BH-BMPT'!$D$34,IF(J151=34,'[1]Equivalencia BH-BMPT'!$D$35,IF(J151=35,'[1]Equivalencia BH-BMPT'!$D$36,IF(J151=36,'[1]Equivalencia BH-BMPT'!$D$37,IF(J151=37,'[1]Equivalencia BH-BMPT'!$D$38,IF(J151=38,'[1]Equivalencia BH-BMPT'!#REF!,IF(J151=39,'[1]Equivalencia BH-BMPT'!$D$40,IF(J151=40,'[1]Equivalencia BH-BMPT'!$D$41,IF(J151=41,'[1]Equivalencia BH-BMPT'!$D$42,IF(J151=42,'[1]Equivalencia BH-BMPT'!$D$43,IF(J151=43,'[1]Equivalencia BH-BMPT'!$D$44,IF(J151=44,'[1]Equivalencia BH-BMPT'!$D$45,IF(J151=45,'[1]Equivalencia BH-BMPT'!$D$46,\"No ha seleccionado un número de programa\")))))))))))))))))))))))))))))))))))))))))))))","v":"No ha seleccionado un número de programa"},null,"N/A","N/A",84793400,null,null,null,null,84793400,null,"2017-01-01","2017-01-01","2017-12-31",360,null,null,null,null,"X",null,1]
["N/A",null,null,19,"Otros","N/A",null,"PAGO ARL","INVERSIÓN",45,{"$f":"IF(J152=1,'[1]Equivalencia BH-BMPT'!$D$2,IF(J152=2,'[1]Equivalencia BH-BMPT'!$D$3,IF(J152=3,'[1]Equivalencia BH-BMPT'!$D$4,IF(J152=4,'[1]Equivalencia BH-BMPT'!$D$5,IF(J152=5,'[1]Equivalencia BH-BMPT'!$D$6,IF(J152=6,'[1]Equivalencia BH-BMPT'!$D$7,IF(J152=7,'[1]Equivalencia BH-BMPT'!$D$8,IF(J152=8,'[1]Equivalencia BH-BMPT'!$D$9,IF(J152=9,'[1]Equivalencia BH-BMPT'!$D$10,IF(J152=10,'[1]Equivalencia BH-BMPT'!$D$11,IF(J152=11,'[1]Equivalencia BH-BMPT'!$D$12,IF(J152=12,'[1]Equivalencia BH-BMPT'!$D$13,IF(J152=13,'[1]Equivalencia BH-BMPT'!$D$14,IF(J152=14,'[1]Equivalencia BH-BMPT'!$D$15,IF(J152=15,'[1]Equivalencia BH-BMPT'!$D$16,IF(J152=16,'[1]Equivalencia BH-BMPT'!$D$17,IF(J152=17,'[1]Equivalencia BH-BMPT'!$D$18,IF(J152=18,'[1]Equivalencia BH-BMPT'!$D$19,IF(J152=19,'[1]Equivalencia BH-BMPT'!$D$20,IF(J152=20,'[1]Equivalencia BH-BMPT'!$D$21,IF(J152=21,'[1]Equivalencia BH-BMPT'!$D$22,IF(J152=22,'[1]Equivalencia BH-BMPT'!$D$23,IF(J152=23,'[1]Equivalencia BH-BMPT'!#REF!,IF(J152=24,'[1]Equivalencia BH-BMPT'!$D$25,IF(J152=25,'[1]Equivalencia BH-BMPT'!$D$26,IF(J152=26,'[1]Equivalencia BH-BMPT'!$D$27,IF(J152=27,'[1]Equivalencia BH-BMPT'!$D$28,IF(J152=28,'[1]Equivalencia BH-BMPT'!$D$29,IF(J152=29,'[1]Equivalencia BH-BMPT'!$D$30,IF(J152=30,'[1]Equivalencia BH-BMPT'!$D$31,IF(J152=31,'[1]Equivalencia BH-BMPT'!$D$32,IF(J152=32,'[1]Equivalencia BH-BMPT'!$D$33,IF(J152=33,'[1]Equivalencia BH-BMPT'!$D$34,IF(J152=34,'[1]Equivalencia BH-BMPT'!$D$35,IF(J152=35,'[1]Equivalencia BH-BMPT'!$D$36,IF(J152=36,'[1]Equivalencia BH-BMPT'!$D$37,IF(J152=37,'[1]Equivalencia BH-BMPT'!$D$38,IF(J152=38,'[1]Equivalencia BH-BMPT'!#REF!,IF(J152=39,'[1]Equivalencia BH-BMPT'!$D$40,IF(J152=40,'[1]Equivalencia BH-BMPT'!$D$41,IF(J152=41,'[1]Equivalencia BH-BMPT'!$D$42,IF(J152=42,'[1]Equivalencia BH-BMPT'!$D$43,IF(J152=43,'[1]Equivalencia BH-BMPT'!$D$44,IF(J152=44,'[1]Equivalencia BH-BMPT'!$D$45,IF(J152=45,'[1]Equivalencia BH-BMPT'!$D$46,\"No ha seleccionado un número de programa\")))))))))))))))))))))))))))))))))))))))))))))","v":"Gobernanza e influencia local, regional e internacional"},1329,"N/A","N/A",1075200,null,null,null,null,1075200,null,"2017-01-01","2017-01-01","2017-12-31",360,null,null,null,null,"X",null,1]
["N/A",null,null,19,"Otros","N/A",null,"PAGO SERVICIOS PÚBLICOS","FUNCIONAMIENTO",null,{"$f":"IF(J153=1,'[1]Equivalencia BH-BMPT'!$D$2,IF(J153=2,'[1]Equivalencia BH-BMPT'!$D$3,IF(J153=3,'[1]Equivalencia BH-BMPT'!$D$4,IF(J153=4,'[1]Equivalencia BH-BMPT'!$D$5,IF(J153=5,'[1]Equivalencia BH-BMPT'!$D$6,IF(J153=6,'[1]Equivalencia BH-BMPT'!$D$7,IF(J153=7,'[1]Equivalencia BH-BMPT'!$D$8,IF(J153=8,'[1]Equivalencia BH-BMPT'!$D$9,IF(J153=9,'[1]Equivalencia BH-BMPT'!$D$10,IF(J153=10,'[1]Equivalencia BH-BMPT'!$D$11,IF(J153=11,'[1]Equivalencia BH-BMPT'!$D$12,IF(J153=12,'[1]Equivalencia BH-BMPT'!$D$13,IF(J153=13,'[1]Equivalencia BH-BMPT'!$D$14,IF(J153=14,'[1]Equivalencia BH-BMPT'!$D$15,IF(J153=15,'[1]Equivalencia BH-BMPT'!$D$16,IF(J153=16,'[1]Equivalencia BH-BMPT'!$D$17,IF(J153=17,'[1]Equivalencia BH-BMPT'!$D$18,IF(J153=18,'[1]Equivalencia BH-BMPT'!$D$19,IF(J153=19,'[1]Equivalencia BH-BMPT'!$D$20,IF(J153=20,'[1]Equivalencia BH-BMPT'!$D$21,IF(J153=21,'[1]Equivalencia BH-BMPT'!$D$22,IF(J153=22,'[1]Equivalencia BH-BMPT'!$D$23,IF(J153=23,'[1]Equivalencia BH-BMPT'!#REF!,IF(J153=24,'[1]Equivalencia BH-BMPT'!$D$25,IF(J153=25,'[1]Equivalencia BH-BMPT'!$D$26,IF(J153=26,'[1]Equivalencia BH-BMPT'!$D$27,IF(J153=27,'[1]Equivalencia BH-BMPT'!$D$28,IF(J153=28,'[1]Equivalencia BH-BMPT'!$D$29,IF(J153=29,'[1]Equivalencia BH-BMPT'!$D$30,IF(J153=30,'[1]Equivalencia BH-BMPT'!$D$31,IF(J153=31,'[1]Equivalencia BH-BMPT'!$D$32,IF(J153=32,'[1]Equivalencia BH-BMPT'!$D$33,IF(J153=33,'[1]Equivalencia BH-BMPT'!$D$34,IF(J153=34,'[1]Equivalencia BH-BMPT'!$D$35,IF(J153=35,'[1]Equivalencia BH-BMPT'!$D$36,IF(J153=36,'[1]Equivalencia BH-BMPT'!$D$37,IF(J153=37,'[1]Equivalencia BH-BMPT'!$D$38,IF(J153=38,'[1]Equivalencia BH-BMPT'!#REF!,IF(J153=39,'[1]Equivalencia BH-BMPT'!$D$40,IF(J153=40,'[1]Equivalencia BH-BMPT'!$D$41,IF(J153=41,'[1]Equivalencia BH-BMPT'!$D$42,IF(J153=42,'[1]Equivalencia BH-BMPT'!$D$43,IF(J153=43,'[1]Equivalencia BH-BMPT'!$D$44,IF(J153=44,'[1]Equivalencia BH-BMPT'!$D$45,IF(J153=45,'[1]Equivalencia BH-BMPT'!$D$46,\"No ha seleccionado un número de programa\")))))))))))))))))))))))))))))))))))))))))))))","v":"No ha seleccionado un número de programa"},null,"N/A","N/A",68151858,null,null,null,null,68151858,null,"2017-01-01","2017-01-01","2017-12-31",360,null,null,null,null,"X",null,1]
["N/A",null,null,19,"Otros","N/A",null,"CAJA MENOR","FUNCIONAMIENTO",null,{"$f":"IF(J154=1,'[1]Equivalencia BH-BMPT'!$D$2,IF(J154=2,'[1]Equivalencia BH-BMPT'!$D$3,IF(J154=3,'[1]Equivalencia BH-BMPT'!$D$4,IF(J154=4,'[1]Equivalencia BH-BMPT'!$D$5,IF(J154=5,'[1]Equivalencia BH-BMPT'!$D$6,IF(J154=6,'[1]Equivalencia BH-BMPT'!$D$7,IF(J154=7,'[1]Equivalencia BH-BMPT'!$D$8,IF(J154=8,'[1]Equivalencia BH-BMPT'!$D$9,IF(J154=9,'[1]Equivalencia BH-BMPT'!$D$10,IF(J154=10,'[1]Equivalencia BH-BMPT'!$D$11,IF(J154=11,'[1]Equivalencia BH-BMPT'!$D$12,IF(J154=12,'[1]Equivalencia BH-BMPT'!$D$13,IF(J154=13,'[1]Equivalencia BH-BMPT'!$D$14,IF(J154=14,'[1]Equivalencia BH-BMPT'!$D$15,IF(J154=15,'[1]Equivalencia BH-BMPT'!$D$16,IF(J154=16,'[1]Equivalencia BH-BMPT'!$D$17,IF(J154=17,'[1]Equivalencia BH-BMPT'!$D$18,IF(J154=18,'[1]Equivalencia BH-BMPT'!$D$19,IF(J154=19,'[1]Equivalencia BH-BMPT'!$D$20,IF(J154=20,'[1]Equivalencia BH-BMPT'!$D$21,IF(J154=21,'[1]Equivalencia BH-BMPT'!$D$22,IF(J154=22,'[1]Equivalencia BH-BMPT'!$D$23,IF(J154=23,'[1]Equivalencia BH-BMPT'!#REF!,IF(J154=24,'[1]Equivalencia BH-BMPT'!$D$25,IF(J154=25,'[1]Equivalencia BH-BMPT'!$D$26,IF(J154=26,'[1]Equivalencia BH-BMPT'!$D$27,IF(J154=27,'[1]Equivalencia BH-BMPT'!$D$28,IF(J154=28,'[1]Equivalencia BH-BMPT'!$D$29,IF(J154=29,'[1]Equivalencia BH-BMPT'!$D$30,IF(J154=30,'[1]Equivalencia BH-BMPT'!$D$31,IF(J154=31,'[1]Equivalencia BH-BMPT'!$D$32,IF(J154=32,'[1]Equivalencia BH-BMPT'!$D$33,IF(J154=33,'[1]Equivalencia BH-BMPT'!$D$34,IF(J154=34,'[1]Equivalencia BH-BMPT'!$D$35,IF(J154=35,'[1]Equivalencia BH-BMPT'!$D$36,IF(J154=36,'[1]Equivalencia BH-BMPT'!$D$37,IF(J154=37,'[1]Equivalencia BH-BMPT'!$D$38,IF(J154=38,'[1]Equivalencia BH-BMPT'!#REF!,IF(J154=39,'[1]Equivalencia BH-BMPT'!$D$40,IF(J154=40,'[1]Equivalencia BH-BMPT'!$D$41,IF(J154=41,'[1]Equivalencia BH-BMPT'!$D$42,IF(J154=42,'[1]Equivalencia BH-BMPT'!$D$43,IF(J154=43,'[1]Equivalencia BH-BMPT'!$D$44,IF(J154=44,'[1]Equivalencia BH-BMPT'!$D$45,IF(J154=45,'[1]Equivalencia BH-BMPT'!$D$46,\"No ha seleccionado un número de programa\")))))))))))))))))))))))))))))))))))))))))))))","v":"No ha seleccionado un número de programa"},null,"N/A","N/A",2541600,null,null,null,null,2541600,null,"2017-01-01","2017-01-01","2017-12-31",360,null,null,null,null,"X",null,1]
["N/A",null,null,null,null,null,null,null,null,null,null,null,null,null,{"$f":"SUM(O14:O149)","v":11741339975},null,null,null,{"$f":"SUM(S14:S149)","v":843961248}]
[]
[null,null,null,null,null,null,null,null,null,null,null,null,null,null,null,null,null,null,null,{"$f":"+SUM(T14:T154)","v":13406057881}]

{"sheet":"Instructivo","index":1,"n_rows":85,"n_cols":3,"rows_kept":85,"cut":false,"hidden":false,"merged":[[2,0,2,2],[27,0,47,0],[60,0,62,0],[60,1,62,1],[22,0,22,2],[23,0,24,0],[23,1,24,1],[30,1,31,1],[48,0,49,0],[48,1,49,1],[4,0,4,2],[52,0,54,0],[53,1,54,1],[56,0,57,0],[59,0,59,2],[11,0,11,2],[0,0,0,2],[74,0,74,2],[75,0,76,0],[75,1,76,1],[82,0,82,2],[68,0,71,0],[68,1,71,1],[63,0,64,0],[63,1,64,1],[1,0,1,2],[3,0,3,2],[9,0,9,2],[8,0,8,2],[7,0,7,2],[6,0,6,2],[5,0,5,2]]}
["INSTRUCTIVO PARA DILIGENCIAMIENTO DEL FORMATO DE RENDICIÓN DE CUENTAS A 31 DE DICIEMBRE DE 2017"]
["OBSERVACIONES INICIALES"]
["Recomendamos leer cuidadosamente y poner en práctica las instrucciones que se explican en este instructivo. De la calidad de la información que se registre, depende en gran medida la calidad del informe de rendición de cuentas de la Gestión Contractual que presenta el Alcalde Mayor, consolidado por la Veeduría Distrital."]
["La base en Excel a diligenciar es inmodificable, debe utilizar versión Excel 2010 o posteriores, la versión 2007 no habilita los macros.  La base no permite que se incluyan columnas con otro tipo de información que la Veeduría Distrital no está solicitando o que se cambie el formato de celda establecido. Tenga en cuenta que muchas celdas están bloqueadas y/o solo permiten el registro de una información determinada."]
["La información que se registre en la base, debe coincidir con los reportes realizados en PREDIS y en el SECOP"]
["Diligencie la totalidad de celdas requeridas."]
["Para insertar una o varias filas,  seleccione una fila que no sea la primera fila del formato (shift+espacio), posteriormente copiar (Control +c), inmediatamente seleccione el numero de filas a insertar, desde 1 hasta las que usted requiera, por ultimo aplique Control+. Si usted no sigue este procedimiento las filas que copie no "]
["En primer lugar diligencie toda la información correspondiente a los contratos suscritos con cargo a la vigencia 2017."]
["Una vez incluidos todos los contratos de la vigencia 2017, a continuación diligencie el formato completo con la información correspondiente a las adiciones efectuadas con cargo a la vigencia 2017 de contratos suscritos en vigencias anteriores. La información general del contrato como: modalidad de selección, tipología contractual, objeto, entre otros, debe corresponder a la información del contrato adicionado o modificado."]
["En caso de haber realizado apropiaciones presupuestales en la vigencia a través de resoluciones, caja menor, honorarios ediles, servicios públicos, debe relacionar dicha información en una sola fila al final de la base, indicando de que se trata la apropiación."]
[]
["ENCABEZADO DEL FORMATO"]
[1,"Entidad","Indique el nombre completo de la Entidad."]
[2,"Sector","Relacione el sector al cual pertenece la Entidad."]
[3,"Presupuesto Disponible Inversión Directa","Indique el valor total del presupuesto disponible de inversión directa, de acuerdo con el PREDIS, a 31 de diciembre de 2017."]
[4,"Presupuesto comprometido de inversión ","Escriba el valor total del presupuesto comprometido de inversión directa, de acuerdo con el PREDIS a 31 de diciembre de 2017."]
[5,"Presupuesto Disponible Funcionamiento","Indique el valor total del presupuesto de funcionamiento disponible, de acuerdo con el PREDIS a 31 de diciembre de 2017."]
[6,"Presupuesto comprometido funcionamiento ","Escriba el monto del presupuesto de funcionamiento, comprometido mediante contratos, de acuerdo con el PREDIS a 31 de diciembre de 2017."]
[7,"Presupuesto Disponible Operación","Coloque el monto del presupuesto de operación disponible, de acuerdo con el PREDIS, a 31 de diciembre de 2017. Los gastos de operación corresponden solamente a aquellas entidades de régimen de contratación  privado."]
[8,"Presupuesto comprometido operación mediante contratos:","Escriba el monto del presupuesto de operación comprometido mediante contratos a  31 de diciembre de 2017."]
[9,"Nombre de quien diligencia el formato:","Indique el nombre completo, cargo, número de teléfono con extensión y correo electrónico del funcionario que diligencia el formato y que posteriormente realizará los ajustes y aclaraciones a que haya lugar por solicitud de la Veeduría Distrital."]
[]
["1- INFORMACIÓN GENERAL"]
[1,"Número de Contrato","En estricto orden consecutivo (1, 2, 3 y así sucesivamente, hasta llegar al último contrato suscrito durante la vigencia) registre el número del contrato, el orden consecutivo hace necesario registrar también, los contratos que fueron anulados, se debe indicar tal situación en la columna 19 (Estado)."]
[null,null,"Una vez terminado el registro de los contratos con cargo a la vigencia 2017, en las siguientes filas registre la información correspondiente a las adiciones efectuadas con cargo a la vigencia 2017 de contratos suscritos en vigencias anteriores, especificando el año de suscripción en la columna dos."]
[2,"Año","Registre el año de celebración del contrato."]
[3,"Número de proceso en el SECOP","Relacione el número de proceso con el cual se encuentra publicado el contrato en el SECOP. Ejemplo 005-FDLU-2017."]
[4,"Tipo de Contrato:","En esta columna solamente escriba el NUMERO de uno de los 19 tipos de contratos relacionados a continuación, al digitar el numero de tipo de contrato, en la columna equivalencia tipo de contrato, aparecerá automáticamente el tipo. Ejemplo si usted digita el numero 2, automáticamente en la siguiente columna aparecerá el tipo Consultoría:"]
[null,"1. Obra :","Son contratos de obra los que celebren las entidades estatales para la construcción, mantenimiento, instalación y, en general, para la realización de cualquier otro trabajo material sobre bienes inmuebles, cualquiera que sea la modalidad de ejecución y pago. Numeral 1 del Artículo 32 de la Ley 80 de 1993. "]
[null,"2. Consultoría:","Aquellos que celebran las entidades estatales, referidos a los estudios necesarios para la ejecución de proyectos de inversión, de diagnósticos, prefactibilidad o factibilidad para programas o proyectos específicos, así como a las asesorías técnicas de coordinación, control y supervisión. Numeral 2 del Artículo 32 de la Ley 80 de 1993. "]
[null,"3. Interventoría:","Son también  contratos de consultoría los que tienen por objeto la Interventoría, asesoría, gerencia de obras o de proyectos, dirección, programación y la ejecución de diseños, planos, anteproyectos y proyectos. Numeral 2 del Artículo 32 de la Ley 80 de 1993."]
[null,null,"El contrato de Interventoría tiene por objeto la  supervisión, seguimiento y vigilancia a la ejecución material de un contrato principal."]
[null,"4. Contrato de Prestación de servicios:","Son contratos de prestación de servicios los que celebren las entidades estatales para desarrollar actividades relacionadas con la administración o funcionamiento de la entidad. Numeral 3 del Artículo 32 de la Ley 80 de 1993."]
[null,"5. Contrato de Prestación de servicios profesionales y de apoyo a la gestión:","Corresponden a aquellos de naturaleza intelectual diferentes a los de consultoría que se derivan del cumplimiento de las funciones de la entidad estatal; así como los relacionados con actividades operativas, logísticas, o asistenciales. Art. 2.2.1.2.1.4.9, Decreto 1082 de 2015"]
[null,"6. Compraventa de bienes muebles:","Son aquellos contratos donde se transfiere el dominio de un bien mueble (aquellos susceptibles de ser trasladadas de un lugar a otro sin alterar ni su forma ni su esencia, tal es el caso del mobiliario y equipo de oficina, maquinaria, automóviles, etc.), cuya ejecución se agota de manera instantánea. Artículo 660, Código Civil."]
[null,"7. Compraventa de bienes inmuebles:","Son aquellos contratos donde se transfiere el dominio de un bien inmueble (todos aquellos bienes considerados bienes raíces, por tener de común la circunstancia de estar íntimamente ligados al suelo, unidos de modo inseparable, física o jurídicamente, al terreno). Artículo 656, Código Civil."]
[null,"8. Arrendamiento de bienes muebles","Es un contrato que tiene por objeto, conceder el uso y goce de un bien mueble a cambio de un precio determinado.  Artículo 1974 Código Civil."]
[null,"9. Arrendamiento de bienes inmuebles:","Es un contrato que tiene por objeto, conceder el uso y goce de un bien inmueble a cambio de un precio determinado.  Artículo 2.2.1.2.1.4.11 Decreto 1082 de 2015"]
[null,"10. Seguros:","El seguro es un contrato, en virtud del cual una persona jurídica llamada asegurador, asume, a cambio de una prima, un riesgo que le es trasladado por una persona natural o jurídica llamado tomador y en el cual éste tiene un interés asegurable, con el fin de indemnizarlo, en el evento de que ocurra la realización del riesgo amparado. de conformidad con el Título V, del Libro Cuarto del Código de Comercio "]
[null,"11. Suministro:","El suministro es el contrato por el cual una parte se obliga, a cambio de una contraprestación, a cumplir en favor de otra, en forma independiente, prestaciones periódicas o continuadas de cosas o servicios. Artículo 968, Código de Comercio"]
[null,"12. Empréstitos:","Son contratos de empréstito los que tienen por objeto proveer a la entidad estatal contratante de recursos en moneda nacional o extranjera con plazo para su pago. Artículo 7,  Decreto 2681 de 1996. "]
[null,"13. Fiducia mercantil o encargo fiduciario:","Son contratos que tienen por objeto la administración o el manejo de los recursos vinculados a los contratos que tales entidades celebren. Numeral 5 de Articulo 32 de la Ley 80 de 1993."]
[null,"14. Concesión:","Este contrato tiene por objeto otorgar a una persona llamada CONCESIONARIO  la prestación, operación, explotación, organización o gestión, total o parcial, de un servicio público, o la construcción, explotación o conservación total o parcial, de una obra o bien destinados al servicio o uso público, así como todas aquellas actividades necesarias para la adecuada prestación o funcionamiento de la obra o servicio por cuenta y riesgo del CONCESIONARIO, y bajo la vigilancia y control de la entidad concedente, a cambio de una remuneración que puede consistir en derechos, tarifas, tasas, valorización, o en la participación que se le otorgue en la explotación del bien, obra o servicio, o en una suma periódica, única o porcentual, y en general, en cualquier otra modalidad de contraprestación que las partes acuerden. Numeral 4 del Artículo 32 de la Ley 80 de 1993 "]
[null,"15. Convenios de cooperación:","Son aquellos mediante los cuales se formaliza la asistencia, ayuda, auxilio, soporte o colaboración entre entidades de una misma nación, de distintos países o por parte de organizaciones internacionales de naturaleza pública o privada a favor de entidades públicas. Artículo 20 de la ley 1150"]
[null,"16. Convenios/Contratos interadministrativos:","El convenio interadministrativo es el negocio jurídico en el cual están presentes dos entidades públicas en desarrollo de relaciones interadministrativas cuyo objeto es coordinar, cooperar, colaborar o distribuir competencias en la realización de funciones administrativas de interés común a los sujetos negóciales. Artículo 95 de la ley 489 de 1998."]
[null,"17. Convenios de Apoyo y/o Convenios de Asociación:","Los contratos que en desarrollo de lo dispuesto en el segundo inciso del artículo 355 de la Constitución Política celebren la Nación, los Departamentos, Distritos y Municipios con entidades privadas sin ánimo de lucro y de reconocida idoneidad, con el propósito de impulsar programas y actividades de interés público.  Reglamentado mediante Decreto 92 de 2017"]
[null,"18. Asociaciones Público Privadas:","Los contratos con personas naturales o jurídicas que se celebran en desarrollo de lo dispuesto en el Decreto 1508 de 2012."]
[null,"19. Otros:","Los demás tipos de contratos que no se encuentren definidos en las anteriores tipologías."]
[5,"Modalidad de Selección","Al ubicarse en la celda, se despliega una lista de modalidades de selección, de las cuales debe seleccionar la indicada. El formato no permite incluir modalidades diferentes a las señaladas en la lista desplegable.  "]
[null,null,"Para las adiciones a contratos de años anteriores se debe diligenciar la modalidad de selección del contrato adicionado o modificado"]
[6,"Procedimiento o causal","Esta columna solo se diligencia para las modalidades de selección abreviada y contratación directa. Al ubicarse en la celda, se despliega una lista de procedimientos o causales, de las cuales debe seleccionar la indicada. El formato no permite incluir procedimientos o causales diferentes a las señaladas en la lista desplegable.  "]
[7,"Objeto","Registre el objeto del contrato."]
[8,"Afectación ","Registre la afectación según la clasificación de cuentas del presupuesto de gastos. Funcionamiento, Inversión y Operación, esta última aplica únicamente para entidades de régimen privado. La celda solamente permite registrar estas tres opciones."]
[null,"Número Programa:","Si en la columna anterior “Afectación”,  indicó funcionamiento u operación deje en blanco el número de programa, es decir esta columna solamente aplica para Inversión."]
[null,null,"Identifíquelo de acuerdo con el código presupuestal del plan de desarrollo Bogotá Mejor Para Todos. Si un mismo contrato afecta más de un código presupuestal discrimine el contrato por cada código que afecte en filas separadas. Si se registra el número del programa (de 1 a 45), automáticamente en la columna siguiente aparece el nombre del mismo."]
[9,"Número Proyecto:","Indique el código presupuestal con el que se identifica el proyecto. Si un mismo contrato afecta más de un proyecto, discriminar el contrato por cada proyecto que afecte en filas separadas."]
[10,"Número de Identificación del contratista:","Indicar el número de identificación del contratista persona natural o jurídica con quien se suscribió el contrato, sin digito de verificación (DV), el formato de celda no permite guiones, puntos o comas, solo números. "]
[null,"Nombre del Contratista","Indicar el nombre del contratista, persona natural o jurídica."]
[]
["2- INFORMACIÓN FINANCIERA"]
[11,"Valor Inicial ","Registre el valor inicial del contrato con cargo a la vigencia 2017, el formato de celda no permite guiones, puntos, comas o texto escrito. Esta columna solo debe contener información numérica."]
[null,null,"En el caso de adiciones a contratos de años anteriores,  no diligencie esta columna, solamente la columna 15 \"Adiciones\" "]
[null,null,"Excluya las reservas de apropiación y cuentas por pagar."]
[12,"Número de reducciones ","Diligencie esta columna solo en el caso de reducciones, reintegros, liberaciones, saldos a favor o cualquier factor que disminuya el valor de los contratos con cargo a la vigencia."]
[null,null,"Registre en esta celda la cantidad de reducciones que se realizaron al contrato."]
[13,"Valor total reducciones (En valor negativo)","Registre el valor total de las reducciones que se realizaron al contrato, el formato de celda no permite guiones, puntos, comas o texto escrito. Esta columna solo debe contener información numérica."]
[14,"Número de adiciones ","Diligencie esta columna solo en el caso de adiciones al valor inicial que aumenten el valor del contrato con cargo a la vigencia."]
[15,"Valor total de adiciones","Registre el valor total de las adiciones que se realizaron al contrato,  el formato de celda no permite guiones, puntos, comas o texto escrito. Esta columna solo debe contener información numérica."]
[16,"Valor Final","Esta columna se encuentra formulada y bloqueada, sí el valor final no coincide, es porque están mal diligenciadas las columnas valor inicial, valor de reducciones y/o valor de adiciones. En tal caso se debe verificar dicha información."]
[null,null,"La sumatoria de la columna 16 (valor final) para los contratos de Inversión Directa, según el programa del Plan de Desarrollo, deberá coincidir con el rubro registrado en el encabezado 4, Presupuesto comprometido de inversión según PREDIS, este valor debe coincidir a la vez con los informes de ejecución presupuestal del PREDIS.  "]
[null,null,"Si los valores no coinciden debe especificarse al final del formato en qué está representada la diferencia (discriminando los conceptos por Programa y Proyecto de inversión), con sus respectivos valores. Recuerde que la justificación debe hacerse solo para los contratos de inversión."]
[null,null,"Las bases donde dichos valores no coincidan serán devueltas por la Veeduría Distrital a cada entidad para los respectivos ajustes."]
[17,"Giros","En esta columna se debe registrar el valor de los giros a la fecha de corte del presente informe, 31 de diciembre de 2017, el formato de celda no permite guiones, puntos, comas o texto escrito. Esta columna solo debe contener información numérica."]
[]
["3- PLAZOS"]
[18,"Fecha de Suscripción","Relacionar la fecha en que se suscribió el contrato original. La celda solo admite el formato Día/Mes/Año así  25/02/2017."]
[null,null,"Para las adiciones a contratos de años anteriores se debe registrar en esta columna la fecha de suscripción de la adición en la vigencia 2017."]
[19,"Fecha de inicio","Indicar la fecha de inicio del contrato. Para las adiciones a contratos de años anteriores se debe diligenciar la fecha de inicio de la adición en la vigencia 2017. La celda solo admite el formato Día/Mes/Año así  25/02/2017."]
[20,"Fecha de terminación","Indicar la fecha efectiva de terminación del contrato. La celda solo admite el formato Día/Mes/Año así  25/02/2017."]
[21,"Plazo en días","Esta columna contiene el plazo inicial del contrato con el número total de días a ejecutar (sólo número de días, no mes, no texto)."]
[22,"Prórroga en días","En caso de presentarse este evento, indicar en días, el tiempo por el cual se prorrogó el contrato a partir de la fecha inicial de terminación (sólo número de días, no mes, no texto)."]
[]
["4- ESTADO A 31 DE DICIEMBRE DE 2017"]
[23,"Estado","Marque con una X en la respectiva columna si el contrato se encuentra Anulado, Por Iniciar, En Ejecución, Terminado o Liquidado."]
[24,"% Avance y/o cumplimiento","Indica el porcentaje de avance o de cumplimiento del mismo en términos presupuestales, es decir lo efectivamente pagado al contratista. Si no se ha iniciado la ejecución, él % de avance es 0%. La celda se encuentra formulada y protegida. Es la relación entre el valor de los giros y el valor final del contrato. Si el porcentaje de avance no coincide, se debe revisar los valores que se registraron en estas columnas. "]

{"sheet":"Equivalencia BH-BMPT","index":2,"n_rows":46,"n_cols":4,"rows_kept":46,"cut":false,"hidden":false,"merged":[]}
[null,null,"Cod_BMT","Programa - Bogotá Mejor para Todos"]
[null,null,1,"Prevención y atención de la maternidad y la paternidad tempranas"]
[null,null,2,"Desarrollo integral desde la gestación hasta la adolescencia"]
[null,null,3,"Igualdad y autonomía para una Bogotá incluyente"]
[null,null,4,"Familias protegidas y adaptadas al cambio climático"]
[null,null,5,"Desarrollo integral para la felicidad y el ejercicio de la ciudadanía"]
[null,null,6,"Calidad educativa para todos"]
[null,null,7,"Inclusión educativa para la equidad"]
[null,null,8,"Acceso con calidad a la educación superior"]
[null,null,9,"Atención integral y eficiente en salud"]
[null,null,10,"Modernización de la infraestructura física y tecnológica en salud"]
[null,null,11,"Mejores oportunidades para el desarrollo a través de la cultura, la recreación y el deporte"]
[null,null,12,"Mujeres protagonistas, activas y empoderadas en el cierre de brechas de género"]
[null,null,13,"Infraestructura para el desarrollo del hábitat"]
[null,null,14,"Intervenciones integrales del hábitat"]
[null,null,15,"Recuperación, incorporación, vida urbana y control de la ilegalidad"]
[null,null,16,"Integración social para una ciudad de oportunidades"]
[null,null,17,"Espacio público, derecho de todos"]
[null,null,18,"Mejor movilidad para todos"]
[null,null,19,"Seguridad y convivencia para todos"]
[null,null,20,"Fortalecimiento del Sistema de Protección Integral a Mujeres Víctimas de Violencia - SOFIA"]
[null,null,21,"Justicia para todos: consolidación del Sistema Distrital de Justicia"]
[null,null,22,"Bogotá vive los derechos humanos"]
[null,null,23,"Bogotá mejor para las víctimas, la paz y la reconciliación"]
[null,null,24,"Equipo por la educación para el reencuentro, la reconciliación y la paz"]
[null,null,25,"Cambio cultural y construcción del tejido social para la vida"]
[null,null,26,"Información relevante e integral para la planeación territorial"]
[null,null,27,"Proyectos urbanos integrales con visión de ciudad"]
[null,null,28,"Suelo para reducir el déficit habitacional de suelo urbanizable, vivienda y soportes urbanos"]
[null,null,29,"Articulación regional y planeación integral del transporte"]
[null,null,30,"Financiación para el Desarrollo Territorial"]
[null,null,31,"Fundamentar el desarrollo económico en la generación y uso del conocimiento para mejorar la competitividad de la Ciudad Región"]
[null,null,32,"Generar alternativas de ingreso y empleo de mejor calidad"]
[null,null,33,"Elevar la eficiencia de los mercados de la ciudad"]
[null,null,34,"Mejorar y fortalecer el recaudo tributario de la ciudad e impulsar el uso de mecanismos de vinculación de capital privado"]
[null,null,35,"Bogotá, ciudad inteligente"]
[null,null,36,"Bogotá, una ciudad digital"]
[null,null,37,"Consolidar el turismo como factor de desarrollo, confianza y felicidad para Bogotá Región"]
[null,null,38,"Recuperación y manejo de la Estructura Ecológica Principal"]
[null,null,39,"Ambiente sano para la equidad y disfrute del ciudadano"]
[null,null,40,"Gestión de la huella ambiental urbana"]
[null,null,41,"Desarrollo rural sostenible"]
[null,null,42,"Transparencia, gestión pública y servicio a la ciudadanía"]
[null,null,43,"Modernización institucional"]
[null,null,44,"Gobierno y ciudadanía digital"]
[null,null,45,"Gobernanza e influencia local, regional e internacional"]

{"sheet":"Tipo ","index":3,"n_rows":30,"n_cols":4,"rows_kept":30,"cut":false,"hidden":false,"merged":[[0,2,1,2]]}
[null,null,"Modalidad de Selección","afectacion"]
[1,"OBRA PÚBLICA",null,"Funcionamiento"]
[2,"CONSULTORÍA","Contratación directa","Inversión"]
[3,"INTERVENTORÍA","Contratación mínima cuantia ","Operación"]
[4,"CONTRATOS DE PRESTACIÓN DE SERVICIOS","Selección abreviada "]
[5,"CONTRATOS DE PRESTACIÓN DE SERVICIOS PROFESIONALES Y DE APOYO A LA GESTIÓN","Licitación pública"]
[6,"COMPRAVENTA DE BIENES MUEBLES","Régimen privado "]
[7,"COMPRAVENTA DE BIENES INMUEBLES","Regimen especial"]
[8,"ARRENDAMIENTO DE BIENES MUEBLES"]
[9,"ARRENDAMIENTO DE BIENES INMUEBLES"]
[10,"SEGUROS","selección abreviada"]
[11,"SUMINISTRO","Subasta inversa "]
[12,"EMPRESTITOS","Bolsas de productos"]
[13,"FIDUCIA MERCANTIL O ENCARGO FIDUCIARIO","Acuerdo marco de precios "]
[14,"CONCESIÓN ","Selección abreviada por menor cuantía "]
[15,"CONVENIOS DE COOPERACION"]
[16,"CONTRATOS INTERADMINISTRATIVOS","contratacion directa"]
[17,"CONVENIOS DE APOYO Y/O CONVENIOS DE ASOCIACIÓN ","Urgencia manifiesta"]
[18,"ASOCIACIONES PÚBLICO PRIVADAS","Contratación de empréstitos"]
[19,"OTROS","Contratos interadministrativos"]
[null,null,"Contratación de bienes y servicios en el sector Defensa y en el Departamento Administrativo de Seguridad, DAS"]
[null,null,"Contratos para el desarrollo de actividades científicas y tecnológicas"]
[null,null,"Contratos de encargo fiduciario que celebren las entidades territoriales cuando inician el Acuerdo de Reestructuración de Pasivos"]
[null,null,"Cuando no exista pluralidad de oferentes en el mercado"]
[null,null,"Prestación de servicios profesionales y de apoyo a la gestión, o para la ejecución de trabajos artísticos que sólo puedan encomendarse a determinadas personas naturales;"]
[null,null,"El arrendamiento o adquisición de inmuebles"]
[null,null,"Contratación de bienes y servicios de la Dirección Nacional de Inteligencia (DNI)"]
[null,null,"Decreto 777 de 1992"]
[null,null,"Decreto 92 de 2017"]
[null,null,"No aplica"]