{"text_format":"1","workbook":"xlsx","n_sheets":8,"sheets":["Gráfico1","1. INFORMACION ACUMULADA","2. PAA","3. CONSOLIDADO","4. INSTRUCTIVO","Proposito_programa","Tipo","Eje_Pilar_Prop1"],"not_rendered":{"charts":2,"images":1,"macros":1,"external_links":1,"defined_names":15,"comments":1,"pivot_tables":0},"unopened":[{"sheet":"Gráfico1","index":0,"reason":"not_a_worksheet"}],"bounds":{"document_bytes":16777216,"sheet_cells":100000,"rows_first":2000,"rows_last":500,"rows_between":2000,"halvings":0,"cell_chars":16384,"cell_head_chars":4096},"cells_cut":0,"cells_raw":0,"read":"whole","date_system":"1900"}

{"sheet":"1. INFORMACION ACUMULADA","index":1,"n_rows":506,"n_cols":44,"rows_kept":506,"cut":false,"hidden":false,"merged":[[1,0,1,39],[2,0,2,39],[4,0,4,3],[4,8,4,10],[4,14,4,15],[4,24,4,39],[5,0,5,3],[5,8,5,10],[5,35,5,36],[6,0,6,3],[6,8,6,10],[6,35,6,36],[7,35,7,36],[8,0,8,3],[8,6,8,7],[8,10,9,15],[8,35,8,36],[9,0,9,3],[9,5,9,7],[9,35,9,36],[10,39,10,42],[11,2,11,3],[11,8,11,12],[11,15,11,22],[11,39,11,42],[10,0,10,22],[10,23,10,28],[10,29,10,34],[10,35,10,38]]}
[]
["VEEDURIA DISTRITAL - INFORMACIÓN GESTION CONTRACTUAL"]
["DEL 1 DE ENERO AL 31 DE DICIEMBRE DE 2021"]
[]
["1. Entidad",null,null,null,null,null,null,"2. Sector"]
["3. Presupuesto Disponible Inversión Directa PREDIS (BOGDATA)",null,null,null,null,null,null,"5. Presupuesto Disponible Funcionamiento PREDIS (BOGDATA)",null,null,null,null,null,null,null,null,null,null,null,null,null,null,null,null,null,null,null,null,null,null,null,null,null,null,null,"9. Nombre de quien diligencia el formato",null,"GERMAN HUMBERTO MEDEELIN MORA"]
["4. Presupuesto Comprometido de Inversión Directa según PREDIS (BOGDATA)",null,null,null,31374359229,null,null,"6. Presupuesto Comprometido Funcionamiento según PREDIS (BOGDATA)",1041550575,null,null,null,null,null,null,null,null,null,null,null,null,null,null,null,null,null,null,null,null,null,null,null,null,null,null,"Cargo",null,"ALCALDE LOCAL (E)"]
[null,null,null,null,null,null,null,null,null,null,null,null,null,null,null,null,null,null,null,null,null,null,null,null,null,null,null,null,null,null,null,null,null,null,null,"Dependencia",null,"FONDO DE DE DESARROLLO RURAL DE SUMAPAZ"]
["7. Presupuesto Disponible Operación (Régimen Privado)",null,null,null,null,null,null,null,null,null,null,null,null,null,null,null,null,null,null,null,null,null,null,null,null,null,null,null,null,null,null,null,null,null,null,"Teléfono",null,3387000]
["8. Presupuesto Comprometido Operación mediante contratos",null,null,null,513643181,null,null,null,null,null,null,null,null,null,null,null,null,null,null,null,null,null,null,null,null,null,null,null,null,null,null,null,null,null,null,"Correo Electrónico",null,"german.medellin@gobiernobogota.gov.co"]
["1- INFORMACION GENERAL",null,null,null,null,null,null,null,null,null,null,null,null,null,null,null,null,null,null,null,null,null,null,"2- INFORMACION FINANCIERA",null,null,null,null,null,"3 - PLAZOS ",null,null,null,null,null,"4. CESION",null,null,null,"5. ESTADO",null,null,null,"6. %  Avance y/o cumplimiento"]
[1,2,3,null,4,5,6,7,8,null,null,null,null,9,10,11,null,null,null,null,null,null,null,12,13,14,15,16,17,18,19,20,21,22,23,24,25,26,27,28,null,null,null,29]
["Número Contrato","Año","Número de proceso contractual \nSECOP","Link proceso SECOP","Tipo de contrato ","Modalidad de Selección","Procedimiento o causal","Objeto","Afectación","Plan de Desarrollo Distrital","Número Programa","Equivalencia número de programa","Propósito","Número Proyecto","Número de proponentes","Número  de Identificación del contratista\n(Cédula o NIT sin puntos, comas ni caracteres especiales y sin digito de verificación)","Nombre del contratista\n  (según el caso: nombres y apellidos o Razón social y Tipo societario)","CONTRATACIÓN 2021","LUCIA BASTIDAS","Naturaleza Jurídica","Número  de Identificación del integrante del Consorcio o U.T.\n(Cédula o NIT sin puntos, comas ni caracteres especiales y sin digito de verificación)","Nombre del Integrante del Consorcio o U.T. y Tipo societario\n (Según el caso: nombres y apellidos o razón social y tipo societario)","% Participación (indicar solo el numero del porcentaje, sin caracteres especiales)","Valor Inicial del contrato","Valor total reducciones \n(En valor negativo)","Número de adiciones","Valor total de adiciones ","Valor Final ","Giros (Valor en pesos)","Fecha de suscripción (DD/MM/AAAA)","Fecha de inicio (DD/MM/AAAA)","Fecha de terminación (DD/MM/AAAA)","Plazo en días","Número de prórrogas","Prorroga en días","Número  de Identificación del cesionario\n(NIT sin digito de verificación)","Nombre cesionario","Fecha cesión\n(DD/MM/AAAA)","Valor cesión","Celebrado o por iniciar","En Ejecución","Terminado","Liquidado","% Avance y/o Cumplimiento"]
["CPS-001-2021",2021,"FDLS-CD-001-2021","https://community.secop.gov.co/Public/Tendering/OpportunityDetail/Index?noticeUID=CO1.NTC.1731548&isFromPublicArea=True&isModal=False","Contratos de prestación de servicios profesionales y de apoyo a la gestión","Contratación directa","Prestación de servicios profesionales y de apoyo a la gestión, o para la ejecución de trabajos artísticos que sólo puedan encomendarse a determinadas personas naturales;","PRESTAR LOS SERVICIOS PROFESIONALES PARA EL DESPACHO DE LA ALCALDÍA LOCAL DE SUMAPAZ EN LAS DIFERENTES ETAPAS DE LOS PROCESOS JURÍDICO- ADMINISTRATIVOS Y OPERATIVOS A FIN DAR CUMPLIMIENTO AL PLAN DE DESARROLLO LOCAL","Inversión","Un Nuevo Contrato Social y Ambiental para la Bogotá del Siglo XXI",57,{"$f":"IF(ISERROR(VLOOKUP(K14,Proposito_programa!$C$2:$E$59,2,FALSE)),\" \",VLOOKUP(K14,Proposito_programa!$C$2:$E$59,2,FALSE))","v":"Gestión pública local"},{"$f":"IF(ISERROR(VLOOKUP(K14,Proposito_programa!$C$2:$E$59,3,FALSE)),\" \",VLOOKUP(K14,Proposito_programa!$C$2:$E$59,3,FALSE))","v":"Propósito 5: Construir Bogotá - Región con gobierno abierto, transparente y ciudadanía consciente"},1696,null,1030610164,"BRAHAN EDUARDO GARCIA LOPEZ","BRAHAN EDUARDO GARCIA LOPEZ","BRAHAN EDUARDO GARCIA LOPEZ","Persona Natural",null,null,null,68000000,null,1,6800000,{"$f":"+X14+Y14+AA14","v":74800000},73213333,"2021-02-03","2021-02-08","2022-01-07",333,1,30,null,null,null,null,null,"X",null,null,{"$f":"IF(ISERROR(AC14/AB14),\"-\",(AC14/AB14))","v":0.97878787433155079}]
["CPS-002-2021",2021,"FDLS-CD-002-2021","https://community.secop.gov.co/Public/Tendering/OpportunityDetail/Index?noticeUID=CO1.NTC.1731569&isFromPublicArea=True&isModal=False","Contratos de prestación de servicios profesionales y de apoyo a la gestión","Contratación directa","Prestación de servicios profesionales y de apoyo a la gestión, o para la ejecución de trabajos artísticos que sólo puedan encomendarse a determinadas personas naturales;","PRESTAR LOS SERVICIOS PROFESIONALES ESPECIALIZADOS PARA EL DESPACHO DE LA ALCALDÍA LOCAL DE SUMAPAZ, EN LOS PROCESOS JURÍDICOS, ADMINISTRATIVOS Y OPERATIVOS PARA DAR CUMPLIMIENTO AL PLAN DE DESARROLLO LOCAL","Inversión","Un Nuevo Contrato Social y Ambiental para la Bogotá del Siglo XXI",57,{"$f":"IF(ISERROR(VLOOKUP(K15,Proposito_programa!$C$2:$E$59,2,FALSE)),\" \",VLOOKUP(K15,Proposito_programa!$C$2:$E$59,2,FALSE))","v":"Gestión pública local"},{"$f":"IF(ISERROR(VLOOKUP(K15,Proposito_programa!$C$2:$E$59,3,FALSE)),\" \",VLOOKUP(K15,Proposito_programa!$C$2:$E$59,3,FALSE))","v":"Propósito 5: Construir Bogotá - Región con gobierno abierto, transparente y ciudadanía consciente"},1696,null,52967366,"DIANA CAROLINA RODRIGUEZ PEÑA","DIANA CAROLINA RODRIGUEZ PEÑA","DIANA CAROLINA RODRIGUEZ PEÑA","Persona Natural",null,null,null,75000000,null,1,7500000,{"$f":"+X15+Y15+AA15","v":82500000},73250000,"2021-02-03","2021-02-08","2022-01-07",333,1,30,null,null,null,null,null,"X",null,null,{"$f":"IF(ISERROR(AC15/AB15),\"-\",(AC15/AB15))","v":0.88787878787878793}]
["CPS-003-2021",2021,"FDLS-CD-003-2021","https://community.secop.gov.co/Public/Tendering/OpportunityDetail/Index?noticeUID=CO1.NTC.1731931&isFromPublicArea=True&isModal=False","Contratos de prestación de servicios profesionales y de apoyo a la gestión","Contratación directa","Prestación de servicios profesionales y de apoyo a la gestión, o para la ejecución de trabajos artísticos que sólo puedan encomendarse a determinadas personas naturales;","PRESTAR LOS SERVICIOS DE APOYO ADMINISTRATIVO AL DESPACHO DE LA ALCALDÍA LOCAL DE SUMAPAZ","Inversión","Un Nuevo Contrato Social y Ambiental para la Bogotá del Siglo XXI",57,{"$f":"IF(ISERROR(VLOOKUP(K16,Proposito_programa!$C$2:$E$59,2,FALSE)),\" \",VLOOKUP(K16,Proposito_programa!$C$2:$E$59,2,FALSE))","v":"Gestión pública local"},{"$f":"IF(ISERROR(VLOOKUP(K16,Proposito_programa!$C$2:$E$59,3,FALSE)),\" \",VLOOKUP(K16,Proposito_programa!$C$2:$E$59,3,FALSE))","v":"Propósito 5: Construir Bogotá - Región con gobierno abierto, transparente y ciudadanía consciente"},1696,null,1075237430,"KAREN SOFIA SILVA PRADA","KAREN SOFÍA SILVA PRADA","KAREN SOFÍA SILVA PRADA","Persona Natural",null,null,null,39000000,null,1,3900000,{"$f":"+X16+Y16+AA16","v":42900000},41600000,"2021-02-03","2021-02-11","2022-01-10",333,1,30,null,null,null,null,null,"X",null,null,{"$f":"IF(ISERROR(AC16/AB16),\"-\",(AC16/AB16))","v":0.96969696969696972}]
["CPS-004-2021",2021,"FDLS-CD-004-2021","https://community.secop.gov.co/Public/Tendering/OpportunityDetail/Index?noticeUID=CO1.NTC.1732037&isFromPublicArea=True&isModal=False","Contratos de prestación de servicios profesionales y de apoyo a la gestión","Contratación directa","Prestación de servicios profesionales y de apoyo a la gestión, o para la ejecución de trabajos artísticos que sólo puedan encomendarse a determinadas personas naturales;","PRESTAR LOS SERVICIOS PROFESIONALES AL DESPACHO DE LA ALCALDÍA LOCAL DE SUMAPAZ EN LAS DIFERENTES ETAPAS DE LOS PROCESOS ADMINISTRATIVOS, FINANCIEROS Y PRESUPUESTALES PARA DAR CUMPLIMIENTO AL PLAN DE DESARROLLO LOCAL","Inversión","Un Nuevo Contrato Social y Ambiental para la Bogotá del Siglo XXI",57,{"$f":"IF(ISERROR(VLOOKUP(K17,Proposito_programa!$C$2:$E$59,2,FALSE)),\" \",VLOOKUP(K17,Proposito_programa!$C$2:$E$59,2,FALSE))","v":"Gestión pública local"},{"$f":"IF(ISERROR(VLOOKUP(K17,Proposito_programa!$C$2:$E$59,3,FALSE)),\" \",VLOOKUP(K17,Proposito_programa!$C$2:$E$59,3,FALSE))","v":"Propósito 5: Construir Bogotá - Región con gobierno abierto, transparente y ciudadanía consciente"},1696,null,39682218,"GEMA ORTEGA TRUJILLO","GEMA ORTEGA TRUJILLO","GEMA ORTEGA TRUJILLO","Persona Natural",null,null,null,80000000,null,1,8000000,88000000,86133333,"2021-02-04","2021-02-08","2022-01-07",333,1,30,null,null,null,null,null,"X",null,null,0.97878787499999997]
["CPS-005-2021",2021,"FDLS-CD-005-2021","https://community.secop.gov.co/Public/Tendering/OpportunityDetail/Index?noticeUID=CO1.NTC.1732224&isFromPublicArea=True&isModal=False","Contratos de prestación de servicios profesionales y de apoyo a la gestión","Contratación directa","Prestación de servicios profesionales y de apoyo a la gestión, o para la ejecución de trabajos artísticos que sólo puedan encomendarse a determinadas personas naturales;","PRESTAR LOS SERVICIOS DE APOYO ADMINISTRATIVO AL ÁREA DE GESTIÓN DE DESARROLLO LOCAL DE LA ALCALDÍA LOCAL DE SUMAPAZ","Inversión","Un Nuevo Contrato Social y Ambiental para la Bogotá del Siglo XXI",57,{"$f":"IF(ISERROR(VLOOKUP(K18,Proposito_programa!$C$2:$E$59,2,FALSE)),\" \",VLOOKUP(K18,Proposito_programa!$C$2:$E$59,2,FALSE))","v":"Gestión pública local"},{"$f":"IF(ISERROR(VLOOKUP(K18,Proposito_programa!$C$2:$E$59,3,FALSE)),\" \",VLOOKUP(K18,Proposito_programa!$C$2:$E$59,3,FALSE))","v":"Propósito 5: Construir Bogotá - Región con gobierno abierto, transparente y ciudadanía consciente"},1696,null,1026253687,"KARINA OLAYA ANDRADE","KARINA OLAYA ANDRADE","KARINA OLAYA ANDRADE","Persona Natural",null,null,null,39000000,null,1,3900000,42900000,37700000,"2021-02-04","2021-02-11","2022-01-10",333,1,30,null,null,null,null,null,"X",null,null,0.87878787878787878]
["CPS-006-2021",2021,"FDLS-CD-006-2021","https://community.secop.gov.co/Public/Tendering/OpportunityDetail/Index?noticeUID=CO1.NTC.1732035&isFromPublicArea=True&isModal=False","Contratos de prestación de servicios profesionales y de apoyo a la gestión","Contratación directa","Prestación de servicios profesionales y de apoyo a la gestión, o para la ejecución de trabajos artísticos que sólo puedan encomendarse a determinadas personas naturales;","PRESTAR LOS SERVICIOS PROFESIONALES AL ÁREA DE GESTIÓN DE DESARROLLO LOCAL, PARA REALIZAR LA PLANEACIÓN Y SEGUIMIENTO A LOS PROYECTOS DE INVERSIÓN Y GASTOS DE FUNCIONAMIENTO RELACIONADOS CON EL PARQUE AUTOMOTOR DEL FONDO DE DESARROLLO LOCAL DE SUMAPAZ","Inversión","Un Nuevo Contrato Social y Ambiental para la Bogotá del Siglo XXI",57,{"$f":"IF(ISERROR(VLOOKUP(K19,Proposito_programa!$C$2:$E$59,2,FALSE)),\" \",VLOOKUP(K19,Proposito_programa!$C$2:$E$59,2,FALSE))","v":"Gestión pública local"},{"$f":"IF(ISERROR(VLOOKUP(K19,Proposito_programa!$C$2:$E$59,3,FALSE)),\" \",VLOOKUP(K19,Proposito_programa!$C$2:$E$59,3,FALSE))","v":"Propósito 5: Construir Bogotá - Región con gobierno abierto, transparente y ciudadanía consciente"},1696,null,1019076465,"EDILSON ARGEMIRO PORRAS CABALLERO","EDILSON ARGEMIRO PORRAS CABALLERO","EDILSON ARGEMIRO PORRAS CABALLERO","Persona Natural",null,null,null,68000000,null,1,6800000,74800000,73213333,"2021-02-03","2021-02-08","2022-01-07",333,1,30,null,null,null,null,null,"X",null,null,0.97878787433155079]
["CPS-007-2021",2021,"FDLS-CD-07-2021","https://community.secop.gov.co/Public/Tendering/OpportunityDetail/Index?noticeUID=CO1.NTC.1733004&isFromPublicArea=True&isModal=False","Contratos de prestación de servicios profesionales y de apoyo a la gestión","Contratación directa","Prestación de servicios profesionales y de apoyo a la gestión, o para la ejecución de trabajos artísticos que sólo puedan encomendarse a determinadas personas naturales;","PRESTAR LOS SERVICIOS PROFESIONALES PARA APOYAR LA PLANEACIÓN, EJECUCIÓN Y SEGUIMIENTO DE LOS PROYECTOS DE INVERSIÓN Y RUBROS DE FUNCIONAMIENTO QUE LE SEAN DESIGNADOS, DEL FONDO DE DESARROLLO LOCAL DE SUMAPAZ","Inversión","Un Nuevo Contrato Social y Ambiental para la Bogotá del Siglo XXI",57,{"$f":"IF(ISERROR(VLOOKUP(K20,Proposito_programa!$C$2:$E$59,2,FALSE)),\" \",VLOOKUP(K20,Proposito_programa!$C$2:$E$59,2,FALSE))","v":"Gestión pública local"},{"$f":"IF(ISERROR(VLOOKUP(K20,Proposito_programa!$C$2:$E$59,3,FALSE)),\" \",VLOOKUP(K20,Proposito_programa!$C$2:$E$59,3,FALSE))","v":"Propósito 5: Construir Bogotá - Región con gobierno abierto, transparente y ciudadanía consciente"},1696,null,1048205442,"ROSA MARIA MENDOZA DE LOS REYES","ROSA MARIA MENDOZA DE LOS REYES","ROSA MARIA MENDOZA DE LOS REYES","Persona Natural",null,null,null,57000000,null,1,5700000,62700000,61370000,"2021-02-04","2021-02-08","2022-01-07",333,1,30,null,null,null,null,null,"X",null,null,0.97878787878787876]
["CPS-008-2021",2021,"FDLS-CD-008-2021","https://community.secop.gov.co/Public/Tendering/OpportunityDetail/Index?noticeUID=CO1.NTC.1732528&isFromPublicArea=True&isModal=False","Contratos de prestación de servicios profesionales y de apoyo a la gestión","Contratación directa","Prestación de servicios profesionales y de apoyo a la gestión, o para la ejecución de trabajos artísticos que sólo puedan encomendarse a determinadas personas naturales;","PRESTAR LOS SERVICIOS PROFESIONALES ESPECIALIZADOS AL ÁREA DE GESTIÓN DE DESARROLLO LOCAL, PARA REALIZAR LA PLANEACIÓN Y SEGUIMIENTO A LOS PROYECTOS DE INVERSIÓN DE INFRAESTRUCTURA Y MALLA VIAL DE LA LOCALIDAD","Inversión","Un Nuevo Contrato Social y Ambiental para la Bogotá del Siglo XXI",57,{"$f":"IF(ISERROR(VLOOKUP(K21,Proposito_programa!$C$2:$E$59,2,FALSE)),\" \",VLOOKUP(K21,Proposito_programa!$C$2:$E$59,2,FALSE))","v":"Gestión pública local"},{"$f":"IF(ISERROR(VLOOKUP(K21,Proposito_programa!$C$2:$E$59,3,FALSE)),\" \",VLOOKUP(K21,Proposito_programa!$C$2:$E$59,3,FALSE))","v":"Propósito 5: Construir Bogotá - Región con gobierno abierto, transparente y ciudadanía consciente"},1696,null,1019006008,"JUAN PABLO SANABRIA MORENO","JUAN PABLO SANABRIA MORENO","JUAN PABLO SANABRIA MORENO","Persona Natural",null,null,null,76000000,null,1,7600000,83600000,81826666,"2021-02-04","2021-02-08","2022-01-07",333,1,30,null,null,null,null,null,"X",null,null,0.97878787081339713]
["CPS-009-2021",2021,"FDLS-CD-009-2021","https://community.secop.gov.co/Public/Tendering/OpportunityDetail/Index?noticeUID=CO1.NTC.1731689&isFromPublicArea=True&isModal=False","Contratos de prestación de servicios profesionales y de apoyo a la gestión","Contratación directa","Prestación de servicios profesionales y de apoyo a la gestión, o para la ejecución de trabajos artísticos que sólo puedan encomendarse a determinadas personas naturales;","PRESTAR LOS SERVICIOS PROFESIONALES JURÍDICOS PARA APOYAR LOS ASUNTOS PRECONTRACTUALES, CONTRACTUALES Y POST-CONTRACTUALES DEL ÁREA DE GESTIÓN DE DESARROLLO LOCAL DE LA ALCALDÍA LOCAL DE SUMAPAZ","Inversión","Un Nuevo Contrato Social y Ambiental para la Bogotá del Siglo XXI",57,{"$f":"IF(ISERROR(VLOOKUP(K22,Proposito_programa!$C$2:$E$59,2,FALSE)),\" \",VLOOKUP(K22,Proposito_programa!$C$2:$E$59,2,FALSE))","v":"Gestión pública local"},{"$f":"IF(ISERROR(VLOOKUP(K22,Proposito_programa!$C$2:$E$59,3,FALSE)),\" \",VLOOKUP(K22,Proposito_programa!$C$2:$E$59,3,FALSE))","v":"Propósito 5: Construir Bogotá - Región con gobierno abierto, transparente y ciudadanía consciente"},1696,null,1020796899,"MARIA CAMILA DIAZ","MARÍA CAMILA DÍAZ MENCO","MARÍA CAMILA DÍAZ MENCO","Persona Natural",null,null,null,57000000,null,1,5700000,62700000,61940000,"2021-02-03","2021-02-05","2022-01-04",333,1,30,null,null,null,null,null,"X",null,null,0.98787878787878791]
["CPS-010-2021",2021,"FDLS-CD-009-2021","https://community.secop.gov.co/Public/Tendering/OpportunityDetail/Index?noticeUID=CO1.NTC.1731689&isFromPublicArea=True&isModal=False","Contratos de prestación de servicios profesionales y de apoyo a la gestión","Contratación directa","Prestación de servicios profesionales y de apoyo a la gestión, o para la ejecución de trabajos artísticos que sólo puedan encomendarse a determinadas personas naturales;","PRESTAR LOS SERVICIOS PROFESIONALES JURÍDICOS PARA APOYAR LOS ASUNTOS PRECONTRACTUALES, CONTRACTUALES Y POST-CONTRACTUALES DEL ÁREA DE GESTIÓN DE DESARROLLO LOCAL DE LA ALCALDÍA LOCAL DE SUMAPAZ","Inversión","Un Nuevo Contrato Social y Ambiental para la Bogotá del Siglo XXI",57,{"$f":"IF(ISERROR(VLOOKUP(K23,Proposito_programa!$C$2:$E$59,2,FALSE)),\" \",VLOOKUP(K23,Proposito_programa!$C$2:$E$59,2,FALSE))","v":"Gestión pública local"},{"$f":"IF(ISERROR(VLOOKUP(K23,Proposito_programa!$C$2:$E$59,3,FALSE)),\" \",VLOOKUP(K23,Proposito_programa!$C$2:$E$59,3,FALSE))","v":"Propósito 5: Construir Bogotá - Región con gobierno abierto, transparente y ciudadanía consciente"},1696,null,51657917,"MARTHA LUCIA SUAREZ MORALES","MARTHA LUCIA SUAREZ MORALES","MARTHA LUCIA SUAREZ MORALES","Persona Natural",null,null,null,57000000,null,null,null,57000000,50540000,"2021-02-03","2021-02-05","2021-12-04",302,null,null,null,null,null,null,null,null,"X",null,0.88666666666666671]
["CPS-011-2021",2021,"FDLS-CD-009-2021","https://community.secop.gov.co/Public/Tendering/OpportunityDetail/Index?noticeUID=CO1.NTC.1731689&isFromPublicArea=True&isModal=False","Contratos de prestación de servicios profesionales y de apoyo a la gestión","Contratación directa","Prestación de servicios profesionales y de apoyo a la gestión, o para la ejecución de trabajos artísticos que sólo puedan encomendarse a determinadas personas naturales;","PRESTAR LOS SERVICIOS PROFESIONALES JURÍDICOS PARA APOYAR LOS ASUNTOS PRECONTRACTUALES, CONTRACTUALES Y POST-CONTRACTUALES DEL ÁREA DE GESTIÓN DE DESARROLLO LOCAL DE LA ALCALDÍA LOCAL DE SUMAPAZ","Inversión","Un Nuevo Contrato Social y Ambiental para la Bogotá del Siglo XXI",57,{"$f":"IF(ISERROR(VLOOKUP(K24,Proposito_programa!$C$2:$E$59,2,FALSE)),\" \",VLOOKUP(K24,Proposito_programa!$C$2:$E$59,2,FALSE))","v":"Gestión pública local"},{"$f":"IF(ISERROR(VLOOKUP(K24,Proposito_programa!$C$2:$E$59,3,FALSE)),\" \",VLOOKUP(K24,Proposito_programa!$C$2:$E$59,3,FALSE))","v":"Propósito 5: Construir Bogotá - Región con gobierno abierto, transparente y ciudadanía consciente"},1696,null,1023888264,"MONICA DEL PILAR PARRA RANGEL","MONICA DEL PILAR PARRA RANGEL","MONICA DEL PILAR PARRA RANGEL","Persona Natural",null,null,null,57000000,null,null,null,57000000,50540000,"2021-02-03","2021-02-05","2021-12-04",302,null,null,null,null,null,null,null,null,"X",null,0.88666666666666671]
["CPS-012-2021",2021,"FDLS-CD-010-2021","https://community.secop.gov.co/Public/Tendering/OpportunityDetail/Index?noticeUID=CO1.NTC.1735039&isFromPublicArea=True&isModal=False","Contratos de prestación de servicios profesionales y de apoyo a la gestión","Contratación directa","Prestación de servicios profesionales y de apoyo a la gestión, o para la ejecución de trabajos artísticos que sólo puedan encomendarse a determinadas personas naturales;","PRESTAR LOS SERVICIOS PROFESIONALES ESPECIALIZADOS PARA APOYAR LA PLANEACIÓN, SEGUIMIENTO, EJECUCIÓN Y CONTROL DE LOS PROYECTOS AMBIENTALES Y DE DESARROLLO RURAL SOSTENIBLE, DE LA ALCALDÍA LOCAL DE SUMAPAZ","Inversión","Un Nuevo Contrato Social y Ambiental para la Bogotá del Siglo XXI",23,{"$f":"IF(ISERROR(VLOOKUP(K25,Proposito_programa!$C$2:$E$59,2,FALSE)),\" \",VLOOKUP(K25,Proposito_programa!$C$2:$E$59,2,FALSE))","v":"Bogotá rural"},{"$f":"IF(ISERROR(VLOOKUP(K25,Proposito_programa!$C$2:$E$59,3,FALSE)),\" \",VLOOKUP(K25,Proposito_programa!$C$2:$E$59,3,FALSE))","v":"Propósito 1: Hacer un nuevo contrato social para incrementar la inclusión social, productiva y política"},1634,null,52155157,"DALGY DANIT LEAL OJEDA","DALGY DANIT LEAL OJEDA","DALGY DANIT LEAL OJEDA","Persona Natural",null,null,null,76000000,null,1,7600000,83600000,66626667,"2021-02-04","2021-02-08","2022-01-07",333,1,30,null,null,null,null,null,"X",null,null,0.79696970095693775]
["CPS-13-2021",2021,"FDLS-CD-11-2021","https://community.secop.gov.co/Public/Tendering/OpportunityDetail/Index?noticeUID=CO1.NTC.1734259&isFromPublicArea=True&isModal=False","Contratos de prestación de servicios profesionales y de apoyo a la gestión","Contratación directa","Prestación de servicios profesionales y de apoyo a la gestión, o para la ejecución de trabajos artísticos que sólo puedan encomendarse a determinadas personas naturales;","PRESTAR LOS SERVICIOS PROFESIONALES ESPECIALIZADOS PARA APOYAR LOS ASUNTOS LEGALES, CONTRACTUALES Y POST-CONTRACTUALES DE LA ALCALDÍA LOCAL DE SUMAPAZ","Inversión","Un Nuevo Contrato Social y Ambiental para la Bogotá del Siglo XXI",57,{"$f":"IF(ISERROR(VLOOKUP(K26,Proposito_programa!$C$2:$E$59,2,FALSE)),\" \",VLOOKUP(K26,Proposito_programa!$C$2:$E$59,2,FALSE))","v":"Gestión pública local"},{"$f":"IF(ISERROR(VLOOKUP(K26,Proposito_programa!$C$2:$E$59,3,FALSE)),\" \",VLOOKUP(K26,Proposito_programa!$C$2:$E$59,3,FALSE))","v":"Propósito 5: Construir Bogotá - Región con gobierno abierto, transparente y ciudadanía consciente"},1696,null,52380146,"PATRICIA ABRIL OSPITIA","PATRICIA ABRIL OSPITIA","PATRICIA ABRIL OSPITIA","Persona Natural",null,null,null,70000000,null,1,7000000,77000000,75366667,"2021-02-04","2021-02-08","2022-01-07",333,1,30,null,null,null,null,null,"X",null,null,0.97878788311688314]
["CPS-014-2021",2021,"FDLS-CD-012-2021","https://community.secop.gov.co/Public/Tendering/OpportunityDetail/Index?noticeUID=CO1.NTC.1736032&isFromPublicArea=True&isModal=False","Contratos de prestación de servicios profesionales y de apoyo a la gestión","Contratación directa","Prestación de servicios profesionales y de apoyo a la gestión, o para la ejecución de trabajos artísticos que sólo puedan encomendarse a determinadas personas naturales;","PRESTAR SUS SERVICIOS PROFESIONALES COMO ADMINISTRADOR DE LA RED DE LA ALCALDÍA LOCAL DE SUMAPAZ Y REALIZAR LA ACTUALIZACIÓN DE LOS DATOS EN LOS DIFERENTES SISTEMAS DE INFORMACIÓN","Inversión","Un Nuevo Contrato Social y Ambiental para la Bogotá del Siglo XXI",57,{"$f":"IF(ISERROR(VLOOKUP(K27,Proposito_programa!$C$2:$E$59,2,FALSE)),\" \",VLOOKUP(K27,Proposito_programa!$C$2:$E$59,2,FALSE))","v":"Gestión pública local"},{"$f":"IF(ISERROR(VLOOKUP(K27,Proposito_programa!$C$2:$E$59,3,FALSE)),\" \",VLOOKUP(K27,Proposito_programa!$C$2:$E$59,3,FALSE))","v":"Propósito 5: Construir Bogotá - Región con gobierno abierto, transparente y ciudadanía consciente"},1696,null,77183787,"YESID AMARIS OSPINO","YESID AMARIS OSPINO","YESID AMARIS OSPINO","Persona Natural",null,null,null,68000000,null,null,null,68000000,68000000,"2021-02-05","2021-02-08","2021-12-07",302,null,null,null,null,null,null,null,null,"X",null,1]
["CPS-015-2021",2021,"FDLS-CD-013-2021","https://community.secop.gov.co/Public/Tendering/OpportunityDetail/Index?noticeUID=CO1.NTC.1739939&isFromPublicArea=True&isModal=False","Contratos de prestación de servicios profesionales y de apoyo a la gestión","Contratación directa","Prestación de servicios profesionales y de apoyo a la gestión, o para la ejecución de trabajos artísticos que sólo puedan encomendarse a determinadas personas naturales;","PRESTAR LOS SERVICIOS PROFESIONALES PARA APOYAR LA PLANEACIÓN, EJECUCIÓN Y SEGUIMIENTO DE LOS PROYECTOS DE INVERSIÓN EN TEMAS DE EDUCACIÓN QUE EJECUTE EL FONDO DE DESARROLLO LOCAL DE SUMAPAZ","Inversión","Un Nuevo Contrato Social y Ambiental para la Bogotá del Siglo XXI",18,{"$f":"IF(ISERROR(VLOOKUP(K28,Proposito_programa!$C$2:$E$59,2,FALSE)),\" \",VLOOKUP(K28,Proposito_programa!$C$2:$E$59,2,FALSE))","v":"Cierre de brechas para la inclusión productiva urbano rural"},{"$f":"IF(ISERROR(VLOOKUP(K28,Proposito_programa!$C$2:$E$59,3,FALSE)),\" \",VLOOKUP(K28,Proposito_programa!$C$2:$E$59,3,FALSE))","v":"Propósito 1: Hacer un nuevo contrato social para incrementar la inclusión social, productiva y política"},1587,null,9770381,"JULIAN ANDRES CARVAJAL ZAMORA","JULIÁN ANDRES CARVAJAL ZAMORA","JULIÁN ANDRES CARVAJAL ZAMORA","Persona Natural",null,null,null,60000000,null,1,6000000,66000000,64200000,"2021-02-05","2021-02-10","2022-01-09",333,1,30,null,null,null,null,null,"X",null,null,0.97272727272727277]
["CPS-016-2021",2021,"FDLS-CD-014-2021","https://community.secop.gov.co/Public/Tendering/OpportunityDetail/Index?noticeUID=CO1.NTC.1740019&isFromPublicArea=True&isModal=False","Contratos de prestación de servicios profesionales y de apoyo a la gestión","Contratación directa","Prestación de servicios profesionales y de apoyo a la gestión, o para la ejecución de trabajos artísticos que sólo puedan encomendarse a determinadas personas naturales;","PRESTAR LOS SERVICIOS PROFESIONALES PARA APOYAR LOS ASUNTOS JURÍDICOS EN LOS PROCESOS CONTRACTUALES Y POST-CONTRACTUALES DE LA ALCALDÍA LOCAL DE SUMAPAZ","Inversión","Un Nuevo Contrato Social y Ambiental para la Bogotá del Siglo XXI",57,{"$f":"IF(ISERROR(VLOOKUP(K29,Proposito_programa!$C$2:$E$59,2,FALSE)),\" \",VLOOKUP(K29,Proposito_programa!$C$2:$E$59,2,FALSE))","v":"Gestión pública local"},{"$f":"IF(ISERROR(VLOOKUP(K29,Proposito_programa!$C$2:$E$59,3,FALSE)),\" \",VLOOKUP(K29,Proposito_programa!$C$2:$E$59,3,FALSE))","v":"Propósito 5: Construir Bogotá - Región con gobierno abierto, transparente y ciudadanía consciente"},1696,null,1019088970,"KAREN VIVIANA GONZALEZ","KAREN VIVIANA GONZÁLEZ","KAREN VIVIANA GONZÁLEZ","Persona Natural",null,null,null,60000000,null,1,6000000,66000000,58400000,"2021-02-05","2021-02-09","2022-01-08",333,1,30,null,null,null,null,null,"X",null,null,0.88484848484848488]
["CPS-017-2021",2021,"FDLS-CD-015-2021","https://community.secop.gov.co/Public/Tendering/OpportunityDetail/Index?noticeUID=CO1.NTC.1748637&isFromPublicArea=True&isModal=False","Contratos de prestación de servicios profesionales y de apoyo a la gestión","Contratación directa","Prestación de servicios profesionales y de apoyo a la gestión, o para la ejecución de trabajos artísticos que sólo puedan encomendarse a determinadas personas naturales;","PRESTAR LOS SERVICIOS DE APOYO ADMINISTRATIVO AL ÁREA DE GESTIÓN DE DESARROLLO LOCAL EN LOS PROCESOS CONTRACTUALES DE LA ALCALDÍA LOCAL DE SUMAPAZ","Inversión","Un Nuevo Contrato Social y Ambiental para la Bogotá del Siglo XXI",57,{"$f":"IF(ISERROR(VLOOKUP(K30,Proposito_programa!$C$2:$E$59,2,FALSE)),\" \",VLOOKUP(K30,Proposito_programa!$C$2:$E$59,2,FALSE))","v":"Gestión pública local"},{"$f":"IF(ISERROR(VLOOKUP(K30,Proposito_programa!$C$2:$E$59,3,FALSE)),\" \",VLOOKUP(K30,Proposito_programa!$C$2:$E$59,3,FALSE))","v":"Propósito 5: Construir Bogotá - Región con gobierno abierto, transparente y ciudadanía consciente"},1696,null,1020839818,"PAULA NATALIA FARFAN PAEZ","PAULA NATALIA FARFAN PAEZ","PAULA NATALIA FARFAN PAEZ","Persona Natural",null,null,null,7800000,null,null,null,7800000,7800000,"2021-02-09","2021-02-10","2021-05-09",88,null,null,null,null,null,null,null,null,"X",null,1]
["CPS-018-2021",2021,"FDLS-CD-016-2021","https://community.secop.gov.co/Public/Tendering/OpportunityDetail/Index?noticeUID=CO1.NTC.1751650&isFromPublicArea=True&isModal=False","Contratos de prestación de servicios profesionales y de apoyo a la gestión","Contratación directa","Prestación de servicios profesionales y de apoyo a la gestión, o para la ejecución de trabajos artísticos que sólo puedan encomendarse a determinadas personas naturales;","PRESTAR LOS SERVICIOS COMO CONDUCTOR DE VEHÍCULOS LIVIANOS DE PROPIEDAD O TENENCIA DEL FONDO DE DESARROLLO LOCAL DE SUMAPAZ","Inversión","Un Nuevo Contrato Social y Ambiental para la Bogotá del Siglo XXI",57,{"$f":"IF(ISERROR(VLOOKUP(K31,Proposito_programa!$C$2:$E$59,2,FALSE)),\" \",VLOOKUP(K31,Proposito_programa!$C$2:$E$59,2,FALSE))","v":"Gestión pública local"},{"$f":"IF(ISERROR(VLOOKUP(K31,Proposito_programa!$C$2:$E$59,3,FALSE)),\" \",VLOOKUP(K31,Proposito_programa!$C$2:$E$59,3,FALSE))","v":"Propósito 5: Construir Bogotá - Región con gobierno abierto, transparente y ciudadanía consciente"},1696,null,1032656249,"ANGEL RODRIGO MUÑOZ","ANGEL RODRIGO MUÑOZ","ANGEL RODRIGO MUÑOZ","Persona Natural",null,null,null,25500000,null,1,2550000,28050000,27200000,"2021-02-10","2021-02-11","2022-01-10",333,1,30,null,null,null,null,null,"X",null,null,0.96969696969696972]
["CPS-019-2021",2021,"FDLS-CD-016-2021","https://community.secop.gov.co/Public/Tendering/OpportunityDetail/Index?noticeUID=CO1.NTC.1751650&isFromPublicArea=True&isModal=False","Contratos de prestación de servicios profesionales y de apoyo a la gestión","Contratación directa","Prestación de servicios profesionales y de apoyo a la gestión, o para la ejecución de trabajos artísticos que sólo puedan encomendarse a determinadas personas naturales;","PRESTAR LOS SERVICIOS COMO CONDUCTOR DE VEHÍCULOS LIVIANOS DE PROPIEDAD O TENENCIA DEL FONDO DE DESARROLLO LOCAL DE SUMAPAZ","Inversión","Un Nuevo Contrato Social y Ambiental para la Bogotá del Siglo XXI",57,{"$f":"IF(ISERROR(VLOOKUP(K32,Proposito_programa!$C$2:$E$59,2,FALSE)),\" \",VLOOKUP(K32,Proposito_programa!$C$2:$E$59,2,FALSE))","v":"Gestión pública local"},{"$f":"IF(ISERROR(VLOOKUP(K32,Proposito_programa!$C$2:$E$59,3,FALSE)),\" \",VLOOKUP(K32,Proposito_programa!$C$2:$E$59,3,FALSE))","v":"Propósito 5: Construir Bogotá - Región con gobierno abierto, transparente y ciudadanía consciente"},1696,null,1032656045,"EDUARDO DIMATE RICO","EDUARDO DIMATE RICO","EDUARDO DIMATE RICO","Persona Natural",null,null,null,25500000,null,1,2550000,28050000,24650000,"2021-02-10","2021-02-11","2022-01-10",333,1,30,null,null,null,null,null,"X",null,null,0.87878787878787878]
["CPS-020-2021",2021,"FDLS-CD-016-2021","https://community.secop.gov.co/Public/Tendering/OpportunityDetail/Index?noticeUID=CO1.NTC.1751650&isFromPublicArea=True&isModal=False","Contratos de prestación de servicios profesionales y de apoyo a la gestión","Contratación directa","Prestación de servicios profesionales y de apoyo a la gestión, o para la ejecución de trabajos artísticos que sólo puedan encomendarse a determinadas personas naturales;","PRESTAR LOS SERVICIOS COMO CONDUCTOR DE VEHÍCULOS LIVIANOS DE PROPIEDAD O TENENCIA DEL FONDO DE DESARROLLO LOCAL DE SUMAPAZ","Inversión","Un Nuevo Contrato Social y Ambiental para la Bogotá del Siglo XXI",57,{"$f":"IF(ISERROR(VLOOKUP(K33,Proposito_programa!$C$2:$E$59,2,FALSE)),\" \",VLOOKUP(K33,Proposito_programa!$C$2:$E$59,2,FALSE))","v":"Gestión pública local"},{"$f":"IF(ISERROR(VLOOKUP(K33,Proposito_programa!$C$2:$E$59,3,FALSE)),\" \",VLOOKUP(K33,Proposito_programa!$C$2:$E$59,3,FALSE))","v":"Propósito 5: Construir Bogotá - Región con gobierno abierto, transparente y ciudadanía consciente"},1696,null,79816851,"WILLIAM EDUARDO MICAN VASQUEZ","WILLIAM EDUARDO MICAN VASQUEZ","WILLIAM EDUARDO MICAN VASQUEZ","Persona Natural",null,null,null,25500000,null,1,2550000,28050000,27200000,"2021-02-10","2021-02-11","2022-01-10",333,1,30,null,null,null,null,null,"X",null,null,0.96969696969696972]
["CPS-021-2021",2021,"FDLS-CD-016-2021","https://community.secop.gov.co/Public/Tendering/OpportunityDetail/Index?noticeUID=CO1.NTC.1751650&isFromPublicArea=True&isModal=False","Contratos de prestación de servicios profesionales y de apoyo a la gestión","Contratación directa","Prestación de servicios profesionales y de apoyo a la gestión, o para la ejecución de trabajos artísticos que sólo puedan encomendarse a determinadas personas naturales;","PRESTAR LOS SERVICIOS COMO CONDUCTOR DE VEHÍCULOS LIVIANOS DE PROPIEDAD O TENENCIA DEL FONDO DE DESARROLLO LOCAL DE SUMAPAZ","Inversión","Un Nuevo Contrato Social y Ambiental para la Bogotá del Siglo XXI",57,{"$f":"IF(ISERROR(VLOOKUP(K34,Proposito_programa!$C$2:$E$59,2,FALSE)),\" \",VLOOKUP(K34,Proposito_programa!$C$2:$E$59,2,FALSE))","v":"Gestión pública local"},{"$f":"IF(ISERROR(VLOOKUP(K34,Proposito_programa!$C$2:$E$59,3,FALSE)),\" \",VLOOKUP(K34,Proposito_programa!$C$2:$E$59,3,FALSE))","v":"Propósito 5: Construir Bogotá - Región con gobierno abierto, transparente y ciudadanía consciente"},1696,null,19271225,"MAXIMILIANO LOPEZ SUAREZ","MAXIMILIANO LOPEZ SUAREZ","MAXIMILIANO LOPEZ SUAREZ","Persona Natural",null,null,null,25500000,null,1,2550000,28050000,27200000,"2021-02-10","2021-02-11","2022-01-10",333,1,30,null,null,null,null,null,"X",null,null,0.96969696969696972]
["CPS-022-2021",2021,"FDLS-CD-017-2021","https://community.secop.gov.co/Public/Tendering/OpportunityDetail/Index?noticeUID=CO1.NTC.1754579&isFromPublicArea=True&isModal=False","Contratos de prestación de servicios profesionales y de apoyo a la gestión","Contratación directa","Prestación de servicios profesionales y de apoyo a la gestión, o para la ejecución de trabajos artísticos que sólo puedan encomendarse a determinadas personas naturales;","PRESTAR LOS SERVICIOS COMO CONDUCTOR DE VEHÍCULOS LIVIANOS DE PROPIEDAD O TENENCIA DEL FONDO DE DESARROLLO LOCAL DE SUMAPAZ","Inversión","Un Nuevo Contrato Social y Ambiental para la Bogotá del Siglo XXI",57,{"$f":"IF(ISERROR(VLOOKUP(K35,Proposito_programa!$C$2:$E$59,2,FALSE)),\" \",VLOOKUP(K35,Proposito_programa!$C$2:$E$59,2,FALSE))","v":"Gestión pública local"},{"$f":"IF(ISERROR(VLOOKUP(K35,Proposito_programa!$C$2:$E$59,3,FALSE)),\" \",VLOOKUP(K35,Proposito_programa!$C$2:$E$59,3,FALSE))","v":"Propósito 5: Construir Bogotá - Región con gobierno abierto, transparente y ciudadanía consciente"},1696,null,79632420,"MARLON RAMIREZ ROMAN","MARLON RAMIREZ ROMAN","MARLON RAMIREZ ROMAN","Persona Natural",null,null,null,25500000,null,1,2550000,28050000,27115000,"2021-02-10","2021-02-12","2022-01-11",333,1,30,null,null,null,null,null,"X",null,null,0.96666666666666667]
["CPS-023-2021",2021,"FDLS-CD-018-2021","https://community.secop.gov.co/Public/Tendering/OpportunityDetail/Index?noticeUID=CO1.NTC.1758306&isFromPublicArea=True&isModal=False","Contratos de prestación de servicios profesionales y de apoyo a la gestión","Contratación directa","Prestación de servicios profesionales y de apoyo a la gestión, o para la ejecución de trabajos artísticos que sólo puedan encomendarse a determinadas personas naturales;","PRESTAR SUS SERVICIOS DE APOYO ADMINISTRATIVO AL ÁREA DE GESTIÓN DE DESARROLLO LOCAL, EN LOS TEMAS RELACIONADOS CON LA INFRAESTRUCTURA VIAL DE LA ALCALDÍA LOCAL DE SUMAPAZ","Inversión","Un Nuevo Contrato Social y Ambiental para la Bogotá del Siglo XXI",57,{"$f":"IF(ISERROR(VLOOKUP(K36,Proposito_programa!$C$2:$E$59,2,FALSE)),\" \",VLOOKUP(K36,Proposito_programa!$C$2:$E$59,2,FALSE))","v":"Gestión pública local"},{"$f":"IF(ISERROR(VLOOKUP(K36,Proposito_programa!$C$2:$E$59,3,FALSE)),\" \",VLOOKUP(K36,Proposito_programa!$C$2:$E$59,3,FALSE))","v":"Propósito 5: Construir Bogotá - Región con gobierno abierto, transparente y ciudadanía consciente"},1696,null,1030562593,"JOHANA MARITZA GOMEZ NEUTO","JOHANA MARITZA GOMEZ NEUTO","JOHANA MARITZA GOMEZ NEUTO","Persona Natural",null,null,null,39000000,null,1,3900000,42900000,41470000,"2021-02-11","2021-02-12","2022-01-11",333,1,30,null,null,null,null,null,"X",null,null,0.96666666666666667]
["CPS-024-2021",2021,"FDLS-CD-019-2021","https://community.secop.gov.co/Public/Tendering/OpportunityDetail/Index?noticeUID=CO1.NTC.1758747&isFromPublicArea=True&isModal=False","Contratos de prestación de servicios profesionales y de apoyo a la gestión","Contratación directa","Prestación de servicios profesionales y de apoyo a la gestión, o para la ejecución de trabajos artísticos que sólo puedan encomendarse a determinadas personas naturales;","PRESTAR LOS SERVICIOS TÉCNICOS DE APOYO ADMINISTRATIVO AL ÁREA DE GESTIÓN DE DESARROLLO LOCAL, DE LA ALCALDÍA LOCAL DE SUMAPAZ","Inversión","Un Nuevo Contrato Social y Ambiental para la Bogotá del Siglo XXI",6,{"$f":"IF(ISERROR(VLOOKUP(K37,Proposito_programa!$C$2:$E$59,2,FALSE)),\" \",VLOOKUP(K37,Proposito_programa!$C$2:$E$59,2,FALSE))","v":"Sistema Distrital de Cuidado"},{"$f":"IF(ISERROR(VLOOKUP(K37,Proposito_programa!$C$2:$E$59,3,FALSE)),\" \",VLOOKUP(K37,Proposito_programa!$C$2:$E$59,3,FALSE))","v":"Propósito 1: Hacer un nuevo contrato social para incrementar la inclusión social, productiva y política"},1643,null,1069737202,"AIDA LORENA TORRES GUZMAN","AIDA LORENA TORRES GUZMAN","AIDA LORENA TORRES GUZMAN","Persona Natural",null,null,null,39000000,null,null,null,39000000,29770000,"2021-02-11","2021-02-12","2021-10-01",231,null,null,null,null,null,null,null,null,"X",null,0.76333333333333331]
["CPS-025-2021",2021,"FDLS-CD-020-2021","https://community.secop.gov.co/Public/Tendering/OpportunityDetail/Index?noticeUID=CO1.NTC.1767231&isFromPublicArea=True&isModal=False","Contratos de prestación de servicios profesionales y de apoyo a la gestión","Contratación directa","Prestación de servicios profesionales y de apoyo a la gestión, o para la ejecución de trabajos artísticos que sólo puedan encomendarse a determinadas personas naturales;","\tPRESTAR LOS SERVICIOS COMO AUXILIAR ADMINISTRATIVO AL SERVICIO DE LA JUNTA ADMINISTRADORA LOCAL DE SUMAPAZ","Inversión","Un Nuevo Contrato Social y Ambiental para la Bogotá del Siglo XXI",57,{"$f":"IF(ISERROR(VLOOKUP(K38,Proposito_programa!$C$2:$E$59,2,FALSE)),\" \",VLOOKUP(K38,Proposito_programa!$C$2:$E$59,2,FALSE))","v":"Gestión pública local"},{"$f":"IF(ISERROR(VLOOKUP(K38,Proposito_programa!$C$2:$E$59,3,FALSE)),\" \",VLOOKUP(K38,Proposito_programa!$C$2:$E$59,3,FALSE))","v":"Propósito 5: Construir Bogotá - Región con gobierno abierto, transparente y ciudadanía consciente"},1696,null,1022943098,"GLORIA YOLANDA DIMATE RICO","GLORIA YOLANDA DIMATE RICO\n- CEDIDO A\nEDISON FERNEY MARTINEZ MOLINA","GLORIA YOLANDA DIMATE RICO\n- CEDIDO A\nEDISON FERNEY MARTINEZ MOLINA","Persona Natural",null,null,null,26000000,null,null,null,26000000,20799998,"2021-02-15","2021-02-17","2021-12-16",302,null,null,1023019730,"EDISON FERNEY MARTINEZ MOLINA","2021-05-18",18113334,null,null,"X",null,0.79999992307692303]
["CPS-026-2021",2021,"FDLS-CD-021-2021","https://community.secop.gov.co/Public/Tendering/OpportunityDetail/Index?noticeUID=CO1.NTC.1772933&isFromPublicArea=True&isModal=False","Contratos de prestación de servicios profesionales y de apoyo a la gestión","Contratación directa","Prestación de servicios profesionales y de apoyo a la gestión, o para la ejecución de trabajos artísticos que sólo puedan encomendarse a determinadas personas naturales;","PRESTAR LOS SERVICIOS PROFESIONALES PARA APOYAR LA PLANEACIÓN, EJECUCIÓN Y SEGUIMIENTO DE LOS PROYECTOS DE INVERSIÓN RELACIONADOS CON LA PLANEACIÓN PARTICIPATIVA RURAL Y DEL DESARROLLO CON ENFOQUE TERRITORIAL, DEL FONDO DE DESARROLLO LOCAL DE SUMAPAZ","Inversión","Un Nuevo Contrato Social y Ambiental para la Bogotá del Siglo XXI",39,{"$f":"IF(ISERROR(VLOOKUP(K39,Proposito_programa!$C$2:$E$59,2,FALSE)),\" \",VLOOKUP(K39,Proposito_programa!$C$2:$E$59,2,FALSE))","v":"Bogotá territorio de paz y atención integral a las víctimas del conflicto armado"},{"$f":"IF(ISERROR(VLOOKUP(K39,Proposito_programa!$C$2:$E$59,3,FALSE)),\" \",VLOOKUP(K39,Proposito_programa!$C$2:$E$59,3,FALSE))","v":"Propósito 3: Inspirar confianza y legitimidad para vivir sin miedo y ser epicentro de cultura ciudadana, paz y reconciliación"},1672,null,1015436119,"ANGELICA MARIA VEGA CARREÑO","ANGELICA MARIA VEGA CARREÑO","ANGELICA MARIA VEGA CARREÑO","Persona Natural",null,null,null,68000000,null,null,null,68000000,13373333,"2021-02-16","2021-03-02","2021-05-01",60,null,null,null,null,null,null,null,null,"X",null,0.19666666176470587]
["CPS-027-2021",2021,"FDLS-CD-022-2021","https://community.secop.gov.co/Public/Tendering/OpportunityDetail/Index?noticeUID=CO1.NTC.1774352&isFromPublicArea=True&isModal=False","Contratos de prestación de servicios profesionales y de apoyo a la gestión","Contratación directa","Prestación de servicios profesionales y de apoyo a la gestión, o para la ejecución de trabajos artísticos que sólo puedan encomendarse a determinadas personas naturales;","PRESTAR LOS SERVICIOS COMO AUXILIAR ADMINISTRATIVO AL ÁREA DE GESTIÓN DEL DESARROLLO EN LA ALCALDÍA LOCAL DE SUMAPAZ","Inversión","Un Nuevo Contrato Social y Ambiental para la Bogotá del Siglo XXI",57,{"$f":"IF(ISERROR(VLOOKUP(K40,Proposito_programa!$C$2:$E$59,2,FALSE)),\" \",VLOOKUP(K40,Proposito_programa!$C$2:$E$59,2,FALSE))","v":"Gestión pública local"},{"$f":"IF(ISERROR(VLOOKUP(K40,Proposito_programa!$C$2:$E$59,3,FALSE)),\" \",VLOOKUP(K40,Proposito_programa!$C$2:$E$59,3,FALSE))","v":"Propósito 5: Construir Bogotá - Región con gobierno abierto, transparente y ciudadanía consciente"},1696,null,1023019741,"CARLOS JULIO MACANA SECHAGUA","CARLOS JULIO MACANA SECHAGUA","CARLOS JULIO MACANA SECHAGUA","Persona Natural",null,null,null,25000000,null,1,2500000,27500000,23583333,"2021-02-17","2021-02-18","2022-01-17",333,1,30,null,null,null,null,null,"X",null,null,0.8575757454545454]
["CPS-028-2021",2021,"FDLS-CD-023-2021","https://community.secop.gov.co/Public/Tendering/OpportunityDetail/Index?noticeUID=CO1.NTC.1773362&isFromPublicArea=True&isModal=False","Contratos de prestación de servicios profesionales y de apoyo a la gestión","Contratación directa","Prestación de servicios profesionales y de apoyo a la gestión, o para la ejecución de trabajos artísticos que sólo puedan encomendarse a determinadas personas naturales;","PRESTAR LOS SERVICIOS PROFESIONALES ESPECIALIZADOS PARA APOYAR EL PROCESO DE PLANEACIÓN Y SEGUIMIENTO DE LOS PLANES, PROGRAMAS Y PROYECTOS DE INVERSIÓN DEL FONDO DE DESARROLLO LOCAL DE SUMAPAZ","Inversión","Un Nuevo Contrato Social y Ambiental para la Bogotá del Siglo XXI",1,{"$f":"IF(ISERROR(VLOOKUP(K41,Proposito_programa!$C$2:$E$59,2,FALSE)),\" \",VLOOKUP(K41,Proposito_programa!$C$2:$E$59,2,FALSE))","v":"Subsidios y transferencias para la equidad"},{"$f":"IF(ISERROR(VLOOKUP(K41,Proposito_programa!$C$2:$E$59,3,FALSE)),\" \",VLOOKUP(K41,Proposito_programa!$C$2:$E$59,3,FALSE))","v":"Propósito 1: Hacer un nuevo contrato social para incrementar la inclusión social, productiva y política"},1583,null,1023861638,"LUIS ALBERTO GALEANO ESCUCHA","LUIS ALBERTO GALEANO ESCUCHA","LUIS ALBERTO GALEANO ESCUCHA","Persona Natural",null,null,null,76000000,null,1,7600000,83600000,78026667,"2021-02-16","2021-02-23","2022-01-22",333,1,30,null,null,null,null,null,"X",null,null,0.93333333732057411]
["CPS-029-2021",2021,"FDLS-CD-024-2021","https://community.secop.gov.co/Public/Tendering/OpportunityDetail/Index?noticeUID=CO1.NTC.1774353&isFromPublicArea=True&isModal=False","Contratos de prestación de servicios profesionales y de apoyo a la gestión","Contratación directa","Prestación de servicios profesionales y de apoyo a la gestión, o para la ejecución de trabajos artísticos que sólo puedan encomendarse a determinadas personas naturales;","PRESTAR LOS SERVICIOS COMO INSPECTOR DE PARQUE AUTOMOTOR DE LA MAQUINARIA Y VEHÍCULOS PESADOS DE PROPIEDAD O TENENCIA DEL FONDO DE DESARROLLO LOCAL DE SUMAPAZ","Inversión","Un Nuevo Contrato Social y Ambiental para la Bogotá del Siglo XXI",57,{"$f":"IF(ISERROR(VLOOKUP(K42,Proposito_programa!$C$2:$E$59,2,FALSE)),\" \",VLOOKUP(K42,Proposito_programa!$C$2:$E$59,2,FALSE))","v":"Gestión pública local"},{"$f":"IF(ISERROR(VLOOKUP(K42,Proposito_programa!$C$2:$E$59,3,FALSE)),\" \",VLOOKUP(K42,Proposito_programa!$C$2:$E$59,3,FALSE))","v":"Propósito 5: Construir Bogotá - Región con gobierno abierto, transparente y ciudadanía consciente"},1696,null,79727160,"VICTOR MANUEL TORRES RAMIREZ","VICTOR MANUEL TORRES RAMIREZ","VICTOR MANUEL TORRES RAMIREZ","Persona Natural",null,null,null,26000000,null,null,null,26000000,24526667,"2021-02-17","2021-02-18","2021-12-17",302,null,null,null,null,null,null,null,null,"X",null,0.94333334615384612]
["CPS-030-2021",2021,"FDLS-CD-025-2021","https://community.secop.gov.co/Public/Tendering/OpportunityDetail/Index?noticeUID=CO1.NTC.1774772&isFromPublicArea=True&isModal=False","Contratos de prestación de servicios profesionales y de apoyo a la gestión","Contratación directa","Prestación de servicios profesionales y de apoyo a la gestión, o para la ejecución de trabajos artísticos que sólo puedan encomendarse a determinadas personas naturales;","PRESTAR LOS SERVICIOS COMO INSPECTOR DE PARQUE AUTOMOTOR DE LA MAQUINARIA Y VEHÍCULOS PESADOS DE PROPIEDAD O TENENCIA DEL FONDO DE DESARROLLO LOCAL DE SUMAPAZ","Inversión","Un Nuevo Contrato Social y Ambiental para la Bogotá del Siglo XXI",57,{"$f":"IF(ISERROR(VLOOKUP(K43,Proposito_programa!$C$2:$E$59,2,FALSE)),\" \",VLOOKUP(K43,Proposito_programa!$C$2:$E$59,2,FALSE))","v":"Gestión pública local"},{"$f":"IF(ISERROR(VLOOKUP(K43,Proposito_programa!$C$2:$E$59,3,FALSE)),\" \",VLOOKUP(K43,Proposito_programa!$C$2:$E$59,3,FALSE))","v":"Propósito 5: Construir Bogotá - Región con gobierno abierto, transparente y ciudadanía consciente"},1696,null,11388875,"WILLIAM OSVALDO RUBIANO TELLEZ","WILLIAM OSVALDO RUBIANO TELLEZ","WILLIAM OSVALDO RUBIANO TELLEZ","Persona Natural",null,null,null,26000000,null,1,2600000,28600000,26000000,"2021-02-17","2021-02-18","2022-01-17",333,1,30,null,null,null,null,null,"X",null,null,0.90909090909090906]
["CPS-031-2021",2021,"FDLS-CD-026-2021","https://community.secop.gov.co/Public/Tendering/OpportunityDetail/Index?noticeUID=CO1.NTC.1781546&isFromPublicArea=True&isModal=False","Contratos de prestación de servicios profesionales y de apoyo a la gestión","Contratación directa","Prestación de servicios profesionales y de apoyo a la gestión, o para la ejecución de trabajos artísticos que sólo puedan encomendarse a determinadas personas naturales;","PRESTAR SUS SERVICIOS DE APOYO ADMINISTRATIVO AL PARQUE AUTOMOTOR DE PROPIEDAD DEL FONDO DE DESARROLLO LOCAL DE SUMAPAZ","Inversión","Un Nuevo Contrato Social y Ambiental para la Bogotá del Siglo XXI",57,{"$f":"IF(ISERROR(VLOOKUP(K44,Proposito_programa!$C$2:$E$59,2,FALSE)),\" \",VLOOKUP(K44,Proposito_programa!$C$2:$E$59,2,FALSE))","v":"Gestión pública local"},{"$f":"IF(ISERROR(VLOOKUP(K44,Proposito_programa!$C$2:$E$59,3,FALSE)),\" \",VLOOKUP(K44,Proposito_programa!$C$2:$E$59,3,FALSE))","v":"Propósito 5: Construir Bogotá - Región con gobierno abierto, transparente y ciudadanía consciente"},1696,null,1023015837,"JULIAN FELIPE GUTIERREZ CARDONA","JULIAN FELIPE GUTIERREZ CARDONA","JULIAN FELIPE GUTIERREZ CARDONA","Persona Natural",null,null,null,25000000,null,null,null,25000000,20583333,"2021-02-18","2021-02-24","2021-12-23",302,null,null,null,null,null,null,null,null,"X",null,0.82333332000000004]
["CPS-032-2021",2021,"FDLS-CD-027-2021","https://community.secop.gov.co/Public/Tendering/OpportunityDetail/Index?noticeUID=CO1.NTC.1778162&isFromPublicArea=True&isModal=False","Contratos de prestación de servicios profesionales y de apoyo a la gestión","Contratación directa","Prestación de servicios profesionales y de apoyo a la gestión, o para la ejecución de trabajos artísticos que sólo puedan encomendarse a determinadas personas naturales;","PRESTAR LOS SERVICIOS COMO CONDUCTOR DE VEHÍCULOS PESADOS DE PROPIEDAD O TENENCIA DEL FONDO DE DESARROLLO LOCAL DE SUMAPAZ","Inversión","Un Nuevo Contrato Social y Ambiental para la Bogotá del Siglo XXI",57,{"$f":"IF(ISERROR(VLOOKUP(K45,Proposito_programa!$C$2:$E$59,2,FALSE)),\" \",VLOOKUP(K45,Proposito_programa!$C$2:$E$59,2,FALSE))","v":"Gestión pública local"},{"$f":"IF(ISERROR(VLOOKUP(K45,Proposito_programa!$C$2:$E$59,3,FALSE)),\" \",VLOOKUP(K45,Proposito_programa!$C$2:$E$59,3,FALSE))","v":"Propósito 5: Construir Bogotá - Región con gobierno abierto, transparente y ciudadanía consciente"},1696,null,80877733,"HILBER VERGARA ROBAYO","HILBER VERGARA ROBAYO","HILBER VERGARA ROBAYO","Persona Natural",null,null,null,25500000,null,1,2550000,28050000,26520000,"2021-02-18","2021-02-19","2022-01-18",333,1,30,null,null,null,null,null,"X",null,null,0.94545454545454544]
["CPS-033-2021",2021,"FDLS-CD-028-2021","https://community.secop.gov.co/Public/Tendering/OpportunityDetail/Index?noticeUID=CO1.NTC.1784955&isFromPublicArea=True&isModal=False","Contratos de prestación de servicios profesionales y de apoyo a la gestión","Contratación directa","Prestación de servicios profesionales y de apoyo a la gestión, o para la ejecución de trabajos artísticos que sólo puedan encomendarse a determinadas personas naturales;","PRESTAR LOS SERVICIOS COMO CONDUCTOR DE VEHÍCULOS PESADOS DE PROPIEDAD O TENENCIA DEL FONDO DE DESARROLLO LOCAL DE SUMAPAZ","Inversión","Un Nuevo Contrato Social y Ambiental para la Bogotá del Siglo XXI",57,{"$f":"IF(ISERROR(VLOOKUP(K46,Proposito_programa!$C$2:$E$59,2,FALSE)),\" \",VLOOKUP(K46,Proposito_programa!$C$2:$E$59,2,FALSE))","v":"Gestión pública local"},{"$f":"IF(ISERROR(VLOOKUP(K46,Proposito_programa!$C$2:$E$59,3,FALSE)),\" \",VLOOKUP(K46,Proposito_programa!$C$2:$E$59,3,FALSE))","v":"Propósito 5: Construir Bogotá - Región con gobierno abierto, transparente y ciudadanía consciente"},1696,null,11448287,"WILLIAM ESNEIDER CHINGATE PULIDO","WILLIAM ESNEIDER CHINGATE PULIDO","WILLIAM ESNEIDER CHINGATE PULIDO","Persona Natural",null,null,null,25500000,null,1,2550000,28050000,26095000,"2021-02-19","2021-02-24","2022-01-23",333,1,30,null,null,null,null,null,"X",null,null,0.9303030303030303]
["CPS-034-2021",2021,"FDLS-CD-028-2021","https://community.secop.gov.co/Public/Tendering/OpportunityDetail/Index?noticeUID=CO1.NTC.1784955&isFromPublicArea=True&isModal=False","Contratos de prestación de servicios profesionales y de apoyo a la gestión","Contratación directa","Prestación de servicios profesionales y de apoyo a la gestión, o para la ejecución de trabajos artísticos que sólo puedan encomendarse a determinadas personas naturales;","PRESTAR LOS SERVICIOS COMO CONDUCTOR DE VEHÍCULOS PESADOS DE PROPIEDAD O TENENCIA DEL FONDO DE DESARROLLO LOCAL DE SUMAPAZ","Inversión","Un Nuevo Contrato Social y Ambiental para la Bogotá del Siglo XXI",57,{"$f":"IF(ISERROR(VLOOKUP(K47,Proposito_programa!$C$2:$E$59,2,FALSE)),\" \",VLOOKUP(K47,Proposito_programa!$C$2:$E$59,2,FALSE))","v":"Gestión pública local"},{"$f":"IF(ISERROR(VLOOKUP(K47,Proposito_programa!$C$2:$E$59,3,FALSE)),\" \",VLOOKUP(K47,Proposito_programa!$C$2:$E$59,3,FALSE))","v":"Propósito 5: Construir Bogotá - Región con gobierno abierto, transparente y ciudadanía consciente"},1696,null,1022924525,"MOISES DELGADO VERGARA","MOISES DELGADO VERGARA","MOISES DELGADO VERGARA","Persona Natural",null,null,null,25500000,null,1,2550000,28050000,26095000,"2021-02-19","2021-02-24","2022-01-23",333,1,30,null,null,null,null,null,"X",null,null,0.9303030303030303]
["CPS-035-2021",2021,"FDLS-CD-029-2021","https://community.secop.gov.co/Public/Tendering/OpportunityDetail/Index?noticeUID=CO1.NTC.1782522&isFromPublicArea=True&isModal=False","Contratos de prestación de servicios profesionales y de apoyo a la gestión","Contratación directa","Prestación de servicios profesionales y de apoyo a la gestión, o para la ejecución de trabajos artísticos que sólo puedan encomendarse a determinadas personas naturales;","PRESTAR LOS SERVICIOS PROFESIONALES PARA APOYAR LA PLANEACIÓN DE LOS PROYECTOS DE INVERSIÓN DEL SECTOR DE PARTICIPACIÓN QUE EJECUTE EL FONDO DE DESARROLLO LOCAL DE SUMAPAZ","Inversión","Un Nuevo Contrato Social y Ambiental para la Bogotá del Siglo XXI",55,{"$f":"IF(ISERROR(VLOOKUP(K48,Proposito_programa!$C$2:$E$59,2,FALSE)),\" \",VLOOKUP(K48,Proposito_programa!$C$2:$E$59,2,FALSE))","v":"Fortalecimiento de cultura ciudadana y su institucionalidad"},{"$f":"IF(ISERROR(VLOOKUP(K48,Proposito_programa!$C$2:$E$59,3,FALSE)),\" \",VLOOKUP(K48,Proposito_programa!$C$2:$E$59,3,FALSE))","v":"Propósito 5: Construir Bogotá - Región con gobierno abierto, transparente y ciudadanía consciente"},1691,null,1015415370,"ANGIE CAROLINA PRIETO ALVARADO","ANGIE CAROLINA PRIETO ALVARADO","ANGIE CAROLINA PRIETO ALVARADO","Persona Natural",null,null,null,57000000,null,null,null,57000000,57000000,"2021-02-18","2021-02-23","2021-12-22",302,null,null,null,null,null,null,null,null,"X",null,1]
["CPS-036-2021",2021,"FDLS-CD-030-2021","https://community.secop.gov.co/Public/Tendering/OpportunityDetail/Index?noticeUID=CO1.NTC.1782418&isFromPublicArea=True&isModal=False","Contratos de prestación de servicios profesionales y de apoyo a la gestión","Contratación directa","Prestación de servicios profesionales y de apoyo a la gestión, o para la ejecución de trabajos artísticos que sólo puedan encomendarse a determinadas personas naturales;","PRESTAR SUS SERVICIOS PROFESIONALES AL ÁREA DE GESTIÓN DE DESARROLLO LOCAL PARA REALIZAR LA FORMULACIÓN, EJECUCIÓN Y SEGUIMIENTO DEL PROYECTO DE INVERSIÓN \" CONECTIVIDAD Y REDES DE COMUNICACIÓN \"","Inversión","Un Nuevo Contrato Social y Ambiental para la Bogotá del Siglo XXI",54,{"$f":"IF(ISERROR(VLOOKUP(K49,Proposito_programa!$C$2:$E$59,2,FALSE)),\" \",VLOOKUP(K49,Proposito_programa!$C$2:$E$59,2,FALSE))","v":"Transformación digital y gestión de TIC para un territorio inteligente"},{"$f":"IF(ISERROR(VLOOKUP(K49,Proposito_programa!$C$2:$E$59,3,FALSE)),\" \",VLOOKUP(K49,Proposito_programa!$C$2:$E$59,3,FALSE))","v":"Propósito 5: Construir Bogotá - Región con gobierno abierto, transparente y ciudadanía consciente"},1692,null,79889352,"JESUS EDIMER RONCANCIO RONCANCIO","JESUS EDIMER RONCANCIO RONCANCIO","JESUS EDIMER RONCANCIO RONCANCIO","Persona Natural",null,null,null,57000000,null,1,2850000,59850000,58710000,"2021-02-18","2021-02-22","2022-01-05",317,1,15,null,null,null,null,null,"X",null,null,0.98095238095238091]
["CPS-037-2021",2021,"FDLS-CD-031-2021","https://community.secop.gov.co/Public/Tendering/OpportunityDetail/Index?noticeUID=CO1.NTC.1777955&isFromPublicArea=True&isModal=False","Contratos de prestación de servicios profesionales y de apoyo a la gestión","Contratación directa","Prestación de servicios profesionales y de apoyo a la gestión, o para la ejecución de trabajos artísticos que sólo puedan encomendarse a determinadas personas naturales;","PRESTAR LOS SERVICIOS PROFESIONALES COORDINAR LA ARTICULACIÓN, ASISTENCIA Y ACOMPAÑAMIENTO DE LOS PROCESOS DE PLANEACIÓN LOCAL, PARA LA PROMOCIÓN DE LA PARTICIPACIÓN DE LAS MUJERES Y DE LA EQUIDAD DE GÉNERO, PARA MATERIALIZAR EN LA LOCALIDAD LAS ESTRATEGIAS DE TERRITORIALIZACIÓN Y TRANSVERSALIZACIÓN DE LA POLÍTICA PUBLICA DE MUJERES Y EQUIDAD DE GÉNERO, PPMYEG","Inversión","Un Nuevo Contrato Social y Ambiental para la Bogotá del Siglo XXI",40,{"$f":"IF(ISERROR(VLOOKUP(K50,Proposito_programa!$C$2:$E$59,2,FALSE)),\" \",VLOOKUP(K50,Proposito_programa!$C$2:$E$59,2,FALSE))","v":"Más mujeres viven una vida libre de violencias, se sienten seguras y acceden con confianza al sistema de justicia"},{"$f":"IF(ISERROR(VLOOKUP(K50,Proposito_programa!$C$2:$E$59,3,FALSE)),\" \",VLOOKUP(K50,Proposito_programa!$C$2:$E$59,3,FALSE))","v":"Propósito 3: Inspirar confianza y legitimidad para vivir sin miedo y ser epicentro de cultura ciudadana, paz y reconciliación"},1674,null,52008301,"ANA ROSA BAUTISTA RINCON","ANA ROSA BAUTISTA RINCON","ANA ROSA BAUTISTA RINCON","Persona Natural",null,null,null,57000000,null,null,null,57000000,53010000,"2021-02-18","2021-02-22","2021-12-21",302,null,null,null,null,null,null,null,null,"X",null,0.93]
["CPS-038-2021",2021,"FDLS-CD-032-2021","https://community.secop.gov.co/Public/Tendering/OpportunityDetail/Index?noticeUID=CO1.NTC.1779939&isFromPublicArea=True&isModal=False","Contratos de prestación de servicios profesionales y de apoyo a la gestión","Contratación directa","Prestación de servicios profesionales y de apoyo a la gestión, o para la ejecución de trabajos artísticos que sólo puedan encomendarse a determinadas personas naturales;","PRESTAR LOS SERVICIOS COMO CONDUCTOR DE VEHÍCULOS PESADOS DE PROPIEDAD O TENENCIA DEL FONDO DE DESARROLLO LOCAL DE SUMAPAZ","Inversión","Un Nuevo Contrato Social y Ambiental para la Bogotá del Siglo XXI",57,{"$f":"IF(ISERROR(VLOOKUP(K51,Proposito_programa!$C$2:$E$59,2,FALSE)),\" \",VLOOKUP(K51,Proposito_programa!$C$2:$E$59,2,FALSE))","v":"Gestión pública local"},{"$f":"IF(ISERROR(VLOOKUP(K51,Proposito_programa!$C$2:$E$59,3,FALSE)),\" \",VLOOKUP(K51,Proposito_programa!$C$2:$E$59,3,FALSE))","v":"Propósito 5: Construir Bogotá - Región con gobierno abierto, transparente y ciudadanía consciente"},1696,null,1007829181,"ELKIN ANDRES GARCIA CIFUENTES ","ELKIN ANDRÉS GARCIA CIFUENTES ","ELKIN ANDRÉS GARCIA CIFUENTES ","Persona Natural",null,null,null,25500000,null,1,2550000,28050000,26520000,"2021-02-18","2021-02-19","2022-01-18",333,1,30,null,null,null,null,null,"X",null,null,0.94545454545454544]
["CPS-039-2021",2021,"FDLS-CD-032-2021","https://community.secop.gov.co/Public/Tendering/OpportunityDetail/Index?noticeUID=CO1.NTC.1779939&isFromPublicArea=True&isModal=False","Contratos de prestación de servicios profesionales y de apoyo a la gestión","Contratación directa","Prestación de servicios profesionales y de apoyo a la gestión, o para la ejecución de trabajos artísticos que sólo puedan encomendarse a determinadas personas naturales;","PRESTAR LOS SERVICIOS COMO CONDUCTOR DE VEHÍCULOS PESADOS DE PROPIEDAD O TENENCIA DEL FONDO DE DESARROLLO LOCAL DE SUMAPAZ","Inversión","Un Nuevo Contrato Social y Ambiental para la Bogotá del Siglo XXI",57,{"$f":"IF(ISERROR(VLOOKUP(K52,Proposito_programa!$C$2:$E$59,2,FALSE)),\" \",VLOOKUP(K52,Proposito_programa!$C$2:$E$59,2,FALSE))","v":"Gestión pública local"},{"$f":"IF(ISERROR(VLOOKUP(K52,Proposito_programa!$C$2:$E$59,3,FALSE)),\" \",VLOOKUP(K52,Proposito_programa!$C$2:$E$59,3,FALSE))","v":"Propósito 5: Construir Bogotá - Región con gobierno abierto, transparente y ciudadanía consciente"},1696,null,79819241,"CARLOS JULIO PALACIOS RAMIREZ","CARLOS JULIO PALACIOS RAMIREZ","CARLOS JULIO PALACIOS RAMIREZ","Persona Natural",null,null,null,25500000,null,1,2550000,28050000,26520000,"2021-02-18","2021-02-19","2022-01-18",333,1,30,null,null,null,null,null,"X",null,null,0.94545454545454544]
["CPS-040-2021",2021,"FDLS-CD-033-2021","https://community.secop.gov.co/Public/Tendering/OpportunityDetail/Index?noticeUID=CO1.NTC.1795207&isFromPublicArea=True&isModal=False","Contratos de prestación de servicios profesionales y de apoyo a la gestión","Contratación directa","Prestación de servicios profesionales y de apoyo a la gestión, o para la ejecución de trabajos artísticos que sólo puedan encomendarse a determinadas personas naturales;","PRESTAR LOS SERVICIOS PROFESIONALES AL ÁREA DE GESTIÓN DE DESARROLLO LOCAL PARA APOYAR LA PLANEACIÓN, EJECUCIÓN Y SEGUIMIENTO A LOS PROYECTOS DE INVERSIÓN QUE LE SEAN DESIGNADOS","Inversión","Un Nuevo Contrato Social y Ambiental para la Bogotá del Siglo XXI",49,{"$f":"IF(ISERROR(VLOOKUP(K53,Proposito_programa!$C$2:$E$59,2,FALSE)),\" \",VLOOKUP(K53,Proposito_programa!$C$2:$E$59,2,FALSE))","v":"Movilidad segura, sostenible y accesible"},{"$f":"IF(ISERROR(VLOOKUP(K53,Proposito_programa!$C$2:$E$59,3,FALSE)),\" \",VLOOKUP(K53,Proposito_programa!$C$2:$E$59,3,FALSE))","v":"Propósito 4: Hacer de Bogotá Región un modelo de movilidad multimodal, incluyente y sostenible"},1688,null,1014239239,"ANAMARIA GOMEZ COLMENARES","ANAMARIA GOMEZ COLMENARES","ANAMARIA GOMEZ COLMENARES","Persona Natural",null,null,null,57000000,null,1,2850000,59850000,58140000,"2021-02-23","2021-02-25","2022-01-08",317,1,15,null,null,null,null,null,"X",null,null,0.97142857142857142]
["CPS-041-2021",2021,"FDLS-CD-034-2021","https://community.secop.gov.co/Public/Tendering/OpportunityDetail/Index?noticeUID=CO1.NTC.1787959&isFromPublicArea=True&isModal=False","Contratos de prestación de servicios profesionales y de apoyo a la gestión","Contratación directa","Prestación de servicios profesionales y de apoyo a la gestión, o para la ejecución de trabajos artísticos que sólo puedan encomendarse a determinadas personas naturales;","PRESTAR LOS SERVICIOS PROFESIONALES PARA APOYAR TÉCNICAMENTE A LOS RESPONSABLES E INTEGRANTES DE LOS PROCESOS EN LA IMPLEMENTACIÓN DE HERRAMIENTAS DE GESTIÓN, SIGUIENDO LOS LINEAMIENTOS METODOLÓGICOS ESTABLECIDOS POR LA OFICINA ASESORA DE PLANEACIÓN DE LA SECRETARÍA DISTRITAL DE GOBIERNO","Inversión","Un Nuevo Contrato Social y Ambiental para la Bogotá del Siglo XXI",57,{"$f":"IF(ISERROR(VLOOKUP(K54,Proposito_programa!$C$2:$E$59,2,FALSE)),\" \",VLOOKUP(K54,Proposito_programa!$C$2:$E$59,2,FALSE))","v":"Gestión pública local"},{"$f":"IF(ISERROR(VLOOKUP(K54,Proposito_programa!$C$2:$E$59,3,FALSE)),\" \",VLOOKUP(K54,Proposito_programa!$C$2:$E$59,3,FALSE))","v":"Propósito 5: Construir Bogotá - Región con gobierno abierto, transparente y ciudadanía consciente"},1696,null,52211430,"GLORIA ESPERANZA PIRAJON TEJEDOR","GLORIA ESPERANZA PIRAJON TEJEDOR","GLORIA ESPERANZA PIRAJON TEJEDOR","Persona Natural",null,null,null,65000000,null,1,3250000,68250000,66300000,"2021-02-22","2021-02-25","2022-01-08",317,1,15,null,null,null,null,null,"X",null,null,0.97142857142857142]
["CPS-042-2021",2021,"FDLS-CD-036-2021","https://community.secop.gov.co/Public/Tendering/OpportunityDetail/Index?noticeUID=CO1.NTC.1788063&isFromPublicArea=True&isModal=False","Contratos de prestación de servicios profesionales y de apoyo a la gestión","Contratación directa","Prestación de servicios profesionales y de apoyo a la gestión, o para la ejecución de trabajos artísticos que sólo puedan encomendarse a determinadas personas naturales;","PRESTAR LOS SERVICIOS PROFESIONALES PARA APOYAR JURÍDICAMENTE LAS RESPUESTAS A LAS SOLICITUDES RADICADAS POR LOS ENTES DE CONTROL, CONCEJO DE BOGOTÁ Y TEMAS RELACIONADOS CON PLANES DE MEJORAMIENTO DE LA ALCALDÍA LOCAL DE SUMAPAZ.","Inversión","Un Nuevo Contrato Social y Ambiental para la Bogotá del Siglo XXI",57,{"$f":"IF(ISERROR(VLOOKUP(K55,Proposito_programa!$C$2:$E$59,2,FALSE)),\" \",VLOOKUP(K55,Proposito_programa!$C$2:$E$59,2,FALSE))","v":"Gestión pública local"},{"$f":"IF(ISERROR(VLOOKUP(K55,Proposito_programa!$C$2:$E$59,3,FALSE)),\" \",VLOOKUP(K55,Proposito_programa!$C$2:$E$59,3,FALSE))","v":"Propósito 5: Construir Bogotá - Región con gobierno abierto, transparente y ciudadanía consciente"},1696,null,52516975,"NINI JOHANA GUTIERREZ TORRES ","NINI JOHANA GUTIERREZ TORRES ","NINI JOHANA GUTIERREZ TORRES ","Persona Natural",null,null,null,43500000,null,null,null,43500000,10440000,"2021-02-22","2021-02-23","2021-05-05",71,null,null,null,null,null,null,null,null,"X",null,0.24]
["CPS-043-2021",2021,"FDLS-CD-037-2021","https://community.secop.gov.co/Public/Tendering/OpportunityDetail/Index?noticeUID=CO1.NTC.1785036&isFromPublicArea=True&isModal=False","Contratos de prestación de servicios profesionales y de apoyo a la gestión","Contratación directa","Prestación de servicios profesionales y de apoyo a la gestión, o para la ejecución de trabajos artísticos que sólo puedan encomendarse a determinadas personas naturales;","PRESTAR LOS SERVICIOS COMO AUXILIAR ADMINISTRATIVO QUE APOYE LAS ACTIVIDADES DE PARQUE AUTOMOTOR EN LA ALCALDÍA LOCAL DE SUMAPAZ","Inversión","Un Nuevo Contrato Social y Ambiental para la Bogotá del Siglo XXI",57,{"$f":"IF(ISERROR(VLOOKUP(K56,Proposito_programa!$C$2:$E$59,2,FALSE)),\" \",VLOOKUP(K56,Proposito_programa!$C$2:$E$59,2,FALSE))","v":"Gestión pública local"},{"$f":"IF(ISERROR(VLOOKUP(K56,Proposito_programa!$C$2:$E$59,3,FALSE)),\" \",VLOOKUP(K56,Proposito_programa!$C$2:$E$59,3,FALSE))","v":"Propósito 5: Construir Bogotá - Región con gobierno abierto, transparente y ciudadanía consciente"},1696,null,52558577,"GLORIA ISABEL AGUILERA ACOSTA","GLORIA ISABEL AGUILERA ACOSTA","GLORIA ISABEL AGUILERA ACOSTA","Persona Natural",null,null,null,39000000,null,null,null,39000000,39000000,"2021-02-19","2021-02-19","2021-12-18",302,null,null,null,null,null,null,null,null,"X",null,1]
["CPS-044-2021",2021,"FDLS-CD-038-2021","https://community.secop.gov.co/Public/Tendering/OpportunityDetail/Index?noticeUID=CO1.NTC.1784980&isFromPublicArea=True&isModal=False","Contratos de prestación de servicios profesionales y de apoyo a la gestión","Contratación directa","Prestación de servicios profesionales y de apoyo a la gestión, o para la ejecución de trabajos artísticos que sólo puedan encomendarse a determinadas personas naturales;","PRESTAR LOS SERVICIOS COMO AUXILIAR ADMINISTRATIVO PARA LA CORREGIDURÍA DE SAN JUAN","Inversión","Un Nuevo Contrato Social y Ambiental para la Bogotá del Siglo XXI",57,{"$f":"IF(ISERROR(VLOOKUP(K57,Proposito_programa!$C$2:$E$59,2,FALSE)),\" \",VLOOKUP(K57,Proposito_programa!$C$2:$E$59,2,FALSE))","v":"Gestión pública local"},{"$f":"IF(ISERROR(VLOOKUP(K57,Proposito_programa!$C$2:$E$59,3,FALSE)),\" \",VLOOKUP(K57,Proposito_programa!$C$2:$E$59,3,FALSE))","v":"Propósito 5: Construir Bogotá - Región con gobierno abierto, transparente y ciudadanía consciente"},1696,null,1016031740,"DEICY AMPARO MORALES TORRES","DEICY AMPARO MORALES TORRES","DEICY AMPARO MORALES TORRES","Persona Natural",null,null,null,23000000,null,null,null,23000000,21236662,"2021-02-19","2021-02-24","2021-12-23",302,null,null,null,null,null,null,null,null,"X",null,0.9233331304347826]
["CPS-045-2021",2021,"FDLS-CD-039-2021","https://community.secop.gov.co/Public/Tendering/OpportunityDetail/Index?noticeUID=CO1.NTC.1786925&isFromPublicArea=True&isModal=False","Contratos de prestación de servicios profesionales y de apoyo a la gestión","Contratación directa","Prestación de servicios profesionales y de apoyo a la gestión, o para la ejecución de trabajos artísticos que sólo puedan encomendarse a determinadas personas naturales;","PRESTAR LOS SERVICIOS COMO AUXILIAR ADMINISTRATIVO PARA EL CENTRO DE DOCUMENTACIÓN E INFORMACIÓN C.D.I. DE LA ALCALDÍA LOCAL DE SUMAPAZ","Inversión","Un Nuevo Contrato Social y Ambiental para la Bogotá del Siglo XXI",57,{"$f":"IF(ISERROR(VLOOKUP(K58,Proposito_programa!$C$2:$E$59,2,FALSE)),\" \",VLOOKUP(K58,Proposito_programa!$C$2:$E$59,2,FALSE))","v":"Gestión pública local"},{"$f":"IF(ISERROR(VLOOKUP(K58,Proposito_programa!$C$2:$E$59,3,FALSE)),\" \",VLOOKUP(K58,Proposito_programa!$C$2:$E$59,3,FALSE))","v":"Propósito 5: Construir Bogotá - Región con gobierno abierto, transparente y ciudadanía consciente"},1696,null,1014306050,"PAULA VALENTINA ARIZA HOLGUIN","PAULA VALENTINA ARIZA HOLGUIN","PAULA VALENTINA ARIZA HOLGUIN","Persona Natural",null,null,null,26000000,null,1,1300000,27300000,26693333,"2021-02-22","2021-02-23","2022-01-06",317,1,15,null,null,null,null,null,"X",null,null,0.97777776556776552]
["CPS-046-2021",2021,"FDLS-CD-040-2021","https://community.secop.gov.co/Public/Tendering/OpportunityDetail/Index?noticeUID=CO1.NTC.1784477&isFromPublicArea=True&isModal=False","Contratos de prestación de servicios profesionales y de apoyo a la gestión","Contratación directa","Prestación de servicios profesionales y de apoyo a la gestión, o para la ejecución de trabajos artísticos que sólo puedan encomendarse a determinadas personas naturales;","PRESTAR SUS SERVICIOS PROFESIONALES DE APOYO AL ÁREA DE GESTIÓN DE DESARROLLO LOCAL EN LOS TEMAS CONTABLES Y PRESUPUESTALES DEL FONDO DE DESARROLLO LOCAL DE SUMAPAZ","Inversión","Un Nuevo Contrato Social y Ambiental para la Bogotá del Siglo XXI",57,{"$f":"IF(ISERROR(VLOOKUP(K59,Proposito_programa!$C$2:$E$59,2,FALSE)),\" \",VLOOKUP(K59,Proposito_programa!$C$2:$E$59,2,FALSE))","v":"Gestión pública local"},{"$f":"IF(ISERROR(VLOOKUP(K59,Proposito_programa!$C$2:$E$59,3,FALSE)),\" \",VLOOKUP(K59,Proposito_programa!$C$2:$E$59,3,FALSE))","v":"Propósito 5: Construir Bogotá - Región con gobierno abierto, transparente y ciudadanía consciente"},1696,null,79639287,"ELKIN RAUL OSWALDO CASTAÑEDA DURAN","ELKIN RAUL OSWALDO CASTAÑEDA DURAN","ELKIN RAUL OSWALDO CASTAÑEDA DURAN","Persona Natural",null,null,null,62000000,null,1,3100000,65100000,63653333,"2021-02-19","2021-02-23","2022-01-06",317,1,15,null,null,null,null,null,"X",null,null,0.97777777265745003]
["CPS-047-2021",2021,"FDLS-CD-051-2021","https://community.secop.gov.co/Public/Tendering/OpportunityDetail/Index?noticeUID=CO1.NTC.1790554&isFromPublicArea=True&isModal=False","Contratos de prestación de servicios profesionales y de apoyo a la gestión","Contratación directa","Prestación de servicios profesionales y de apoyo a la gestión, o para la ejecución de trabajos artísticos que sólo puedan encomendarse a determinadas personas naturales;","PRESTAR LOS SERVICIOS PROFESIONALES PARA APOYAR LA PLANEACIÓN, SEGUIMIENTO, EJECUCIÓN Y CONTROL DE LOS PROYECTOS ENFOCADOS A LA MITIGACIÓN Y GESTIÓN DEL RIESGO Y ADAPTACIÓN AL CAMBIO CLIMÁTICO PARA LA CONSERVACIÓN DEL MEDIO AMBIENTE Y LOS RECURSOS NATURALES RENOVABLES EXISTENTES EN LA LOCALIDAD DE SUMAPAZ","Inversión","Un Nuevo Contrato Social y Ambiental para la Bogotá del Siglo XXI",30,{"$f":"IF(ISERROR(VLOOKUP(K60,Proposito_programa!$C$2:$E$59,2,FALSE)),\" \",VLOOKUP(K60,Proposito_programa!$C$2:$E$59,2,FALSE))","v":"Eficiencia en la atención de emergencias"},{"$f":"IF(ISERROR(VLOOKUP(K60,Proposito_programa!$C$2:$E$59,3,FALSE)),\" \",VLOOKUP(K60,Proposito_programa!$C$2:$E$59,3,FALSE))","v":"Propósito 2 : Cambiar Nuestros Hábitos de Vida para Reverdecer a Bogotá y Adaptarnos y Mitigar la Crisis Climática"},1652,null,1032656281,"WILMAR GILDARDO TORRES TORRES",null,"WILMAR GILDARDO TORRES TORRES","Persona Natural",null,null,null,57000000,null,null,null,57000000,null,"2021-02-23","2021-02-25","2021-12-23",302,null,null,null,null,null,null,null,null,"X",null,0]
["CPS-048-2021",2021,"FDLS-CD-041-2021","https://community.secop.gov.co/Public/Tendering/OpportunityDetail/Index?noticeUID=CO1.NTC.1783286&isFromPublicArea=True&isModal=False","Contratos de prestación de servicios profesionales y de apoyo a la gestión","Contratación directa","Prestación de servicios profesionales y de apoyo a la gestión, o para la ejecución de trabajos artísticos que sólo puedan encomendarse a determinadas personas naturales;","PRESTAR LOS SERVICIOS COMO AUXILIAR ADMINISTRATIVO PARA LA CORREGIDURÍA DE BETANIA","Inversión","Un Nuevo Contrato Social y Ambiental para la Bogotá del Siglo XXI",57,{"$f":"IF(ISERROR(VLOOKUP(K61,Proposito_programa!$C$2:$E$59,2,FALSE)),\" \",VLOOKUP(K61,Proposito_programa!$C$2:$E$59,2,FALSE))","v":"Gestión pública local"},{"$f":"IF(ISERROR(VLOOKUP(K61,Proposito_programa!$C$2:$E$59,3,FALSE)),\" \",VLOOKUP(K61,Proposito_programa!$C$2:$E$59,3,FALSE))","v":"Propósito 5: Construir Bogotá - Región con gobierno abierto, transparente y ciudadanía consciente"},1696,null,1032656360,"DIANA LUCIA RAMIREZ MUÑOZ","DIANA LUCÍA RAMIREZ MUÑOZ","DIANA LUCÍA RAMIREZ MUÑOZ","Persona Natural",null,null,null,23000000,null,null,null,23000000,57000000,"2021-02-16","2021-02-24","2021-12-24",302,null,null,null,null,null,null,null,null,"X",null,2.4782608695652173]
["CPS-049-2021",2021,"FDLS-CD-042-2021","https://community.secop.gov.co/Public/Tendering/OpportunityDetail/Index?noticeUID=CO1.NTC.1797083&isFromPublicArea=True&isModal=False","Contratos de prestación de servicios profesionales y de apoyo a la gestión","Contratación directa","Prestación de servicios profesionales y de apoyo a la gestión, o para la ejecución de trabajos artísticos que sólo puedan encomendarse a determinadas personas naturales;","PRESTAR LOS SERVICIOS TÉCNICOS PARA LA OPERACIÓN, SEGUIMIENTO Y CUMPLIMIENTO DE LOS PROCESOS Y PROCEDIMIENTOS DEL SERVICIO APOYOS PARA LA SEGURIDAD ECONÓMICA TIPO C, REQUERIDOS PARA EL OPORTUNO Y ADECUADO REGISTRO, CRUCE Y REPORTE DE LOS DATOS EN EL SISTEMA MISIONAL–SIRBE, QUE CONTRIBUYAN A LA GARANTÍA DE LOS DERECHOS DE LA POBLACIÓN MAYOR EN EL MARCO DE LA POLÍTICA PÚBLICA SOCIAL PARA EL ENVEJECIMIENTO Y LA VEJEZ1 EN EL DISTRITO CAPITAL A CARGO DE LA ALCALDÍA LOCAL","Inversión","Un Nuevo Contrato Social y Ambiental para la Bogotá del Siglo XXI",1,{"$f":"IF(ISERROR(VLOOKUP(K62,Proposito_programa!$C$2:$E$59,2,FALSE)),\" \",VLOOKUP(K62,Proposito_programa!$C$2:$E$59,2,FALSE))","v":"Subsidios y transferencias para la equidad"},{"$f":"IF(ISERROR(VLOOKUP(K62,Proposito_programa!$C$2:$E$59,3,FALSE)),\" \",VLOOKUP(K62,Proposito_programa!$C$2:$E$59,3,FALSE))","v":"Propósito 1: Hacer un nuevo contrato social para incrementar la inclusión social, productiva y política"},1583,null,1022998108,"CRISTIAN ANDRES VASQUEZ CHINGATE","CRISTIAN ANDRES VASQUEZ CHINGATE","CRISTIAN ANDRES VASQUEZ CHINGATE","Persona Natural",null,null,null,31000000,null,null,null,31000000,21236666,"2021-02-24","2021-02-25","2021-12-23",302,null,null,null,null,null,null,null,null,"X",null,0.68505374193548385]
["CPS-050-2021",2021,"FDLS-CD-043-2021","https://community.secop.gov.co/Public/Tendering/OpportunityDetail/Index?noticeUID=CO1.NTC.1787828&isFromPublicArea=True&isModal=False","Contratos de prestación de servicios profesionales y de apoyo a la gestión","Contratación directa","Prestación de servicios profesionales y de apoyo a la gestión, o para la ejecución de trabajos artísticos que sólo puedan encomendarse a determinadas personas naturales;","PRESTAR SUS SERVICIOS PROFESIONALES DE APOYO AL ÁREA DE GESTIÓN DEL DESARROLLO LOCAL EN ASPECTOS DE CONTRATACIÓN DEL FONDO DE DESARROLLO LOCAL DE SUMAPAZ","Inversión","Un Nuevo Contrato Social y Ambiental para la Bogotá del Siglo XXI",57,{"$f":"IF(ISERROR(VLOOKUP(K63,Proposito_programa!$C$2:$E$59,2,FALSE)),\" \",VLOOKUP(K63,Proposito_programa!$C$2:$E$59,2,FALSE))","v":"Gestión pública local"},{"$f":"IF(ISERROR(VLOOKUP(K63,Proposito_programa!$C$2:$E$59,3,FALSE)),\" \",VLOOKUP(K63,Proposito_programa!$C$2:$E$59,3,FALSE))","v":"Propósito 5: Construir Bogotá - Región con gobierno abierto, transparente y ciudadanía consciente"},1696,null,9695442,"LUIS EDUARDO VILLEGAS GIL","LUIS EDUARDO VILLEGAS GIL","LUIS EDUARDO VILLEGAS GIL","Persona Natural",null,null,null,43500000,null,null,null,43500000,31000000,"2021-02-22","2021-02-24","2021-03-26",30,null,null,null,null,null,null,null,null,"X",null,0.71264367816091956]
["CPS-051-2021",2021,"FDLS-CD-044-2021","https://community.secop.gov.co/Public/Tendering/OpportunityDetail/Index?noticeUID=CO1.NTC.1788133&isFromPublicArea=True&isModal=False","Contratos de prestación de servicios profesionales y de apoyo a la gestión","Contratación directa","Prestación de servicios profesionales y de apoyo a la gestión, o para la ejecución de trabajos artísticos que sólo puedan encomendarse a determinadas personas naturales;","PRESTAR SUS SERVICIOS COMO PROFESIONAL DE APOYO A LA GESTIÓN PARA DAR RESPUESTA A DERECHOS DE PETICIÓN Y DEMÁS REQUERIMIENTOS RELACIONADOS CON LOS PROCESOS CONTRACTUALES DEL FONDO DE DESARROLLO LOCAL DE SUMAPAZ","Inversión","Un Nuevo Contrato Social y Ambiental para la Bogotá del Siglo XXI",57,{"$f":"IF(ISERROR(VLOOKUP(K64,Proposito_programa!$C$2:$E$59,2,FALSE)),\" \",VLOOKUP(K64,Proposito_programa!$C$2:$E$59,2,FALSE))","v":"Gestión pública local"},{"$f":"IF(ISERROR(VLOOKUP(K64,Proposito_programa!$C$2:$E$59,3,FALSE)),\" \",VLOOKUP(K64,Proposito_programa!$C$2:$E$59,3,FALSE))","v":"Propósito 5: Construir Bogotá - Región con gobierno abierto, transparente y ciudadanía consciente"},1696,null,1020802394,"JESSICA JULIETH CARDONA JARAMILLO","JESSICA JULIETH CARDONA JARAMILLO","JESSICA JULIETH CARDONA JARAMILLO","Persona Natural",null,null,null,43650000,null,1,2182500,45832500,4640000,"2021-02-22","2021-02-24","2022-01-07",317,1,15,null,null,null,null,null,"X",null,null,0.10123820433098783]
["CPS-052-2021",2021,"FDLS-CD-045-2021","https://community.secop.gov.co/Public/Tendering/OpportunityDetail/Index?noticeUID=CO1.NTC.1796393&isFromPublicArea=True&isModal=False","Contratos de prestación de servicios profesionales y de apoyo a la gestión","Contratación directa","Prestación de servicios profesionales y de apoyo a la gestión, o para la ejecución de trabajos artísticos que sólo puedan encomendarse a determinadas personas naturales;","PRESTAR LOS SERVICIOS PROFESIONALES AL ÁREA DE GESTIÓN DE DESARROLLO LOCAL PARA APOYAR LA PLANEACIÓN, EJECUCIÓN Y SEGUIMIENTO A LOS PROYECTOS DE INVERSIÓN DE INFRAESTRUCTURA VIAL QUE LE SEAN DESIGNADOS","Inversión","Un Nuevo Contrato Social y Ambiental para la Bogotá del Siglo XXI",49,{"$f":"IF(ISERROR(VLOOKUP(K65,Proposito_programa!$C$2:$E$59,2,FALSE)),\" \",VLOOKUP(K65,Proposito_programa!$C$2:$E$59,2,FALSE))","v":"Movilidad segura, sostenible y accesible"},{"$f":"IF(ISERROR(VLOOKUP(K65,Proposito_programa!$C$2:$E$59,3,FALSE)),\" \",VLOOKUP(K65,Proposito_programa!$C$2:$E$59,3,FALSE))","v":"Propósito 4: Hacer de Bogotá Región un modelo de movilidad multimodal, incluyente y sostenible"},1688,null,1014264950,"VALENTINA MARTINEZ MUÑOZ","VALENTINA MARTINEZ MUÑOZ","VALENTINA MARTINEZ MUÑOZ","Persona Natural",null,null,null,57000000,null,1,2850000,59850000,44668500,"2021-02-24","2021-02-26","2022-01-09",317,1,15,null,null,null,null,null,"X",null,null,0.74634085213032586]
["CPS-053-2021",2021,"FDLS-CD-046-2021","https://community.secop.gov.co/Public/Tendering/OpportunityDetail/Index?noticeUID=CO1.NTC.1794105&isFromPublicArea=True&isModal=False","Contratos de prestación de servicios profesionales y de apoyo a la gestión","Contratación directa","Prestación de servicios profesionales y de apoyo a la gestión, o para la ejecución de trabajos artísticos que sólo puedan encomendarse a determinadas personas naturales;","PRESTAR LOS SERVICIOS PROFESIONALES PARA APOYAR LA PLANEACIÓN, LA EJECUCIÓN Y SEGUIMIENTO DE LOS PROYECTOS DE INVERSIÓN EN LOS TEMAS DE RECREACIÓN Y DEPORTE QUE EJECUTE EL FONDO DE DESARROLLO LOCAL DE SUMAPAZ","Inversión","Un Nuevo Contrato Social y Ambiental para la Bogotá del Siglo XXI",20,{"$f":"IF(ISERROR(VLOOKUP(K66,Proposito_programa!$C$2:$E$59,2,FALSE)),\" \",VLOOKUP(K66,Proposito_programa!$C$2:$E$59,2,FALSE))","v":"Bogotá, referente en cultura, deporte, recreación y actividad física, con parques para el desarrollo y la salud"},{"$f":"IF(ISERROR(VLOOKUP(K66,Proposito_programa!$C$2:$E$59,3,FALSE)),\" \",VLOOKUP(K66,Proposito_programa!$C$2:$E$59,3,FALSE))","v":"Propósito 1: Hacer un nuevo contrato social para incrementar la inclusión social, productiva y política"},1590,null,1016062253,"JENNY MARCELA GONZALEZ MARTIN","JENNY MARCELA GONZALEZ MARTIN","JENNY MARCELA GONZALEZ MARTIN","Persona Natural",null,null,null,57000000,null,null,null,57000000,57950000,"2021-02-23","2021-02-25","2021-12-24",302,null,null,null,null,null,null,null,null,"X",null,1.0166666666666666]
["CPS-054-2021",2021,"FDLS-CD-047-2021","https://community.secop.gov.co/Public/Tendering/OpportunityDetail/Index?noticeUID=CO1.NTC.1792503&isFromPublicArea=True&isModal=False","Contratos de prestación de servicios profesionales y de apoyo a la gestión","Contratación directa","Prestación de servicios profesionales y de apoyo a la gestión, o para la ejecución de trabajos artísticos que sólo puedan encomendarse a determinadas personas naturales;","PRESTAR LOS SERVICIOS COMO CONDUCTOR DE VEHÍCULOS LIVIANOS DE PROPIEDAD O TENENCIA DEL FONDO DE DESARROLLO LOCAL DE SUMAPAZ","Inversión","Un Nuevo Contrato Social y Ambiental para la Bogotá del Siglo XXI",57,{"$f":"IF(ISERROR(VLOOKUP(K67,Proposito_programa!$C$2:$E$59,2,FALSE)),\" \",VLOOKUP(K67,Proposito_programa!$C$2:$E$59,2,FALSE))","v":"Gestión pública local"},{"$f":"IF(ISERROR(VLOOKUP(K67,Proposito_programa!$C$2:$E$59,3,FALSE)),\" \",VLOOKUP(K67,Proposito_programa!$C$2:$E$59,3,FALSE))","v":"Propósito 5: Construir Bogotá - Región con gobierno abierto, transparente y ciudadanía consciente"},1696,null,79763739,"WILLIAN FERNANDO PORRAS LOPEZ","WILLIAN FERNANDO PORRAS LOPEZ","WILLIAN FERNANDO PORRAS LOPEZ","Persona Natural",null,null,null,25500000,null,1,2550000,28050000,52440000,"2021-02-23","2021-02-25","2022-01-24",333,1,30,null,null,null,null,null,"X",null,null,1.8695187165775402]
["CPS-055-2021",2021,"FDLS-CD-048-2021","https://community.secop.gov.co/Public/Tendering/OpportunityDetail/Index?noticeUID=CO1.NTC.1791926&isFromPublicArea=True&isModal=False","Contratos de prestación de servicios profesionales y de apoyo a la gestión","Contratación directa","Prestación de servicios profesionales y de apoyo a la gestión, o para la ejecución de trabajos artísticos que sólo puedan encomendarse a determinadas personas naturales;","PRESTAR LOS SERVICIOS PROFESIONALES PARA APOYAR LA PLANEACIÓN, SEGUIMIENTO, EJECUCIÓN Y CONTROL DE LAS ACTIVIDADES AGROPECUARIAS ENFOCADAS A PROMOVER EL DESARROLLO RURAL SOSTENIBLE, EN LA LOCALIDAD DE SUMAPAZ","Inversión","Un Nuevo Contrato Social y Ambiental para la Bogotá del Siglo XXI",34,{"$f":"IF(ISERROR(VLOOKUP(K68,Proposito_programa!$C$2:$E$59,2,FALSE)),\" \",VLOOKUP(K68,Proposito_programa!$C$2:$E$59,2,FALSE))","v":"Bogotá protectora de los animales"},{"$f":"IF(ISERROR(VLOOKUP(K68,Proposito_programa!$C$2:$E$59,3,FALSE)),\" \",VLOOKUP(K68,Proposito_programa!$C$2:$E$59,3,FALSE))","v":"Propósito 2 : Cambiar Nuestros Hábitos de Vida para Reverdecer a Bogotá y Adaptarnos y Mitigar la Crisis Climática"},1666,null,79381209,"WILSON REY MORENO","WILSON REY MORENO","WILSON REY MORENO","Persona Natural",null,null,null,57000000,null,null,null,57000000,26010000,"2021-02-23","2021-03-01","2021-12-31",305,null,null,null,null,null,null,null,"X",null,null,0.45631578947368423]
["CPS-056-2021",2021,"FDLS-CD-049-2021","https://community.secop.gov.co/Public/Tendering/OpportunityDetail/Index?noticeUID=CO1.NTC.1797447&isFromPublicArea=True&isModal=False","Contratos de prestación de servicios profesionales y de apoyo a la gestión","Contratación directa","Prestación de servicios profesionales y de apoyo a la gestión, o para la ejecución de trabajos artísticos que sólo puedan encomendarse a determinadas personas naturales;","PRESTAR SUS SERVICIOS PROFESIONALES AL ALMACÉN DEL FONDO DE DESARROLLO LOCAL DE SUMAPAZ","Inversión","Un Nuevo Contrato Social y Ambiental para la Bogotá del Siglo XXI",57,{"$f":"IF(ISERROR(VLOOKUP(K69,Proposito_programa!$C$2:$E$59,2,FALSE)),\" \",VLOOKUP(K69,Proposito_programa!$C$2:$E$59,2,FALSE))","v":"Gestión pública local"},{"$f":"IF(ISERROR(VLOOKUP(K69,Proposito_programa!$C$2:$E$59,3,FALSE)),\" \",VLOOKUP(K69,Proposito_programa!$C$2:$E$59,3,FALSE))","v":"Propósito 5: Construir Bogotá - Región con gobierno abierto, transparente y ciudadanía consciente"},1696,null,1053803005,"YEINER GARCIA MARIN","YEINER GARCÍA MARÍN","YEINER GARCÍA MARÍN","Persona Natural",null,null,null,43650000,null,null,null,43650000,51300000,"2021-02-24","2021-02-26","2021-11-10",257,null,null,null,null,null,null,null,null,"X",null,1.1752577319587629]
["CPS-057-2021",2021,"FDLS-CD-050-2021","https://community.secop.gov.co/Public/Tendering/OpportunityDetail/Index?noticeUID=CO1.NTC.1802241&isFromPublicArea=True&isModal=False","Contratos de prestación de servicios profesionales y de apoyo a la gestión","Contratación directa","Prestación de servicios profesionales y de apoyo a la gestión, o para la ejecución de trabajos artísticos que sólo puedan encomendarse a determinadas personas naturales;","PRESTAR SUS SERVICIOS COMO TÉCNICO DE APOYO ADMINISTRATIVO AL ÁREA DE GESTIÓN DE DESARROLLO LOCAL EN LOS PROCESOS CONTRACTUALES DE LA ALCALDÍA LOCAL DE SUMAPAZ","Inversión","Un Nuevo Contrato Social y Ambiental para la Bogotá del Siglo XXI",57,{"$f":"IF(ISERROR(VLOOKUP(K70,Proposito_programa!$C$2:$E$59,2,FALSE)),\" \",VLOOKUP(K70,Proposito_programa!$C$2:$E$59,2,FALSE))","v":"Gestión pública local"},{"$f":"IF(ISERROR(VLOOKUP(K70,Proposito_programa!$C$2:$E$59,3,FALSE)),\" \",VLOOKUP(K70,Proposito_programa!$C$2:$E$59,3,FALSE))","v":"Propósito 5: Construir Bogotá - Región con gobierno abierto, transparente y ciudadanía consciente"},1696,null,53074893,"MARLEN MAZANORY PARRA BORREGO","MARLEN MAZANORY PARRA BORREGO","MARLEN MAZANORY PARRA BORREGO","Persona Natural",null,null,null,38000000,null,null,null,38000000,35647500,"2021-02-25","2021-03-02","2022-01-01",305,null,null,null,null,null,null,null,"X",null,null,0.93809210526315789]
["CPS-058-2021",2021,"FDLS-CD-052-2021","https://community.secop.gov.co/Public/Tendering/OpportunityDetail/Index?noticeUID=CO1.NTC.1791684&isFromPublicArea=True&isModal=False","Contratos de prestación de servicios profesionales y de apoyo a la gestión","Contratación directa","Prestación de servicios profesionales y de apoyo a la gestión, o para la ejecución de trabajos artísticos que sólo puedan encomendarse a determinadas personas naturales;","PRESTAR LOS SERVICIOS PROFESIONALES PARA APOYAR LA PLANEACIÓN, SEGUIMIENTO, EJECUCIÓN Y CONTROL DE LOS PROYECTOS ENFOCADOS A LA RESTAURACIÓN ECOLÓGICA RURAL Y, ATENDER LA GESTIÓN AMBIENTAL EXTERNA EN LA LOCALIDAD DE SUMAPAZ","Inversión","Un Nuevo Contrato Social y Ambiental para la Bogotá del Siglo XXI",28,{"$f":"IF(ISERROR(VLOOKUP(K71,Proposito_programa!$C$2:$E$59,2,FALSE)),\" \",VLOOKUP(K71,Proposito_programa!$C$2:$E$59,2,FALSE))","v":"Bogotá protectora de sus recursos naturales"},{"$f":"IF(ISERROR(VLOOKUP(K71,Proposito_programa!$C$2:$E$59,3,FALSE)),\" \",VLOOKUP(K71,Proposito_programa!$C$2:$E$59,3,FALSE))","v":"Propósito 2 : Cambiar Nuestros Hábitos de Vida para Reverdecer a Bogotá y Adaptarnos y Mitigar la Crisis Climática"},1651,null,1026277892,"WILLIAM ANDRES HERRERA PABON","WILMAR GILDARDO TORRES TORRES","WILLIAM ANDRÉS HERRERA PABÓN","Persona Natural",null,null,null,57000000,null,null,null,57000000,34073333,"2021-02-23","2021-03-03","2022-01-02",307,null,null,null,null,null,null,null,"X",null,null,0.59777777192982451]
["CPS-059-2021",2021,"FDLS-CD-053-2021","https://community.secop.gov.co/Public/Tendering/OpportunityDetail/Index?noticeUID=CO1.NTC.1792580&isFromPublicArea=True&isModal=False","Contratos de prestación de servicios profesionales y de apoyo a la gestión","Contratación directa","Prestación de servicios profesionales y de apoyo a la gestión, o para la ejecución de trabajos artísticos que sólo puedan encomendarse a determinadas personas naturales;","PRESTAR LOS SERVICIOS PROFESIONALES PARA APOYAR LA PLANEACIÓN, EJECUCIÓN Y SEGUIMIENTO DE LOS PROYECTOS DE INVERSIÓN EN TEMAS DE REACTIVACIÓN ECONÓMICA QUE LE SEAN DESIGNADOS, DEL FONDO DE DESARROLLO LOCAL DE SUMAPAZ","Inversión","Un Nuevo Contrato Social y Ambiental para la Bogotá del Siglo XXI",1,{"$f":"IF(ISERROR(VLOOKUP(K72,Proposito_programa!$C$2:$E$59,2,FALSE)),\" \",VLOOKUP(K72,Proposito_programa!$C$2:$E$59,2,FALSE))","v":"Subsidios y transferencias para la equidad"},{"$f":"IF(ISERROR(VLOOKUP(K72,Proposito_programa!$C$2:$E$59,3,FALSE)),\" \",VLOOKUP(K72,Proposito_programa!$C$2:$E$59,3,FALSE))","v":"Propósito 1: Hacer un nuevo contrato social para incrementar la inclusión social, productiva y política"},1583,null,80016995,"JHOJAN ANDRES CASTAÑEDA SANCHEZ","WILLIAM ANDRÉS HERRERA PABÓN","JHOJAN ANDRES CASTAÑEDA SANCHEZ","Persona Natural",null,null,null,57000000,null,1,2850000,59850000,56620000,"2021-02-23","2021-02-25","2022-01-08",317,1,15,null,null,null,null,null,"X",null,null,0.946031746031746]
["CPS-060-2021",2021,"FDLS-CD-054-2021","https://community.secop.gov.co/Public/Tendering/OpportunityDetail/Index?noticeUID=CO1.NTC.1797459&isFromPublicArea=True&isModal=False","Contratos de prestación de servicios profesionales y de apoyo a la gestión","Contratación directa","Prestación de servicios profesionales y de apoyo a la gestión, o para la ejecución de trabajos artísticos que sólo puedan encomendarse a determinadas personas naturales;","PRESTAR LOS SERVICIOS DE APOYO ADMINISTRATIVO AL ÁREA DE GESTIÓN DE DESARROLLO LOCAL, EN LA GESTIÓN DE PLANEACIÓN DE LA ALCALDÍA LOCAL DE SUMAPAZ","Inversión","Un Nuevo Contrato Social y Ambiental para la Bogotá del Siglo XXI",57,{"$f":"IF(ISERROR(VLOOKUP(K73,Proposito_programa!$C$2:$E$59,2,FALSE)),\" \",VLOOKUP(K73,Proposito_programa!$C$2:$E$59,2,FALSE))","v":"Gestión pública local"},{"$f":"IF(ISERROR(VLOOKUP(K73,Proposito_programa!$C$2:$E$59,3,FALSE)),\" \",VLOOKUP(K73,Proposito_programa!$C$2:$E$59,3,FALSE))","v":"Propósito 5: Construir Bogotá - Región con gobierno abierto, transparente y ciudadanía consciente"},1696,null,1000601472,"JUAN FELIPE FLOREZ GALEANO","JHOJAN ANDRES CASTAÑEDA SANCHEZ","JUAN FELIPE FLOREZ GALEANO","Persona Natural",null,null,null,26000000,null,null,null,26000000,52440000,"2021-02-24","2021-02-26","2021-12-25",302,null,null,null,null,null,null,null,null,"X",null,2.016923076923077]
["CPS-061-2021",2021,"FDLS-CD-055-2021","https://community.secop.gov.co/Public/Tendering/OpportunityDetail/Index?noticeUID=CO1.NTC.1796492&isFromPublicArea=True&isModal=False","Contratos de prestación de servicios profesionales y de apoyo a la gestión","Contratación directa","Prestación de servicios profesionales y de apoyo a la gestión, o para la ejecución de trabajos artísticos que sólo puedan encomendarse a determinadas personas naturales;","PRESTAR LOS SERVICIOS COMO AYUDANTES DE MAQUINARIA PESADA DE PROPIEDAD O TENENCIA DEL FONDO DE DESARROLLO LOCAL DE SUMAPAZ","Inversión","Un Nuevo Contrato Social y Ambiental para la Bogotá del Siglo XXI",57,{"$f":"IF(ISERROR(VLOOKUP(K74,Proposito_programa!$C$2:$E$59,2,FALSE)),\" \",VLOOKUP(K74,Proposito_programa!$C$2:$E$59,2,FALSE))","v":"Gestión pública local"},{"$f":"IF(ISERROR(VLOOKUP(K74,Proposito_programa!$C$2:$E$59,3,FALSE)),\" \",VLOOKUP(K74,Proposito_programa!$C$2:$E$59,3,FALSE))","v":"Propósito 5: Construir Bogotá - Región con gobierno abierto, transparente y ciudadanía consciente"},1696,null,3129847,"ALEXANDER PEREZ MOLINA","JUAN FELIPE FLOREZ GALEANO","ALEXANDER PÉREZ MOLINA","Persona Natural",null,null,null,25000000,null,1,2500000,27500000,25999999,"2021-02-24","2021-03-01","2022-01-30",333,1,30,null,null,null,null,null,"X",null,null,0.94545450909090911]
["CPS-062-2021",2021,"FDLS-CD-056-2021","https://community.secop.gov.co/Public/Tendering/OpportunityDetail/Index?noticeUID=CO1.NTC.1797866&isFromPublicArea=True&isModal=False","Contratos de prestación de servicios profesionales y de apoyo a la gestión","Contratación directa","Prestación de servicios profesionales y de apoyo a la gestión, o para la ejecución de trabajos artísticos que sólo puedan encomendarse a determinadas personas naturales;","PRESTAR SUS SERVICIOS PROFESIONALES DE APOYO AL ÁREA DE GESTIÓN DE DESARROLLO LOCAL EN TEMAS ADMINISTRATIVOS DEL FONDO DE DESARROLLO LOCAL DE SUMAPAZ","Inversión","Un Nuevo Contrato Social y Ambiental para la Bogotá del Siglo XXI",57,{"$f":"IF(ISERROR(VLOOKUP(K75,Proposito_programa!$C$2:$E$59,2,FALSE)),\" \",VLOOKUP(K75,Proposito_programa!$C$2:$E$59,2,FALSE))","v":"Gestión pública local"},{"$f":"IF(ISERROR(VLOOKUP(K75,Proposito_programa!$C$2:$E$59,3,FALSE)),\" \",VLOOKUP(K75,Proposito_programa!$C$2:$E$59,3,FALSE))","v":"Propósito 5: Construir Bogotá - Región con gobierno abierto, transparente y ciudadanía consciente"},1696,null,52185103,"MARIBEL JOHANA REYES","ALEXANDER PÉREZ MOLINA","MARIBEL JOHANA REYES","Persona Natural",null,null,null,43650000,null,null,null,43650000,25000000,"2021-02-24","2021-02-26","2021-12-25",302,null,null,null,null,null,null,null,null,"X",null,0.57273768613974796]
["CPS-063-2021",2021,"FDLS-CD-057-2021","https://community.secop.gov.co/Public/Tendering/OpportunityDetail/Index?noticeUID=CO1.NTC.1799833&isFromPublicArea=True&isModal=False","Contratos de prestación de servicios profesionales y de apoyo a la gestión","Contratación directa","Prestación de servicios profesionales y de apoyo a la gestión, o para la ejecución de trabajos artísticos que sólo puedan encomendarse a determinadas personas naturales;","PRESTAR SUS SERVICIOS PROFESIONALES DE APOYO ADMINISTRATIVO AL ÁREA DE GESTIÓN DEL DESARROLLO LOCAL, EN LA GESTIÓN CONTRACTUAL DEL FONDO DE DESARROLLO LOCAL DE SUMAPAZ","Inversión","Un Nuevo Contrato Social y Ambiental para la Bogotá del Siglo XXI",57,{"$f":"IF(ISERROR(VLOOKUP(K76,Proposito_programa!$C$2:$E$59,2,FALSE)),\" \",VLOOKUP(K76,Proposito_programa!$C$2:$E$59,2,FALSE))","v":"Gestión pública local"},{"$f":"IF(ISERROR(VLOOKUP(K76,Proposito_programa!$C$2:$E$59,3,FALSE)),\" \",VLOOKUP(K76,Proposito_programa!$C$2:$E$59,3,FALSE))","v":"Propósito 5: Construir Bogotá - Región con gobierno abierto, transparente y ciudadanía consciente"},1696,null,1010204948,"CHRISTIAN CAMILO RUBIANO GOMEZ","MARIBEL JOHANA REYES","CHRISTIAN CAMILO RUBIANO GÓMEZ","Persona Natural",null,null,null,57000000,null,null,null,57000000,40012500,"2021-02-25","2021-03-01","2021-12-31",305,null,null,null,null,null,null,null,"X",null,null,0.70197368421052631]
["CPS-064-2021",2021,"FDLS-CD-058-2021","https://community.secop.gov.co/Public/Tendering/OpportunityDetail/Index?noticeUID=CO1.NTC.1803028&isFromPublicArea=True&isModal=False","Contratos de prestación de servicios profesionales y de apoyo a la gestión","Contratación directa","Prestación de servicios profesionales y de apoyo a la gestión, o para la ejecución de trabajos artísticos que sólo puedan encomendarse a determinadas personas naturales;","PRESTAR LOS SERVICIOS PROFESIONALES PARA APOYAR LA PLANEACIÓN DE LOS PROYECTOS DE INVERSIÓN RELACIONADOS CON SALONES COMUNALES QUE EJECUTE EL FONDO DE DESARROLLO LOCAL DE SUMAPAZ","Inversión","Un Nuevo Contrato Social y Ambiental para la Bogotá del Siglo XXI",55,{"$f":"IF(ISERROR(VLOOKUP(K77,Proposito_programa!$C$2:$E$59,2,FALSE)),\" \",VLOOKUP(K77,Proposito_programa!$C$2:$E$59,2,FALSE))","v":"Fortalecimiento de cultura ciudadana y su institucionalidad"},{"$f":"IF(ISERROR(VLOOKUP(K77,Proposito_programa!$C$2:$E$59,3,FALSE)),\" \",VLOOKUP(K77,Proposito_programa!$C$2:$E$59,3,FALSE))","v":"Propósito 5: Construir Bogotá - Región con gobierno abierto, transparente y ciudadanía consciente"},1691,null,1018498031,"DANIEL ALFONSO ESPINOSA ROCHA","CHRISTIAN CAMILO RUBIANO GÓMEZ","DANIEL ALFONSO ESPINOSA ROCHA","Persona Natural",null,null,null,43650000,null,1,2182500,45832500,57000000,"2021-02-26","2021-02-26","2022-01-09",317,1,15,null,null,null,null,null,"X",null,null,1.2436589756177385]
["CPS-065-2021",2021,"FDLS-CD-059-2021","https://community.secop.gov.co/Public/Tendering/OpportunityDetail/Index?noticeUID=CO1.NTC.1808035&isFromPublicArea=True&isModal=False","Contratos de prestación de servicios profesionales y de apoyo a la gestión","Contratación directa","Prestación de servicios profesionales y de apoyo a la gestión, o para la ejecución de trabajos artísticos que sólo puedan encomendarse a determinadas personas naturales;","PRESTAR LOS SERVICIOS COMO TÉCNICO ADMINISTRATIVO AL SERVICIO DE LA JUNTA ADMINISTRADORA LOCAL DE SUMAPAZ","Inversión","Un Nuevo Contrato Social y Ambiental para la Bogotá del Siglo XXI",57,{"$f":"IF(ISERROR(VLOOKUP(K78,Proposito_programa!$C$2:$E$59,2,FALSE)),\" \",VLOOKUP(K78,Proposito_programa!$C$2:$E$59,2,FALSE))","v":"Gestión pública local"},{"$f":"IF(ISERROR(VLOOKUP(K78,Proposito_programa!$C$2:$E$59,3,FALSE)),\" \",VLOOKUP(K78,Proposito_programa!$C$2:$E$59,3,FALSE))","v":"Propósito 5: Construir Bogotá - Región con gobierno abierto, transparente y ciudadanía consciente"},1696,null,52231511,"CARLA NIAMED LOZANO TAUTIVA ","DANIEL ALFONSO ESPINOSA ROCHA","CARLA NIAMED LOZANO TAUTIVA ","Persona Natural",null,null,null,31000000,null,null,null,31000000,44377500,"2021-03-01","2021-03-01","2021-12-31",305,null,null,null,null,null,null,null,"X",null,null,1.4315322580645162]
["CPS-066-2021",2021,"FDLS-CD-060-2021","https://community.secop.gov.co/Public/Tendering/OpportunityDetail/Index?noticeUID=CO1.NTC.1803801&isFromPublicArea=True&isModal=False","Contratos de prestación de servicios profesionales y de apoyo a la gestión","Contratación directa","Prestación de servicios profesionales y de apoyo a la gestión, o para la ejecución de trabajos artísticos que sólo puedan encomendarse a determinadas personas naturales;","PRESTAR LOS SERVICIOS PROFESIONALES DE APOYO AL ÁREA DE GESTIÓN DE DESARROLLO LOCA DE LA ALCALDÍA LOCAL DE SUMAPAZ, EN TEMAS RELACIONADOS CON LA REACTIVACIÓN ECONÓMICA Y EMPLEO LOCAL","Inversión","Un Nuevo Contrato Social y Ambiental para la Bogotá del Siglo XXI",1,{"$f":"IF(ISERROR(VLOOKUP(K79,Proposito_programa!$C$2:$E$59,2,FALSE)),\" \",VLOOKUP(K79,Proposito_programa!$C$2:$E$59,2,FALSE))","v":"Subsidios y transferencias para la equidad"},{"$f":"IF(ISERROR(VLOOKUP(K79,Proposito_programa!$C$2:$E$59,3,FALSE)),\" \",VLOOKUP(K79,Proposito_programa!$C$2:$E$59,3,FALSE))","v":"Propósito 1: Hacer un nuevo contrato social para incrementar la inclusión social, productiva y política"},1583,null,79972956,"JUAN CARLOS HERNANDEZ PEÑA","CARLA NIAMED LOZANO TAUTIVA ","JUAN CARLOS HERNANDEZ PEÑA","Persona Natural",null,null,null,43650000,null,null,null,{"$f":"+X79+Y79+AA79","v":43650000},39000000,"2021-02-26","2021-03-01","2021-12-31",305,null,null,null,null,null,null,null,"X",null,null,0.89347079037800692]
["CPS-067-2021",2021,"FDLS-CD-061-2021","https://community.secop.gov.co/Public/Tendering/OpportunityDetail/Index?noticeUID=CO1.NTC.1802289&isFromPublicArea=True&isModal=False","Contratos de prestación de servicios profesionales y de apoyo a la gestión","Contratación directa","Prestación de servicios profesionales y de apoyo a la gestión, o para la ejecución de trabajos artísticos que sólo puedan encomendarse a determinadas personas naturales;","PRESTAR LOS SERVICIOS COMO AYUDANTES DE MAQUINARIA PESADA DE PROPIEDAD O TENENCIA DEL FONDO DE DESARROLLO LOCAL DE SUMAPAZ","Inversión","Un Nuevo Contrato Social y Ambiental para la Bogotá del Siglo XXI",57,{"$f":"IF(ISERROR(VLOOKUP(K80,Proposito_programa!$C$2:$E$59,2,FALSE)),\" \",VLOOKUP(K80,Proposito_programa!$C$2:$E$59,2,FALSE))","v":"Gestión pública local"},{"$f":"IF(ISERROR(VLOOKUP(K80,Proposito_programa!$C$2:$E$59,3,FALSE)),\" \",VLOOKUP(K80,Proposito_programa!$C$2:$E$59,3,FALSE))","v":"Propósito 5: Construir Bogotá - Región con gobierno abierto, transparente y ciudadanía consciente"},1696,null,1013598298,"CARLOS JAIR PEÑA PEÑA","JUAN CARLOS HERNANDEZ PEÑA","CARLOS JAIR PEÑA PEÑA","Persona Natural",null,null,null,25000000,null,1,2500000,27500000,43650000,"2021-02-25","2021-03-01","2022-01-31",336,1,30,null,null,null,null,null,"X",null,null,{"$f":"IF(ISERROR(AC80/AB80),\"-\",(AC80/AB80))","v":1.5872727272727272}]
["CPS-068-2021",2021,"FDLS-CD-062-2021","https://community.secop.gov.co/Public/Tendering/OpportunityDetail/Index?noticeUID=CO1.NTC.1810242&isFromPublicArea=True&isModal=False","Contratos de prestación de servicios profesionales y de apoyo a la gestión","Contratación directa","Prestación de servicios profesionales y de apoyo a la gestión, o para la ejecución de trabajos artísticos que sólo puedan encomendarse a determinadas personas naturales;","PRESTAR LOS SERVICIOS PROFESIONALES PARA APOYAR LOS ASUNTOS JURÍDICOS EN LA GESTIÓN CONTRACTUAL Y POSTCONTRACTUALES DEL FONDO DE DESARROLLO LOCAL DE SUMAPAZ","Inversión","Un Nuevo Contrato Social y Ambiental para la Bogotá del Siglo XXI",57,{"$f":"IF(ISERROR(VLOOKUP(K81,Proposito_programa!$C$2:$E$59,2,FALSE)),\" \",VLOOKUP(K81,Proposito_programa!$C$2:$E$59,2,FALSE))","v":"Gestión pública local"},{"$f":"IF(ISERROR(VLOOKUP(K81,Proposito_programa!$C$2:$E$59,3,FALSE)),\" \",VLOOKUP(K81,Proposito_programa!$C$2:$E$59,3,FALSE))","v":"Propósito 5: Construir Bogotá - Región con gobierno abierto, transparente y ciudadanía consciente"},1696,null,52900762,"JENNY CAROLINA GIRON CUERVO","CARLOS JAIR PEÑA PEÑA","JENNY CAROLINA GIRÓN CUERVO","Persona Natural",null,null,null,19500000,null,null,null,19500000,25000000,"2021-03-01","2021-03-01","2021-05-30",90,null,null,null,null,null,null,null,null,"X",null,1.2820512820512822]
["CPS-069-2021",2021,"FDLS-CD-063-2021","https://community.secop.gov.co/Public/Tendering/OpportunityDetail/Index?noticeUID=CO1.NTC.1809698&isFromPublicArea=True&isModal=False","Contratos de prestación de servicios profesionales y de apoyo a la gestión","Contratación directa","Prestación de servicios profesionales y de apoyo a la gestión, o para la ejecución de trabajos artísticos que sólo puedan encomendarse a determinadas personas naturales;","PRESTAR LOS SERVICIOS PROFESIONALES COMO ABOGADO (A) DE APOYO AL ÁREA DE GESTIÓN POLICIVA DE LA ALCALDÍA LOCAL DE SUMAPAZ","Inversión","Un Nuevo Contrato Social y Ambiental para la Bogotá del Siglo XXI",57,{"$f":"IF(ISERROR(VLOOKUP(K82,Proposito_programa!$C$2:$E$59,2,FALSE)),\" \",VLOOKUP(K82,Proposito_programa!$C$2:$E$59,2,FALSE))","v":"Gestión pública local"},{"$f":"IF(ISERROR(VLOOKUP(K82,Proposito_programa!$C$2:$E$59,3,FALSE)),\" \",VLOOKUP(K82,Proposito_programa!$C$2:$E$59,3,FALSE))","v":"Propósito 5: Construir Bogotá - Región con gobierno abierto, transparente y ciudadanía consciente"},1696,null,79632494,"ELZON FERNEY DELGADO MORALES","JENNY CAROLINA GIRÓN CUERVO","ELZON FERNEY DELGADO MORALES","Persona Natural",null,null,null,55000000,null,null,null,55000000,19500000,"2021-03-01","2021-03-02","2022-01-01",305,null,null,null,null,null,null,null,"X",null,null,0.35454545454545455]
["CPS-070-2021",2021,"FDLS-CD-064-2021","https://community.secop.gov.co/Public/Tendering/OpportunityDetail/Index?noticeUID=CO1.NTC.1819767&isFromPublicArea=True&isModal=False","Contratos de prestación de servicios profesionales y de apoyo a la gestión","Contratación directa","Prestación de servicios profesionales y de apoyo a la gestión, o para la ejecución de trabajos artísticos que sólo puedan encomendarse a determinadas personas naturales;","PRESTAR LOS SERVICIOS COMO AYUDANTES DE MAQUINARIA PESADA DE PROPIEDAD O TENENCIA DEL FONDO DE DESARROLLO LOCAL DE  SUMAPAZ","Inversión","Un Nuevo Contrato Social y Ambiental para la Bogotá del Siglo XXI",57,{"$f":"IF(ISERROR(VLOOKUP(K83,Proposito_programa!$C$2:$E$59,2,FALSE)),\" \",VLOOKUP(K83,Proposito_programa!$C$2:$E$59,2,FALSE))","v":"Gestión pública local"},{"$f":"IF(ISERROR(VLOOKUP(K83,Proposito_programa!$C$2:$E$59,3,FALSE)),\" \",VLOOKUP(K83,Proposito_programa!$C$2:$E$59,3,FALSE))","v":"Propósito 5: Construir Bogotá - Región con gobierno abierto, transparente y ciudadanía consciente"},1696,null,79216776,"ERISMENDIZ CASTELLANOS DIAZ","ELZON FERNEY DELGADO MORALES","ERISMENDIZ CASTELLANOS DIAZ","Persona Natural",null,null,null,25000000,null,1,2500000,27500000,54999666,"2021-03-04","2021-03-05","2022-02-04",336,1,30,null,null,null,null,null,"X",null,null,1.9999878545454546]
["CPS-071-2021",2021,"FDLS-CD-065-2021","https://community.secop.gov.co/Public/Tendering/OpportunityDetail/Index?noticeUID=CO1.NTC.1814617&isFromPublicArea=True&isModal=False","Contratos de prestación de servicios profesionales y de apoyo a la gestión","Contratación directa","Prestación de servicios profesionales y de apoyo a la gestión, o para la ejecución de trabajos artísticos que sólo puedan encomendarse a determinadas personas naturales;","PRESTAR SUS SERVICIOS PROFESIONALES PARA COORDINAR, LIDERAR Y ASESORAR LOS PLANES Y ESTRATEGIAS DE COMUNICACIÓN INTERNA Y EXTERNA PARA LA DIVULGACIÓN DE LOS PROGRAMAS, PROYECTOS Y ACTIVIDADES DE LA ALCALDÍA LOCAL DE SUMAPAZ","Inversión","Un Nuevo Contrato Social y Ambiental para la Bogotá del Siglo XXI",57,{"$f":"IF(ISERROR(VLOOKUP(K84,Proposito_programa!$C$2:$E$59,2,FALSE)),\" \",VLOOKUP(K84,Proposito_programa!$C$2:$E$59,2,FALSE))","v":"Gestión pública local"},{"$f":"IF(ISERROR(VLOOKUP(K84,Proposito_programa!$C$2:$E$59,3,FALSE)),\" \",VLOOKUP(K84,Proposito_programa!$C$2:$E$59,3,FALSE))","v":"Propósito 5: Construir Bogotá - Región con gobierno abierto, transparente y ciudadanía consciente"},1696,null,1032460361,"FABIAN ANDRES FLOREZ RODRIGUEZ","ERISMENDIZ CASTELLANOS DIAZ","FABIAN ANDRES FLOREZ RODRIGUEZ","Persona Natural",null,null,null,57000000,null,null,null,57000000,24666667,"2021-03-02","2021-03-03","2022-01-02",305,null,null,null,null,null,null,null,"X",null,null,0.43274854385964912]
["CPS-072-2021",2021,"FDLS-CD-067-2021","https://community.secop.gov.co/Public/Tendering/OpportunityDetail/Index?noticeUID=CO1.NTC.1810689&isFromPublicArea=True&isModal=False","Contratos de prestación de servicios profesionales y de apoyo a la gestión","Contratación directa","Prestación de servicios profesionales y de apoyo a la gestión, o para la ejecución de trabajos artísticos que sólo puedan encomendarse a determinadas personas naturales;","PRESTAR LOS SERVICIOS COMO AYUDANTES DE MAQUINARIA PESADA DE PROPIEDAD O TENENCIA DEL FONDO DE DESARROLLO LOCAL DE SUMAPAZ","Inversión","Un Nuevo Contrato Social y Ambiental para la Bogotá del Siglo XXI",57,{"$f":"IF(ISERROR(VLOOKUP(K85,Proposito_programa!$C$2:$E$59,2,FALSE)),\" \",VLOOKUP(K85,Proposito_programa!$C$2:$E$59,2,FALSE))","v":"Gestión pública local"},{"$f":"IF(ISERROR(VLOOKUP(K85,Proposito_programa!$C$2:$E$59,3,FALSE)),\" \",VLOOKUP(K85,Proposito_programa!$C$2:$E$59,3,FALSE))","v":"Propósito 5: Construir Bogotá - Región con gobierno abierto, transparente y ciudadanía consciente"},1696,null,1010000989,"HECTOR JOHAN MORALES HILARION","FABIAN ANDRES FLOREZ RODRIGUEZ","HECTOR JOHAN MORALES HILARION","Persona Natural",null,null,null,25000000,null,1,2500000,27500000,57000000,"2021-03-01","2021-03-02","2022-02-01",336,1,30,null,null,null,null,null,"X",null,null,2.0727272727272728]
["CPS-073-2021",2021,"FDLS-CD-068-2021","https://community.secop.gov.co/Public/Tendering/OpportunityDetail/Index?noticeUID=CO1.NTC.1812056&isFromPublicArea=True&isModal=False","Contratos de prestación de servicios profesionales y de apoyo a la gestión","Contratación directa","Prestación de servicios profesionales y de apoyo a la gestión, o para la ejecución de trabajos artísticos que sólo puedan encomendarse a determinadas personas naturales;","PRESTAR LOS SERVICIOS COMO AUXILIAR DE APOYO ADMINISTRATIVO AL ÁREA DE GESTIÓN POLICIVA DE LA ALCALDÍA LOCAL DE SUMAPAZ","Inversión","Un Nuevo Contrato Social y Ambiental para la Bogotá del Siglo XXI",57,{"$f":"IF(ISERROR(VLOOKUP(K86,Proposito_programa!$C$2:$E$59,2,FALSE)),\" \",VLOOKUP(K86,Proposito_programa!$C$2:$E$59,2,FALSE))","v":"Gestión pública local"},{"$f":"IF(ISERROR(VLOOKUP(K86,Proposito_programa!$C$2:$E$59,3,FALSE)),\" \",VLOOKUP(K86,Proposito_programa!$C$2:$E$59,3,FALSE))","v":"Propósito 5: Construir Bogotá - Región con gobierno abierto, transparente y ciudadanía consciente"},1696,null,52524470,"MARCELA TORRES RAMIREZ ","SEGURIDAD LAS AMÉRICAS LTDA SEGURIAMÉRICAS LTDA","MARCELA TORRES RAMIREZ ","Persona Natural",null,null,null,26000000,null,null,null,26000000,22416666,"2021-03-01","2021-03-02","2022-01-01",305,null,null,null,null,null,null,null,"X",null,null,0.86217946153846159]
["CPS-074-2021",2021,"FDLS-CD-069-2021","https://community.secop.gov.co/Public/Tendering/OpportunityDetail/Index?noticeUID=CO1.NTC.1809105&isFromPublicArea=True&isModal=False","Contratos de prestación de servicios profesionales y de apoyo a la gestión","Contratación directa","Prestación de servicios profesionales y de apoyo a la gestión, o para la ejecución de trabajos artísticos que sólo puedan encomendarse a determinadas personas naturales;","PRESTAR LOS SERVICIOS PROFESIONALES PARA APOYAR LOS ASUNTOS JURÍDICOS, CONTRACTUALES Y POS-CONTRACTUALES DE LA ALCALDÍA LOCAL DE SUMAPAZ","Inversión","Un Nuevo Contrato Social y Ambiental para la Bogotá del Siglo XXI",57,{"$f":"IF(ISERROR(VLOOKUP(K87,Proposito_programa!$C$2:$E$59,2,FALSE)),\" \",VLOOKUP(K87,Proposito_programa!$C$2:$E$59,2,FALSE))","v":"Gestión pública local"},{"$f":"IF(ISERROR(VLOOKUP(K87,Proposito_programa!$C$2:$E$59,3,FALSE)),\" \",VLOOKUP(K87,Proposito_programa!$C$2:$E$59,3,FALSE))","v":"Propósito 5: Construir Bogotá - Región con gobierno abierto, transparente y ciudadanía consciente"},1696,null,52777050,"MIRYAN CRISTINA PARRA DUQUE","HECTOR JOHAN MORALES HILARION","MIRYAN CRISTINA PARRA DUQUE","Persona Natural",null,null,null,60000000,null,null,null,60000000,23313333,"2021-03-01","2021-03-05","2022-01-04",305,null,null,null,null,null,null,null,"X",null,null,0.38855555000000003]
["CPS-075-2021",2021,"FDLS-CD-070-2021","https://community.secop.gov.co/Public/Tendering/OpportunityDetail/Index?noticeUID=CO1.NTC.1820474&isFromPublicArea=True&isModal=False","Contratos de prestación de servicios profesionales y de apoyo a la gestión","Contratación directa","Prestación de servicios profesionales y de apoyo a la gestión, o para la ejecución de trabajos artísticos que sólo puedan encomendarse a determinadas personas naturales;","PRESTAR LOS SERVICIOS PARA DESARROLLAR ACTIVIDADES LOGÍSTICAS Y OPERATIVAS, EN LOS BIENES Y/O PREDIOS EN DONDE FUNCIONA LA ALCALDÍA LOCAL DE SUMAPAZ","Inversión","Un Nuevo Contrato Social y Ambiental para la Bogotá del Siglo XXI",57,{"$f":"IF(ISERROR(VLOOKUP(K88,Proposito_programa!$C$2:$E$59,2,FALSE)),\" \",VLOOKUP(K88,Proposito_programa!$C$2:$E$59,2,FALSE))","v":"Gestión pública local"},{"$f":"IF(ISERROR(VLOOKUP(K88,Proposito_programa!$C$2:$E$59,3,FALSE)),\" \",VLOOKUP(K88,Proposito_programa!$C$2:$E$59,3,FALSE))","v":"Propósito 5: Construir Bogotá - Región con gobierno abierto, transparente y ciudadanía consciente"},1696,null,79358856,"LEOPOLDO MARTINEZ MARTINEZ ","MARCELA TORRES RAMIREZ ","LEOPOLDO MARTINEZ MARTINEZ ","Persona Natural",null,null,null,26000000,null,null,null,26000000,59200000,"2021-03-04","2021-03-05","2022-01-04",305,null,null,null,null,null,null,null,"X",null,null,2.2769230769230768]
["CPS-076-2021",2021,"FDLS-CD-071-2021","https://community.secop.gov.co/Public/Tendering/OpportunityDetail/Index?noticeUID=CO1.NTC.1812551&isFromPublicArea=True&isModal=False","Contratos de prestación de servicios profesionales y de apoyo a la gestión","Contratación directa","Prestación de servicios profesionales y de apoyo a la gestión, o para la ejecución de trabajos artísticos que sólo puedan encomendarse a determinadas personas naturales;","PRESTAR LOS SERVICIOS PROFESIONALES PARA APOYAR LA PLANEACIÓN, SEGUIMIENTO, EJECUCIÓN Y CONTROL DE LAS ACTIVIDADES AGROPECUARIAS ENFOCADAS A PROMOVER EL DESARROLLO RURAL SOSTENIBLE, EN LA LOCALIDAD DE SUMAPAZ","Inversión","Un Nuevo Contrato Social y Ambiental para la Bogotá del Siglo XXI",6,{"$f":"IF(ISERROR(VLOOKUP(K89,Proposito_programa!$C$2:$E$59,2,FALSE)),\" \",VLOOKUP(K89,Proposito_programa!$C$2:$E$59,2,FALSE))","v":"Sistema Distrital de Cuidado"},{"$f":"IF(ISERROR(VLOOKUP(K89,Proposito_programa!$C$2:$E$59,3,FALSE)),\" \",VLOOKUP(K89,Proposito_programa!$C$2:$E$59,3,FALSE))","v":"Propósito 1: Hacer un nuevo contrato social para incrementar la inclusión social, productiva y política"},1637,null,79266150,"GUILLERMO ENRIQUE MONTAÑO CALDERON","MIRYAN CRISTINA PARRA DUQUE","GUILLERMO ENRIQUE MONTAÑO CALDERON","Persona Natural",null,null,null,57000000,null,null,null,57000000,25653333,"2021-03-02","2021-03-03","2022-01-09",305,null,null,null,null,null,null,null,"X",null,null,0.45005847368421054]
["CPS-077-2021",2021,"FDLS-CD-072-2021","https://community.secop.gov.co/Public/Tendering/OpportunityDetail/Index?noticeUID=CO1.NTC.1821453&isFromPublicArea=True&isModal=False","Contratos de prestación de servicios profesionales y de apoyo a la gestión","Contratación directa","Prestación de servicios profesionales y de apoyo a la gestión, o para la ejecución de trabajos artísticos que sólo puedan encomendarse a determinadas personas naturales;","PRESTAR LOS SERVICIOS COMO AYUDANTES DE MAQUINARIA PESADA DE PROPIEDAD O TENENCIA DEL FONDO DE DESARROLLO LOCAL DE SUMAPAZ","Inversión","Un Nuevo Contrato Social y Ambiental para la Bogotá del Siglo XXI",57,{"$f":"IF(ISERROR(VLOOKUP(K90,Proposito_programa!$C$2:$E$59,2,FALSE)),\" \",VLOOKUP(K90,Proposito_programa!$C$2:$E$59,2,FALSE))","v":"Gestión pública local"},{"$f":"IF(ISERROR(VLOOKUP(K90,Proposito_programa!$C$2:$E$59,3,FALSE)),\" \",VLOOKUP(K90,Proposito_programa!$C$2:$E$59,3,FALSE))","v":"Propósito 5: Construir Bogotá - Región con gobierno abierto, transparente y ciudadanía consciente"},1696,null,1069749786,"YILBER ADAMES RAMIREZ","LEOPOLDO MARTINEZ MARTINEZ ","YILBER ADAMES RAMÍREZ","Persona Natural",null,null,null,25000000,null,1,2500000,27500000,55100000,"2021-03-04","2021-03-05","2022-02-04",336,1,30,null,null,null,null,null,"X",null,null,2.0036363636363634]
["CPS-078-2021",2021,"FDLS-CD-073-2021","https://community.secop.gov.co/Public/Tendering/OpportunityDetail/Index?noticeUID=CO1.NTC.1814010&isFromPublicArea=True&isModal=False","Contratos de prestación de servicios profesionales y de apoyo a la gestión","Contratación directa","Prestación de servicios profesionales y de apoyo a la gestión, o para la ejecución de trabajos artísticos que sólo puedan encomendarse a determinadas personas naturales;","PRESTAR LOS SERVICIOS COMO AUXILIAR ADMINISTRATIVO PARA EL ÁREA DE GESTIÓN DE DESARROLLO LOCAL, EN LOS TEMAS DE INFRAESTRUCTURA, DE LA ALCALDÍA LOCAL DE SUMAPAZ","Inversión","Un Nuevo Contrato Social y Ambiental para la Bogotá del Siglo XXI",56,{"$f":"IF(ISERROR(VLOOKUP(K91,Proposito_programa!$C$2:$E$59,2,FALSE)),\" \",VLOOKUP(K91,Proposito_programa!$C$2:$E$59,2,FALSE))","v":"Gestión pública efectiva"},{"$f":"IF(ISERROR(VLOOKUP(K91,Proposito_programa!$C$2:$E$59,3,FALSE)),\" \",VLOOKUP(K91,Proposito_programa!$C$2:$E$59,3,FALSE))","v":"Propósito 5: Construir Bogotá - Región con gobierno abierto, transparente y ciudadanía consciente"},1693,null,1015419501,"NATALIA SANCHEZ MARIN ","GUILLERMO ENRIQUE MONTAÑO CALDERON","NATALIA SANCHEZ MARIN ","Persona Natural",null,null,null,26000000,null,null,null,26000000,24666667,"2021-03-02","2021-03-03","2022-01-02",305,null,null,null,null,null,null,null,"X",null,null,0.94871796153846155]
["CPS-079-2021",2021,"FDLS-CD-074-2021","https://community.secop.gov.co/Public/Tendering/OpportunityDetail/Index?noticeUID=CO1.NTC.1813925&isFromPublicArea=True&isModal=False","Contratos de prestación de servicios profesionales y de apoyo a la gestión","Contratación directa","Prestación de servicios profesionales y de apoyo a la gestión, o para la ejecución de trabajos artísticos que sólo puedan encomendarse a determinadas personas naturales;","PRESTAR LOS SERVICIOS COMO AUXILIAR ADMINISTRATIVO PARA EL ÁREA DE GESTIÓN DE DESARROLLO LOCAL, EN LOS TEMAS DE INFRAESTRUCTURA, DE LA ALCALDÍA LOCAL DE SUMAPAZ","Inversión","Un Nuevo Contrato Social y Ambiental para la Bogotá del Siglo XXI",56,{"$f":"IF(ISERROR(VLOOKUP(K92,Proposito_programa!$C$2:$E$59,2,FALSE)),\" \",VLOOKUP(K92,Proposito_programa!$C$2:$E$59,2,FALSE))","v":"Gestión pública efectiva"},{"$f":"IF(ISERROR(VLOOKUP(K92,Proposito_programa!$C$2:$E$59,3,FALSE)),\" \",VLOOKUP(K92,Proposito_programa!$C$2:$E$59,3,FALSE))","v":"Propósito 5: Construir Bogotá - Región con gobierno abierto, transparente y ciudadanía consciente"},1693,null,1022323083,"SANDRA MARCELA CASTRO GONZALEZ","YILBER ADAMES RAMÍREZ","SANDRA MARCELA CASTRO GONZALEZ","Persona Natural",null,null,null,26000000,null,null,null,26000000,23226667,"2021-03-02","2021-03-03","2022-01-02",305,null,null,null,null,null,null,null,"X",null,null,0.89333334615384619]
["CPS-080-2021",2021,"FDLS-CD-075-2021","https://community.secop.gov.co/Public/Tendering/OpportunityDetail/Index?noticeUID=CO1.NTC.1812338&isFromPublicArea=True&isModal=False","Contratos de prestación de servicios profesionales y de apoyo a la gestión","Contratación directa","Prestación de servicios profesionales y de apoyo a la gestión, o para la ejecución de trabajos artísticos que sólo puedan encomendarse a determinadas personas naturales;","PRESTAR LOS SERVICIOS TÉCNICOS PARA LA GESTIÓN AMBIENTAL-AGROPECUARIA, DEL ÁREA DE GESTIÓN DE DESARROLLO LOCAL DE LA ALCALDÍA LOCAL DE SUMAPAZ","Inversión","Un Nuevo Contrato Social y Ambiental para la Bogotá del Siglo XXI",23,{"$f":"IF(ISERROR(VLOOKUP(K93,Proposito_programa!$C$2:$E$59,2,FALSE)),\" \",VLOOKUP(K93,Proposito_programa!$C$2:$E$59,2,FALSE))","v":"Bogotá rural"},{"$f":"IF(ISERROR(VLOOKUP(K93,Proposito_programa!$C$2:$E$59,3,FALSE)),\" \",VLOOKUP(K93,Proposito_programa!$C$2:$E$59,3,FALSE))","v":"Propósito 1: Hacer un nuevo contrato social para incrementar la inclusión social, productiva y política"},1634,null,1022988839,"ALEXANDRA CORTES LOPEZ ","NATALIA SANCHEZ MARIN ","ALEXANDRA CORTES LOPEZ ","Persona Natural",null,null,null,39000000,null,null,null,39000000,25826666,"2021-03-02","2021-03-03","2022-01-02",305,null,null,null,null,null,null,null,"X",null,null,0.66222220512820518]
["CPS-081-2021",2021,"FDLS-CD-076-2021","https://community.secop.gov.co/Public/Tendering/OpportunityDetail/Index?noticeUID=CO1.NTC.1812000&isFromPublicArea=True&isModal=False","Contratos de prestación de servicios profesionales y de apoyo a la gestión","Contratación directa","Prestación de servicios profesionales y de apoyo a la gestión, o para la ejecución de trabajos artísticos que sólo puedan encomendarse a determinadas personas naturales;","PRESTAR LOS SERVICIOS DE APOYO LOGÍSTICO Y OPERATIVO PARA LA ALCALDÍA LOCAL DE SUMAPAZ, EN ESPECIAL EN LAS CORREGIDURÍAS DE NAZARETH Y BETANIA","Inversión","Un Nuevo Contrato Social y Ambiental para la Bogotá del Siglo XXI",57,{"$f":"IF(ISERROR(VLOOKUP(K94,Proposito_programa!$C$2:$E$59,2,FALSE)),\" \",VLOOKUP(K94,Proposito_programa!$C$2:$E$59,2,FALSE))","v":"Gestión pública local"},{"$f":"IF(ISERROR(VLOOKUP(K94,Proposito_programa!$C$2:$E$59,3,FALSE)),\" \",VLOOKUP(K94,Proposito_programa!$C$2:$E$59,3,FALSE))","v":"Propósito 5: Construir Bogotá - Región con gobierno abierto, transparente y ciudadanía consciente"},1696,null,19157189,"ENRIQUE HUERTAS","SANDRA MARCELA CASTRO GONZALEZ","ENRIQUE HUERTAS","Persona Natural",null,null,null,20700000,null,null,null,20700000,38740000,"2021-03-02","2021-03-03","2022-01-02",305,null,null,null,null,null,null,null,"X",null,null,1.8714975845410629]
["CPS-082-2021",2021,"FDLS-CD-077-2021","https://community.secop.gov.co/Public/Tendering/OpportunityDetail/Index?noticeUID=CO1.NTC.1812642&isFromPublicArea=True&isModal=False","Contratos de prestación de servicios profesionales y de apoyo a la gestión","Contratación directa","Prestación de servicios profesionales y de apoyo a la gestión, o para la ejecución de trabajos artísticos que sólo puedan encomendarse a determinadas personas naturales;","PRESTAR SUS SERVICIOS PROFESIONALES PARA APOYAR AL EQUIPO DE PRENSA Y COMUNICACIONES DE LA ALCALDÍA LOCAL EN LA CREACIÓN, REALIZACIÓN, PRODUCCIÓN Y EDICIÓN DE VIDEOS, ASÍ COMO EL REGISTRO, EDICIÓN Y LA PRESENTACIÓN DE FOTOGRAFÍAS DE LOS ACONTECIMIENTOS, HECHOS Y EVENTOS EXTERNOS E INTERNOS DE LA ALCALDÍA LOCAL, PARA SER UTILIZADOS COMO INSUMOS DE COMUNICACIÓN EN LOS MEDIOS, ESPECIALMENTE ESCRITOS, DIGITALES Y AUDIOVISUALES","Inversión","Un Nuevo Contrato Social y Ambiental para la Bogotá del Siglo XXI",57,{"$f":"IF(ISERROR(VLOOKUP(K95,Proposito_programa!$C$2:$E$59,2,FALSE)),\" \",VLOOKUP(K95,Proposito_programa!$C$2:$E$59,2,FALSE))","v":"Gestión pública local"},{"$f":"IF(ISERROR(VLOOKUP(K95,Proposito_programa!$C$2:$E$59,3,FALSE)),\" \",VLOOKUP(K95,Proposito_programa!$C$2:$E$59,3,FALSE))","v":"Propósito 5: Construir Bogotá - Región con gobierno abierto, transparente y ciudadanía consciente"},1696,null,81715533,"LUIS ANGEL ARROYAVE VILARO","ALEXANDRA CORTES LOPEZ ","LUIS ANGEL ARROYAVE VILARO","Persona Natural",null,null,null,43650000,null,null,null,43650000,20562000,"2021-03-02","2021-03-04","2022-01-03",305,null,null,null,null,null,null,null,"X",null,null,0.47106529209621995]
["CPS-083-2021",2021,"FDLS-CD-078-2021","https://community.secop.gov.co/Public/Tendering/OpportunityDetail/Index?noticeUID=CO1.NTC.1812877&isFromPublicArea=True&isModal=False","Contratos de prestación de servicios profesionales y de apoyo a la gestión","Contratación directa","Prestación de servicios profesionales y de apoyo a la gestión, o para la ejecución de trabajos artísticos que sólo puedan encomendarse a determinadas personas naturales;","PRESTAR SUS SERVICIOS PROFESIONALES DE APOYO AL ÁREA DE GESTIÓN DE DESARROLLO LOCAL DE LA ALCALDÍA LOCAL DE SUMAPAZ, EN TEMAS DE REACTIVACIÓN ECONÓMICA, EMPLEOS DE EMERGENCIA","Inversión","Un Nuevo Contrato Social y Ambiental para la Bogotá del Siglo XXI",1,{"$f":"IF(ISERROR(VLOOKUP(K96,Proposito_programa!$C$2:$E$59,2,FALSE)),\" \",VLOOKUP(K96,Proposito_programa!$C$2:$E$59,2,FALSE))","v":"Subsidios y transferencias para la equidad"},{"$f":"IF(ISERROR(VLOOKUP(K96,Proposito_programa!$C$2:$E$59,3,FALSE)),\" \",VLOOKUP(K96,Proposito_programa!$C$2:$E$59,3,FALSE))","v":"Propósito 1: Hacer un nuevo contrato social para incrementar la inclusión social, productiva y política"},1583,null,1022390655,"LUIS ALBERTO MARTINEZ SICHACA ","ENRIQUE HUERTAS","LUIS ALBERTO MARTINEZ SICHACA ","Persona Natural",null,null,null,50000000,null,null,null,50000000,7857000,"2021-03-02","2021-03-03","2022-01-02",305,null,null,null,null,null,null,null,"X",null,null,0.15714]
["CPS-084-2021",2021,"FDLS-CD-079-2021","https://community.secop.gov.co/Public/Tendering/OpportunityDetail/Index?noticeUID=CO1.NTC.1812078&isFromPublicArea=True&isModal=False","Contratos de prestación de servicios profesionales y de apoyo a la gestión","Contratación directa","Prestación de servicios profesionales y de apoyo a la gestión, o para la ejecución de trabajos artísticos que sólo puedan encomendarse a determinadas personas naturales;","PRESTAR LOS SERVICIOS PROFESIONALES AL ÁREA DE GESTIÓN DE DESARROLLO LOCAL PARA APOYAR LA PLANEACIÓN, EJECUCIÓN Y SEGUIMIENTO A LOS PROYECTOS DE INVERSIÓN DE MEJORAMIENTO DE VIVIENDA RURAL QUE LE SEAN DESIGNADOS","Inversión","Un Nuevo Contrato Social y Ambiental para la Bogotá del Siglo XXI",19,{"$f":"IF(ISERROR(VLOOKUP(K97,Proposito_programa!$C$2:$E$59,2,FALSE)),\" \",VLOOKUP(K97,Proposito_programa!$C$2:$E$59,2,FALSE))","v":"Vivienda y entornos dignos en el territorio urbano y rural"},{"$f":"IF(ISERROR(VLOOKUP(K97,Proposito_programa!$C$2:$E$59,3,FALSE)),\" \",VLOOKUP(K97,Proposito_programa!$C$2:$E$59,3,FALSE))","v":"Propósito 1: Hacer un nuevo contrato social para incrementar la inclusión social, productiva y política"},1589,null,79889687,"LUIS CARLOS LOPEZ MENDOZA  ","LUIS ANGEL ARROYAVE VILARO","LUIS CARLOS LÓPEZ MENDOZA  ","Persona Natural",null,null,null,70000000,null,null,null,70000000,49666667,"2021-03-02","2021-03-04","2022-01-03",305,null,null,null,null,null,null,null,"X",null,null,0.70952381428571432]
["CPS-085-2021",2021,"FDLS-CD-080-2021*","https://community.secop.gov.co/Public/Tendering/OpportunityDetail/Index?noticeUID=CO1.NTC.1840702&isFromPublicArea=True&isModal=False","Contratos de prestación de servicios profesionales y de apoyo a la gestión","Contratación directa","Prestación de servicios profesionales y de apoyo a la gestión, o para la ejecución de trabajos artísticos que sólo puedan encomendarse a determinadas personas naturales;","PRESTAR LOS SERVICIOS COMO OPERARIOS DE LA MAQUINARIA PESADA DE PROPIEDAD O TENENCIA DEL FONDO DE DESARROLLO LOCAL DE SUMAPAZ","Inversión","Un Nuevo Contrato Social y Ambiental para la Bogotá del Siglo XXI",57,{"$f":"IF(ISERROR(VLOOKUP(K98,Proposito_programa!$C$2:$E$59,2,FALSE)),\" \",VLOOKUP(K98,Proposito_programa!$C$2:$E$59,2,FALSE))","v":"Gestión pública local"},{"$f":"IF(ISERROR(VLOOKUP(K98,Proposito_programa!$C$2:$E$59,3,FALSE)),\" \",VLOOKUP(K98,Proposito_programa!$C$2:$E$59,3,FALSE))","v":"Propósito 5: Construir Bogotá - Región con gobierno abierto, transparente y ciudadanía consciente"},1696,null,1032656287,"ALBEIRO BARBOSA CIFUENTES","LUIS ALBERTO MARTINEZ SICHACA ","ALBEIRO BARBOSA CIFUENTES","Persona Natural",null,null,null,22950000,null,1,2550000,25500000,69300000,"2021-03-12","2021-03-15","2022-01-14",305,1,30,null,null,null,null,null,"X",null,null,2.7176470588235295]
["CPS-086-2021",2021,"FDLS-CD-080-2021*","https://community.secop.gov.co/Public/Tendering/OpportunityDetail/Index?noticeUID=CO1.NTC.1840702&isFromPublicArea=True&isModal=False","Contratos de prestación de servicios profesionales y de apoyo a la gestión","Contratación directa","Prestación de servicios profesionales y de apoyo a la gestión, o para la ejecución de trabajos artísticos que sólo puedan encomendarse a determinadas personas naturales;","PRESTAR LOS SERVICIOS COMO OPERARIOS DE LA MAQUINARIA PESADA DE PROPIEDAD O TENENCIA DEL FONDO DE DESARROLLO LOCAL DE SUMAPAZ","Inversión","Un Nuevo Contrato Social y Ambiental para la Bogotá del Siglo XXI",57,{"$f":"IF(ISERROR(VLOOKUP(K99,Proposito_programa!$C$2:$E$59,2,FALSE)),\" \",VLOOKUP(K99,Proposito_programa!$C$2:$E$59,2,FALSE))","v":"Gestión pública local"},{"$f":"IF(ISERROR(VLOOKUP(K99,Proposito_programa!$C$2:$E$59,3,FALSE)),\" \",VLOOKUP(K99,Proposito_programa!$C$2:$E$59,3,FALSE))","v":"Propósito 5: Construir Bogotá - Región con gobierno abierto, transparente y ciudadanía consciente"},1696,null,1022938049,"ALEXANDER BUSTOS CHAVARRO","LUIS CARLOS LÓPEZ MENDOZA  ","ALEXANDER BUSTOS CHAVARRO","Persona Natural",null,null,null,22950000,null,1,2550000,25500000,24310000,"2021-03-12","2021-03-15","2022-01-14",305,1,30,null,null,null,null,null,"X",null,null,0.95333333333333337]
["CPS-087-2021",2021,"FDLS-CD-080-2021*","https://community.secop.gov.co/Public/Tendering/OpportunityDetail/Index?noticeUID=CO1.NTC.1840702&isFromPublicArea=True&isModal=False","Contratos de prestación de servicios profesionales y de apoyo a la gestión","Contratación directa","Prestación de servicios profesionales y de apoyo a la gestión, o para la ejecución de trabajos artísticos que sólo puedan encomendarse a determinadas personas naturales;","PRESTAR LOS SERVICIOS COMO OPERARIOS DE LA MAQUINARIA PESADA DE PROPIEDAD O TENENCIA DEL FONDO DE DESARROLLO LOCAL DE SUMAPAZ","Inversión","Un Nuevo Contrato Social y Ambiental para la Bogotá del Siglo XXI",57,{"$f":"IF(ISERROR(VLOOKUP(K100,Proposito_programa!$C$2:$E$59,2,FALSE)),\" \",VLOOKUP(K100,Proposito_programa!$C$2:$E$59,2,FALSE))","v":"Gestión pública local"},{"$f":"IF(ISERROR(VLOOKUP(K100,Proposito_programa!$C$2:$E$59,3,FALSE)),\" \",VLOOKUP(K100,Proposito_programa!$C$2:$E$59,3,FALSE))","v":"Propósito 5: Construir Bogotá - Región con gobierno abierto, transparente y ciudadanía consciente"},1696,null,79462118,"ERNESTO GUEVARA GONZALEZ","ALBEIRO BARBOSA CIFUENTES","ERNESTO GUEVARA GONZALEZ","Persona Natural",null,null,null,22950000,null,1,2550000,25500000,24310000,"2021-03-12","2021-03-15","2022-01-14",305,1,30,null,null,null,null,null,"X",null,null,0.95333333333333337]
["CPS-088-2021",2021,"FDLS-CD-080-2021*","https://community.secop.gov.co/Public/Tendering/OpportunityDetail/Index?noticeUID=CO1.NTC.1840702&isFromPublicArea=True&isModal=False","Contratos de prestación de servicios profesionales y de apoyo a la gestión","Contratación directa","Prestación de servicios profesionales y de apoyo a la gestión, o para la ejecución de trabajos artísticos que sólo puedan encomendarse a determinadas personas naturales;","PRESTAR LOS SERVICIOS COMO OPERARIOS DE LA MAQUINARIA PESADA DE PROPIEDAD O TENENCIA DEL FONDO DE DESARROLLO LOCAL DE SUMAPAZ","Inversión","Un Nuevo Contrato Social y Ambiental para la Bogotá del Siglo XXI",57,{"$f":"IF(ISERROR(VLOOKUP(K101,Proposito_programa!$C$2:$E$59,2,FALSE)),\" \",VLOOKUP(K101,Proposito_programa!$C$2:$E$59,2,FALSE))","v":"Gestión pública local"},{"$f":"IF(ISERROR(VLOOKUP(K101,Proposito_programa!$C$2:$E$59,3,FALSE)),\" \",VLOOKUP(K101,Proposito_programa!$C$2:$E$59,3,FALSE))","v":"Propósito 5: Construir Bogotá - Región con gobierno abierto, transparente y ciudadanía consciente"},1696,null,80451743,"SALOMON ROMERO PALACIOS","ALEXANDER BUSTOS CHAVARRO","SALOMON ROMERO PALACIOS","Persona Natural",null,null,null,22950000,null,1,2550000,25500000,24310000,"2021-03-12","2021-03-15","2022-01-14",305,1,30,null,null,null,null,null,"X",null,null,0.95333333333333337]
["CPS-089-2021",2021,"FDLS-CD-080-2021*","https://community.secop.gov.co/Public/Tendering/OpportunityDetail/Index?noticeUID=CO1.NTC.1840702&isFromPublicArea=True&isModal=False","Contratos de prestación de servicios profesionales y de apoyo a la gestión","Contratación directa","Prestación de servicios profesionales y de apoyo a la gestión, o para la ejecución de trabajos artísticos que sólo puedan encomendarse a determinadas personas naturales;","PRESTAR LOS SERVICIOS COMO OPERARIOS DE LA MAQUINARIA PESADA DE PROPIEDAD O TENENCIA DEL FONDO DE DESARROLLO LOCAL DE SUMAPAZ","Inversión","Un Nuevo Contrato Social y Ambiental para la Bogotá del Siglo XXI",57,{"$f":"IF(ISERROR(VLOOKUP(K102,Proposito_programa!$C$2:$E$59,2,FALSE)),\" \",VLOOKUP(K102,Proposito_programa!$C$2:$E$59,2,FALSE))","v":"Gestión pública local"},{"$f":"IF(ISERROR(VLOOKUP(K102,Proposito_programa!$C$2:$E$59,3,FALSE)),\" \",VLOOKUP(K102,Proposito_programa!$C$2:$E$59,3,FALSE))","v":"Propósito 5: Construir Bogotá - Región con gobierno abierto, transparente y ciudadanía consciente"},1696,null,79565214,"NEIDER MOLINA REY","ERNESTO GUEVARA GONZALEZ","NEIDER MOLINA REY","Persona Natural",null,null,null,22950000,null,1,2550000,25500000,24310000,"2021-03-12","2021-03-15","2022-01-14",305,1,30,null,null,null,null,null,"X",null,null,0.95333333333333337]
["CPS-090-2021",2021,"FDLS-CD-080-2021*","https://community.secop.gov.co/Public/Tendering/OpportunityDetail/Index?noticeUID=CO1.NTC.1840702&isFromPublicArea=True&isModal=False","Contratos de prestación de servicios profesionales y de apoyo a la gestión","Contratación directa","Prestación de servicios profesionales y de apoyo a la gestión, o para la ejecución de trabajos artísticos que sólo puedan encomendarse a determinadas personas naturales;","PRESTAR LOS SERVICIOS COMO OPERARIOS DE LA MAQUINARIA PESADA DE PROPIEDAD O TENENCIA DEL FONDO DE DESARROLLO LOCAL DE SUMAPAZ","Inversión","Un Nuevo Contrato Social y Ambiental para la Bogotá del Siglo XXI",57,{"$f":"IF(ISERROR(VLOOKUP(K103,Proposito_programa!$C$2:$E$59,2,FALSE)),\" \",VLOOKUP(K103,Proposito_programa!$C$2:$E$59,2,FALSE))","v":"Gestión pública local"},{"$f":"IF(ISERROR(VLOOKUP(K103,Proposito_programa!$C$2:$E$59,3,FALSE)),\" \",VLOOKUP(K103,Proposito_programa!$C$2:$E$59,3,FALSE))","v":"Propósito 5: Construir Bogotá - Región con gobierno abierto, transparente y ciudadanía consciente"},1696,null,1070750533,"RAFAEL ANTONIO LARA SANABRIA","SALOMON ROMERO PALACIOS","RAFAEL ANTONIO LARA SANABRIA","Persona Natural",null,null,null,22950000,null,1,2550000,25500000,24310000,"2021-03-12","2021-03-15","2022-01-14",305,1,30,null,null,null,null,null,"X",null,null,0.95333333333333337]
["CPS-091-2021",2021,"FDLS-CD-080-2021*","https://community.secop.gov.co/Public/Tendering/OpportunityDetail/Index?noticeUID=CO1.NTC.1840702&isFromPublicArea=True&isModal=False","Contratos de prestación de servicios profesionales y de apoyo a la gestión","Contratación directa","Prestación de servicios profesionales y de apoyo a la gestión, o para la ejecución de trabajos artísticos que sólo puedan encomendarse a determinadas personas naturales;","PRESTAR LOS SERVICIOS COMO OPERARIOS DE LA MAQUINARIA PESADA DE PROPIEDAD O TENENCIA DEL FONDO DE DESARROLLO LOCAL DE SUMAPAZ","Inversión","Un Nuevo Contrato Social y Ambiental para la Bogotá del Siglo XXI",57,{"$f":"IF(ISERROR(VLOOKUP(K104,Proposito_programa!$C$2:$E$59,2,FALSE)),\" \",VLOOKUP(K104,Proposito_programa!$C$2:$E$59,2,FALSE))","v":"Gestión pública local"},{"$f":"IF(ISERROR(VLOOKUP(K104,Proposito_programa!$C$2:$E$59,3,FALSE)),\" \",VLOOKUP(K104,Proposito_programa!$C$2:$E$59,3,FALSE))","v":"Propósito 5: Construir Bogotá - Región con gobierno abierto, transparente y ciudadanía consciente"},1696,null,1023037487,"JHONATAN VALBUENA VERGARA","NEIDER MOLINA REY","JHONATAN VALBUENA VERGARA","Persona Natural",null,null,null,22950000,null,null,null,22950000,24310000,"2021-03-12","2021-03-15","2021-12-22",273,null,null,null,null,null,null,null,null,"X",null,1.0592592592592593]
["CPS-092-2021",2021,"FDLS-CD-081-2021","https://community.secop.gov.co/Public/Tendering/OpportunityDetail/Index?noticeUID=CO1.NTC.1814511&isFromPublicArea=True&isModal=False","Contratos de prestación de servicios profesionales y de apoyo a la gestión","Contratación directa","Prestación de servicios profesionales y de apoyo a la gestión, o para la ejecución de trabajos artísticos que sólo puedan encomendarse a determinadas personas naturales;","PRESTAR LOS SERVICIOS PROFESIONALES AL ÁREA DE GESTIÓN DE DESARROLLO LOCAL PARA APOYAR LA PLANEACIÓN, EJECUCIÓN Y SEGUIMIENTO DE LOS PROYECTOS DE INVERSIÓN RELACIONADOS CON LAS OBRAS DE MITIGACIÓN A DESARROLLAR POR EL FDLS","Inversión","Un Nuevo Contrato Social y Ambiental para la Bogotá del Siglo XXI",57,{"$f":"IF(ISERROR(VLOOKUP(K105,Proposito_programa!$C$2:$E$59,2,FALSE)),\" \",VLOOKUP(K105,Proposito_programa!$C$2:$E$59,2,FALSE))","v":"Gestión pública local"},{"$f":"IF(ISERROR(VLOOKUP(K105,Proposito_programa!$C$2:$E$59,3,FALSE)),\" \",VLOOKUP(K105,Proposito_programa!$C$2:$E$59,3,FALSE))","v":"Propósito 5: Construir Bogotá - Región con gobierno abierto, transparente y ciudadanía consciente"},1696,null,1090424977,"JUAN DAVID CORTES GOMEZ","RAFAEL ANTONIO LARA SANABRIA","JUAN DAVID CORTÉS GOMEZ","Persona Natural",null,null,null,57000000,null,null,null,57000000,5780000,"2021-03-02","2021-03-04","2022-01-03",274,null,null,null,null,null,null,null,"X",null,null,0.10140350877192983]
["CPS-093-2021",2021,"FDLS-CD-082-2021","https://community.secop.gov.co/Public/Tendering/OpportunityDetail/Index?noticeUID=CO1.NTC.1818969&isFromPublicArea=True&isModal=False","Contratos de prestación de servicios profesionales y de apoyo a la gestión","Contratación directa","Prestación de servicios profesionales y de apoyo a la gestión, o para la ejecución de trabajos artísticos que sólo puedan encomendarse a determinadas personas naturales;","PRESTAR LOS SERVICIOS PROFESIONALES ESPECIALIZADOS AL ÁREA DE GESTIÓN DEL DESARROLLO LOCAL DE LA ALCALDÍA LOCAL DE SUMAPAZ","Inversión","Un Nuevo Contrato Social y Ambiental para la Bogotá del Siglo XXI",57,{"$f":"IF(ISERROR(VLOOKUP(K106,Proposito_programa!$C$2:$E$59,2,FALSE)),\" \",VLOOKUP(K106,Proposito_programa!$C$2:$E$59,2,FALSE))","v":"Gestión pública local"},{"$f":"IF(ISERROR(VLOOKUP(K106,Proposito_programa!$C$2:$E$59,3,FALSE)),\" \",VLOOKUP(K106,Proposito_programa!$C$2:$E$59,3,FALSE))","v":"Propósito 5: Construir Bogotá - Región con gobierno abierto, transparente y ciudadanía consciente"},1696,null,79625519,"JAIME ANTONIO MAHECHA QUINTERO","JHONATAN VALBUENA VERGARA","JAIME ANTONIO MAHECHA QUINTERO","Persona Natural",null,null,null,75000000,null,null,null,75000000,50730000,"2021-03-04","2021-03-04","2022-01-03",274,null,null,null,null,null,null,null,"X",null,null,0.6764]
["CPS-094-2021",2021,"FDLS-CD-083-2021","https://community.secop.gov.co/Public/Tendering/OpportunityDetail/Index?noticeUID=CO1.NTC.1823158&isFromPublicArea=True&isModal=False","Contratos de prestación de servicios profesionales y de apoyo a la gestión","Contratación directa","Prestación de servicios profesionales y de apoyo a la gestión, o para la ejecución de trabajos artísticos que sólo puedan encomendarse a determinadas personas naturales;","PRESTAR LOS SERVICIOS PROFESIONALES PARA APOYAR LA PLANEACIÓN, EJECUCIÓN Y SEGUIMIENTO DE LOS PROYECTOS DE INVERSIÓN EN TEMAS DE CULTURA QUE EJECUTE EL FONDO DE DESARROLLO LOCAL DE SUMAPAZ","Inversión","Un Nuevo Contrato Social y Ambiental para la Bogotá del Siglo XXI",57,{"$f":"IF(ISERROR(VLOOKUP(K107,Proposito_programa!$C$2:$E$59,2,FALSE)),\" \",VLOOKUP(K107,Proposito_programa!$C$2:$E$59,2,FALSE))","v":"Gestión pública local"},{"$f":"IF(ISERROR(VLOOKUP(K107,Proposito_programa!$C$2:$E$59,3,FALSE)),\" \",VLOOKUP(K107,Proposito_programa!$C$2:$E$59,3,FALSE))","v":"Propósito 5: Construir Bogotá - Región con gobierno abierto, transparente y ciudadanía consciente"},1696,null,28723701,"LUZ YOLANDA LEON FLOREZ ","JUAN DAVID CORTÉS GOMEZ","LUZ YOLANDA LEON FLOREZ ","Persona Natural",null,null,null,57000000,null,null,null,57000000,75000000,"2021-03-05","2021-03-08","2022-01-07",305,null,null,null,null,null,null,null,"X",null,null,1.3157894736842106]
["CPS-095-2021",2021,"FDLS-CD-084-2021","https://community.secop.gov.co/Public/Tendering/OpportunityDetail/Index?noticeUID=CO1.NTC.1823712&isFromPublicArea=True&isModal=False","Contratos de prestación de servicios profesionales y de apoyo a la gestión","Contratación directa","Prestación de servicios profesionales y de apoyo a la gestión, o para la ejecución de trabajos artísticos que sólo puedan encomendarse a determinadas personas naturales;","PRESTAR LOS SERVICIOS COMO CONDUCTOR DEL CARROTANQUE DE PROPIEDAD DEL FONDO DE DESARROLLO LOCAL DE SUMAPAZ","Inversión","Un Nuevo Contrato Social y Ambiental para la Bogotá del Siglo XXI",57,{"$f":"IF(ISERROR(VLOOKUP(K108,Proposito_programa!$C$2:$E$59,2,FALSE)),\" \",VLOOKUP(K108,Proposito_programa!$C$2:$E$59,2,FALSE))","v":"Gestión pública local"},{"$f":"IF(ISERROR(VLOOKUP(K108,Proposito_programa!$C$2:$E$59,3,FALSE)),\" \",VLOOKUP(K108,Proposito_programa!$C$2:$E$59,3,FALSE))","v":"Propósito 5: Construir Bogotá - Región con gobierno abierto, transparente y ciudadanía consciente"},1696,null,1032656406,"FABIAN LEONARDO PULIDO MORENO","JAIME ANTONIO MAHECHA QUINTERO","FABIAN LEONARDO PULIDO MORENO","Persona Natural",null,null,null,25500000,null,1,2550000,28050000,49970000,"2021-03-05","2021-03-08","2022-02-07",336,1,30,null,null,null,null,null,"X",null,null,1.7814616755793227]
["CPS-096-2021",2021,"FDLS-MC-066-2021","https://community.secop.gov.co/Public/Tendering/OpportunityDetail/Index?noticeUID=CO1.NTC.1802527&isFromPublicArea=True&isModal=False","Contratos de prestación de servicios","Contratación mínima cuantia","No aplica","CONTRATAR LA PRESTACION DE SERVICIOS DE VIGILANCIA Y SEGURIDAD PRIVADA CON ARMAS, PARA LAS SEDES DE LA ALCALDIA LOCAL DE SUMAPAZ","Funcionamiento","Un Nuevo Contrato Social y Ambiental para la Bogotá del Siglo XXI","No aplica",{"$f":"IF(ISERROR(VLOOKUP(K109,Proposito_programa!$C$2:$E$59,2,FALSE)),\" \",VLOOKUP(K109,Proposito_programa!$C$2:$E$59,2,FALSE))","v":" "},{"$f":"IF(ISERROR(VLOOKUP(K109,Proposito_programa!$C$2:$E$59,3,FALSE)),\" \",VLOOKUP(K109,Proposito_programa!$C$2:$E$59,3,FALSE))","v":" "},null,1,860518862,"SEGURIDAD LAS AMERICAS LTDA SEGURIAMERICAS LTDA","LUZ YOLANDA LEON FLOREZ ","EDISON FERNEY MARTINEZ MOLINA\n- CEDIDO A \nGLORIA YOLANDA DIMATE RICO","Persona Jurídica",null,null,null,25293289,null,2,12646644,37939933,24905000,"2021-03-05","2021-03-06","2021-04-25",50,2,17,null,null,null,null,null,null,null,"X",0.6564323663934778]
["CPS-097-2021",2021,"FDLS-CD-085-2021","https://community.secop.gov.co/Public/Tendering/OpportunityDetail/Index?noticeUID=CO1.NTC.1828826&isFromPublicArea=True&isModal=False","Contratos de prestación de servicios profesionales y de apoyo a la gestión","Contratación directa","Prestación de servicios profesionales y de apoyo a la gestión, o para la ejecución de trabajos artísticos que sólo puedan encomendarse a determinadas personas naturales;","PRESTAR LOS SERVICIOS COMO AUXILIAR ADMINISTRATIVO PARA EL CENTRO DE SERVICIOS DE SANTA ROSA","Inversión","Un Nuevo Contrato Social y Ambiental para la Bogotá del Siglo XXI",57,{"$f":"IF(ISERROR(VLOOKUP(K110,Proposito_programa!$C$2:$E$59,2,FALSE)),\" \",VLOOKUP(K110,Proposito_programa!$C$2:$E$59,2,FALSE))","v":"Gestión pública local"},{"$f":"IF(ISERROR(VLOOKUP(K110,Proposito_programa!$C$2:$E$59,3,FALSE)),\" \",VLOOKUP(K110,Proposito_programa!$C$2:$E$59,3,FALSE))","v":"Propósito 5: Construir Bogotá - Región con gobierno abierto, transparente y ciudadanía consciente"},1696,null,1023019730,"EDISON FERNEY MARTINEZ MOLINA","FABIAN LEONARDO PULIDO MORENO","MARTHA LILIANA CARRERO VILLAMIL","Persona Natural",null,null,null,23000000,null,null,null,23000000,18663333,"2021-03-08","2021-03-13","2022-05-12",303,null,null,1022943098,"GLORIA YOLANDA DIMATE RICO","2021-05-18",17863334,null,"X",null,null,0.81144926086956526]
["CPS-098-2021",2021,"FDLS-CD-086-2021","https://community.secop.gov.co/Public/Tendering/OpportunityDetail/Index?noticeUID=CO1.NTC.1838618&isFromPublicArea=True&isModal=False","Contratos de prestación de servicios profesionales y de apoyo a la gestión","Contratación directa","Prestación de servicios profesionales y de apoyo a la gestión, o para la ejecución de trabajos artísticos que sólo puedan encomendarse a determinadas personas naturales;","PRESTAR LOS SERVICIOS COMO AUXILIAR ADMINISTRATIVO EN LOS TEMAS FINANCIEROS DEL ÁREA DE GESTIÓN DE DESARROLLO LOCAL DE LA ALCALDÍA LOCAL DE SUMAPAZ","Inversión","Un Nuevo Contrato Social y Ambiental para la Bogotá del Siglo XXI",57,{"$f":"IF(ISERROR(VLOOKUP(K111,Proposito_programa!$C$2:$E$59,2,FALSE)),\" \",VLOOKUP(K111,Proposito_programa!$C$2:$E$59,2,FALSE))","v":"Gestión pública local"},{"$f":"IF(ISERROR(VLOOKUP(K111,Proposito_programa!$C$2:$E$59,3,FALSE)),\" \",VLOOKUP(K111,Proposito_programa!$C$2:$E$59,3,FALSE))","v":"Propósito 5: Construir Bogotá - Región con gobierno abierto, transparente y ciudadanía consciente"},1696,null,52809596,"MARTHA LILIANA CARRERO VILLAMIL","EDISON FERNEY MARTINEZ MOLINA\n- CEDIDO A \nGLORIA YOLANDA DIMATE RICO","EDISON JOAQUIN BECERRA GONZÁLEZ","Persona Natural",null,null,null,26000000,null,null,null,26000000,24960000,"2021-03-11","2021-03-13","2022-01-12",305,null,null,null,null,null,null,null,"X",null,null,0.96]
["CPS-099-2021",2021,"FDLS-CD-087-2021","https://community.secop.gov.co/Public/Tendering/OpportunityDetail/Index?noticeUID=CO1.NTC.1838491&isFromPublicArea=True&isModal=False","Contratos de prestación de servicios profesionales y de apoyo a la gestión","Contratación directa","Prestación de servicios profesionales y de apoyo a la gestión, o para la ejecución de trabajos artísticos que sólo puedan encomendarse a determinadas personas naturales;","PRESTAR LOS SERVICIOS COMO AYUDANTES DE MAQUINARIA PESADA DE PROPIEDAD O TENENCIA DEL FONDO DE DESARROLLO LOCAL DE SUMAPAZ","Inversión","Un Nuevo Contrato Social y Ambiental para la Bogotá del Siglo XXI",57,{"$f":"IF(ISERROR(VLOOKUP(K112,Proposito_programa!$C$2:$E$59,2,FALSE)),\" \",VLOOKUP(K112,Proposito_programa!$C$2:$E$59,2,FALSE))","v":"Gestión pública local"},{"$f":"IF(ISERROR(VLOOKUP(K112,Proposito_programa!$C$2:$E$59,3,FALSE)),\" \",VLOOKUP(K112,Proposito_programa!$C$2:$E$59,3,FALSE))","v":"Propósito 5: Construir Bogotá - Región con gobierno abierto, transparente y ciudadanía consciente"},1696,null,1055314053,"EDISON JOAQUIN BECERRA GONZALEZ","MARTHA LILIANA CARRERO VILLAMIL","GERMAN ROMERO ROMAN","Persona Natural",null,null,null,25000000,null,null,null,25000000,24083333,"2021-03-11","2021-03-12","2022-01-11",305,null,null,null,null,null,null,null,"X",null,null,0.96333332000000005]
["CPS-100-2021",2021,"FDLS-CD-088-2021","https://community.secop.gov.co/Public/Tendering/OpportunityDetail/Index?noticeUID=CO1.NTC.1839097&isFromPublicArea=True&isModal=False","Contratos de prestación de servicios profesionales y de apoyo a la gestión","Contratación directa","Prestación de servicios profesionales y de apoyo a la gestión, o para la ejecución de trabajos artísticos que sólo puedan encomendarse a determinadas personas naturales;","PRESTAR LOS SERVICIOS COMO CONDUCTOR DE VEHÍCULOS PESADOS DE PROPIEDAD O TENENCIA DEL FONDO DE DESARROLLO LOCAL DE SUMAPAZ","Inversión","Un Nuevo Contrato Social y Ambiental para la Bogotá del Siglo XXI",57,{"$f":"IF(ISERROR(VLOOKUP(K113,Proposito_programa!$C$2:$E$59,2,FALSE)),\" \",VLOOKUP(K113,Proposito_programa!$C$2:$E$59,2,FALSE))","v":"Gestión pública local"},{"$f":"IF(ISERROR(VLOOKUP(K113,Proposito_programa!$C$2:$E$59,3,FALSE)),\" \",VLOOKUP(K113,Proposito_programa!$C$2:$E$59,3,FALSE))","v":"Propósito 5: Construir Bogotá - Región con gobierno abierto, transparente y ciudadanía consciente"},1696,null,79632409,"GERMAN ROMERO ROMAN","EDISON JOAQUIN BECERRA GONZÁLEZ","JENNY VIVIANA CASTAÑEDA RAMIREZ","Persona Natural",null,null,null,25500000,null,null,null,25500000,24565000,"2021-03-11","2021-03-12","2022-01-11",305,null,null,null,null,null,null,null,"X",null,null,0.96333333333333337]
["CPS-101-2021",2021,"FDLS-CD-089-2021","https://community.secop.gov.co/Public/Tendering/OpportunityDetail/Index?noticeUID=CO1.NTC.1838812&isFromPublicArea=True&isModal=False","Contratos de prestación de servicios profesionales y de apoyo a la gestión","Contratación directa","Prestación de servicios profesionales y de apoyo a la gestión, o para la ejecución de trabajos artísticos que sólo puedan encomendarse a determinadas personas naturales;","PRESTAR SUS SERVICIOS PROFESIONALES PARA APOYAR AL EQUIPO DE PRENSA Y COMUNICACIONES DE LA ALCALDÍA LOCAL EN LA  REALIZACIÓN DE PRODUCTOS Y PIEZAS DIGITALES, IMPRESAS Y PUBLICITARIAS DE GRAN FORMATO Y DE ANIMACIÓN GRÁFICA, ASÍ COMO APOYAR LA PRODUCCIÓN Y MONTAJE DE EVENTOS","Inversión","Un Nuevo Contrato Social y Ambiental para la Bogotá del Siglo XXI",57,{"$f":"IF(ISERROR(VLOOKUP(K114,Proposito_programa!$C$2:$E$59,2,FALSE)),\" \",VLOOKUP(K114,Proposito_programa!$C$2:$E$59,2,FALSE))","v":"Gestión pública local"},{"$f":"IF(ISERROR(VLOOKUP(K114,Proposito_programa!$C$2:$E$59,3,FALSE)),\" \",VLOOKUP(K114,Proposito_programa!$C$2:$E$59,3,FALSE))","v":"Propósito 5: Construir Bogotá - Región con gobierno abierto, transparente y ciudadanía consciente"},1696,null,1012368691,"JENNY VIVIANA CASTAÑEDA RAMIREZ","GERMAN ROMERO ROMAN","ANDREI ESTEBAN VARGAS BENITEZ ","Persona Natural",null,null,null,49500000,null,1,5500000,55000000,52800000,"2021-03-11","2021-03-13","2022-01-12",305,1,30,null,null,null,null,null,"X",null,null,0.96]
["CPS-102-2021",2021,"FDLS-CD-090-2021","https://community.secop.gov.co/Public/Tendering/OpportunityDetail/Index?noticeUID=CO1.NTC.1838280&isFromPublicArea=True&isModal=False","Contratos de prestación de servicios profesionales y de apoyo a la gestión","Contratación directa","Prestación de servicios profesionales y de apoyo a la gestión, o para la ejecución de trabajos artísticos que sólo puedan encomendarse a determinadas personas naturales;","PRESTAR LOS SERVICIOS DE APOYO ADMINISTRATIVO EN LOS PROCESOS QUE SE ADELANTAN EN EL ALMACÉN DE LA ALCALDÍA LOCAL DE  SUMAPAZ","Inversión","Un Nuevo Contrato Social y Ambiental para la Bogotá del Siglo XXI",57,{"$f":"IF(ISERROR(VLOOKUP(K115,Proposito_programa!$C$2:$E$59,2,FALSE)),\" \",VLOOKUP(K115,Proposito_programa!$C$2:$E$59,2,FALSE))","v":"Gestión pública local"},{"$f":"IF(ISERROR(VLOOKUP(K115,Proposito_programa!$C$2:$E$59,3,FALSE)),\" \",VLOOKUP(K115,Proposito_programa!$C$2:$E$59,3,FALSE))","v":"Propósito 5: Construir Bogotá - Región con gobierno abierto, transparente y ciudadanía consciente"},1696,null,1030591646,"ANDREI ESTEBAN VARGAS BENITEZ ","DIEGO YOHANY REY CHINGATE","EDUAR IVAN AVENDAÑO BAUTISTA","Persona Natural",null,null,null,7800000,null,null,null,7800000,7800000,"2021-03-11","2021-03-12","2021-06-11",91,null,null,null,null,null,null,null,null,"X",null,1]
["CPS-103-2021",2021,"FDLS-CD-091-2021","https://community.secop.gov.co/Public/Tendering/OpportunityDetail/Index?noticeUID=CO1.NTC.1849107&isFromPublicArea=True&isModal=False","Contratos de prestación de servicios profesionales y de apoyo a la gestión","Contratación directa","Prestación de servicios profesionales y de apoyo a la gestión, o para la ejecución de trabajos artísticos que sólo puedan encomendarse a determinadas personas naturales;","PRESTAR LOS SERVICIOS COMO CONDUCTOR DE VEHÍCULOS PESADOS DE PROPIEDAD O TENENCIA DEL FONDO DE DESARROLLO LOCAL DE  SUMAPAZ","Inversión","Un Nuevo Contrato Social y Ambiental para la Bogotá del Siglo XXI",57,{"$f":"IF(ISERROR(VLOOKUP(K116,Proposito_programa!$C$2:$E$59,2,FALSE)),\" \",VLOOKUP(K116,Proposito_programa!$C$2:$E$59,2,FALSE))","v":"Gestión pública local"},{"$f":"IF(ISERROR(VLOOKUP(K116,Proposito_programa!$C$2:$E$59,3,FALSE)),\" \",VLOOKUP(K116,Proposito_programa!$C$2:$E$59,3,FALSE))","v":"Propósito 5: Construir Bogotá - Región con gobierno abierto, transparente y ciudadanía consciente"},1696,null,80742188,"EDUAR IVAN AVENDAÑO BAUTISTA","JENNY VIVIANA CASTAÑEDA RAMIREZ","LEMDER CONTRERAS MARROQUIN","Persona Natural",null,null,null,25500000,null,null,null,25500000,24140000,"2021-03-16","2021-03-17","2022-01-16",305,null,null,null,null,null,null,null,"X",null,null,0.94666666666666666]
["CPS-104-2021",2021,"FDLS-CD-091-2021","https://community.secop.gov.co/Public/Tendering/OpportunityDetail/Index?noticeUID=CO1.NTC.1849107&isFromPublicArea=True&isModal=False","Contratos de prestación de servicios profesionales y de apoyo a la gestión","Contratación directa","Prestación de servicios profesionales y de apoyo a la gestión, o para la ejecución de trabajos artísticos que sólo puedan encomendarse a determinadas personas naturales;","PRESTAR LOS SERVICIOS COMO CONDUCTOR DE VEHÍCULOS PESADOS DE PROPIEDAD O TENENCIA DEL FONDO DE DESARROLLO LOCAL DE SUMAPAZ","Inversión","Un Nuevo Contrato Social y Ambiental para la Bogotá del Siglo XXI",57,{"$f":"IF(ISERROR(VLOOKUP(K117,Proposito_programa!$C$2:$E$59,2,FALSE)),\" \",VLOOKUP(K117,Proposito_programa!$C$2:$E$59,2,FALSE))","v":"Gestión pública local"},{"$f":"IF(ISERROR(VLOOKUP(K117,Proposito_programa!$C$2:$E$59,3,FALSE)),\" \",VLOOKUP(K117,Proposito_programa!$C$2:$E$59,3,FALSE))","v":"Propósito 5: Construir Bogotá - Región con gobierno abierto, transparente y ciudadanía consciente"},1696,null,79819196,"LEMDER CONTRERAS MARROQUIN","ANDREI ESTEBAN VARGAS BENITEZ ","DIEGO YOHANY REY CHINGATE","Persona Natural",null,null,null,25500000,null,null,null,25500000,24140000,"2021-03-16","2021-03-17","2022-01-16",305,null,null,null,null,null,null,null,"X",null,null,0.94666666666666666]
["CPS-105-2021",2021,"FDLS-CD-088-2021","https://community.secop.gov.co/Public/Tendering/OpportunityDetail/Index?noticeUID=CO1.NTC.1839097&isFromPublicArea=True&isModal=False","Contratos de prestación de servicios profesionales y de apoyo a la gestión","Contratación directa","Prestación de servicios profesionales y de apoyo a la gestión, o para la ejecución de trabajos artísticos que sólo puedan encomendarse a determinadas personas naturales;","PRESTAR LOS SERVICIOS COMO CONDUCTOR DE VEHÍCULOS PESADOS DE PROPIEDAD O TENENCIA DEL FONDO DE DESARROLLO LOCAL DE SUMAPAZ","Inversión","Un Nuevo Contrato Social y Ambiental para la Bogotá del Siglo XXI",57,{"$f":"IF(ISERROR(VLOOKUP(K118,Proposito_programa!$C$2:$E$59,2,FALSE)),\" \",VLOOKUP(K118,Proposito_programa!$C$2:$E$59,2,FALSE))","v":"Gestión pública local"},{"$f":"IF(ISERROR(VLOOKUP(K118,Proposito_programa!$C$2:$E$59,3,FALSE)),\" \",VLOOKUP(K118,Proposito_programa!$C$2:$E$59,3,FALSE))","v":"Propósito 5: Construir Bogotá - Región con gobierno abierto, transparente y ciudadanía consciente"},1696,null,1032656218,"DIEGO YOHANY REY CHINGATE","EDUAR IVAN AVENDAÑO BAUTISTA","MILENY HILARION RIOS","Persona Natural",null,null,null,25500000,null,null,null,25500000,21675000,"2021-03-11","2021-03-16","2022-01-15",305,null,null,null,null,null,null,null,"X",null,null,0.85]
["CPS-106-2021",2021,"FDLS-CD-093-2021","https://community.secop.gov.co/Public/Tendering/OpportunityDetail/Index?noticeUID=CO1.NTC.1840862&isFromPublicArea=True&isModal=False","Contratos de prestación de servicios profesionales y de apoyo a la gestión","Contratación directa","Prestación de servicios profesionales y de apoyo a la gestión, o para la ejecución de trabajos artísticos que sólo puedan encomendarse a determinadas personas naturales;","PRESTAR LOS SERVICIOS PROFESIONALES PARA LA OPERACIÓN, PRESTACIÓN, SEGUIMIENTO Y CUMPLIMIENTO DE LOS PROCEDIMIENTOS ADMINISTRATIVOS, OPERATIVOS Y PROGRAMÁTICOS DEL SERVICIO APOYO ECONÓMICO TIPO C, QUE CONTRIBUYAN A LA GARANTÍA DE LOS  DERECHOS DE LA POBLACIÓN MAYOR EN EL MARCO DE LA POLÍTICA PÚBLICA SOCIAL PARA EL ENVEJECIMIENTO Y LA VEJEZ EN EL DISTRITO CAPITAL A CARGO DE LA ALCALDÍA LOCAL DE SUMAPAZ","Inversión","Un Nuevo Contrato Social y Ambiental para la Bogotá del Siglo XXI",1,{"$f":"IF(ISERROR(VLOOKUP(K119,Proposito_programa!$C$2:$E$59,2,FALSE)),\" \",VLOOKUP(K119,Proposito_programa!$C$2:$E$59,2,FALSE))","v":"Subsidios y transferencias para la equidad"},{"$f":"IF(ISERROR(VLOOKUP(K119,Proposito_programa!$C$2:$E$59,3,FALSE)),\" \",VLOOKUP(K119,Proposito_programa!$C$2:$E$59,3,FALSE))","v":"Propósito 1: Hacer un nuevo contrato social para incrementar la inclusión social, productiva y política"},1583,null,52372021,"MILENY HILARION RIOS","LEMDER CONTRERAS MARROQUIN","LEILA MARCELA LUGO","Persona Natural",null,null,null,43650000,null,null,null,43650000,42049500,"2021-03-12","2021-03-12","2022-01-11",305,null,null,null,null,null,null,null,"X",null,null,0.96333333333333337]
["CPS-107-2021",2021,"FDLS-CD-094-2021","https://community.secop.gov.co/Public/Tendering/OpportunityDetail/Index?noticeUID=CO1.NTC.1840966&isFromPublicArea=True&isModal=False","Contratos de prestación de servicios profesionales y de apoyo a la gestión","Contratación directa","Prestación de servicios profesionales y de apoyo a la gestión, o para la ejecución de trabajos artísticos que sólo puedan encomendarse a determinadas personas naturales;","PRESTAR LOS SERVICIOS PROFESIONALES PARA LA OPERACIÓN, PRESTACIÓN, SEGUIMIENTO Y CUMPLIMIENTO DE LOS PROCEDIMIENTOS  ADMINISTRATIVOS, OPERATIVOS Y PROGRAMÁTICOS DEL SERVICIO APOYO ECONÓMICO TIPO C, QUE CONTRIBUYAN A LA GARANTÍA DE LOS  DERECHOS DE LA POBLACIÓN MAYOR EN EL MARCO DE LA POLÍTICA PÚBLICA SOCIAL PARA EL ENVEJECIMIENTO Y LA VEJEZ EN EL DISTRITO  CAPITAL A CARGO DE LA ALCALDÍA LOCAL DE SUMAPAZ","Inversión","Un Nuevo Contrato Social y Ambiental para la Bogotá del Siglo XXI",1,{"$f":"IF(ISERROR(VLOOKUP(K120,Proposito_programa!$C$2:$E$59,2,FALSE)),\" \",VLOOKUP(K120,Proposito_programa!$C$2:$E$59,2,FALSE))","v":"Subsidios y transferencias para la equidad"},{"$f":"IF(ISERROR(VLOOKUP(K120,Proposito_programa!$C$2:$E$59,3,FALSE)),\" \",VLOOKUP(K120,Proposito_programa!$C$2:$E$59,3,FALSE))","v":"Propósito 1: Hacer un nuevo contrato social para incrementar la inclusión social, productiva y política"},1583,null,1018414927,"LEILA MARCELA LUGO","VISATEL DE COLOMBIA S A S","ARNOLDO RAMIREZ MALAGÓN","Persona Natural",null,null,null,51300000,null,1,5700000,57000000,54340000,"2021-03-12","2021-03-15","2022-01-14",305,1,30,null,null,null,null,null,"X",null,null,0.95333333333333337]
["CPS-108-2021",2021,"FDLS-CD-080-2021*","https://community.secop.gov.co/Public/Tendering/OpportunityDetail/Index?noticeUID=CO1.NTC.1840702&isFromPublicArea=True&isModal=False","Contratos de prestación de servicios profesionales y de apoyo a la gestión","Contratación directa","Prestación de servicios profesionales y de apoyo a la gestión, o para la ejecución de trabajos artísticos que sólo puedan encomendarse a determinadas personas naturales;","PRESTAR LOS SERVICIOS COMO OPERARIOS DE LA MAQUINARIA PESADA DE PROPIEDAD O TENENCIA DEL FONDO DE DESARROLLO LOCAL DE SUMAPAZ","Inversión","Un Nuevo Contrato Social y Ambiental para la Bogotá del Siglo XXI",57,{"$f":"IF(ISERROR(VLOOKUP(K121,Proposito_programa!$C$2:$E$59,2,FALSE)),\" \",VLOOKUP(K121,Proposito_programa!$C$2:$E$59,2,FALSE))","v":"Gestión pública local"},{"$f":"IF(ISERROR(VLOOKUP(K121,Proposito_programa!$C$2:$E$59,3,FALSE)),\" \",VLOOKUP(K121,Proposito_programa!$C$2:$E$59,3,FALSE))","v":"Propósito 5: Construir Bogotá - Región con gobierno abierto, transparente y ciudadanía consciente"},1696,null,80489721,"ARNOLDO RAMIREZ MALAGON","MILENY HILARION RIOS","HECTOR ERNESTO GARCÍA GARIBELLO","Persona Natural",null,null,null,22950000,null,1,2550000,25500000,24310000,"2021-03-12","2021-03-15","2022-01-14",305,1,30,null,null,null,null,null,"X",null,null,0.95333333333333337]
["CPS-109-2021",2021,"FDLS-CD-080-2021*","https://community.secop.gov.co/Public/Tendering/OpportunityDetail/Index?noticeUID=CO1.NTC.1840702&isFromPublicArea=True&isModal=False","Contratos de prestación de servicios profesionales y de apoyo a la gestión","Contratación directa","Prestación de servicios profesionales y de apoyo a la gestión, o para la ejecución de trabajos artísticos que sólo puedan encomendarse a determinadas personas naturales;","PRESTAR LOS SERVICIOS COMO OPERARIOS DE LA MAQUINARIA PESADA DE PROPIEDAD O TENENCIA DEL FONDO DE DESARROLLO LOCAL DE SUMAPAZ","Inversión","Un Nuevo Contrato Social y Ambiental para la Bogotá del Siglo XXI",57,{"$f":"IF(ISERROR(VLOOKUP(K122,Proposito_programa!$C$2:$E$59,2,FALSE)),\" \",VLOOKUP(K122,Proposito_programa!$C$2:$E$59,2,FALSE))","v":"Gestión pública local"},{"$f":"IF(ISERROR(VLOOKUP(K122,Proposito_programa!$C$2:$E$59,3,FALSE)),\" \",VLOOKUP(K122,Proposito_programa!$C$2:$E$59,3,FALSE))","v":"Propósito 5: Construir Bogotá - Región con gobierno abierto, transparente y ciudadanía consciente"},1696,null,1033676728,"HECTOR ERNESTO GARCIA GARIBELLO","LEILA MARCELA LUGO","JOSE JAVIER PORRAS","Persona Natural",null,null,null,22950000,null,1,2550000,25500000,24310000,"2021-03-12","2021-03-15","2022-01-14",305,1,30,null,null,null,null,null,"X",null,null,0.95333333333333337]
["CPS-110-2021",2021,"FDLS-CD-080-2021*","https://community.secop.gov.co/Public/Tendering/OpportunityDetail/Index?noticeUID=CO1.NTC.1840702&isFromPublicArea=True&isModal=False","Contratos de prestación de servicios profesionales y de apoyo a la gestión","Contratación directa","Prestación de servicios profesionales y de apoyo a la gestión, o para la ejecución de trabajos artísticos que sólo puedan encomendarse a determinadas personas naturales;","PRESTAR LOS SERVICIOS COMO OPERARIOS DE LA MAQUINARIA PESADA DE PROPIEDAD O TENENCIA DEL FONDO DE DESARROLLO LOCAL DE SUMAPAZ","Inversión","Un Nuevo Contrato Social y Ambiental para la Bogotá del Siglo XXI",57,{"$f":"IF(ISERROR(VLOOKUP(K123,Proposito_programa!$C$2:$E$59,2,FALSE)),\" \",VLOOKUP(K123,Proposito_programa!$C$2:$E$59,2,FALSE))","v":"Gestión pública local"},{"$f":"IF(ISERROR(VLOOKUP(K123,Proposito_programa!$C$2:$E$59,3,FALSE)),\" \",VLOOKUP(K123,Proposito_programa!$C$2:$E$59,3,FALSE))","v":"Propósito 5: Construir Bogotá - Región con gobierno abierto, transparente y ciudadanía consciente"},1696,null,79519630,"JOSE JAVIER PORRAS","ARNOLDO RAMIREZ MALAGÓN","LEONEL JESID MARTINEZ MARTINEZ","Persona Natural",null,null,null,22950000,null,1,2550000,25500000,24310000,"2021-03-12","2021-03-15","2022-01-14",305,1,30,null,null,null,null,null,"X",null,null,0.95333333333333337]
["CPS-111-2021",2021,"FDLS-CD-080-2021*","https://community.secop.gov.co/Public/Tendering/OpportunityDetail/Index?noticeUID=CO1.NTC.1840702&isFromPublicArea=True&isModal=False","Contratos de prestación de servicios profesionales y de apoyo a la gestión","Contratación directa","Prestación de servicios profesionales y de apoyo a la gestión, o para la ejecución de trabajos artísticos que sólo puedan encomendarse a determinadas personas naturales;","PRESTAR LOS SERVICIOS COMO OPERARIOS DE LA MAQUINARIA PESADA DE PROPIEDAD O TENENCIA DEL FONDO DE DESARROLLO LOCAL DE SUMAPAZ","Inversión","Un Nuevo Contrato Social y Ambiental para la Bogotá del Siglo XXI",57,{"$f":"IF(ISERROR(VLOOKUP(K124,Proposito_programa!$C$2:$E$59,2,FALSE)),\" \",VLOOKUP(K124,Proposito_programa!$C$2:$E$59,2,FALSE))","v":"Gestión pública local"},{"$f":"IF(ISERROR(VLOOKUP(K124,Proposito_programa!$C$2:$E$59,3,FALSE)),\" \",VLOOKUP(K124,Proposito_programa!$C$2:$E$59,3,FALSE))","v":"Propósito 5: Construir Bogotá - Región con gobierno abierto, transparente y ciudadanía consciente"},1696,null,1023017436,"LEONEL JESID MARTINEZ MARTINEZ","HECTOR ERNESTO GARCÍA GARIBELLO","PABLO YESID RIOS HILARION","Persona Natural",null,null,null,22950000,null,null,null,22950000,21250000,"2021-03-12","2021-03-15","2021-12-20",274,null,null,null,null,null,null,null,null,"X",null,0.92592592592592593]
["CPS-112-2021",2021,"FDLS-CD-080-2021*","https://community.secop.gov.co/Public/Tendering/OpportunityDetail/Index?noticeUID=CO1.NTC.1840702&isFromPublicArea=True&isModal=False","Contratos de prestación de servicios profesionales y de apoyo a la gestión","Contratación directa","Prestación de servicios profesionales y de apoyo a la gestión, o para la ejecución de trabajos artísticos que sólo puedan encomendarse a determinadas personas naturales;","PRESTAR LOS SERVICIOS COMO OPERARIOS DE LA MAQUINARIA PESADA DE PROPIEDAD O TENENCIA DEL FONDO DE DESARROLLO LOCAL DE SUMAPAZ","Inversión","Un Nuevo Contrato Social y Ambiental para la Bogotá del Siglo XXI",57,{"$f":"IF(ISERROR(VLOOKUP(K125,Proposito_programa!$C$2:$E$59,2,FALSE)),\" \",VLOOKUP(K125,Proposito_programa!$C$2:$E$59,2,FALSE))","v":"Gestión pública local"},{"$f":"IF(ISERROR(VLOOKUP(K125,Proposito_programa!$C$2:$E$59,3,FALSE)),\" \",VLOOKUP(K125,Proposito_programa!$C$2:$E$59,3,FALSE))","v":"Propósito 5: Construir Bogotá - Región con gobierno abierto, transparente y ciudadanía consciente"},1696,null,1023025796,"PABLO YESID RIOS HILARION","JOSE JAVIER PORRAS","PEDRO ALFONSO CASTRO MORALES","Persona Natural",null,null,null,22950000,null,1,2550000,25500000,24310000,"2021-03-12","2021-03-15","2022-01-14",305,1,30,null,null,null,null,null,"X",null,null,0.95333333333333337]
["CPS-113-2021",2021,"FDLS-CD-095-2021","https://community.secop.gov.co/Public/Tendering/OpportunityDetail/Index?noticeUID=CO1.NTC.1841521&isFromPublicArea=True&isModal=False","Contratos de prestación de servicios profesionales y de apoyo a la gestión","Contratación directa","Prestación de servicios profesionales y de apoyo a la gestión, o para la ejecución de trabajos artísticos que sólo puedan encomendarse a determinadas personas naturales;","PRESTAR LOS SERVICIOS PARA DESARROLLAR ACTIVIDADES LOGÍSTICAS Y OPERATIVAS, EN LOS BIENES Y/O PREDIOS EN DONDE FUNCIONA LA ALCALDÍA LOCAL DE SUMAPAZ","Inversión","Un Nuevo Contrato Social y Ambiental para la Bogotá del Siglo XXI",57,{"$f":"IF(ISERROR(VLOOKUP(K126,Proposito_programa!$C$2:$E$59,2,FALSE)),\" \",VLOOKUP(K126,Proposito_programa!$C$2:$E$59,2,FALSE))","v":"Gestión pública local"},{"$f":"IF(ISERROR(VLOOKUP(K126,Proposito_programa!$C$2:$E$59,3,FALSE)),\" \",VLOOKUP(K126,Proposito_programa!$C$2:$E$59,3,FALSE))","v":"Propósito 5: Construir Bogotá - Región con gobierno abierto, transparente y ciudadanía consciente"},1696,null,80559448,"PEDRO ALFONSO CASTRO MORALES","LEONEL JESID MARTINEZ MARTINEZ","SANTIAGO HINCAPIE  GARCIA","Persona Natural",null,null,null,23400000,null,1,2600000,26000000,25046666,"2021-03-12","2021-03-12","2022-01-11",274,1,30,null,null,null,null,null,"X",null,null,0.96333330769230774]
["CPS-114-2021",2021,"FDLS-CD-096-2021","https://community.secop.gov.co/Public/Tendering/OpportunityDetail/Index?noticeUID=CO1.NTC.1849195&isFromPublicArea=True&isModal=False","Contratos de prestación de servicios profesionales y de apoyo a la gestión","Contratación directa","Prestación de servicios profesionales y de apoyo a la gestión, o para la ejecución de trabajos artísticos que sólo puedan encomendarse a determinadas personas naturales;","PRESTAR LOS SERVICIOS PROFESIONALES PARA APOYAR LA FORMULACIÓN, EJECUCIÓN, SEGUIMIENTO Y MEJORA CONTINUA DE LAS HERRAMIENTAS QUE CONFORMAN LA GESTIÓN AMBIENTAL INSTITUCIONAL DE LA ALCALDÍA LOCAL","Inversión","Un Nuevo Contrato Social y Ambiental para la Bogotá del Siglo XXI",28,{"$f":"IF(ISERROR(VLOOKUP(K127,Proposito_programa!$C$2:$E$59,2,FALSE)),\" \",VLOOKUP(K127,Proposito_programa!$C$2:$E$59,2,FALSE))","v":"Bogotá protectora de sus recursos naturales"},{"$f":"IF(ISERROR(VLOOKUP(K127,Proposito_programa!$C$2:$E$59,3,FALSE)),\" \",VLOOKUP(K127,Proposito_programa!$C$2:$E$59,3,FALSE))","v":"Propósito 2 : Cambiar Nuestros Hábitos de Vida para Reverdecer a Bogotá y Adaptarnos y Mitigar la Crisis Climática"},1648,null,1077034483,"SANTIAGO HINCAPIE  GARCIA","PABLO YESID RIOS HILARION","MIGUEL ANTONIO CHAVARRO TORRES","Persona Natural",null,null,null,43650000,null,null,null,43650000,41031000,"2021-03-16","2021-03-19","2022-01-18",305,null,null,null,null,null,null,null,"X",null,null,0.94]
["CPS-115-2021",2021,"FDLS-CD-097-2021","https://community.secop.gov.co/Public/Tendering/OpportunityDetail/Index?noticeUID=CO1.NTC.1846655&isFromPublicArea=True&isModal=False","Contratos de prestación de servicios profesionales y de apoyo a la gestión","Contratación directa","Prestación de servicios profesionales y de apoyo a la gestión, o para la ejecución de trabajos artísticos que sólo puedan encomendarse a determinadas personas naturales;","PRESTAR LOS SERVICIOS COMO AUXILIAR ADMINISTRATIVO PARA EL ÁREA DE GESTIÓN DE DESARROLLO LOCAL, EN LOS TEMAS DE INFRAESTRUCTURA, DE LA ALCALDÍA LOCAL DE SUMAPAZ","Inversión","Un Nuevo Contrato Social y Ambiental para la Bogotá del Siglo XXI",57,{"$f":"IF(ISERROR(VLOOKUP(K128,Proposito_programa!$C$2:$E$59,2,FALSE)),\" \",VLOOKUP(K128,Proposito_programa!$C$2:$E$59,2,FALSE))","v":"Gestión pública local"},{"$f":"IF(ISERROR(VLOOKUP(K128,Proposito_programa!$C$2:$E$59,3,FALSE)),\" \",VLOOKUP(K128,Proposito_programa!$C$2:$E$59,3,FALSE))","v":"Propósito 5: Construir Bogotá - Región con gobierno abierto, transparente y ciudadanía consciente"},1696,null,1023020151,"MIGUEL ANTONIO CHAVARRO TORRES","PEDRO ALFONSO CASTRO MORALES","FABIO MORENO TORRES","Persona Natural",null,null,null,18000000,null,null,null,18000000,15240000,"2021-03-15","2021-03-17","2022-01-16",305,null,null,null,null,null,null,null,"X",null,null,0.84666666666666668]
["CPS-116-2021",2021,"FDLS-CD-100-2021","https://community.secop.gov.co/Public/Tendering/OpportunityDetail/Index?noticeUID=CO1.NTC.1850930&isFromPublicArea=True&isModal=False","Contratos de prestación de servicios profesionales y de apoyo a la gestión","Contratación directa","Prestación de servicios profesionales y de apoyo a la gestión, o para la ejecución de trabajos artísticos que sólo puedan encomendarse a determinadas personas naturales;","PRESTAR LOS SERVICIOS COMO OPERARIOS DE LA MAQUINARIA PESADA DE PROPIEDAD O TENENCIA DEL FONDO DE DESARROLLO LOCAL DE  SUMAPAZ","Inversión","Un Nuevo Contrato Social y Ambiental para la Bogotá del Siglo XXI",57,{"$f":"IF(ISERROR(VLOOKUP(K129,Proposito_programa!$C$2:$E$59,2,FALSE)),\" \",VLOOKUP(K129,Proposito_programa!$C$2:$E$59,2,FALSE))","v":"Gestión pública local"},{"$f":"IF(ISERROR(VLOOKUP(K129,Proposito_programa!$C$2:$E$59,3,FALSE)),\" \",VLOOKUP(K129,Proposito_programa!$C$2:$E$59,3,FALSE))","v":"Propósito 5: Construir Bogotá - Región con gobierno abierto, transparente y ciudadanía consciente"},1696,null,79887251,"FABIO MORENO TORRES","SANTIAGO HINCAPIE  GARCIA","RUPERTO VILLALBA ROMAN","Persona Natural",null,null,null,22950000,null,1,2550000,25500000,24055000,"2021-03-16","2021-03-18","2022-01-17",307,1,30,null,null,null,null,null,"X",null,null,0.94333333333333336]
["CPS-117-2021",2021,"FDLS-CD-100-2021","https://community.secop.gov.co/Public/Tendering/OpportunityDetail/Index?noticeUID=CO1.NTC.1850930&isFromPublicArea=True&isModal=False","Contratos de prestación de servicios profesionales y de apoyo a la gestión","Contratación directa","Prestación de servicios profesionales y de apoyo a la gestión, o para la ejecución de trabajos artísticos que sólo puedan encomendarse a determinadas personas naturales;","PRESTAR LOS SERVICIOS COMO OPERARIOS DE LA MAQUINARIA PESADA DE PROPIEDAD O TENENCIA DEL FONDO DE DESARROLLO LOCAL DE SUMAPAZ","Inversión","Un Nuevo Contrato Social y Ambiental para la Bogotá del Siglo XXI",57,{"$f":"IF(ISERROR(VLOOKUP(K130,Proposito_programa!$C$2:$E$59,2,FALSE)),\" \",VLOOKUP(K130,Proposito_programa!$C$2:$E$59,2,FALSE))","v":"Gestión pública local"},{"$f":"IF(ISERROR(VLOOKUP(K130,Proposito_programa!$C$2:$E$59,3,FALSE)),\" \",VLOOKUP(K130,Proposito_programa!$C$2:$E$59,3,FALSE))","v":"Propósito 5: Construir Bogotá - Región con gobierno abierto, transparente y ciudadanía consciente"},1696,null,174188,"RUPERTO VILLALBA ROMAN","MIGUEL ANTONIO CHAVARRO TORRES","JENNY MARCELA PACHECO DUARTE","Persona Natural",null,null,null,22950000,null,1,2550000,25500000,21505000,"2021-03-16","2021-03-18","2022-01-17",307,1,30,null,null,null,null,null,"X",null,null,0.84333333333333338]
["CPS-118-2021",2021,"FDLS-CD-101-2021","https://community.secop.gov.co/Public/Tendering/OpportunityDetail/Index?noticeUID=CO1.NTC.1851229&isFromPublicArea=True&isModal=False","Contratos de prestación de servicios profesionales y de apoyo a la gestión","Contratación directa","Prestación de servicios profesionales y de apoyo a la gestión, o para la ejecución de trabajos artísticos que sólo puedan encomendarse a determinadas personas naturales;","PRESTAR LOS SERVICIOS DE APOYO A LA GESTIÓN DOCUMENTAL DE LA ALCALDÍA LOCAL EN LA IMPLEMENTACIÓN DE LOS PROCESOS DE CLASIFICACIÓN, ORDENACIÓN, SELECCIÓN NATURAL, FOLIACIÓN, IDENTIFICACIÓN, LEVANTAMIENTO DE INVENTARIOS, ALMACENAMIENTO Y  APLICACIÓN DE PROTOCOLOS DE ELIMINACIÓN Y TRANSFERENCIAS DOCUMENTALES","Inversión","Un Nuevo Contrato Social y Ambiental para la Bogotá del Siglo XXI",57,{"$f":"IF(ISERROR(VLOOKUP(K131,Proposito_programa!$C$2:$E$59,2,FALSE)),\" \",VLOOKUP(K131,Proposito_programa!$C$2:$E$59,2,FALSE))","v":"Gestión pública local"},{"$f":"IF(ISERROR(VLOOKUP(K131,Proposito_programa!$C$2:$E$59,3,FALSE)),\" \",VLOOKUP(K131,Proposito_programa!$C$2:$E$59,3,FALSE))","v":"Propósito 5: Construir Bogotá - Región con gobierno abierto, transparente y ciudadanía consciente"},1696,null,1023906225,"JENNY MARCELA PACHECO DUARTE","S&S SUMINISTROS EMPRESARIALES S.A.S","DIANA MERALDA OVIEDO RODRÍGUEZ","Persona Natural",null,null,null,23400000,null,null,null,23400000,21840000,"2021-03-16","2021-03-19","2021-12-18",274,null,null,null,null,null,null,null,null,"X",null,0.93333333333333335]
["CPS-119-2021",2021,"FDLS-CD-101-2021","https://community.secop.gov.co/Public/Tendering/OpportunityDetail/Index?noticeUID=CO1.NTC.1851229&isFromPublicArea=True&isModal=False","Contratos de prestación de servicios profesionales y de apoyo a la gestión","Contratación directa","Prestación de servicios profesionales y de apoyo a la gestión, o para la ejecución de trabajos artísticos que sólo puedan encomendarse a determinadas personas naturales;","PRESTAR LOS SERVICIOS DE APOYO A LA GESTIÓN DOCUMENTAL DE LA ALCALDÍA LOCAL EN LA IMPLEMENTACIÓN DE LOS PROCESOS DE CLASIFICACIÓN, ORDENACIÓN, SELECCIÓN NATURAL, FOLIACIÓN, IDENTIFICACIÓN, LEVANTAMIENTO DE INVENTARIOS, ALMACENAMIENTO Y APLICACIÓN DE PROTOCOLOS DE ELIMINACIÓN Y TRANSFERENCIAS DOCUMENTALES","Inversión","Un Nuevo Contrato Social y Ambiental para la Bogotá del Siglo XXI",57,{"$f":"IF(ISERROR(VLOOKUP(K132,Proposito_programa!$C$2:$E$59,2,FALSE)),\" \",VLOOKUP(K132,Proposito_programa!$C$2:$E$59,2,FALSE))","v":"Gestión pública local"},{"$f":"IF(ISERROR(VLOOKUP(K132,Proposito_programa!$C$2:$E$59,3,FALSE)),\" \",VLOOKUP(K132,Proposito_programa!$C$2:$E$59,3,FALSE))","v":"Propósito 5: Construir Bogotá - Región con gobierno abierto, transparente y ciudadanía consciente"},1696,null,1073606208,"DIANA MERALDA OVIEDO RODRIGUEZ","CORPORACIÓN COLECTIVO DIGERATI","IVAN DARIO CHINGATE MICAN","Persona Natural",null,null,null,23400000,null,1,1300000,24700000,21840000,"2021-03-16","2021-03-19","2022-01-02",289,1,15,null,null,null,null,null,"X",null,null,0.88421052631578945]
["CPS-120-2021",2021,"FDLS-CD-102-2021","https://community.secop.gov.co/Public/Tendering/OpportunityDetail/Index?noticeUID=CO1.NTC.1854891&isFromPublicArea=True&isModal=False","Contratos de prestación de servicios profesionales y de apoyo a la gestión","Contratación directa","Prestación de servicios profesionales y de apoyo a la gestión, o para la ejecución de trabajos artísticos que sólo puedan encomendarse a determinadas personas naturales;","PRESTAR LOS SERVICIOS DE APOYO EN LAS LABORES DE OFICIOS VARIOS Y NOTIFICACIÓN PARA LA CUENCA DEL RIO BLANCO, DE LA ALCALDÍA LOCAL DE SUMAPAZ","Inversión","Un Nuevo Contrato Social y Ambiental para la Bogotá del Siglo XXI",57,{"$f":"IF(ISERROR(VLOOKUP(K133,Proposito_programa!$C$2:$E$59,2,FALSE)),\" \",VLOOKUP(K133,Proposito_programa!$C$2:$E$59,2,FALSE))","v":"Gestión pública local"},{"$f":"IF(ISERROR(VLOOKUP(K133,Proposito_programa!$C$2:$E$59,3,FALSE)),\" \",VLOOKUP(K133,Proposito_programa!$C$2:$E$59,3,FALSE))","v":"Propósito 5: Construir Bogotá - Región con gobierno abierto, transparente y ciudadanía consciente"},1696,null,1033767652,"IVAN DARIO CHINGATE MICAN","FABIO MORENO TORRES","NILSON LOPEZ RAMIREZ","Persona Natural",null,null,null,18630000,null,null,null,18630000,6486000,"2021-03-18","2021-03-24","2021-12-23",274,null,null,null,null,null,null,null,null,"X",null,0.34814814814814815]
["CPS-121-2021",2021,"FDLS-CD-103-2021","https://community.secop.gov.co/Public/Tendering/OpportunityDetail/Index?noticeUID=CO1.NTC.1850859&isFromPublicArea=True&isModal=False","Contratos de prestación de servicios profesionales y de apoyo a la gestión","Contratación directa","Prestación de servicios profesionales y de apoyo a la gestión, o para la ejecución de trabajos artísticos que sólo puedan encomendarse a determinadas personas naturales;","PRESTAR LOS SERVICIOS COMO CONDUCTOR DE VEHÍCULOS PESADOS DE PROPIEDAD O TENENCIA DEL FONDO DE DESARROLLO LOCAL DE SUMAPAZ","Inversión","Un Nuevo Contrato Social y Ambiental para la Bogotá del Siglo XXI",57,{"$f":"IF(ISERROR(VLOOKUP(K134,Proposito_programa!$C$2:$E$59,2,FALSE)),\" \",VLOOKUP(K134,Proposito_programa!$C$2:$E$59,2,FALSE))","v":"Gestión pública local"},{"$f":"IF(ISERROR(VLOOKUP(K134,Proposito_programa!$C$2:$E$59,3,FALSE)),\" \",VLOOKUP(K134,Proposito_programa!$C$2:$E$59,3,FALSE))","v":"Propósito 5: Construir Bogotá - Región con gobierno abierto, transparente y ciudadanía consciente"},1696,null,80452901,"NILSON LOPEZ RAMIREZ","RUPERTO VILLALBA ROMAN","JHON WILSON PINTO","Persona Natural",null,null,null,25500000,null,null,null,25500000,24055000,"2021-03-17","2021-03-23","2022-01-22",305,null,null,null,null,null,null,null,"X",null,null,0.94333333333333336]
["CPS-122-2021",2021,"FDLS-CD-104-2021","https://community.secop.gov.co/Public/Tendering/OpportunityDetail/Index?noticeUID=CO1.NTC.1853488&isFromPublicArea=True&isModal=False","Contratos de prestación de servicios profesionales y de apoyo a la gestión","Contratación directa","Prestación de servicios profesionales y de apoyo a la gestión, o para la ejecución de trabajos artísticos que sólo puedan encomendarse a determinadas personas naturales;","PRESTAR LOS SERVICIOS COMO CONDUCTOR DE VEHÍCULOS LIVIANOS DE PROPIEDAD O TENENCIA DEL FONDO DE DESARROLLO LOCAL DE SUMAPAZ","Inversión","Un Nuevo Contrato Social y Ambiental para la Bogotá del Siglo XXI",57,{"$f":"IF(ISERROR(VLOOKUP(K135,Proposito_programa!$C$2:$E$59,2,FALSE)),\" \",VLOOKUP(K135,Proposito_programa!$C$2:$E$59,2,FALSE))","v":"Gestión pública local"},{"$f":"IF(ISERROR(VLOOKUP(K135,Proposito_programa!$C$2:$E$59,3,FALSE)),\" \",VLOOKUP(K135,Proposito_programa!$C$2:$E$59,3,FALSE))","v":"Propósito 5: Construir Bogotá - Región con gobierno abierto, transparente y ciudadanía consciente"},1696,null,80804748,"JHON WILSON PINTO","JENNY MARCELA PACHECO DUARTE","PARMENIO POVEDA SALAZAR ","Persona Natural",null,null,null,25500000,null,null,null,25500000,15980000,"2021-03-17","2021-03-23","2021-10-01",192,null,null,null,null,null,null,null,null,"X",null,0.62666666666666671]
["CAR-123-2021",2021,"FDLS-CD-105-2021","https://community.secop.gov.co/Public/Tendering/OpportunityDetail/Index?noticeUID=CO1.NTC.1852347&isFromPublicArea=True&isModal=False","Arrendamiento de bienes inmuebles","Contratación directa","El arrendamiento o adquisición de inmuebles","ADQUIRIR A TÍTULO DE ARRENDAMIENTO UNA (1) VIVIENDA PARA EL FUNCIONAMIENTO DEL PUESTO DE CONTROL Y DESINFECCIÓN EN LA LOCALIDAD DE SUMAPAZ”","Funcionamiento","Un Nuevo Contrato Social y Ambiental para la Bogotá del Siglo XXI","No aplica",{"$f":"IF(ISERROR(VLOOKUP(K136,Proposito_programa!$C$2:$E$59,2,FALSE)),\" \",VLOOKUP(K136,Proposito_programa!$C$2:$E$59,2,FALSE))","v":" "},{"$f":"IF(ISERROR(VLOOKUP(K136,Proposito_programa!$C$2:$E$59,3,FALSE)),\" \",VLOOKUP(K136,Proposito_programa!$C$2:$E$59,3,FALSE))","v":" "},null,null,80419747,"DAVID ANTONIO RAFIC ALJURE SFEIR","DIANA MERALDA OVIEDO RODRÍGUEZ","BRAYAN ANDRES ROMERO ROMERO ","Persona Natural",null,null,null,3570000,null,null,null,3570000,17043000,"2021-03-17","2021-03-19","2022-03-18",364,null,null,null,null,null,null,null,"X",null,null,4.7739495798319327]
["CPS-124-2021",2021,"FDLS-CD-106-2021","https://community.secop.gov.co/Public/Tendering/OpportunityDetail/Index?noticeUID=CO1.NTC.1852424&isFromPublicArea=True&isModal=False","Contratos de prestación de servicios profesionales y de apoyo a la gestión","Contratación directa","Prestación de servicios profesionales y de apoyo a la gestión, o para la ejecución de trabajos artísticos que sólo puedan encomendarse a determinadas personas naturales;","PRESTAR LOS SERVICIOS DE APOYO COMO AUXILIAR ADMINISTRATIVO EN LAS LABORES DE OFICIOS VARIOS Y NOTIFICACIÓN PARA LA CUENCA DEL SUMAPAZ, DE LA ALCALDÍA LOCAL DE SUMAPAZ","Inversión","Un Nuevo Contrato Social y Ambiental para la Bogotá del Siglo XXI",57,{"$f":"IF(ISERROR(VLOOKUP(K137,Proposito_programa!$C$2:$E$59,2,FALSE)),\" \",VLOOKUP(K137,Proposito_programa!$C$2:$E$59,2,FALSE))","v":"Gestión pública local"},{"$f":"IF(ISERROR(VLOOKUP(K137,Proposito_programa!$C$2:$E$59,3,FALSE)),\" \",VLOOKUP(K137,Proposito_programa!$C$2:$E$59,3,FALSE))","v":"Propósito 5: Construir Bogotá - Región con gobierno abierto, transparente y ciudadanía consciente"},1696,null,19230696,"PARMENIO POVEDA SALAZAR ","IVAN DARIO CHINGATE MICAN","BRAND SEBASTIAN MORENO GARCIA","Persona Natural",null,null,null,18630000,null,null,null,18630000,21493333,"2021-04-23","2021-04-27","2022-01-26",{"$f":"AF137-AE137","v":274},null,null,null,null,null,null,null,"X",null,null,1.1536947396672035]
["CPS-125-2021",2021,"FDLS-CD-107-2021","https://community.secop.gov.co/Public/Tendering/OpportunityDetail/Index?noticeUID=CO1.NTC.1857327&isFromPublicArea=True&isModal=False","Contratos de prestación de servicios profesionales y de apoyo a la gestión","Contratación directa","Prestación de servicios profesionales y de apoyo a la gestión, o para la ejecución de trabajos artísticos que sólo puedan encomendarse a determinadas personas naturales;","PRESTAR LOS SERVICIOS DE APOYO A LA GESTIÓN DOCUMENTAL DE LA ALCALDÍA LOCAL EN LA IMPLEMENTACIÓN DE LOS PROCESOS DE  CLASIFICACIÓN, ORDENACIÓN, SELECCIÓN NATURAL, FOLIACIÓN, IDENTIFICACIÓN, LEVANTAMIENTO DE INVENTARIOS, ALMACENAMIENTO Y APLICACIÓN DE PROTOCOLOS DE ELIMINACIÓN Y TRANSFERENCIAS DOCUMENTALES","Inversión","Un Nuevo Contrato Social y Ambiental para la Bogotá del Siglo XXI",57,{"$f":"IF(ISERROR(VLOOKUP(K138,Proposito_programa!$C$2:$E$59,2,FALSE)),\" \",VLOOKUP(K138,Proposito_programa!$C$2:$E$59,2,FALSE))","v":"Gestión pública local"},{"$f":"IF(ISERROR(VLOOKUP(K138,Proposito_programa!$C$2:$E$59,3,FALSE)),\" \",VLOOKUP(K138,Proposito_programa!$C$2:$E$59,3,FALSE))","v":"Propósito 5: Construir Bogotá - Región con gobierno abierto, transparente y ciudadanía consciente"},1696,null,1007395591,"BRAYAN ANDRES ROMERO ROMERO ","NILSON LOPEZ RAMIREZ","CAMILO ANDRES SUSA CIFUENTES","Persona Natural",null,null,null,23400000,null,null,null,{"$f":"+X138+Y138+AA138","v":23400000},41031000,"2021-03-19","2021-03-23","2021-12-22",274,null,null,null,null,null,null,null,null,"X",null,1.7534615384615384]
["CPS-126-2021",2021,"FDLS-CD-108-2021","https://community.secop.gov.co/Public/Tendering/OpportunityDetail/Index?noticeUID=CO1.NTC.1855172&isFromPublicArea=True&isModal=False","Contratos de prestación de servicios profesionales y de apoyo a la gestión","Contratación directa","Prestación de servicios profesionales y de apoyo a la gestión, o para la ejecución de trabajos artísticos que sólo puedan encomendarse a determinadas personas naturales;","PRESTAR LOS SERVICIOS PROFESIONALES DE APOYO AL ÁREA DE GESTIÓN DE DESARROLLO LOCAL DE LA ALCALDÍA LOCAL DE SUMAPAZ, EN  TEMAS RELACIONADOS CON EL EMPLEO LOCAL Y CORAZÓN PRODUCTIVO","Inversión","Un Nuevo Contrato Social y Ambiental para la Bogotá del Siglo XXI",1,{"$f":"IF(ISERROR(VLOOKUP(K139,Proposito_programa!$C$2:$E$59,2,FALSE)),\" \",VLOOKUP(K139,Proposito_programa!$C$2:$E$59,2,FALSE))","v":"Subsidios y transferencias para la equidad"},{"$f":"IF(ISERROR(VLOOKUP(K139,Proposito_programa!$C$2:$E$59,3,FALSE)),\" \",VLOOKUP(K139,Proposito_programa!$C$2:$E$59,3,FALSE))","v":"Propósito 1: Hacer un nuevo contrato social para incrementar la inclusión social, productiva y política"},1583,null,1016101268,"BRAND SEBASTIAN MORENO GARCIA","JHON WILSON PINTO","MARIA PAULA CONTRERAS MORALES","Persona Natural",null,null,null,39285000,null,1,2182500,41467500,23375000,"2021-03-18","2021-03-19","2021-01-02",289,1,15,null,null,null,null,null,"X",null,null,0.56369445951648878]
["CPS-127-2021",2021,"FDLS-CD-109-2021","https://community.secop.gov.co/Public/Tendering/OpportunityDetail/Index?noticeUID=CO1.NTC.1859436&isFromPublicArea=True&isModal=False","Contratos de prestación de servicios profesionales y de apoyo a la gestión","Contratación directa","Prestación de servicios profesionales y de apoyo a la gestión, o para la ejecución de trabajos artísticos que sólo puedan encomendarse a determinadas personas naturales;","PRESTAR LOS SERVICIOS COMO CONDUCTOR DE VEHÍCULOS PESADOS DE PROPIEDAD O TENENCIA DEL FONDO DE DESARROLLO LOCAL DE SUMAPAZ","Inversión","Un Nuevo Contrato Social y Ambiental para la Bogotá del Siglo XXI",57,{"$f":"IF(ISERROR(VLOOKUP(K140,Proposito_programa!$C$2:$E$59,2,FALSE)),\" \",VLOOKUP(K140,Proposito_programa!$C$2:$E$59,2,FALSE))","v":"Gestión pública local"},{"$f":"IF(ISERROR(VLOOKUP(K140,Proposito_programa!$C$2:$E$59,3,FALSE)),\" \",VLOOKUP(K140,Proposito_programa!$C$2:$E$59,3,FALSE))","v":"Propósito 5: Construir Bogotá - Región con gobierno abierto, transparente y ciudadanía consciente"},1696,null,1069230738,"CAMILO ANDRES SUSA CIFUENTES","DAVID ANTONIO RAFIC ALJURE SFEIR","EDGAR ENRIQUE RAMÍREZ","Persona Natural",null,null,null,25500000,null,null,null,25500000,21233333,"2021-03-19","2021-03-26","2022-01-25",305,null,null,null,null,null,null,null,"X",null,null,0.83267972549019609]
["CPS-128-2021",2021,"FDLS-CD-110-2021","https://community.secop.gov.co/Public/Tendering/OpportunityDetail/Index?noticeUID=CO1.NTC.1867210&isFromPublicArea=True&isModal=False","Contratos de prestación de servicios profesionales y de apoyo a la gestión","Contratación directa","Prestación de servicios profesionales y de apoyo a la gestión, o para la ejecución de trabajos artísticos que sólo puedan encomendarse a determinadas personas naturales;","PRESTAR LOS SERVICIOS DE APOYO A LA GESTIÓN DOCUMENTAL DE LA ALCALDÍA LOCAL EN LA IMPLEMENTACIÓN DE LOS PROCESOS DE CLASIFICACIÓN, ORDENACIÓN, SELECCIÓN NATURAL, FOLIACIÓN, IDENTIFICACIÓN, LEVANTAMIENTO DE INVENTARIOS, ALMACENAMIENTO Y  APLICACIÓN DE PROTOCOLOS DE ELIMINACIÓN Y TRANSFERENCIAS DOCUMENTALES","Inversión","Un Nuevo Contrato Social y Ambiental para la Bogotá del Siglo XXI",57,{"$f":"IF(ISERROR(VLOOKUP(K141,Proposito_programa!$C$2:$E$59,2,FALSE)),\" \",VLOOKUP(K141,Proposito_programa!$C$2:$E$59,2,FALSE))","v":"Gestión pública local"},{"$f":"IF(ISERROR(VLOOKUP(K141,Proposito_programa!$C$2:$E$59,3,FALSE)),\" \",VLOOKUP(K141,Proposito_programa!$C$2:$E$59,3,FALSE))","v":"Propósito 5: Construir Bogotá - Región con gobierno abierto, transparente y ciudadanía consciente"},1696,null,1030671895,"MARIA PAULA CONTRERAS MORALES","PARMENIO POVEDA SALAZAR ","DANNA MARCELA FORERO RODRIGUEZ ","Persona Natural",null,null,null,23400000,null,null,null,23400000,23375000,"2021-03-24","2021-03-26","2021-12-25",274,null,null,null,null,null,null,null,null,"X",null,0.99893162393162394]
["CPS-129-2021",2021,"FDLS-CD-080-2021*","https://community.secop.gov.co/Public/Tendering/OpportunityDetail/Index?noticeUID=CO1.NTC.1840702&isFromPublicArea=True&isModal=False","Contratos de prestación de servicios profesionales y de apoyo a la gestión","Contratación directa","Prestación de servicios profesionales y de apoyo a la gestión, o para la ejecución de trabajos artísticos que sólo puedan encomendarse a determinadas personas naturales;","PRESTAR LOS SERVICIOS COMO OPERARIOS DE LA MAQUINARIA PESADA DE PROPIEDAD O TENENCIA DEL FONDO DE DESARROLLO LOCAL DE SUMAPAZ","Inversión","Un Nuevo Contrato Social y Ambiental para la Bogotá del Siglo XXI",57,{"$f":"IF(ISERROR(VLOOKUP(K142,Proposito_programa!$C$2:$E$59,2,FALSE)),\" \",VLOOKUP(K142,Proposito_programa!$C$2:$E$59,2,FALSE))","v":"Gestión pública local"},{"$f":"IF(ISERROR(VLOOKUP(K142,Proposito_programa!$C$2:$E$59,3,FALSE)),\" \",VLOOKUP(K142,Proposito_programa!$C$2:$E$59,3,FALSE))","v":"Propósito 5: Construir Bogotá - Región con gobierno abierto, transparente y ciudadanía consciente"},1696,null,80380149,"EDGAR ENRIQUE RAMIREZ","BRAYAN ANDRES ROMERO ROMERO ","LUIS EDUARDO VILLEGAS GIL","Persona Natural",null,null,null,22950000,null,1,2550000,25500000,23400000,"2021-03-25","2021-03-26","2022-01-25",305,1,30,null,null,null,null,null,"X",null,null,0.91764705882352937]
["CPS-130-2021",2021,"FDLS-CD-112-2021","https://community.secop.gov.co/Public/Tendering/OpportunityDetail/Index?noticeUID=CO1.NTC.1876563&isFromPublicArea=True&isModal=False","Contratos de prestación de servicios profesionales y de apoyo a la gestión","Contratación directa","Prestación de servicios profesionales y de apoyo a la gestión, o para la ejecución de trabajos artísticos que sólo puedan encomendarse a determinadas personas naturales;","PRESTAR LOS SERVICIOS COMO AUXILIAR ADMINISTRATIVO PARA LA GESTIÓN AMBIENTAL DEL ÁREA DE GESTIÓN DE DESARROLLO LOCAL DE LA ALCALDÍA LOCAL DE SUMAPAZ","Inversión","Un Nuevo Contrato Social y Ambiental para la Bogotá del Siglo XXI",23,{"$f":"IF(ISERROR(VLOOKUP(K143,Proposito_programa!$C$2:$E$59,2,FALSE)),\" \",VLOOKUP(K143,Proposito_programa!$C$2:$E$59,2,FALSE))","v":"Bogotá rural"},{"$f":"IF(ISERROR(VLOOKUP(K143,Proposito_programa!$C$2:$E$59,3,FALSE)),\" \",VLOOKUP(K143,Proposito_programa!$C$2:$E$59,3,FALSE))","v":"Propósito 1: Hacer un nuevo contrato social para incrementar la inclusión social, productiva y política"},1634,null,1136888698,"DANNA MARCELA FORERO RODRIGUEZ ","BRAND SEBASTIAN MORENO GARCIA","CORPORACIÓN COLECTIVO DIGERATI","Persona Natural",null,null,null,26000000,null,null,null,{"$f":"+X143+Y143+AA143","v":26000000},51490000,"2021-03-26","2021-03-31","2022-01-30",305,null,null,null,null,null,null,null,"X",null,null,1.9803846153846154]
["CPS-131-2021",2021,"FDLS-MC-092-2021","https://community.secop.gov.co/Public/Tendering/OpportunityDetail/Index?noticeUID=CO1.NTC.1838187&isFromPublicArea=True&isModal=False","Contratos de prestación de servicios","Contratación mínima cuantia","No aplica","PRESTAR EL SERVICIO DE MONITOREO VEHICULAR INTEGRAL POR GPS SATELITAL PARA LA MAQUINARIA DE PROPIEDAD O TENENCIA DEL FONDO DE DESARROLLO LOCAL DE SUMAPAZ","Inversión","Un Nuevo Contrato Social y Ambiental para la Bogotá del Siglo XXI",49,{"$f":"IF(ISERROR(VLOOKUP(K144,Proposito_programa!$C$2:$E$59,2,FALSE)),\" \",VLOOKUP(K144,Proposito_programa!$C$2:$E$59,2,FALSE))","v":"Movilidad segura, sostenible y accesible"},{"$f":"IF(ISERROR(VLOOKUP(K144,Proposito_programa!$C$2:$E$59,3,FALSE)),\" \",VLOOKUP(K144,Proposito_programa!$C$2:$E$59,3,FALSE))","v":"Propósito 4: Hacer de Bogotá Región un modelo de movilidad multimodal, incluyente y sostenible"},1688,2,900465924,"VISATEL DE COLOMBIA SAS","CAMILO ANDRES SUSA CIFUENTES","LAURA XIMENA RUBIANO CARRILLO ","Persona Jurídica",null,null,null,15708000,null,null,null,15708000,18789900,"2021-03-05","2021-04-06","2022-01-20",289,2,45,null,null,null,null,null,"X",null,null,{"$f":"IF(ISERROR(AC144/AB144),\"-\",(AC144/AB144))","v":1.1961993888464477}]
["CPS-132-2021",2021,"FDLS-CD-113-2021","https://community.secop.gov.co/Public/Tendering/OpportunityDetail/Index?noticeUID=CO1.NTC.1875553&isFromPublicArea=True&isModal=False","Contratos de prestación de servicios profesionales y de apoyo a la gestión","Contratación directa","Prestación de servicios profesionales y de apoyo a la gestión, o para la ejecución de trabajos artísticos que sólo puedan encomendarse a determinadas personas naturales;","PRESTAR LOS SERVICIOS PROFESIONALES JURÍDICOS PARA APOYAR LOS ASUNTOS PRECONTRACTUALES, CONTRACTUALES Y POSTCONTRACTUALES DEL ÁREA DE GESTIÓN DE DESARROLLO LOCAL DE LA ALCALDÍA LOCAL DE SUMAPAZ","Inversión","Un Nuevo Contrato Social y Ambiental para la Bogotá del Siglo XXI",57,{"$f":"IF(ISERROR(VLOOKUP(K145,Proposito_programa!$C$2:$E$59,2,FALSE)),\" \",VLOOKUP(K145,Proposito_programa!$C$2:$E$59,2,FALSE))","v":"Gestión pública local"},{"$f":"IF(ISERROR(VLOOKUP(K145,Proposito_programa!$C$2:$E$59,3,FALSE)),\" \",VLOOKUP(K145,Proposito_programa!$C$2:$E$59,3,FALSE))","v":"Propósito 5: Construir Bogotá - Región con gobierno abierto, transparente y ciudadanía consciente"},1696,null,9695442,"LUIS EDUARDO VILLEGAS GIL","MARIA PAULA CONTRERAS MORALES","JHONATAN ALVAREZ MORA ","Persona Natural",null,null,null,57000000,null,null,null,57000000,19856667,"2021-03-26","2021-03-30","2022-01-29",305,null,null,null,null,null,null,null,"X",null,null,0.34836257894736844]
["CPS-133-2021",2021,"FDLS-MC-098-2021","https://community.secop.gov.co/Public/Tendering/OpportunityDetail/Index?noticeUID=CO1.NTC.1842704&isFromPublicArea=True&isModal=False","Suministro","Contratación mínima cuantia","No aplica","PRESTAR EL SERVICIO DE AVITUALLAMIENTO (ALIMENTACIÓN) PARA LA REALIZACIÓN DE EVENTOS Y/O ACTIVIDADES DE GESTIÓN, PROMOCIÓN Y PARTICIPACIÓN","Funcionamiento","Un Nuevo Contrato Social y Ambiental para la Bogotá del Siglo XXI","No aplica",{"$f":"IF(ISERROR(VLOOKUP(K146,Proposito_programa!$C$2:$E$59,2,FALSE)),\" \",VLOOKUP(K146,Proposito_programa!$C$2:$E$59,2,FALSE))","v":" "},{"$f":"IF(ISERROR(VLOOKUP(K146,Proposito_programa!$C$2:$E$59,3,FALSE)),\" \",VLOOKUP(K146,Proposito_programa!$C$2:$E$59,3,FALSE))","v":" "},null,3,900585357,"S&S SUMINISTROS EMPRESARIALES SAS","EDGAR ENRIQUE RAMÍREZ","GIOVANNI BATTISTA MAINERO MARMOLEJO","Persona Jurídica",null,null,null,18500000,null,1,9000000,27500000,20106666,"2021-03-29","2021-04-12","2022-02-11",305,null,null,null,null,null,null,null,"X",null,null,0.73115149090909093]
["CPS-134-2021",2021,"FDLS-MC-099-2021","https://community.secop.gov.co/Public/Tendering/OpportunityDetail/Index?noticeUID=CO1.NTC.1854147&isFromPublicArea=True&isModal=False","Contratos de prestación de servicios","Contratación mínima cuantia","No aplica","PRESTAR LOS SERVICIOS LOGÍSTICOS PARA LA REALIZACIÓN DE LA AUDIENCIA PÚBLICA DE RENDICIÓN DE CUENTAS DE LA VIGENCIA 2020 PARA LA LOCALIDAD DE SUMAPAZ","Inversión","Un Nuevo Contrato Social y Ambiental para la Bogotá del Siglo XXI",57,{"$f":"IF(ISERROR(VLOOKUP(K147,Proposito_programa!$C$2:$E$59,2,FALSE)),\" \",VLOOKUP(K147,Proposito_programa!$C$2:$E$59,2,FALSE))","v":"Gestión pública local"},{"$f":"IF(ISERROR(VLOOKUP(K147,Proposito_programa!$C$2:$E$59,3,FALSE)),\" \",VLOOKUP(K147,Proposito_programa!$C$2:$E$59,3,FALSE))","v":"Propósito 5: Construir Bogotá - Región con gobierno abierto, transparente y ciudadanía consciente"},1696,8,900360948,"CORPORACION COLECTIVO DIGERATI","SEGURIDAD LAS AMÉRICAS LTDA SEGURIAMÉRICAS LTDA","JANEIRY ROMERO HERNANDEZ","Persona Jurídica",null,null,null,19825720,null,1,4365000,24190720,33174000,"2021-03-30","2021-04-05","2021-05-04",29,null,null,null,null,null,null,null,null,"X",null,1.3713523202285836]
["CPS-135-2021",2021,"FDLS-CD-114-2021","https://community.secop.gov.co/Public/Tendering/OpportunityDetail/Index?noticeUID=CO1.NTC.1896796&isFromPublicArea=True&isModal=False","Contratos de prestación de servicios profesionales y de apoyo a la gestión","Contratación directa","Prestación de servicios profesionales y de apoyo a la gestión, o para la ejecución de trabajos artísticos que sólo puedan encomendarse a determinadas personas naturales;","PRESTAR LOS SERVICIOS COMO AUXILIAR ADMINISTRATIVO PARA LA CORREGIDURÍA DE NAZARETH","Inversión","Un Nuevo Contrato Social y Ambiental para la Bogotá del Siglo XXI",57,{"$f":"IF(ISERROR(VLOOKUP(K148,Proposito_programa!$C$2:$E$59,2,FALSE)),\" \",VLOOKUP(K148,Proposito_programa!$C$2:$E$59,2,FALSE))","v":"Gestión pública local"},{"$f":"IF(ISERROR(VLOOKUP(K148,Proposito_programa!$C$2:$E$59,3,FALSE)),\" \",VLOOKUP(K148,Proposito_programa!$C$2:$E$59,3,FALSE))","v":"Propósito 5: Construir Bogotá - Región con gobierno abierto, transparente y ciudadanía consciente"},1696,null,1000691517,"LAURA XIMENA RUBIANO CARRILLO ","DANNA MARCELA FORERO RODRIGUEZ ","LUIS ANGEL ARROYAVE VILARO","Persona Natural",null,null,null,23000000,null,null,null,23000000,37248000,"2021-04-07","2021-04-12","2022-02-11",305,null,null,null,null,null,null,null,"X",null,null,1.6194782608695653]
["CPS-136-2021",2021,"FDLS-CD-115-2021","https://community.secop.gov.co/Public/Tendering/OpportunityDetail/Index?noticeUID=CO1.NTC.1897343&isFromPublicArea=True&isModal=False","Contratos de prestación de servicios profesionales y de apoyo a la gestión","Contratación directa","Prestación de servicios profesionales y de apoyo a la gestión, o para la ejecución de trabajos artísticos que sólo puedan encomendarse a determinadas personas naturales;","PRESTAR SUS SERVICIOS COMO AUXILIAR ADMINISTRATIVO PARA EL ÁREA DE GESTIÓN DEL DESARROLLO LOCAL, DE LA ALCALDÍA LOCAL DE SUMAPAZ","Inversión","Un Nuevo Contrato Social y Ambiental para la Bogotá del Siglo XXI",57,{"$f":"IF(ISERROR(VLOOKUP(K149,Proposito_programa!$C$2:$E$59,2,FALSE)),\" \",VLOOKUP(K149,Proposito_programa!$C$2:$E$59,2,FALSE))","v":"Gestión pública local"},{"$f":"IF(ISERROR(VLOOKUP(K149,Proposito_programa!$C$2:$E$59,3,FALSE)),\" \",VLOOKUP(K149,Proposito_programa!$C$2:$E$59,3,FALSE))","v":"Propósito 5: Construir Bogotá - Región con gobierno abierto, transparente y ciudadanía consciente"},1696,null,80897743,"JHONATAN ALVAREZ MORA ","LUIS EDUARDO VILLEGAS GIL","LUIS HERNANDO BEJARANO","Persona Natural",null,null,null,26000000,null,null,null,26000000,35833333,"2021-04-07","2021-04-09","2022-02-08",305,null,null,null,null,null,null,null,"X",null,null,1.3782051153846153]
["CPS-137-2021",2021,"FDLS-CD-116-2021","https://community.secop.gov.co/Public/Tendering/OpportunityDetail/Index?noticeUID=CO1.NTC.1905978&isFromPublicArea=True&isModal=False","Contratos de prestación de servicios profesionales y de apoyo a la gestión","Contratación directa","Prestación de servicios profesionales y de apoyo a la gestión, o para la ejecución de trabajos artísticos que sólo puedan encomendarse a determinadas personas naturales;","PRESTAR LOS SERVICIOS PROFESIONALES AL ÁREA DE GESTIÓN DE DESARROLLO LOCAL PARA APOYAR LA PLANEACIÓN, EJECUCIÓN Y SEGUIMIENTO A LOS PROYECTOS DE INVERSIÓN QUE LE SEAN DESIGNADOS","Inversión","Un Nuevo Contrato Social y Ambiental para la Bogotá del Siglo XXI",49,{"$f":"IF(ISERROR(VLOOKUP(K150,Proposito_programa!$C$2:$E$59,2,FALSE)),\" \",VLOOKUP(K150,Proposito_programa!$C$2:$E$59,2,FALSE))","v":"Movilidad segura, sostenible y accesible"},{"$f":"IF(ISERROR(VLOOKUP(K150,Proposito_programa!$C$2:$E$59,3,FALSE)),\" \",VLOOKUP(K150,Proposito_programa!$C$2:$E$59,3,FALSE))","v":"Propósito 4: Hacer de Bogotá Región un modelo de movilidad multimodal, incluyente y sostenible"},1688,null,1047406951,"GIOVANNI BATTISTA MAINERO MARMOLEJO","LAURA XIMENA RUBIANO CARRILLO ","JOSE REINERO GALEANO LEMUS","Persona Natural",null,null,null,34920000,null,null,null,34920000,50866666,"2021-04-12","2021-04-13","2021-12-31",262,null,null,null,null,null,null,null,"X",null,null,1.4566628293241695]
["CPS-138-2021",2021,"FDLS-CD-117-2021","https://community.secop.gov.co/Public/Tendering/OpportunityDetail/Index?noticeUID=CO1.NTC.1911958&isFromPublicArea=True&isModal=False","Contratos de prestación de servicios profesionales y de apoyo a la gestión","Contratación directa","Prestación de servicios profesionales y de apoyo a la gestión, o para la ejecución de trabajos artísticos que sólo puedan encomendarse a determinadas personas naturales;","PRESTAR LOS SERVICIOS PROFESIONALES COMO ABOGADO, PARA EL TRAMITE DE LOS ASUNTOS JURIDICOS Y LEGALES, QUE REQUIERAN LOS PROCESOS MISIONALES Y ADMINISTRATIVOS QUE SE ADELANTAN EN LA ALCALDÍA LOCAL DE SUMAPAZ","Inversión","Un Nuevo Contrato Social y Ambiental para la Bogotá del Siglo XXI",57,{"$f":"IF(ISERROR(VLOOKUP(K151,Proposito_programa!$C$2:$E$59,2,FALSE)),\" \",VLOOKUP(K151,Proposito_programa!$C$2:$E$59,2,FALSE))","v":"Gestión pública local"},{"$f":"IF(ISERROR(VLOOKUP(K151,Proposito_programa!$C$2:$E$59,3,FALSE)),\" \",VLOOKUP(K151,Proposito_programa!$C$2:$E$59,3,FALSE))","v":"Propósito 5: Construir Bogotá - Región con gobierno abierto, transparente y ciudadanía consciente"},1696,null,1012413960,"JANEIRY ROMERO HERNANDEZ","JHONATAN ALVAREZ MORA ","NICOLAS ALBERTO CABRERA PUENTE ","Persona Natural",null,null,null,34920000,null,1,4365000,39285000,48506666,"2021-04-14","2021-04-15","2022-01-14",274,1,30,null,null,null,null,null,"X",null,null,1.2347375843197148]
["CPS-139-2021",2021,"FDRS-CD-118-2021","https://community.secop.gov.co/Public/Tendering/OpportunityDetail/Index?noticeUID=CO1.NTC.1933623&isFromPublicArea=True&isModal=False","Contratos de prestación de servicios profesionales y de apoyo a la gestión","Contratación directa","Prestación de servicios profesionales y de apoyo a la gestión, o para la ejecución de trabajos artísticos que sólo puedan encomendarse a determinadas personas naturales;","PRESTAR SUS SERVICIOS PROFESIONALES PARA APOYAR AL EQUIPO DE PRENSA Y COMUNICACIONES DE LA ALCALDÍA LOCAL EN LA CREACIÓN, REALIZACIÓN, PRODUCCIÓN Y EDICIÓN DE VIDEOS, ASÍ́COMO EL REGISTRO, EDICIÓN Y LA PRESENTACIÓN DE FOTOGRAFÍAS DE LOS ACONTECIMIENTOS, HECHOS Y EVENTOS EXTERNOS E INTERNOS DE LA ALCALDÍA LOCAL, PARA SER UTILIZADOS COMO INSUMOS DE COMUNICACIÓN EN LOS MEDIOS, ESPECIALMENTE ESCRITOS, DIGITALES Y AUDIOVISUALES","Inversión","Un Nuevo Contrato Social y Ambiental para la Bogotá del Siglo XXI",57,{"$f":"IF(ISERROR(VLOOKUP(K152,Proposito_programa!$C$2:$E$59,2,FALSE)),\" \",VLOOKUP(K152,Proposito_programa!$C$2:$E$59,2,FALSE))","v":"Gestión pública local"},{"$f":"IF(ISERROR(VLOOKUP(K152,Proposito_programa!$C$2:$E$59,3,FALSE)),\" \",VLOOKUP(K152,Proposito_programa!$C$2:$E$59,3,FALSE))","v":"Propósito 5: Construir Bogotá - Región con gobierno abierto, transparente y ciudadanía consciente"},1696,null,81715533,"LUIS ANGEL ARROYAVE VILARO","GIOVANNI BATTISTA MAINERO MARMOLEJO","EDWIN RUIZ VÁSQUEZ","Persona Natural",null,null,null,40000000,null,1,2500000,42500000,44000000,"2021-04-23","2021-04-26","2022-01-09",258,1,15,null,null,null,null,null,"X",null,null,1.0352941176470589]
["CPS-140-2021",2021,"FDRS-119-2021","https://community.secop.gov.co/Public/Tendering/OpportunityDetail/Index?noticeUID=CO1.NTC.1931423&isFromPublicArea=True&isModal=False","Contratos de prestación de servicios profesionales y de apoyo a la gestión","Contratación directa","Prestación de servicios profesionales y de apoyo a la gestión, o para la ejecución de trabajos artísticos que sólo puedan encomendarse a determinadas personas naturales;","PRESTAR LOS SERVICIOS PROFESIONALES ESPECIALIZADOS PARA ATENDER EL PROCESO DE ATENCIÓN DE VÍCTIMAS, LEGALIZACIÓN DE PREDIOS, JUSTICIA REITERATIVA, ENTRE OTROS, PARA LA ALCALDÍA LOCAL DE SUMAPAZ","Inversión","Un Nuevo Contrato Social y Ambiental para la Bogotá del Siglo XXI",57,{"$f":"IF(ISERROR(VLOOKUP(K153,Proposito_programa!$C$2:$E$59,2,FALSE)),\" \",VLOOKUP(K153,Proposito_programa!$C$2:$E$59,2,FALSE))","v":"Gestión pública local"},{"$f":"IF(ISERROR(VLOOKUP(K153,Proposito_programa!$C$2:$E$59,3,FALSE)),\" \",VLOOKUP(K153,Proposito_programa!$C$2:$E$59,3,FALSE))","v":"Propósito 5: Construir Bogotá - Región con gobierno abierto, transparente y ciudadanía consciente"},1696,null,3249841,"LUIS HERNANDO BEJARANO","JANEIRY ROMERO HERNANDEZ","NINI JOHANA GUTIERREZ TORRES ","Persona Natural",null,null,null,56000000,null,null,null,56000000,20366666,"2021-04-23","2021-04-23","2021-12-22",243,null,null,null,null,null,null,null,null,"X",null,0.36369046428571428]
["CPS-141-2021",2021,"FDLS-MC-111-2021","https://community.secop.gov.co/Public/Tendering/OpportunityDetail/Index?noticeUID=CO1.NTC.1917898&isFromPublicArea=True&isModal=False","Contratos de prestación de servicios","Contratación mínima cuantia","No aplica","CONTRATAR LA PRESTACION DE SERVICIOS DE VIGILANCIA Y SEGURIDAD PRIVADA CON ARMAS, PARA LAS SEDES DE LA ALCALDIA LOCAL DE SUMAPAZ","Funcionamiento","Un Nuevo Contrato Social y Ambiental para la Bogotá del Siglo XXI","No aplica",{"$f":"IF(ISERROR(VLOOKUP(K154,Proposito_programa!$C$2:$E$59,2,FALSE)),\" \",VLOOKUP(K154,Proposito_programa!$C$2:$E$59,2,FALSE))","v":" "},{"$f":"IF(ISERROR(VLOOKUP(K154,Proposito_programa!$C$2:$E$59,3,FALSE)),\" \",VLOOKUP(K154,Proposito_programa!$C$2:$E$59,3,FALSE))","v":" "},null,1,860518862,"SEGURIDAD LAS AMERICAS LTDA SEGURIAMERICAS LTDA","LUIS ANGEL ARROYAVE VILARO","PAULA NATALIA FARFAN PAEZ","Persona Jurídica",null,null,null,24792421,null,1,12396210,37188631,44650000,"2021-04-23","2021-04-23","2021-06-18",36,1,18,null,null,null,null,null,null,"X",null,1.2006357534376568]
["CPS-142-2021",2021,"FDRS-CD-120-2021","https://community.secop.gov.co/Public/Tendering/OpportunityDetail/Index?noticeUID=CO1.NTC.1937587&isFromPublicArea=True&isModal=False","Contratos de prestación de servicios profesionales y de apoyo a la gestión","Contratación directa","Prestación de servicios profesionales y de apoyo a la gestión, o para la ejecución de trabajos artísticos que sólo puedan encomendarse a determinadas personas naturales;","PRESTAR LOS SERVICIOS PROFESIONALES PARA APOYAR LA PLANEACIÓN, EJECUCIÓN Y SEGUIMIENTO DE LOS PROYECTOS DE INVERSIÓN RELACIONADOS CON LA PLANEACIÓN PARTICIPATIVA RURAL Y DEL DESARROLLO CON ENFOQUE TERRITORIAL, DEL FONDO DE DESARROLLO LOCAL DE SUMAPAZ","Inversión","Un Nuevo Contrato Social y Ambiental para la Bogotá del Siglo XXI",39,{"$f":"IF(ISERROR(VLOOKUP(K155,Proposito_programa!$C$2:$E$59,2,FALSE)),\" \",VLOOKUP(K155,Proposito_programa!$C$2:$E$59,2,FALSE))","v":"Bogotá territorio de paz y atención integral a las víctimas del conflicto armado"},{"$f":"IF(ISERROR(VLOOKUP(K155,Proposito_programa!$C$2:$E$59,3,FALSE)),\" \",VLOOKUP(K155,Proposito_programa!$C$2:$E$59,3,FALSE))","v":"Propósito 3: Inspirar confianza y legitimidad para vivir sin miedo y ser epicentro de cultura ciudadana, paz y reconciliación"},1672,null,80727859,"JOSE REINERO GALEANO LEMUS","LUIS HERNANDO BEJARANO","ELIANA KATHERINE JIMENEZ RODRÍGUEZ ","Persona Natural",null,null,null,54400000,null,null,null,54400000,23571733,"2021-04-26","2021-04-27","2021-12-26",243,null,null,null,null,null,null,null,null,"X",null,0.43330391544117647]
["CPS-143-2021",2021,"FDRS-CD-121-2021","https://community.secop.gov.co/Public/Tendering/OpportunityDetail/Index?noticeUID=CO1.NTC.1941063&isFromPublicArea=True&isModal=False","Contratos de prestación de servicios profesionales y de apoyo a la gestión","Contratación directa","Prestación de servicios profesionales y de apoyo a la gestión, o para la ejecución de trabajos artísticos que sólo puedan encomendarse a determinadas personas naturales;","PRESTAR SUS SERVICIOS PROFESIONALES AL ÁREA GESTIÓN DE DESARROLLO LOCAL, EN LOS TEMAS RELACIONADOS CON LA GESTIÓN CULTURAL DE LA LOCALIDAD DE SUMAPAZ","Inversión","Un Nuevo Contrato Social y Ambiental para la Bogotá del Siglo XXI",21,{"$f":"IF(ISERROR(VLOOKUP(K156,Proposito_programa!$C$2:$E$59,2,FALSE)),\" \",VLOOKUP(K156,Proposito_programa!$C$2:$E$59,2,FALSE))","v":"Creación y vida cotidiana: Apropiación ciudadana del arte, la cultura y el patrimonio, para la democracia cultural"},{"$f":"IF(ISERROR(VLOOKUP(K156,Proposito_programa!$C$2:$E$59,3,FALSE)),\" \",VLOOKUP(K156,Proposito_programa!$C$2:$E$59,3,FALSE))","v":"Propósito 1: Hacer un nuevo contrato social para incrementar la inclusión social, productiva y política"},1633,null,79957036,"NICOLAS ALBERTO CABRERA PUENTE ","JOSE REINERO GALEANO LEMUS","MARIA DEL PILAR CONTRERAS MARTÍNEZ","Persona Natural",null,null,null,44000000,null,null,null,44000000,16120000,"2021-04-27","2021-04-29","2021-12-28",243,null,null,null,null,null,null,null,null,"X",null,0.36636363636363639]
["CPS-144-2021",2021,"FDRS-CD-123-2021","https://community.secop.gov.co/Public/Tendering/OpportunityDetail/Index?noticeUID=CO1.NTC.1957373&isFromPublicArea=True&isModal=False","Contratos de prestación de servicios profesionales y de apoyo a la gestión","Contratación directa","Prestación de servicios profesionales y de apoyo a la gestión, o para la ejecución de trabajos artísticos que sólo puedan encomendarse a determinadas personas naturales;","PRESTAR SUS SERVICIOS DE APOYO ADMINISTRATIVO AL PARQUE AUTOMOTOR DE PROPIEDAD DEL FONDO DE DESARROLLO LOCAL DE SUMAPAZ","Inversión","Un Nuevo Contrato Social y Ambiental para la Bogotá del Siglo XXI",57,{"$f":"IF(ISERROR(VLOOKUP(K157,Proposito_programa!$C$2:$E$59,2,FALSE)),\" \",VLOOKUP(K157,Proposito_programa!$C$2:$E$59,2,FALSE))","v":"Gestión pública local"},{"$f":"IF(ISERROR(VLOOKUP(K157,Proposito_programa!$C$2:$E$59,3,FALSE)),\" \",VLOOKUP(K157,Proposito_programa!$C$2:$E$59,3,FALSE))","v":"Propósito 5: Construir Bogotá - Región con gobierno abierto, transparente y ciudadanía consciente"},1696,null,1019019834,"EDWIN RUIZ VASQUEZ","NICOLAS ALBERTO CABRERA PUENTE ","LUIS YOBANY ROBLES RUBIANO","Persona Natural",null,null,null,20800000,null,null,null,20800000,15333333,"2021-05-05","2021-05-06","2022-01-05",244,null,null,null,null,null,null,null,"X",null,null,0.73717947115384619]
["CPS-145-2021",2021,"FDRS-CD.-124-2021","https://community.secop.gov.co/Public/Tendering/OpportunityDetail/Index?noticeUID=CO1.NTC.1957863&isFromPublicArea=True&isModal=False","Contratos de prestación de servicios profesionales y de apoyo a la gestión","Contratación directa","Prestación de servicios profesionales y de apoyo a la gestión, o para la ejecución de trabajos artísticos que sólo puedan encomendarse a determinadas personas naturales;","PRESTAR LOS SERVICIOS PROFESIONALES PARA APOYAR JURÍDICAMENTE LAS RESPUESTAS A LAS SOLICITUDES RADICADAS POR LOS ENTES DE CONTROL, CONCEJO DE BOGOTÁ Y TEMAS RELACIONADOS CON PLANES DE MEJORAMIENTO DE LA ALCALDÍA LOCAL DE SUMAPAZ","Inversión","Un Nuevo Contrato Social y Ambiental para la Bogotá del Siglo XXI",57,{"$f":"IF(ISERROR(VLOOKUP(K158,Proposito_programa!$C$2:$E$59,2,FALSE)),\" \",VLOOKUP(K158,Proposito_programa!$C$2:$E$59,2,FALSE))","v":"Gestión pública local"},{"$f":"IF(ISERROR(VLOOKUP(K158,Proposito_programa!$C$2:$E$59,3,FALSE)),\" \",VLOOKUP(K158,Proposito_programa!$C$2:$E$59,3,FALSE))","v":"Propósito 5: Construir Bogotá - Región con gobierno abierto, transparente y ciudadanía consciente"},1696,null,52516975,"NINI JOHANA GUTIERREZ TORRES ","ASEGURADORA SOLIDARIA DE COLOMBIA ENTIDAD COOPERATIVA","DUVAN HERNAN HERNANDEZ TORRES","Persona Natural",null,null,null,45600000,null,null,null,45600000,38033333,"2021-05-05","2021-05-06","2022-01-05",244,null,null,null,null,null,null,null,"X",null,null,0.83406432017543863]
["CPS-146-2021",2021,"FDRS-CD-126-2021","https://community.secop.gov.co/Public/Tendering/OpportunityDetail/Index?noticeUID=CO1.NTC.1967524&isFromPublicArea=True&isModal=False","Contratos de prestación de servicios profesionales y de apoyo a la gestión","Contratación directa","Prestación de servicios profesionales y de apoyo a la gestión, o para la ejecución de trabajos artísticos que sólo puedan encomendarse a determinadas personas naturales;","PRESTAR SUS SERVICIOS COMO TÉCNICO DE APOYO ADMINISTRATIVO AL ÁREA DE GESTIÓN DEL DESARROLLO LOCAL EN LA ALCALDÍA LOCAL DE SUMAPAZ","Inversión","Un Nuevo Contrato Social y Ambiental para la Bogotá del Siglo XXI",57,{"$f":"IF(ISERROR(VLOOKUP(K159,Proposito_programa!$C$2:$E$59,2,FALSE)),\" \",VLOOKUP(K159,Proposito_programa!$C$2:$E$59,2,FALSE))","v":"Gestión pública local"},{"$f":"IF(ISERROR(VLOOKUP(K159,Proposito_programa!$C$2:$E$59,3,FALSE)),\" \",VLOOKUP(K159,Proposito_programa!$C$2:$E$59,3,FALSE))","v":"Propósito 5: Construir Bogotá - Región con gobierno abierto, transparente y ciudadanía consciente"},1696,null,1020839818,"PAULA NATALIA FARFAN PAEZ","EDWIN RUIZ VÁSQUEZ","CRISTIAN ANDRES TORRES MALAMBO","Persona Natural",null,null,null,24704000,null,null,null,24704000,30555000,"2021-05-11","2021-05-12","2022-01-11",244,null,null,null,null,null,null,null,"X",null,null,1.2368442357512954]
["CPS-147-2021",2021,"FDRS-CD-127-2021","https://community.secop.gov.co/Public/Tendering/OpportunityDetail/Index?noticeUID=CO1.NTC.1992430&isFromPublicArea=True&isModal=False","Contratos de prestación de servicios profesionales y de apoyo a la gestión","Contratación directa","Prestación de servicios profesionales y de apoyo a la gestión, o para la ejecución de trabajos artísticos que sólo puedan encomendarse a determinadas personas naturales;","PRESTAR LOS SERVICIOS COMO AUXILIAR ADMINISTRATIVO EN LA GESTIÓN DE INFRAESTRUCTURA EN LA ALCALDÍA LOCAL DE SUMAPAZ","Inversión","Un Nuevo Contrato Social y Ambiental para la Bogotá del Siglo XXI",19,{"$f":"IF(ISERROR(VLOOKUP(K160,Proposito_programa!$C$2:$E$59,2,FALSE)),\" \",VLOOKUP(K160,Proposito_programa!$C$2:$E$59,2,FALSE))","v":"Vivienda y entornos dignos en el territorio urbano y rural"},{"$f":"IF(ISERROR(VLOOKUP(K160,Proposito_programa!$C$2:$E$59,3,FALSE)),\" \",VLOOKUP(K160,Proposito_programa!$C$2:$E$59,3,FALSE))","v":"Propósito 1: Hacer un nuevo contrato social para incrementar la inclusión social, productiva y política"},1589,null,53095155,"ELIANA KATHERINE JIMENEZ RODRIGUEZ ","NINI JOHANA GUTIERREZ TORRES ","JENNY CAROLINA GIRÓN CUERVO","Persona Natural",null,null,null,18200000,null,null,null,18200000,28518000,"2021-05-24","2021-05-25","2021-12-24",213,null,null,null,null,null,null,null,null,"X",null,1.5669230769230769]
["CPS-148-2021",2021,"FDRS-CD-128-2021","https://community.secop.gov.co/Public/Tendering/OpportunityDetail/Index?noticeUID=CO1.NTC.1997323&isFromPublicArea=True&isModal=False","Contratos de prestación de servicios profesionales y de apoyo a la gestión","Contratación directa","Prestación de servicios profesionales y de apoyo a la gestión, o para la ejecución de trabajos artísticos que sólo puedan encomendarse a determinadas personas naturales;","PRESTAR LOS SERVICIOS COMO AYUDANTES DE MAQUINARIA PESADA DE PROPIEDAD O TENENCIA DEL FONDO DE DESARROLLO LOCAL DE SUMAPAZ","Inversión","Un Nuevo Contrato Social y Ambiental para la Bogotá del Siglo XXI",57,{"$f":"IF(ISERROR(VLOOKUP(K161,Proposito_programa!$C$2:$E$59,2,FALSE)),\" \",VLOOKUP(K161,Proposito_programa!$C$2:$E$59,2,FALSE))","v":"Gestión pública local"},{"$f":"IF(ISERROR(VLOOKUP(K161,Proposito_programa!$C$2:$E$59,3,FALSE)),\" \",VLOOKUP(K161,Proposito_programa!$C$2:$E$59,3,FALSE))","v":"Propósito 5: Construir Bogotá - Región con gobierno abierto, transparente y ciudadanía consciente"},1696,null,1023006848,"MARIA DEL PILAR CONTRERAS MARTÍNEZ","SEGURIDAD LAS AMÉRICAS LTDA SEGURIAMERICAS LTDA","HECTOR ORLANDO PENAGOS PABÓN ","Persona Natural",null,null,null,20000000,null,null,null,20000000,45283333,"2021-05-26","2021-05-27","2022-01-26",244,null,null,null,null,null,null,null,"X",null,null,2.2641666499999999]
["CPS-149-2021",2021,"FDRS-CD-129-2021","https://community.secop.gov.co/Public/Tendering/OpportunityDetail/Index?noticeUID=CO1.NTC.1996821&isFromPublicArea=True&isModal=False","Contratos de prestación de servicios profesionales y de apoyo a la gestión","Contratación directa","Prestación de servicios profesionales y de apoyo a la gestión, o para la ejecución de trabajos artísticos que sólo puedan encomendarse a determinadas personas naturales;","PRESTAR LOS SERVICIOS PROFESIONALES ESPECIALIZADOS PARA APOYAR LA IMPLEMENTACIÓN Y GESTIÓN DE ESTRATEGIAS DE \nFORTALECIMIENTO DE LOS SISTEMAS LOCALES DE JUSTICIA ESTABLECIDAS EN EL PROYECTO 1683","Inversión","Un Nuevo Contrato Social y Ambiental para la Bogotá del Siglo XXI",48,{"$f":"IF(ISERROR(VLOOKUP(K162,Proposito_programa!$C$2:$E$59,2,FALSE)),\" \",VLOOKUP(K162,Proposito_programa!$C$2:$E$59,2,FALSE))","v":"Plataforma institucional para la seguridad y justicia"},{"$f":"IF(ISERROR(VLOOKUP(K162,Proposito_programa!$C$2:$E$59,3,FALSE)),\" \",VLOOKUP(K162,Proposito_programa!$C$2:$E$59,3,FALSE))","v":"Propósito 3: Inspirar confianza y legitimidad para vivir sin miedo y ser epicentro de cultura ciudadana, paz y reconciliación"},1683,null,79428028,"LUIS YOBANY ROBLES RUBIANO","PAULA NATALIA FARFAN PAEZ","ANDREI ESTEBAN VARGAS BENITEZ ","Persona Natural",null,null,null,56000000,null,null,null,56000000,17250000,"2021-05-26","2021-05-27","2021-11-10",167,null,null,null,null,null,null,null,null,"X",null,0.3080357142857143]
["CSE-150-2021",2021,"FRDS-SAMC-122-2021","https://community.secop.gov.co/Public/Tendering/OpportunityDetail/Index?noticeUID=CO1.NTC.1939044&isFromPublicArea=True&isModal=False","Seguros","Selección abreviada","Selección abreviada por menor cuantía ","CONTRATAR LOS SEGUROS QUE AMPAREN LOS INTERESES PATRIMONIALES ACTUALES Y FUTUROS, ASÍ COMO LOS BIENES DE PROPIEDAD DE LA ALCALDIA LOCAL DE SUMAPAZ, QUE ESTÉN BAJO SU RESPONSABILIDAD Y CUSTODIA Y AQUELLOS QUE SEAN ADQUIRIDOS PARA DESARROLLAR LAS FUNCIONES INHERENTES A SU ACTIVIDAD, ASI COMO CUALQUIER OTRA PÓLIZA DE SEGUROS QUE REQUIERA LA ENTIDAD EN EL DESARROLLO DE SU ACTIVIDAD","Funcionamiento","Un Nuevo Contrato Social y Ambiental para la Bogotá del Siglo XXI","No aplica",{"$f":"IF(ISERROR(VLOOKUP(K163,Proposito_programa!$C$2:$E$59,2,FALSE)),\" \",VLOOKUP(K163,Proposito_programa!$C$2:$E$59,2,FALSE))","v":" "},{"$f":"IF(ISERROR(VLOOKUP(K163,Proposito_programa!$C$2:$E$59,3,FALSE)),\" \",VLOOKUP(K163,Proposito_programa!$C$2:$E$59,3,FALSE))","v":" "},null,1,860524654,"ASEGURADORA SOLIDARIA DE COLOMBIA ENTIDAD COOPERATIVA","ELIANA KATHERINE JIMENEZ RODRÍGUEZ ","EMPRESA DE TELECOMUNICACIONES DE BOGOTÁ SA ESP","Persona Jurídica",null,null,null,251998595,null,1,973890,252972485,16293333,"2021-05-24","2021-05-24","2022-05-23",364,null,null,null,null,null,null,null,"X",null,null,6.4407530328841889E-2]
["CAR-151-2021",2021,"FDRS-CD-132-2021","https://community.secop.gov.co/Public/Tendering/OpportunityDetail/Index?noticeUID=CO1.NTC.1997555&isFromPublicArea=True&isModal=False","Arrendamiento de bienes inmuebles","Contratación directa","El arrendamiento o adquisición de inmuebles","ADQUIRIR A TÍTULO DE ARRENDAMIENTO UNA (1) BODEGA PARA EL FUNCIONAMIENTO DEL PUESTO DE DESINFECCIÓN EN LA LOCALIDAD DE SUMAPAZ","Funcionamiento","Un Nuevo Contrato Social y Ambiental para la Bogotá del Siglo XXI","No aplica",{"$f":"IF(ISERROR(VLOOKUP(K164,Proposito_programa!$C$2:$E$59,2,FALSE)),\" \",VLOOKUP(K164,Proposito_programa!$C$2:$E$59,2,FALSE))","v":" "},{"$f":"IF(ISERROR(VLOOKUP(K164,Proposito_programa!$C$2:$E$59,3,FALSE)),\" \",VLOOKUP(K164,Proposito_programa!$C$2:$E$59,3,FALSE))","v":" "},null,null,79640478,"OSCAR PEÑALOZA CASTELLANOS","MARIA DEL PILAR CONTRERAS MARTÍNEZ","MARIO ANDRES MUÑOZ ONOFRE","Persona Natural",null,null,null,3570000,null,null,null,3570000,120333877,"2021-05-26","2021-05-28","2021-08-27",91,null,null,null,null,null,null,null,null,"X",null,33.706968347338936]
["CPS-152-2021",2021,"FDRS-CD-133-2021","https://community.secop.gov.co/Public/Tendering/OpportunityDetail/Index?noticeUID=CO1.NTC.2011407&isFromPublicArea=True&isModal=False","Contratos de prestación de servicios profesionales y de apoyo a la gestión","Contratación directa","Prestación de servicios profesionales y de apoyo a la gestión, o para la ejecución de trabajos artísticos que sólo puedan encomendarse a determinadas personas naturales;","PRESTAR LOS SERVICIOS PROFESIONALES PARA APOYAR LA IMPLEMENTACIÓN Y GESTIÓN DE ESTRATEGIAS DE FORTALECIMIENTO DE LOS SISTEMAS LOCALES DE JUSTICIA ESTABLECIDAS EN EL PROYECTO 1683","Inversión","Un Nuevo Contrato Social y Ambiental para la Bogotá del Siglo XXI",48,{"$f":"IF(ISERROR(VLOOKUP(K165,Proposito_programa!$C$2:$E$59,2,FALSE)),\" \",VLOOKUP(K165,Proposito_programa!$C$2:$E$59,2,FALSE))","v":"Plataforma institucional para la seguridad y justicia"},{"$f":"IF(ISERROR(VLOOKUP(K165,Proposito_programa!$C$2:$E$59,3,FALSE)),\" \",VLOOKUP(K165,Proposito_programa!$C$2:$E$59,3,FALSE))","v":"Propósito 3: Inspirar confianza y legitimidad para vivir sin miedo y ser epicentro de cultura ciudadana, paz y reconciliación"},1683,null,1024555613,"DUVAN HERNAN HERNANDEZ TORRES","LUIS YOBANY ROBLES RUBIANO","LILIANA MARCELA MEDINA CHAVARRO ","Persona Natural",null,null,null,30555000,null,null,null,30555000,16640000,"2021-06-01","2021-06-02","2022-01-01",213,null,null,null,null,null,null,null,"X",null,null,0.54459171984945176]
["CPS-153-2021",2021,"FDRS-CD-134-2021","https://community.secop.gov.co/Public/Tendering/OpportunityDetail/Index?noticeUID=CO1.NTC.2028979&isFromPublicArea=True&isModal=False","Contratos de prestación de servicios profesionales y de apoyo a la gestión","Contratación directa","Prestación de servicios profesionales y de apoyo a la gestión, o para la ejecución de trabajos artísticos que sólo puedan encomendarse a determinadas personas naturales;","EL CONTRATO QUE SE PRETENDE CELEBRAR TENDRÁ POR OBJETO PRESTAR LOS SERVICIOS PROFESIONALES DE APOYO AL ÁREA DE GESTIÓN DE DESARROLLO LOCAL DE LA ALCALDÍA LOCAL DE SUMAPAZ, EN TEMAS RELACIONADOS CON EL EMPLEO LOCAL Y CORAZÓN PRODUCTIVO","Inversión","Un Nuevo Contrato Social y Ambiental para la Bogotá del Siglo XXI",1,{"$f":"IF(ISERROR(VLOOKUP(K166,Proposito_programa!$C$2:$E$59,2,FALSE)),\" \",VLOOKUP(K166,Proposito_programa!$C$2:$E$59,2,FALSE))","v":"Subsidios y transferencias para la equidad"},{"$f":"IF(ISERROR(VLOOKUP(K166,Proposito_programa!$C$2:$E$59,3,FALSE)),\" \",VLOOKUP(K166,Proposito_programa!$C$2:$E$59,3,FALSE))","v":"Propósito 1: Hacer un nuevo contrato social para incrementar la inclusión social, productiva y política"},1583,null,1013642097,"CRISTIAN ANDRES TORRES MALAMBO","COMPAÑÍA DE DISTRIBUCIÓN FERRETERA S.A.S.","LAURA JULIANA CUERVO MORALES","Persona Natural",null,null,null,30555000,null,null,null,30555000,21660000,"2021-06-11","2021-06-15","2022-01-14",213,null,null,null,null,null,null,null,"X",null,null,0.70888561610211098]
["CPS-154-2021",2021,"FDRS-CD-135-2021","https://community.secop.gov.co/Public/Tendering/OpportunityDetail/Index?noticeUID=CO1.NTC.2012254&isFromPublicArea=True&isModal=False","Contratos de prestación de servicios profesionales y de apoyo a la gestión","Contratación directa","Prestación de servicios profesionales y de apoyo a la gestión, o para la ejecución de trabajos artísticos que sólo puedan encomendarse a determinadas personas naturales;","PRESTAR LOS SERVICIOS PROFESIONALES PARA APOYAR LOS ASUNTOS JURÍDICOS EN LA GESTIÓN CONTRACTUAL Y POSTCONTRACTUALES DEL FONDO DE DESARROLLO LOCAL DE SUMAPAZ","Inversión","Un Nuevo Contrato Social y Ambiental para la Bogotá del Siglo XXI",57,{"$f":"IF(ISERROR(VLOOKUP(K167,Proposito_programa!$C$2:$E$59,2,FALSE)),\" \",VLOOKUP(K167,Proposito_programa!$C$2:$E$59,2,FALSE))","v":"Gestión pública local"},{"$f":"IF(ISERROR(VLOOKUP(K167,Proposito_programa!$C$2:$E$59,3,FALSE)),\" \",VLOOKUP(K167,Proposito_programa!$C$2:$E$59,3,FALSE))","v":"Propósito 5: Construir Bogotá - Región con gobierno abierto, transparente y ciudadanía consciente"},1696,null,52900762,"JENNY CAROLINA GIRON CUERVO","GRUPO EMPRESARIAL MADEX SAS","COMPAÑÍA DE DISTRIBUCIÓN FERRETERA S.A.S.","Persona Natural",null,null,null,45500000,null,null,null,45500000,26216667,"2021-06-02","2021-06-02","2022-01-01",213,null,null,null,null,null,null,null,"X",null,null,0.5761904835164835]
["CPS-155-2021",2021,"FDRS-CD-136-2021","https://community.secop.gov.co/Public/Tendering/OpportunityDetail/Index?noticeUID=CO1.NTC.2012363&isFromPublicArea=True&isModal=False","Contratos de prestación de servicios profesionales y de apoyo a la gestión","Contratación directa","Prestación de servicios profesionales y de apoyo a la gestión, o para la ejecución de trabajos artísticos que sólo puedan encomendarse a determinadas personas naturales;","PRESTAR LOS SERVICIOS COMO AYUDANTES DE MAQUINARIA PESADA DE PROPIEDAD O TENENCIA DEL FONDO DE DESARROLLO LOCAL DE SUMAPAZ","Inversión","Un Nuevo Contrato Social y Ambiental para la Bogotá del Siglo XXI",57,{"$f":"IF(ISERROR(VLOOKUP(K168,Proposito_programa!$C$2:$E$59,2,FALSE)),\" \",VLOOKUP(K168,Proposito_programa!$C$2:$E$59,2,FALSE))","v":"Gestión pública local"},{"$f":"IF(ISERROR(VLOOKUP(K168,Proposito_programa!$C$2:$E$59,3,FALSE)),\" \",VLOOKUP(K168,Proposito_programa!$C$2:$E$59,3,FALSE))","v":"Propósito 5: Construir Bogotá - Región con gobierno abierto, transparente y ciudadanía consciente"},1696,null,1024559011,"HECTOR ORLANDO PENAGOS PABON ","REDCOMPUTO LIMITADA","GRUPO EMPRESARIAL MADEX SAS","Persona Natural",null,null,null,20000000,null,null,null,20000000,0,"2021-06-02","2021-06-04","2022-02-03",244,null,null,null,null,null,null,null,"X",null,null,0]
["CPS-156-2021",2021,"FDRS-CD-138-2021","https://community.secop.gov.co/Public/Tendering/OpportunityDetail/Index?noticeUID=CO1.NTC.2042508&isFromPublicArea=True&isModal=False","Contratos de prestación de servicios profesionales y de apoyo a la gestión","Contratación directa","Prestación de servicios profesionales y de apoyo a la gestión, o para la ejecución de trabajos artísticos que sólo puedan encomendarse a determinadas personas naturales;","PRESTAR LOS SERVICIOS DE APOYO ADMINISTRATIVO EN LOS PROCESOS QUE SE ADELANTAN EN EL ALMACÉN DE LA ALCALDÍA LOCAL DE SUMAPAZ","Inversión","Un Nuevo Contrato Social y Ambiental para la Bogotá del Siglo XXI",57,{"$f":"IF(ISERROR(VLOOKUP(K169,Proposito_programa!$C$2:$E$59,2,FALSE)),\" \",VLOOKUP(K169,Proposito_programa!$C$2:$E$59,2,FALSE))","v":"Gestión pública local"},{"$f":"IF(ISERROR(VLOOKUP(K169,Proposito_programa!$C$2:$E$59,3,FALSE)),\" \",VLOOKUP(K169,Proposito_programa!$C$2:$E$59,3,FALSE))","v":"Propósito 5: Construir Bogotá - Región con gobierno abierto, transparente y ciudadanía consciente"},1696,null,1030591646,"ANDREI ESTEBAN VARGAS BENITEZ ","COMPAÑÍA DE DISTRIBUCIÓN FERRETERA S.A.S.","REDCOMPUTO LIMITADA","Persona Natural",null,null,null,18200000,null,null,null,18200000,0,"2021-06-21","2021-06-23","2022-01-22",213,null,null,null,null,null,null,null,"X",null,null,0]
["CIA-157-2021",2021,"FDRS-CD-137-2021","https://community.secop.gov.co/Public/Tendering/OpportunityDetail/Index?noticeUID=CO1.NTC.2028938&isFromPublicArea=True&isModal=False","Contratos de prestación de servicios","Contratación directa","Contratos interadministrativos","DESARROLLAR UN PROCESO DE INTERVENCIÓN QUE GARANTICE EL DERECHO A LAS COMUNICACIONES, MEDIANTE LA OPERACIÓN, ADMINISTRACIÓN Y MANTENIMIENTO DE LOS CINCO (5) CENTROS DE CONECTIVIDAD CAMPESINA EXISTENTE","Inversión","Un Nuevo Contrato Social y Ambiental para la Bogotá del Siglo XXI",54,{"$f":"IF(ISERROR(VLOOKUP(K170,Proposito_programa!$C$2:$E$59,2,FALSE)),\" \",VLOOKUP(K170,Proposito_programa!$C$2:$E$59,2,FALSE))","v":"Transformación digital y gestión de TIC para un territorio inteligente"},{"$f":"IF(ISERROR(VLOOKUP(K170,Proposito_programa!$C$2:$E$59,3,FALSE)),\" \",VLOOKUP(K170,Proposito_programa!$C$2:$E$59,3,FALSE))","v":"Propósito 5: Construir Bogotá - Región con gobierno abierto, transparente y ciudadanía consciente"},1692,null,899999115,"EMPRESA DE TELECOMUNICACIONES DE BOGOTA SA ESP","COMPAÑÍA DE DISTRIBUCIÓN FERRETERA S.A.S.","SECRETARIA DE EDUCACIÓN DEL DISTRITO","Persona Jurídica",null,null,null,123264241,null,null,null,123264241,0,"2021-06-11","2021-06-17","2021-08-16",60,null,null,null,null,null,null,null,null,"X",null,0]
["CPS-158-2021",2021,"FDRS-CD-140-2021","https://community.secop.gov.co/Public/Tendering/OpportunityDetail/Index?noticeUID=CO1.NTC.2047302&isFromPublicArea=True&isModal=False","Contratos de prestación de servicios profesionales y de apoyo a la gestión","Contratación directa","Prestación de servicios profesionales y de apoyo a la gestión, o para la ejecución de trabajos artísticos que sólo puedan encomendarse a determinadas personas naturales;","PRESTAR LOS SERVICIOS DE APOYO ADMINISTRATIVO AL ÁREA GESTIÓN DE DESARROLLO LOCAL, EN LA GESTIÓN CULTURAL DE LA LOCALIDAD DE SUMAPAZ","Inversión","Un Nuevo Contrato Social y Ambiental para la Bogotá del Siglo XXI",21,{"$f":"IF(ISERROR(VLOOKUP(K171,Proposito_programa!$C$2:$E$59,2,FALSE)),\" \",VLOOKUP(K171,Proposito_programa!$C$2:$E$59,2,FALSE))","v":"Creación y vida cotidiana: Apropiación ciudadana del arte, la cultura y el patrimonio, para la democracia cultural"},{"$f":"IF(ISERROR(VLOOKUP(K171,Proposito_programa!$C$2:$E$59,3,FALSE)),\" \",VLOOKUP(K171,Proposito_programa!$C$2:$E$59,3,FALSE))","v":"Propósito 1: Hacer un nuevo contrato social para incrementar la inclusión social, productiva y política"},1633,null,79984076,"MARIO ANDRES MUÑOZ ONOFRE","HYUNDAUTOS SAS","CINDY GERALDINE GARCIA MORENO","Persona Natural",null,null,null,23400000,null,null,null,23400000,2894552000,"2021-06-22","2021-06-23","2021-12-22",182,null,null,null,null,null,null,null,null,"X",null,123.69880341880342]
["CPS-159-2021",2021,"FDRS-SAMC-125-2021","https://community.secop.gov.co/Public/Tendering/OpportunityDetail/Index?noticeUID=CO1.NTC.2026594&isFromPublicArea=True&isModal=False","Contratos de prestación de servicios","Selección abreviada","Selección abreviada por menor cuantía ","CONTRATAR LA PRESTACIÓN DE SERVICIOS DE VIGILANCIA Y SEGURIDAD PRIVADA CON ARMAS, PARA LAS SEDES DE LA ALCALDIA LOCAL DE SUMAPAZ","Funcionamiento","Un Nuevo Contrato Social y Ambiental para la Bogotá del Siglo XXI","No aplica",{"$f":"IF(ISERROR(VLOOKUP(K172,Proposito_programa!$C$2:$E$59,2,FALSE)),\" \",VLOOKUP(K172,Proposito_programa!$C$2:$E$59,2,FALSE))","v":" "},{"$f":"IF(ISERROR(VLOOKUP(K172,Proposito_programa!$C$2:$E$59,3,FALSE)),\" \",VLOOKUP(K172,Proposito_programa!$C$2:$E$59,3,FALSE))","v":" "},null,5,860518862,"SEGURIDAD LAS AMERICAS LTDA SEGURIAMERICAS LTDA","OSCAR PEÑALOZA CASTELLANOS","COMPAÑÍA DE DISTRIBUCIÓN FERRETERA S.A.S.","Persona Jurídica",null,null,null,227273288,null,null,null,227273288,11093333,"2021-06-21","2021-06-22","2022-02-21",244,null,null,null,null,null,null,null,"X",null,null,4.8810544774623932E-2]
["CPS-160-2021",2021,"FDRS-MC-139-2021","https://community.secop.gov.co/Public/Tendering/OpportunityDetail/Index?noticeUID=CO1.NTC.2037307&isFromPublicArea=True&isModal=False","Contratos de prestación de servicios","Contratación mínima cuantia","No aplica","CONTRATAR LA PÓLIZA DE VIDA GRUPO DE LOS EDILES Y EDILESAS DE LA ALCALDIA LOCAL DE SUMAPAZ","Funcionamiento","Un Nuevo Contrato Social y Ambiental para la Bogotá del Siglo XXI","No aplica",{"$f":"IF(ISERROR(VLOOKUP(K173,Proposito_programa!$C$2:$E$59,2,FALSE)),\" \",VLOOKUP(K173,Proposito_programa!$C$2:$E$59,2,FALSE))","v":" "},{"$f":"IF(ISERROR(VLOOKUP(K173,Proposito_programa!$C$2:$E$59,3,FALSE)),\" \",VLOOKUP(K173,Proposito_programa!$C$2:$E$59,3,FALSE))","v":" "},null,2,860037013,"COMPAÑIA MUNDIAL DE SEGUROS S A","DUVAN HERNAN HERNANDEZ TORRES","COMPAÑÍA DE DISTRIBUCIÓN FERRETERA S.A.S.","Persona Jurídica",null,null,null,5107027,null,null,null,5107027,12584772,"2021-06-29","2021-06-29","2022-05-21",326,null,null,null,null,null,null,null,"X",null,null,2.4642070621518157]
["CPS-161-2021",2021,"FDRS-CD-142-2021","https://community.secop.gov.co/Public/Tendering/OpportunityDetail/Index?noticeUID=CO1.NTC.2071061&isFromPublicArea=True&isModal=False","Contratos de prestación de servicios profesionales y de apoyo a la gestión","Contratación directa","Prestación de servicios profesionales y de apoyo a la gestión, o para la ejecución de trabajos artísticos que sólo puedan encomendarse a determinadas personas naturales;","PRESTAR LOS SERVICIOS PROFESIONALES PARA APOYAR LA PLANEACIÓN, SEGUIMIENTO, EJECUCIÓN Y CONTROL DEL PROYECTO DE INVERSIÓN “ACUEDUCTOS VEREDALES Y SANEAMIENTO BÁSICO” EN LA LOCALIDAD DE SUMAPAZ","Inversión","Un Nuevo Contrato Social y Ambiental para la Bogotá del Siglo XXI",37,{"$f":"IF(ISERROR(VLOOKUP(K174,Proposito_programa!$C$2:$E$59,2,FALSE)),\" \",VLOOKUP(K174,Proposito_programa!$C$2:$E$59,2,FALSE))","v":"Provisión y mejoramiento de servicios públicos"},{"$f":"IF(ISERROR(VLOOKUP(K174,Proposito_programa!$C$2:$E$59,3,FALSE)),\" \",VLOOKUP(K174,Proposito_programa!$C$2:$E$59,3,FALSE))","v":"Propósito 2 : Cambiar Nuestros Hábitos de Vida para Reverdecer a Bogotá y Adaptarnos y Mitigar la Crisis Climática"},1668,null,1024479198,"LILIANA MARCELA MEDINA CHAVARRO ","CRISTIAN ANDRES TORRES MALAMBO","HYUNDAUTOS SAS","Persona Natural",null,null,null,39900000,null,null,null,39900000,1221390669,"2021-07-02","2021-07-07","2022-03-08",244,null,null,null,null,null,null,null,"X",null,null,30.611294962406014]
["CPS-162-2021",2021,"FDRS-CD-143-2021","https://community.secop.gov.co/Public/Tendering/OpportunityDetail/Index?noticeUID=CO1.NTC.2077283&isFromPublicArea=True&isModal=False","Contratos de prestación de servicios profesionales y de apoyo a la gestión","Contratación directa","Prestación de servicios profesionales y de apoyo a la gestión, o para la ejecución de trabajos artísticos que sólo puedan encomendarse a determinadas personas naturales;","PRESTAR LOS SERVICIOS PROFESIONALES PARA APOYAR LA EJECUCIÓN DE LA META BENEFICIAR 150 PERSONAS A TRAVÉS DE ESTRATEGIAS PARA EL FORTALECIMIENTO DE LOS MECANISMOS DE JUSTICIA COMUNITARIA. 1683 DE LA ALCALDÍA LOCAL DE SUMAPAZ","Inversión","Un Nuevo Contrato Social y Ambiental para la Bogotá del Siglo XXI",48,{"$f":"IF(ISERROR(VLOOKUP(K175,Proposito_programa!$C$2:$E$59,2,FALSE)),\" \",VLOOKUP(K175,Proposito_programa!$C$2:$E$59,2,FALSE))","v":"Plataforma institucional para la seguridad y justicia"},{"$f":"IF(ISERROR(VLOOKUP(K175,Proposito_programa!$C$2:$E$59,3,FALSE)),\" \",VLOOKUP(K175,Proposito_programa!$C$2:$E$59,3,FALSE))","v":"Propósito 3: Inspirar confianza y legitimidad para vivir sin miedo y ser epicentro de cultura ciudadana, paz y reconciliación"},1683,null,1032379433,"LAURA JULIANA CUERVO MORALES","JENNY CAROLINA GIRÓN CUERVO","VERONICA LUCIA CASTRO CHIGUAZUQUE","Persona Natural",null,null,null,33000000,null,null,null,33000000,247362924,"2021-07-06","2021-07-08","2022-01-07",183,null,null,null,null,null,null,null,"X",null,null,7.4958461818181821]
["CSU-163-2021",2021,"FDRS-SASI-130-2021","https://community.secop.gov.co/Public/Tendering/OpportunityDetail/Index?noticeUID=CO1.NTC.2025735&isFromPublicArea=True&isModal=False","Suministro","Selección abreviada","Selección abreviada por menor cuantía ","CONTRATAR EL SUMINISTRO DE MATERIALES, INSUMOS, INSTRUMENTOS, ELEMENTOS, EQUIPOS Y HERRAMIENTAS PARA EL DESARROLLO DE LOS PROYECTOS DE INVERSIÓN E INICIATIVAS LOCALES DEL FONDO DE DESARROLLO RURAL DE SUMAPAZ","Inversión","Un Nuevo Contrato Social y Ambiental para la Bogotá del Siglo XXI",14,{"$f":"IF(ISERROR(VLOOKUP(K176,Proposito_programa!$C$2:$E$59,2,FALSE)),\" \",VLOOKUP(K176,Proposito_programa!$C$2:$E$59,2,FALSE))","v":"Formación integral: más y mejor tiempo en los colegios"},{"$f":"IF(ISERROR(VLOOKUP(K176,Proposito_programa!$C$2:$E$59,3,FALSE)),\" \",VLOOKUP(K176,Proposito_programa!$C$2:$E$59,3,FALSE))","v":"Propósito 1: Hacer un nuevo contrato social para incrementar la inclusión social, productiva y política"},1586,14,900063026,"COMPAÑIA DE DISTRIBUCION FERRETERA SAS","HECTOR ORLANDO PENAGOS PABÓN ","JUAN SEBASTIAN MONTAÑEZ ROMERO","Persona Jurídica",null,null,null,102712400,null,null,null,102712400,22916666,"2021-07-13","2021-07-23","2022-04-22",273,null,null,null,null,null,null,null,"X",null,null,0.2231148916781226]
["CSU-164-2021",2021,"FDRS-SASI-130-2021","https://community.secop.gov.co/Public/Tendering/OpportunityDetail/Index?noticeUID=CO1.NTC.2025735&isFromPublicArea=True&isModal=False","Suministro","Selección abreviada","Selección abreviada por menor cuantía ","CONTRATAR EL SUMINISTRO DE MATERIALES, INSUMOS, INSTRUMENTOS, ELEMENTOS, EQUIPOS Y HERRAMIENTAS PARA EL DESARROLLO DE LOS PROYECTOS DE INVERSIÓN E INICIATIVAS LOCALES DEL FONDO DE DESARROLLO RURAL DE SUMAPAZ","Inversión","Un Nuevo Contrato Social y Ambiental para la Bogotá del Siglo XXI",12,{"$f":"IF(ISERROR(VLOOKUP(K177,Proposito_programa!$C$2:$E$59,2,FALSE)),\" \",VLOOKUP(K177,Proposito_programa!$C$2:$E$59,2,FALSE))","v":"Educación inicial: Bases sólidas para la vida."},{"$f":"IF(ISERROR(VLOOKUP(K177,Proposito_programa!$C$2:$E$59,3,FALSE)),\" \",VLOOKUP(K177,Proposito_programa!$C$2:$E$59,3,FALSE))","v":"Propósito 1: Hacer un nuevo contrato social para incrementar la inclusión social, productiva y política"},1585,14,900552715,"GRUPO EMPRESARIAL MADEX SAS","EMPRESA DE TELECOMUNICACIONES DE BOGOTÁ SA ESP","GERALDINE YURANI RUBIANO RUBIANO ","Persona Jurídica",null,null,null,50000000,null,null,null,50000000,9533333,"2021-07-13","2021-08-04","2022-02-03",213,null,null,null,null,null,null,null,"X",null,null,0.19066665999999999]
["CSU-164-2021",2021,"FDRS-SASI-130-2021","https://community.secop.gov.co/Public/Tendering/OpportunityDetail/Index?noticeUID=CO1.NTC.2025735&isFromPublicArea=True&isModal=False","Suministro","Selección abreviada","Selección abreviada por menor cuantía ","CONTRATAR EL SUMINISTRO DE MATERIALES, INSUMOS, INSTRUMENTOS, ELEMENTOS, EQUIPOS Y HERRAMIENTAS PARA EL DESARROLLO DE LOS PROYECTOS DE INVERSIÓN E INICIATIVAS LOCALES DEL FONDO DE DESARROLLO RURAL DE SUMAPAZ","Inversión","Un Nuevo Contrato Social y Ambiental para la Bogotá del Siglo XXI",14,{"$f":"IF(ISERROR(VLOOKUP(K178,Proposito_programa!$C$2:$E$59,2,FALSE)),\" \",VLOOKUP(K178,Proposito_programa!$C$2:$E$59,2,FALSE))","v":"Formación integral: más y mejor tiempo en los colegios"},{"$f":"IF(ISERROR(VLOOKUP(K178,Proposito_programa!$C$2:$E$59,3,FALSE)),\" \",VLOOKUP(K178,Proposito_programa!$C$2:$E$59,3,FALSE))","v":"Propósito 1: Hacer un nuevo contrato social para incrementar la inclusión social, productiva y política"},1586,14,900552715,"GRUPO EMPRESARIAL MADEX SAS","ANDREI ESTEBAN VARGAS BENITEZ ","GERALDINE YURANI RUBIANO RUBIANO ","Persona Jurídica",null,null,null,152712577,null,null,null,152712577,19110000,"2021-07-13","2021-08-04","2022-02-03",213,null,null,null,null,null,null,null,"X",null,null,0.12513704093933273]
["CSU-164-2021",2021,"FDRS-SASI-130-2021","https://community.secop.gov.co/Public/Tendering/OpportunityDetail/Index?noticeUID=CO1.NTC.2025735&isFromPublicArea=True&isModal=False","Suministro","Selección abreviada","Selección abreviada por menor cuantía ","CONTRATAR EL SUMINISTRO DE MATERIALES, INSUMOS, INSTRUMENTOS, ELEMENTOS, EQUIPOS Y HERRAMIENTAS PARA EL DESARROLLO DE LOS PROYECTOS DE INVERSIÓN E INICIATIVAS LOCALES DEL FONDO DE DESARROLLO RURAL DE SUMAPAZ","Inversión","Un Nuevo Contrato Social y Ambiental para la Bogotá del Siglo XXI",20,{"$f":"IF(ISERROR(VLOOKUP(K179,Proposito_programa!$C$2:$E$59,2,FALSE)),\" \",VLOOKUP(K179,Proposito_programa!$C$2:$E$59,2,FALSE))","v":"Bogotá, referente en cultura, deporte, recreación y actividad física, con parques para el desarrollo y la salud"},{"$f":"IF(ISERROR(VLOOKUP(K179,Proposito_programa!$C$2:$E$59,3,FALSE)),\" \",VLOOKUP(K179,Proposito_programa!$C$2:$E$59,3,FALSE))","v":"Propósito 1: Hacer un nuevo contrato social para incrementar la inclusión social, productiva y política"},1590,14,900552715,"GRUPO EMPRESARIAL MADEX SAS","ANDREI ESTEBAN VARGAS BENITEZ ","GERALDINE YURANI RUBIANO RUBIANO ","Persona Jurídica",null,null,null,380812000,null,null,null,380812000,null,"2021-07-13","2021-08-04","2022-02-03",213,null,null,null,null,null,null,null,"X",null,null,0]
["CSU-164-2021",2021,"FDRS-SASI-130-2021","https://community.secop.gov.co/Public/Tendering/OpportunityDetail/Index?noticeUID=CO1.NTC.2025735&isFromPublicArea=True&isModal=False","Suministro","Selección abreviada","Selección abreviada por menor cuantía ","CONTRATAR EL SUMINISTRO DE MATERIALES, INSUMOS, INSTRUMENTOS, ELEMENTOS, EQUIPOS Y HERRAMIENTAS PARA EL DESARROLLO DE LOS PROYECTOS DE INVERSIÓN E INICIATIVAS LOCALES DEL FONDO DE DESARROLLO RURAL DE SUMAPAZ","Inversión","Un Nuevo Contrato Social y Ambiental para la Bogotá del Siglo XXI",21,{"$f":"IF(ISERROR(VLOOKUP(K180,Proposito_programa!$C$2:$E$59,2,FALSE)),\" \",VLOOKUP(K180,Proposito_programa!$C$2:$E$59,2,FALSE))","v":"Creación y vida cotidiana: Apropiación ciudadana del arte, la cultura y el patrimonio, para la democracia cultural"},{"$f":"IF(ISERROR(VLOOKUP(K180,Proposito_programa!$C$2:$E$59,3,FALSE)),\" \",VLOOKUP(K180,Proposito_programa!$C$2:$E$59,3,FALSE))","v":"Propósito 1: Hacer un nuevo contrato social para incrementar la inclusión social, productiva y política"},1633,14,900552715,"GRUPO EMPRESARIAL MADEX SAS","ANDREI ESTEBAN VARGAS BENITEZ ","GERALDINE YURANI RUBIANO RUBIANO ","Persona Jurídica",null,null,null,24000000,null,null,null,24000000,null,"2021-07-13","2021-08-04","2022-02-03",213,null,null,null,null,null,null,null,"X",null,null,0]
["CSU-164-2021",2021,"FDRS-SASI-130-2021","https://community.secop.gov.co/Public/Tendering/OpportunityDetail/Index?noticeUID=CO1.NTC.2025735&isFromPublicArea=True&isModal=False","Suministro","Selección abreviada","Selección abreviada por menor cuantía ","CONTRATAR EL SUMINISTRO DE MATERIALES, INSUMOS, INSTRUMENTOS, ELEMENTOS, EQUIPOS Y HERRAMIENTAS PARA EL DESARROLLO DE LOS PROYECTOS DE INVERSIÓN E INICIATIVAS LOCALES DEL FONDO DE DESARROLLO RURAL DE SUMAPAZ","Inversión","Un Nuevo Contrato Social y Ambiental para la Bogotá del Siglo XXI",55,{"$f":"IF(ISERROR(VLOOKUP(K181,Proposito_programa!$C$2:$E$59,2,FALSE)),\" \",VLOOKUP(K181,Proposito_programa!$C$2:$E$59,2,FALSE))","v":"Fortalecimiento de cultura ciudadana y su institucionalidad"},{"$f":"IF(ISERROR(VLOOKUP(K181,Proposito_programa!$C$2:$E$59,3,FALSE)),\" \",VLOOKUP(K181,Proposito_programa!$C$2:$E$59,3,FALSE))","v":"Propósito 5: Construir Bogotá - Región con gobierno abierto, transparente y ciudadanía consciente"},1691,14,900552715,"GRUPO EMPRESARIAL MADEX SAS","ANDREI ESTEBAN VARGAS BENITEZ ","GERALDINE YURANI RUBIANO RUBIANO ","Persona Jurídica",null,null,null,51468000,null,null,null,51468000,null,"2021-07-13","2021-08-04","2022-02-03",213,null,null,null,null,null,null,null,"X",null,null,0]
["CSU-165-2021",2021,"FDRS-SASI-130-2021","https://community.secop.gov.co/Public/Tendering/OpportunityDetail/Index?noticeUID=CO1.NTC.2025735&isFromPublicArea=True&isModal=False","Suministro","Selección abreviada","Selección abreviada por menor cuantía ","CONTRATAR EL SUMINISTRO DE MATERIALES, INSUMOS, INSTRUMENTOS, ELEMENTOS, EQUIPOS Y HERRAMIENTAS PARA EL DESARROLLO DE LOS PROYECTOS DE INVERSIÓN E INICIATIVAS LOCALES DEL FONDO DE DESARROLLO RURAL DE SUMAPAZ","Inversión","Un Nuevo Contrato Social y Ambiental para la Bogotá del Siglo XXI",12,{"$f":"IF(ISERROR(VLOOKUP(K182,Proposito_programa!$C$2:$E$59,2,FALSE)),\" \",VLOOKUP(K182,Proposito_programa!$C$2:$E$59,2,FALSE))","v":"Educación inicial: Bases sólidas para la vida."},{"$f":"IF(ISERROR(VLOOKUP(K182,Proposito_programa!$C$2:$E$59,3,FALSE)),\" \",VLOOKUP(K182,Proposito_programa!$C$2:$E$59,3,FALSE))","v":"Propósito 1: Hacer un nuevo contrato social para incrementar la inclusión social, productiva y política"},1585,14,830016004,"REDCOMPUTO LIMITADA","ANDREI ESTEBAN VARGAS BENITEZ ","CLARA LEONOR CABRERA","Persona Jurídica",null,null,null,62411000,null,null,null,62411000,null,"2021-07-13","2021-07-23","2022-04-22",273,null,null,null,null,null,null,null,"X",null,null,0]
["CSU-165-2021",2021,"FDRS-SASI-130-2021","https://community.secop.gov.co/Public/Tendering/OpportunityDetail/Index?noticeUID=CO1.NTC.2025735&isFromPublicArea=True&isModal=False","Suministro","Selección abreviada","Selección abreviada por menor cuantía ","CONTRATAR EL SUMINISTRO DE MATERIALES, INSUMOS, INSTRUMENTOS, ELEMENTOS, EQUIPOS Y HERRAMIENTAS PARA EL DESARROLLO DE LOS PROYECTOS DE INVERSIÓN E INICIATIVAS LOCALES DEL FONDO DE DESARROLLO RURAL DE SUMAPAZ","Inversión","Un Nuevo Contrato Social y Ambiental para la Bogotá del Siglo XXI",14,{"$f":"IF(ISERROR(VLOOKUP(K183,Proposito_programa!$C$2:$E$59,2,FALSE)),\" \",VLOOKUP(K183,Proposito_programa!$C$2:$E$59,2,FALSE))","v":"Formación integral: más y mejor tiempo en los colegios"},{"$f":"IF(ISERROR(VLOOKUP(K183,Proposito_programa!$C$2:$E$59,3,FALSE)),\" \",VLOOKUP(K183,Proposito_programa!$C$2:$E$59,3,FALSE))","v":"Propósito 1: Hacer un nuevo contrato social para incrementar la inclusión social, productiva y política"},1586,14,830016004,"REDCOMPUTO LIMITADA","COMPAÑÍA MUNDIAL DE SEGUROS S A","CLARA LEONOR CABRERA","Persona Jurídica",null,null,null,151912577,null,null,null,151912577,20370000,"2021-07-13","2021-07-23","2022-04-22",273,null,null,null,null,null,null,null,"X",null,null,0.13409028009576851]
["CSU-165-2021",2021,"FDRS-SASI-130-2021","https://community.secop.gov.co/Public/Tendering/OpportunityDetail/Index?noticeUID=CO1.NTC.2025735&isFromPublicArea=True&isModal=False","Suministro","Selección abreviada","Selección abreviada por menor cuantía ","CONTRATAR EL SUMINISTRO DE MATERIALES, INSUMOS, INSTRUMENTOS, ELEMENTOS, EQUIPOS Y HERRAMIENTAS PARA EL DESARROLLO DE LOS PROYECTOS DE INVERSIÓN E INICIATIVAS LOCALES DEL FONDO DE DESARROLLO RURAL DE SUMAPAZ","Inversión","Un Nuevo Contrato Social y Ambiental para la Bogotá del Siglo XXI",21,{"$f":"IF(ISERROR(VLOOKUP(K184,Proposito_programa!$C$2:$E$59,2,FALSE)),\" \",VLOOKUP(K184,Proposito_programa!$C$2:$E$59,2,FALSE))","v":"Creación y vida cotidiana: Apropiación ciudadana del arte, la cultura y el patrimonio, para la democracia cultural"},{"$f":"IF(ISERROR(VLOOKUP(K184,Proposito_programa!$C$2:$E$59,3,FALSE)),\" \",VLOOKUP(K184,Proposito_programa!$C$2:$E$59,3,FALSE))","v":"Propósito 1: Hacer un nuevo contrato social para incrementar la inclusión social, productiva y política"},1633,14,830016004,"REDCOMPUTO LIMITADA","COMPAÑÍA MUNDIAL DE SEGUROS S A","CLARA LEONOR CABRERA","Persona Jurídica",null,null,null,73936000,null,null,null,73936000,20370000,"2021-07-13","2021-07-23","2022-04-22",273,null,null,null,null,null,null,null,"X",null,null,0.27550854793334778]
["CSU-165-2021",2021,"FDRS-SASI-130-2021","https://community.secop.gov.co/Public/Tendering/OpportunityDetail/Index?noticeUID=CO1.NTC.2025735&isFromPublicArea=True&isModal=False","Suministro","Selección abreviada","Selección abreviada por menor cuantía ","CONTRATAR EL SUMINISTRO DE MATERIALES, INSUMOS, INSTRUMENTOS, ELEMENTOS, EQUIPOS Y HERRAMIENTAS PARA EL DESARROLLO DE LOS PROYECTOS DE INVERSIÓN E INICIATIVAS LOCALES DEL FONDO DE DESARROLLO RURAL DE SUMAPAZ","Inversión","Un Nuevo Contrato Social y Ambiental para la Bogotá del Siglo XXI",23,{"$f":"IF(ISERROR(VLOOKUP(K185,Proposito_programa!$C$2:$E$59,2,FALSE)),\" \",VLOOKUP(K185,Proposito_programa!$C$2:$E$59,2,FALSE))","v":"Bogotá rural"},{"$f":"IF(ISERROR(VLOOKUP(K185,Proposito_programa!$C$2:$E$59,3,FALSE)),\" \",VLOOKUP(K185,Proposito_programa!$C$2:$E$59,3,FALSE))","v":"Propósito 1: Hacer un nuevo contrato social para incrementar la inclusión social, productiva y política"},1634,14,830016004,"REDCOMPUTO LIMITADA","COMPAÑÍA MUNDIAL DE SEGUROS S A","CLARA LEONOR CABRERA","Persona Jurídica",null,null,null,16000000,null,null,null,16000000,20370000,"2021-07-13","2021-07-23","2022-04-22",273,null,null,null,null,null,null,null,"X",null,null,1.2731250000000001]
["CSU-165-2021",2021,"FDRS-SASI-130-2021","https://community.secop.gov.co/Public/Tendering/OpportunityDetail/Index?noticeUID=CO1.NTC.2025735&isFromPublicArea=True&isModal=False","Suministro","Selección abreviada","Selección abreviada por menor cuantía ","CONTRATAR EL SUMINISTRO DE MATERIALES, INSUMOS, INSTRUMENTOS, ELEMENTOS, EQUIPOS Y HERRAMIENTAS PARA EL DESARROLLO DE LOS PROYECTOS DE INVERSIÓN E INICIATIVAS LOCALES DEL FONDO DE DESARROLLO RURAL DE SUMAPAZ","Inversión","Un Nuevo Contrato Social y Ambiental para la Bogotá del Siglo XXI",55,{"$f":"IF(ISERROR(VLOOKUP(K186,Proposito_programa!$C$2:$E$59,2,FALSE)),\" \",VLOOKUP(K186,Proposito_programa!$C$2:$E$59,2,FALSE))","v":"Fortalecimiento de cultura ciudadana y su institucionalidad"},{"$f":"IF(ISERROR(VLOOKUP(K186,Proposito_programa!$C$2:$E$59,3,FALSE)),\" \",VLOOKUP(K186,Proposito_programa!$C$2:$E$59,3,FALSE))","v":"Propósito 5: Construir Bogotá - Región con gobierno abierto, transparente y ciudadanía consciente"},1691,14,830016004,"REDCOMPUTO LIMITADA","COMPAÑÍA MUNDIAL DE SEGUROS S A","CLARA LEONOR CABRERA","Persona Jurídica",null,null,null,198800000,null,null,null,198800000,20370000,"2021-07-13","2021-07-23","2022-04-22",273,null,null,null,null,null,null,null,"X",null,null,0.10246478873239437]
["CIA-166-2021",2021,"FDRS-CD-144-2021","https://www.contratos.gov.co/consultas/detalleProceso.do?numConstancia=21-22-27410&g-recaptcha-response=03AGdBq26SqJTDb8ZqhwPC7t0MjNliPkLoUJah-v_2pC2lSaDBrQv2ol7jtR8STqC1mgVacwZ9CMsCwF0HzOwQcSA8gws4vOjQIBVwV_LctIO2ZJ8VN6PeO7uShwja1BOW_5xbQRLaom4ywEb9vgp3EhjEgvB1WjtE-6lRPSZm7Ld4gMSuIE_MJn0GH7O89Rawk4Eazzn2rQZBHK4hq8Dmu6hSavpwGVPAGmZt7U-nJF7DPwLkoS5bkm9x3XVgOTlkfdpNXHd865kRZWjU7SwOcqPSBUzgnc2H6UUR2Pay8NIMIsbIU5N9Z4YxhTiKfY84AqzDMw7-gLdUw0wcMSUFFrIsjTh8VYIWqnLvD7CwLEhWZv_SAjch5ER8f7P00_puXVNzYRimmGRPi_WGcTweZ8VvMkd_X3K7aiQEB-NRD9G-OK9UVvxn2EA1xspI8-fnZlww8u6entqN","Contratos interadministrativos","Contratación directa","Contratos interadministrativos","AUNAR ESFUERZOS TECNICOS, ADMINISTRATIVOS, JURIDICOS Y FINANCIEROS, ENTRE LA SECRETARIA DE EDUCACION EL DISTRITO Y LOS FONDOS DE DESARROLLO LOCAL QUE HACEN PARTE DEL DISTRITO CAPITAL, PARA LA IMPLEMENTACION DE UN NUEVO MODELO INCLUSIVO, EFICIENTE Y FLEXIBLE PARA EL ACCESO Y LA PERMANENCIA DE LAS Y LOS JOVENES EGRESADOS DE INSTITUCIONES DE EDUCACION MEDIA A PROGRAMAS DE EDUCACION SUPERIOR","Inversión","Un Nuevo Contrato Social y Ambiental para la Bogotá del Siglo XXI",18,{"$f":"IF(ISERROR(VLOOKUP(K187,Proposito_programa!$C$2:$E$59,2,FALSE)),\" \",VLOOKUP(K187,Proposito_programa!$C$2:$E$59,2,FALSE))","v":"Cierre de brechas para la inclusión productiva urbano rural"},{"$f":"IF(ISERROR(VLOOKUP(K187,Proposito_programa!$C$2:$E$59,3,FALSE)),\" \",VLOOKUP(K187,Proposito_programa!$C$2:$E$59,3,FALSE))","v":"Propósito 1: Hacer un nuevo contrato social para incrementar la inclusión social, productiva y política"},1587,null,899999061,"SECRETARIA DE EDUCACION DEL DSITRITO","COMPAÑÍA MUNDIAL DE SEGUROS S A","EMPRESA DE \nTELECOMUNICACIONES DE BOGOTÁ S.A ESP","Persona Jurídica",null,null,null,2894552000,null,null,null,2894552000,20370000,"2021-06-28","2021-06-28","2027-06-30",2193,null,null,null,null,null,null,null,"X",null,null,7.0373584582346426E-3]
["CPS-167-2021",2021,"FDRS-CD-145-2021","https://community.secop.gov.co/Public/Tendering/OpportunityDetail/Index?noticeUID=CO1.NTC.2105892&isFromPublicArea=True&isModal=False","Contratos de prestación de servicios profesionales y de apoyo a la gestión","Contratación directa","Prestación de servicios profesionales y de apoyo a la gestión, o para la ejecución de trabajos artísticos que sólo puedan encomendarse a determinadas personas naturales;","PRESTAR LOS SERVICIOS COMO AUXILIAR ADMINISTRATIVO EN LA EJECUCIÓN DEL PROYECTO 1683 DE LA ALCALDÍA LOCAL DE SUMAPAZ","Inversión","Un Nuevo Contrato Social y Ambiental para la Bogotá del Siglo XXI",48,{"$f":"IF(ISERROR(VLOOKUP(K188,Proposito_programa!$C$2:$E$59,2,FALSE)),\" \",VLOOKUP(K188,Proposito_programa!$C$2:$E$59,2,FALSE))","v":"Plataforma institucional para la seguridad y justicia"},{"$f":"IF(ISERROR(VLOOKUP(K188,Proposito_programa!$C$2:$E$59,3,FALSE)),\" \",VLOOKUP(K188,Proposito_programa!$C$2:$E$59,3,FALSE))","v":"Propósito 3: Inspirar confianza y legitimidad para vivir sin miedo y ser epicentro de cultura ciudadana, paz y reconciliación"},1683,null,1072661424,"CINDY GERALDINE GARCIA MORENO","MARIO ANDRES MUÑOZ ONOFRE","JAVIER ENRIQUE BUITRAGO GOMEZ","Persona Natural",null,null,null,15600000,null,null,null,15600000,240188537,"2021-07-19","2021-07-23","2022-01-22",183,null,null,null,null,null,null,null,"X",null,null,15.396701089743591]
["CSU-168-2021",2021,"FDRS-SASI-130-2021","https://community.secop.gov.co/Public/Tendering/OpportunityDetail/Index?noticeUID=CO1.NTC.2025735&isFromPublicArea=True&isModal=False","Suministro","Selección abreviada","Selección abreviada por menor cuantía ","CONTRATAR EL SUMINISTRO DE MATERIALES, INSUMOS, INSTRUMENTOS, ELEMENTOS, EQUIPOS Y HERRAMIENTAS PARA EL DESARROLLO DE LOS PROYECTOS DE INVERSIÓN E INICIATIVAS LOCALES DEL FONDO DE DESARROLLO RURAL DE SUMAPAZ","Inversión","Un Nuevo Contrato Social y Ambiental para la Bogotá del Siglo XXI",14,{"$f":"IF(ISERROR(VLOOKUP(K189,Proposito_programa!$C$2:$E$59,2,FALSE)),\" \",VLOOKUP(K189,Proposito_programa!$C$2:$E$59,2,FALSE))","v":"Formación integral: más y mejor tiempo en los colegios"},{"$f":"IF(ISERROR(VLOOKUP(K189,Proposito_programa!$C$2:$E$59,3,FALSE)),\" \",VLOOKUP(K189,Proposito_programa!$C$2:$E$59,3,FALSE))","v":"Propósito 1: Hacer un nuevo contrato social para incrementar la inclusión social, productiva y política"},1586,14,900063026,"COMPAÑIA DE DISTRIBUCION FERRETERA SAS","JAVIER ENRIQUE BUITRAGO GOMEZ","NESTOR VILLALBA BAQUERO","Persona Jurídica",null,null,null,260000000,null,null,null,260000000,0,"2021-07-13","2021-08-24","2022-01-23",214,null,null,null,null,null,null,null,"X",null,null,0]
["CSU-168-2021",2021,"FDRS-SASI-130-2021","https://community.secop.gov.co/Public/Tendering/OpportunityDetail/Index?noticeUID=CO1.NTC.2025735&isFromPublicArea=True&isModal=False","Suministro","Selección abreviada","Selección abreviada por menor cuantía ","CONTRATAR EL SUMINISTRO DE MATERIALES, INSUMOS, INSTRUMENTOS, ELEMENTOS, EQUIPOS Y HERRAMIENTAS PARA EL DESARROLLO DE LOS PROYECTOS DE INVERSIÓN E INICIATIVAS LOCALES DEL FONDO DE DESARROLLO RURAL DE SUMAPAZ","Inversión","Un Nuevo Contrato Social y Ambiental para la Bogotá del Siglo XXI",23,{"$f":"IF(ISERROR(VLOOKUP(K190,Proposito_programa!$C$2:$E$59,2,FALSE)),\" \",VLOOKUP(K190,Proposito_programa!$C$2:$E$59,2,FALSE))","v":"Bogotá rural"},{"$f":"IF(ISERROR(VLOOKUP(K190,Proposito_programa!$C$2:$E$59,3,FALSE)),\" \",VLOOKUP(K190,Proposito_programa!$C$2:$E$59,3,FALSE))","v":"Propósito 1: Hacer un nuevo contrato social para incrementar la inclusión social, productiva y política"},1634,14,900063026,"COMPAÑIA DE DISTRIBUCION FERRETERA SAS","LILIANA MARCELA MEDINA CHAVARRO ","NESTOR VILLALBA BAQUERO","Persona Jurídica",null,null,null,60000000,null,null,null,60000000,11006666,"2021-07-13","2021-08-24","2022-01-23",214,null,null,null,null,null,null,null,"X",null,null,0.18344443333333332]
["CSU-168-2021",2021,"FDRS-SASI-130-2021","https://community.secop.gov.co/Public/Tendering/OpportunityDetail/Index?noticeUID=CO1.NTC.2025735&isFromPublicArea=True&isModal=False","Suministro","Selección abreviada","Selección abreviada por menor cuantía ","CONTRATAR EL SUMINISTRO DE MATERIALES, INSUMOS, INSTRUMENTOS, ELEMENTOS, EQUIPOS Y HERRAMIENTAS PARA EL DESARROLLO DE LOS PROYECTOS DE INVERSIÓN E INICIATIVAS LOCALES DEL FONDO DE DESARROLLO RURAL DE SUMAPAZ","Inversión","Un Nuevo Contrato Social y Ambiental para la Bogotá del Siglo XXI",28,{"$f":"IF(ISERROR(VLOOKUP(K191,Proposito_programa!$C$2:$E$59,2,FALSE)),\" \",VLOOKUP(K191,Proposito_programa!$C$2:$E$59,2,FALSE))","v":"Bogotá protectora de sus recursos naturales"},{"$f":"IF(ISERROR(VLOOKUP(K191,Proposito_programa!$C$2:$E$59,3,FALSE)),\" \",VLOOKUP(K191,Proposito_programa!$C$2:$E$59,3,FALSE))","v":"Propósito 2 : Cambiar Nuestros Hábitos de Vida para Reverdecer a Bogotá y Adaptarnos y Mitigar la Crisis Climática"},1651,14,900063026,"COMPAÑIA DE DISTRIBUCION FERRETERA SAS","LILIANA MARCELA MEDINA CHAVARRO ","NESTOR VILLALBA BAQUERO","Persona Jurídica",null,null,null,343511869,null,null,null,343511869,11006666,"2021-07-13","2021-08-24","2022-01-23",214,null,null,null,null,null,null,null,"X",null,null,3.2041588641584899E-2]
["CSU-169-2021",2021,"FDRS-SASI-130-2021","https://community.secop.gov.co/Public/Tendering/OpportunityDetail/Index?noticeUID=CO1.NTC.2025735&isFromPublicArea=True&isModal=False","Suministro","Selección abreviada","Selección abreviada por menor cuantía ","CONTRATAR EL SUMINISTRO DE MATERIALES, INSUMOS, INSTRUMENTOS, ELEMENTOS, EQUIPOS Y HERRAMIENTAS PARA EL DESARROLLO DE LOS PROYECTOS DE INVERSIÓN E INICIATIVAS LOCALES DEL FONDO DE DESARROLLO RURAL DE SUMAPAZ","Inversión","Un Nuevo Contrato Social y Ambiental para la Bogotá del Siglo XXI",12,{"$f":"IF(ISERROR(VLOOKUP(K192,Proposito_programa!$C$2:$E$59,2,FALSE)),\" \",VLOOKUP(K192,Proposito_programa!$C$2:$E$59,2,FALSE))","v":"Educación inicial: Bases sólidas para la vida."},{"$f":"IF(ISERROR(VLOOKUP(K192,Proposito_programa!$C$2:$E$59,3,FALSE)),\" \",VLOOKUP(K192,Proposito_programa!$C$2:$E$59,3,FALSE))","v":"Propósito 1: Hacer un nuevo contrato social para incrementar la inclusión social, productiva y política"},1585,14,900063026,"COMPAÑIA DE DISTRIBUCION FERRETERA SAS","LILIANA MARCELA MEDINA CHAVARRO ","YURI ALEJANDRA MOLINA GARCIA","Persona Jurídica",null,null,null,15000000,null,null,null,15000000,11006666,"2021-07-13","2021-07-23","2022-04-22",273,null,null,null,null,null,null,null,"X",null,null,0.73377773333333329]
["CSU-169-2021",2021,"FDRS-SASI-130-2021","https://community.secop.gov.co/Public/Tendering/OpportunityDetail/Index?noticeUID=CO1.NTC.2025735&isFromPublicArea=True&isModal=False","Suministro","Selección abreviada","Selección abreviada por menor cuantía ","CONTRATAR EL SUMINISTRO DE MATERIALES, INSUMOS, INSTRUMENTOS, ELEMENTOS, EQUIPOS Y HERRAMIENTAS PARA EL DESARROLLO DE LOS PROYECTOS DE INVERSIÓN E INICIATIVAS LOCALES DEL FONDO DE DESARROLLO RURAL DE SUMAPAZ","Inversión","Un Nuevo Contrato Social y Ambiental para la Bogotá del Siglo XXI",14,{"$f":"IF(ISERROR(VLOOKUP(K193,Proposito_programa!$C$2:$E$59,2,FALSE)),\" \",VLOOKUP(K193,Proposito_programa!$C$2:$E$59,2,FALSE))","v":"Formación integral: más y mejor tiempo en los colegios"},{"$f":"IF(ISERROR(VLOOKUP(K193,Proposito_programa!$C$2:$E$59,3,FALSE)),\" \",VLOOKUP(K193,Proposito_programa!$C$2:$E$59,3,FALSE))","v":"Propósito 1: Hacer un nuevo contrato social para incrementar la inclusión social, productiva y política"},1586,14,900063026,"COMPAÑIA DE DISTRIBUCION FERRETERA SAS","LAURA JULIANA CUERVO MORALES","YURI ALEJANDRA MOLINA GARCIA","Persona Jurídica",null,null,null,82712577,null,null,null,82712577,11006666,"2021-07-13","2021-07-23","2022-04-22",273,null,null,null,null,null,null,null,"X",null,null,0.13307124985357427]
["CSU-169-2021",2021,"FDRS-SASI-130-2021","https://community.secop.gov.co/Public/Tendering/OpportunityDetail/Index?noticeUID=CO1.NTC.2025735&isFromPublicArea=True&isModal=False","Suministro","Selección abreviada","Selección abreviada por menor cuantía ","CONTRATAR EL SUMINISTRO DE MATERIALES, INSUMOS, INSTRUMENTOS, ELEMENTOS, EQUIPOS Y HERRAMIENTAS PARA EL DESARROLLO DE LOS PROYECTOS DE INVERSIÓN E INICIATIVAS LOCALES DEL FONDO DE DESARROLLO RURAL DE SUMAPAZ","Inversión","Un Nuevo Contrato Social y Ambiental para la Bogotá del Siglo XXI",19,{"$f":"IF(ISERROR(VLOOKUP(K194,Proposito_programa!$C$2:$E$59,2,FALSE)),\" \",VLOOKUP(K194,Proposito_programa!$C$2:$E$59,2,FALSE))","v":"Vivienda y entornos dignos en el territorio urbano y rural"},{"$f":"IF(ISERROR(VLOOKUP(K194,Proposito_programa!$C$2:$E$59,3,FALSE)),\" \",VLOOKUP(K194,Proposito_programa!$C$2:$E$59,3,FALSE))","v":"Propósito 1: Hacer un nuevo contrato social para incrementar la inclusión social, productiva y política"},1589,14,900063026,"COMPAÑIA DE DISTRIBUCION FERRETERA SAS","LAURA JULIANA CUERVO MORALES","YURI ALEJANDRA MOLINA GARCIA","Persona Jurídica",null,null,null,797056000,null,1,376830000,1173886000,11006666,"2021-07-13","2021-07-23","2022-04-22",273,null,null,null,null,null,null,null,"X",null,null,9.3762648161746544E-3]
["CSU-169-2021",2021,"FDRS-SASI-130-2021","https://community.secop.gov.co/Public/Tendering/OpportunityDetail/Index?noticeUID=CO1.NTC.2025735&isFromPublicArea=True&isModal=False","Suministro","Selección abreviada","Selección abreviada por menor cuantía ","CONTRATAR EL SUMINISTRO DE MATERIALES, INSUMOS, INSTRUMENTOS, ELEMENTOS, EQUIPOS Y HERRAMIENTAS PARA EL DESARROLLO DE LOS PROYECTOS DE INVERSIÓN E INICIATIVAS LOCALES DEL FONDO DE DESARROLLO RURAL DE SUMAPAZ","Inversión","Un Nuevo Contrato Social y Ambiental para la Bogotá del Siglo XXI",20,{"$f":"IF(ISERROR(VLOOKUP(K195,Proposito_programa!$C$2:$E$59,2,FALSE)),\" \",VLOOKUP(K195,Proposito_programa!$C$2:$E$59,2,FALSE))","v":"Bogotá, referente en cultura, deporte, recreación y actividad física, con parques para el desarrollo y la salud"},{"$f":"IF(ISERROR(VLOOKUP(K195,Proposito_programa!$C$2:$E$59,3,FALSE)),\" \",VLOOKUP(K195,Proposito_programa!$C$2:$E$59,3,FALSE))","v":"Propósito 1: Hacer un nuevo contrato social para incrementar la inclusión social, productiva y política"},1590,14,900063026,"COMPAÑIA DE DISTRIBUCION FERRETERA SAS","LAURA JULIANA CUERVO MORALES","YURI ALEJANDRA MOLINA GARCIA","Persona Jurídica",null,null,null,2400000,null,null,null,2400000,11006666,"2021-07-13","2021-07-23","2022-04-22",273,null,null,null,null,null,null,null,"X",null,null,4.5861108333333336]
["CSU-169-2021",2021,"FDRS-SASI-130-2021","https://community.secop.gov.co/Public/Tendering/OpportunityDetail/Index?noticeUID=CO1.NTC.2025735&isFromPublicArea=True&isModal=False","Suministro","Selección abreviada","Selección abreviada por menor cuantía ","CONTRATAR EL SUMINISTRO DE MATERIALES, INSUMOS, INSTRUMENTOS, ELEMENTOS, EQUIPOS Y HERRAMIENTAS PARA EL DESARROLLO DE LOS PROYECTOS DE INVERSIÓN E INICIATIVAS LOCALES DEL FONDO DE DESARROLLO RURAL DE SUMAPAZ","Inversión","Un Nuevo Contrato Social y Ambiental para la Bogotá del Siglo XXI",21,{"$f":"IF(ISERROR(VLOOKUP(K196,Proposito_programa!$C$2:$E$59,2,FALSE)),\" \",VLOOKUP(K196,Proposito_programa!$C$2:$E$59,2,FALSE))","v":"Creación y vida cotidiana: Apropiación ciudadana del arte, la cultura y el patrimonio, para la democracia cultural"},{"$f":"IF(ISERROR(VLOOKUP(K196,Proposito_programa!$C$2:$E$59,3,FALSE)),\" \",VLOOKUP(K196,Proposito_programa!$C$2:$E$59,3,FALSE))","v":"Propósito 1: Hacer un nuevo contrato social para incrementar la inclusión social, productiva y política"},1633,14,900063026,"COMPAÑIA DE DISTRIBUCION FERRETERA SAS","LAURA JULIANA CUERVO MORALES","YURI ALEJANDRA MOLINA GARCIA","Persona Jurídica",null,null,null,42000000,null,1,20000000,62000000,11006666,"2021-07-13","2021-07-23","2022-04-22",273,null,null,null,null,null,null,null,"X",null,null,0.17752687096774195]
["CSU-169-2021",2021,"FDRS-SASI-130-2021","https://community.secop.gov.co/Public/Tendering/OpportunityDetail/Index?noticeUID=CO1.NTC.2025735&isFromPublicArea=True&isModal=False","Suministro","Selección abreviada","Selección abreviada por menor cuantía ","CONTRATAR EL SUMINISTRO DE MATERIALES, INSUMOS, INSTRUMENTOS, ELEMENTOS, EQUIPOS Y HERRAMIENTAS PARA EL DESARROLLO DE LOS PROYECTOS DE INVERSIÓN E INICIATIVAS LOCALES DEL FONDO DE DESARROLLO RURAL DE SUMAPAZ","Inversión","Un Nuevo Contrato Social y Ambiental para la Bogotá del Siglo XXI",28,{"$f":"IF(ISERROR(VLOOKUP(K197,Proposito_programa!$C$2:$E$59,2,FALSE)),\" \",VLOOKUP(K197,Proposito_programa!$C$2:$E$59,2,FALSE))","v":"Bogotá protectora de sus recursos naturales"},{"$f":"IF(ISERROR(VLOOKUP(K197,Proposito_programa!$C$2:$E$59,3,FALSE)),\" \",VLOOKUP(K197,Proposito_programa!$C$2:$E$59,3,FALSE))","v":"Propósito 2 : Cambiar Nuestros Hábitos de Vida para Reverdecer a Bogotá y Adaptarnos y Mitigar la Crisis Climática"},1648,14,900063026,"COMPAÑIA DE DISTRIBUCION FERRETERA SAS","LAURA JULIANA CUERVO MORALES","YURI ALEJANDRA MOLINA GARCIA","Persona Jurídica",null,null,null,100000000,null,1,4366000,104366000,11006666,"2021-07-13","2021-07-23","2022-04-22",273,null,null,null,null,null,null,null,"X",null,null,0.10546218117011287]
["CSU-169-2021",2021,"FDRS-SASI-130-2021","https://community.secop.gov.co/Public/Tendering/OpportunityDetail/Index?noticeUID=CO1.NTC.2025735&isFromPublicArea=True&isModal=False","Suministro","Selección abreviada","Selección abreviada por menor cuantía ","CONTRATAR EL SUMINISTRO DE MATERIALES, INSUMOS, INSTRUMENTOS, ELEMENTOS, EQUIPOS Y HERRAMIENTAS PARA EL DESARROLLO DE LOS PROYECTOS DE INVERSIÓN E INICIATIVAS LOCALES DEL FONDO DE DESARROLLO RURAL DE SUMAPAZ","Inversión","Un Nuevo Contrato Social y Ambiental para la Bogotá del Siglo XXI",28,{"$f":"IF(ISERROR(VLOOKUP(K198,Proposito_programa!$C$2:$E$59,2,FALSE)),\" \",VLOOKUP(K198,Proposito_programa!$C$2:$E$59,2,FALSE))","v":"Bogotá protectora de sus recursos naturales"},{"$f":"IF(ISERROR(VLOOKUP(K198,Proposito_programa!$C$2:$E$59,3,FALSE)),\" \",VLOOKUP(K198,Proposito_programa!$C$2:$E$59,3,FALSE))","v":"Propósito 2 : Cambiar Nuestros Hábitos de Vida para Reverdecer a Bogotá y Adaptarnos y Mitigar la Crisis Climática"},1651,14,900063026,"COMPAÑIA DE DISTRIBUCION FERRETERA SAS","LAURA JULIANA CUERVO MORALES","YURI ALEJANDRA MOLINA GARCIA","Persona Jurídica",null,null,null,132000000,null,1,28593000,160593000,11006666,"2021-07-13","2021-07-23","2022-04-22",273,null,null,null,null,null,null,null,"X",null,null,6.8537644853760751E-2]
["CSU-169-2021",2021,"FDRS-SASI-130-2021","https://community.secop.gov.co/Public/Tendering/OpportunityDetail/Index?noticeUID=CO1.NTC.2025735&isFromPublicArea=True&isModal=False","Suministro","Selección abreviada","Selección abreviada por menor cuantía ","CONTRATAR EL SUMINISTRO DE MATERIALES, INSUMOS, INSTRUMENTOS, ELEMENTOS, EQUIPOS Y HERRAMIENTAS PARA EL DESARROLLO DE LOS PROYECTOS DE INVERSIÓN E INICIATIVAS LOCALES DEL FONDO DE DESARROLLO RURAL DE SUMAPAZ","Inversión","Un Nuevo Contrato Social y Ambiental para la Bogotá del Siglo XXI",49,{"$f":"IF(ISERROR(VLOOKUP(K199,Proposito_programa!$C$2:$E$59,2,FALSE)),\" \",VLOOKUP(K199,Proposito_programa!$C$2:$E$59,2,FALSE))","v":"Movilidad segura, sostenible y accesible"},{"$f":"IF(ISERROR(VLOOKUP(K199,Proposito_programa!$C$2:$E$59,3,FALSE)),\" \",VLOOKUP(K199,Proposito_programa!$C$2:$E$59,3,FALSE))","v":"Propósito 4: Hacer de Bogotá Región un modelo de movilidad multimodal, incluyente y sostenible"},1688,14,900063026,"COMPAÑIA DE DISTRIBUCION FERRETERA SAS","LAURA JULIANA CUERVO MORALES","YURI ALEJANDRA MOLINA GARCIA","Persona Jurídica",null,null,null,753864000,null,1,376932000,1130796000,11006666,"2021-07-13","2021-07-23","2022-04-22",273,null,null,null,null,null,null,null,"X",null,null,9.7335558314673911E-3]
["CSU-169-2021",2021,"FDRS-SASI-130-2021","https://community.secop.gov.co/Public/Tendering/OpportunityDetail/Index?noticeUID=CO1.NTC.2025735&isFromPublicArea=True&isModal=False","Suministro","Selección abreviada","Selección abreviada por menor cuantía ","CONTRATAR EL SUMINISTRO DE MATERIALES, INSUMOS, INSTRUMENTOS, ELEMENTOS, EQUIPOS Y HERRAMIENTAS PARA EL DESARROLLO DE LOS PROYECTOS DE INVERSIÓN E INICIATIVAS LOCALES DEL FONDO DE DESARROLLO RURAL DE SUMAPAZ","Inversión","Un Nuevo Contrato Social y Ambiental para la Bogotá del Siglo XXI",55,{"$f":"IF(ISERROR(VLOOKUP(K200,Proposito_programa!$C$2:$E$59,2,FALSE)),\" \",VLOOKUP(K200,Proposito_programa!$C$2:$E$59,2,FALSE))","v":"Fortalecimiento de cultura ciudadana y su institucionalidad"},{"$f":"IF(ISERROR(VLOOKUP(K200,Proposito_programa!$C$2:$E$59,3,FALSE)),\" \",VLOOKUP(K200,Proposito_programa!$C$2:$E$59,3,FALSE))","v":"Propósito 5: Construir Bogotá - Región con gobierno abierto, transparente y ciudadanía consciente"},1691,14,900063026,"COMPAÑIA DE DISTRIBUCION FERRETERA SAS","LAURA JULIANA CUERVO MORALES","YURI ALEJANDRA MOLINA GARCIA","Persona Jurídica",null,null,null,171297000,null,1,12900000,184197000,11006666,"2021-07-13","2021-07-23","2022-04-22",273,null,null,null,null,null,null,null,"X",null,null,5.975486028545525E-2]
["CSU-169-2021",2021,"FDRS-SASI-130-2021","https://community.secop.gov.co/Public/Tendering/OpportunityDetail/Index?noticeUID=CO1.NTC.2025735&isFromPublicArea=True&isModal=False","Suministro","Selección abreviada","Selección abreviada por menor cuantía ","CONTRATAR EL SUMINISTRO DE MATERIALES, INSUMOS, INSTRUMENTOS, ELEMENTOS, EQUIPOS Y HERRAMIENTAS PARA EL DESARROLLO DE LOS PROYECTOS DE INVERSIÓN E INICIATIVAS LOCALES DEL FONDO DE DESARROLLO RURAL DE SUMAPAZ","Inversión","Un Nuevo Contrato Social y Ambiental para la Bogotá del Siglo XXI",56,{"$f":"IF(ISERROR(VLOOKUP(K201,Proposito_programa!$C$2:$E$59,2,FALSE)),\" \",VLOOKUP(K201,Proposito_programa!$C$2:$E$59,2,FALSE))","v":"Gestión pública efectiva"},{"$f":"IF(ISERROR(VLOOKUP(K201,Proposito_programa!$C$2:$E$59,3,FALSE)),\" \",VLOOKUP(K201,Proposito_programa!$C$2:$E$59,3,FALSE))","v":"Propósito 5: Construir Bogotá - Región con gobierno abierto, transparente y ciudadanía consciente"},1693,14,900063026,"COMPAÑIA DE DISTRIBUCION FERRETERA SAS","LAURA JULIANA CUERVO MORALES","YURI ALEJANDRA MOLINA GARCIA","Persona Jurídica",null,null,null,393826000,null,1,344800000,738626000,11006666,"2021-07-13","2021-07-23","2022-04-22",273,null,null,null,null,null,null,null,"X",null,null,1.4901541510859352E-2]
["CPS-170-2021",2021,"FDRS-LP-131-2021","https://community.secop.gov.co/Public/Tendering/OpportunityDetail/Index?noticeUID=CO1.NTC.2030122&isFromPublicArea=True&isModal=False","Contratos de prestación de servicios","Licitación pública","No aplica","PRESTACIÓN DEL SERVICIO DE MANTENIMIENTO DE LA MAQUINARIA Y VEHICULOS PESADOS DE PROPIEDAD, GUARDA Y/O TENENCIA DEL FONDO DE DESARROLLO RURAL DE SUMAPAZ CON SUMINISTRO DE REPUESTOS, LLANTAS, INSUMOS, ACCESORIOS Y MANO DE OBRA","Inversión","Un Nuevo Contrato Social y Ambiental para la Bogotá del Siglo XXI",49,{"$f":"IF(ISERROR(VLOOKUP(K202,Proposito_programa!$C$2:$E$59,2,FALSE)),\" \",VLOOKUP(K202,Proposito_programa!$C$2:$E$59,2,FALSE))","v":"Movilidad segura, sostenible y accesible"},{"$f":"IF(ISERROR(VLOOKUP(K202,Proposito_programa!$C$2:$E$59,3,FALSE)),\" \",VLOOKUP(K202,Proposito_programa!$C$2:$E$59,3,FALSE))","v":"Propósito 4: Hacer de Bogotá Región un modelo de movilidad multimodal, incluyente y sostenible"},1688,10,830070987,"HYUNDAUTOS SAS","LAURA JULIANA CUERVO MORALES","GLORIA YINET RIVEROS","Persona Jurídica",null,null,null,481345792,null,null,null,481345792,11006666,"2021-07-23","2021-08-11","2022-04-13",245,null,null,null,null,null,null,null,"X",null,null,2.286644275888881E-2]
["CPS-171-2021",2021,"FDRS-CD-146-2021","https://community.secop.gov.co/Public/Tendering/OpportunityDetail/Index?noticeUID=CO1.NTC.2120244&isFromPublicArea=True&isModal=False","Contratos de prestación de servicios profesionales y de apoyo a la gestión","Contratación directa","Prestación de servicios profesionales y de apoyo a la gestión, o para la ejecución de trabajos artísticos que sólo puedan encomendarse a determinadas personas naturales;","PRESTAR LOS SERVICIOS PROFESIONALES PARA APOYAR LA EJECUCIÓN DE LA META ATENDER A 200 PERSONAS EN ESTRATEGIAS DE ACCESO A LA JUSTICIA INTEGRAL EN LA CIUDAD DEL PROYECTO 1683 DE LA ALCALDÍA LOCAL DE SUMAPAZ","Inversión","Un Nuevo Contrato Social y Ambiental para la Bogotá del Siglo XXI",48,{"$f":"IF(ISERROR(VLOOKUP(K203,Proposito_programa!$C$2:$E$59,2,FALSE)),\" \",VLOOKUP(K203,Proposito_programa!$C$2:$E$59,2,FALSE))","v":"Plataforma institucional para la seguridad y justicia"},{"$f":"IF(ISERROR(VLOOKUP(K203,Proposito_programa!$C$2:$E$59,3,FALSE)),\" \",VLOOKUP(K203,Proposito_programa!$C$2:$E$59,3,FALSE))","v":"Propósito 3: Inspirar confianza y legitimidad para vivir sin miedo y ser epicentro de cultura ciudadana, paz y reconciliación"},1683,null,1016043437,"VERONICA LUCIA CASTRO CHIGUAZUQUE","SECRETARIA DE EDUCACIÓN DEL DISTRITO","MARIA CRISTINA BARBOSA DIAZ ","Persona Natural",null,null,null,33000000,null,null,null,33000000,11006666,"2021-07-23","2021-07-26","2022-01-25",183,null,null,null,null,null,null,null,"X",null,null,0.33353533333333335]
["CPS-172-2021",2021,"FDRS-CD-147-2021","https://community.secop.gov.co/Public/Tendering/OpportunityDetail/Index?noticeUID=CO1.NTC.2163302&isFromPublicArea=True&isModal=False","Contratos de prestación de servicios profesionales y de apoyo a la gestión","Contratación directa","Prestación de servicios profesionales y de apoyo a la gestión, o para la ejecución de trabajos artísticos que sólo puedan encomendarse a determinadas personas naturales;","PRESTAR LOS SERVICIOS DE AUXILIAR ADMINISTRATIVO EN LA EJECUCIÓN DEL PROYECTO 1587 DE LA ALCALDIA LOCAL DE SUMAPAZ","Inversión","Un Nuevo Contrato Social y Ambiental para la Bogotá del Siglo XXI",18,{"$f":"IF(ISERROR(VLOOKUP(K204,Proposito_programa!$C$2:$E$59,2,FALSE)),\" \",VLOOKUP(K204,Proposito_programa!$C$2:$E$59,2,FALSE))","v":"Cierre de brechas para la inclusión productiva urbano rural"},{"$f":"IF(ISERROR(VLOOKUP(K204,Proposito_programa!$C$2:$E$59,3,FALSE)),\" \",VLOOKUP(K204,Proposito_programa!$C$2:$E$59,3,FALSE))","v":"Propósito 1: Hacer un nuevo contrato social para incrementar la inclusión social, productiva y política"},1587,null,1022399769,"JUAN SEBASTIAN MONTAÑEZ ROMERO","CINDY GERALDINE GARCIA MORENO","DIANA MARCELA CIFUENTES DIAZ","Persona Natural",null,null,null,15600000,null,null,null,15600000,11006666,"2021-08-10","2021-08-11","2022-02-10",152,null,null,null,null,null,null,null,"X",null,null,0.70555551282051288]
["CPS-173-2021",2021,"FDRS-CD-148-2021","https://community.secop.gov.co/Public/Tendering/OpportunityDetail/Index?noticeUID=CO1.NTC.2148722&isFromPublicArea=True&isModal=False","Contratos de prestación de servicios profesionales y de apoyo a la gestión","Contratación directa","Prestación de servicios profesionales y de apoyo a la gestión, o para la ejecución de trabajos artísticos que sólo puedan encomendarse a determinadas personas naturales;","PRESTAR LOS SERVICIOS DE APOYO ADMINISTRATIVO AL ÁREA DE GESTIÓN DE DESARROLLO LOCAL EN LOS PROCESOS RELACIONADOS CON EL PROYECTO DE INVERSIÓN 1641","Inversión","Un Nuevo Contrato Social y Ambiental para la Bogotá del Siglo XXI",6,{"$f":"IF(ISERROR(VLOOKUP(K205,Proposito_programa!$C$2:$E$59,2,FALSE)),\" \",VLOOKUP(K205,Proposito_programa!$C$2:$E$59,2,FALSE))","v":"Sistema Distrital de Cuidado"},{"$f":"IF(ISERROR(VLOOKUP(K205,Proposito_programa!$C$2:$E$59,3,FALSE)),\" \",VLOOKUP(K205,Proposito_programa!$C$2:$E$59,3,FALSE))","v":"Propósito 1: Hacer un nuevo contrato social para incrementar la inclusión social, productiva y política"},1641,null,1010237047,"GERALDINE YURANI RUBIANO RUBIANO ","VERONICA LUCIA CASTRO CHIGUAZUQUE","FUNDACIÓN JUNTOS POR UN PAÍS","Persona Natural",null,null,null,23400000,null,null,null,23400000,22893333,"2021-08-04","2021-08-04","2022-02-03",183,null,null,null,null,null,null,null,"X",null,null,0.97834756410256407]
["CPS-174-2021",2021,"FDRS-CD-150-2021","https://community.secop.gov.co/Public/Tendering/OpportunityDetail/Index?noticeUID=CO1.NTC.2163816&isFromPublicArea=True&isModal=False","Contratos de prestación de servicios profesionales y de apoyo a la gestión","Contratación directa","Prestación de servicios profesionales y de apoyo a la gestión, o para la ejecución de trabajos artísticos que sólo puedan encomendarse a determinadas personas naturales;","PRESTAR LOS SERVICIOS PROFESIONALES PARA APOYAR LA ADMINISTRACIÓN Y OPERACIÓN DE LOS CENTROS DE CONECTIVIDAD CAMPESINA DE LA LOCALIDAD DE SUMAPAZ, DEL PROYECTO 1692","Inversión","Un Nuevo Contrato Social y Ambiental para la Bogotá del Siglo XXI",54,{"$f":"IF(ISERROR(VLOOKUP(K206,Proposito_programa!$C$2:$E$59,2,FALSE)),\" \",VLOOKUP(K206,Proposito_programa!$C$2:$E$59,2,FALSE))","v":"Transformación digital y gestión de TIC para un territorio inteligente"},{"$f":"IF(ISERROR(VLOOKUP(K206,Proposito_programa!$C$2:$E$59,3,FALSE)),\" \",VLOOKUP(K206,Proposito_programa!$C$2:$E$59,3,FALSE))","v":"Propósito 5: Construir Bogotá - Región con gobierno abierto, transparente y ciudadanía consciente"},1692,null,52215660,"CLARA LEONOR CABRERA","JUAN SEBASTIAN MONTAÑEZ ROMERO","PIEDAD CONSTANZA CIRO BASTO","Persona Natural",null,null,null,21825000,null,null,null,21825000,0,"2021-08-10","2021-08-11","2022-01-10",152,null,null,null,null,null,null,null,"X",null,null,0]
["CIA-175-2021",2021,"FDRS-CD-152-2021","https://community.secop.gov.co/Public/Tendering/OpportunityDetail/Index?noticeUID=CO1.NTC.2168920&isFromPublicArea=True&isModal=False","Contratos interadministrativos","Contratación directa","Contratos interadministrativos","GARANTIZAR EL DERECHO A LAS COMUNICACIONES, MEDIANTE LA OPERACIÓN DE LOS CINCO (5) CENTROS DE CONECTIVIDAD CAMPESINA EXISTENTES Y LA APERTURA DE UNO (1) NUEVO EN ( TUNAL ALTO ) Y UNA SOLUCION WIFI EN LA LOCALIDAD DE SUMAPAZ","Inversión","Un Nuevo Contrato Social y Ambiental para la Bogotá del Siglo XXI",54,{"$f":"IF(ISERROR(VLOOKUP(K207,Proposito_programa!$C$2:$E$59,2,FALSE)),\" \",VLOOKUP(K207,Proposito_programa!$C$2:$E$59,2,FALSE))","v":"Transformación digital y gestión de TIC para un territorio inteligente"},{"$f":"IF(ISERROR(VLOOKUP(K207,Proposito_programa!$C$2:$E$59,3,FALSE)),\" \",VLOOKUP(K207,Proposito_programa!$C$2:$E$59,3,FALSE))","v":"Propósito 5: Construir Bogotá - Región con gobierno abierto, transparente y ciudadanía consciente"},1692,null,899999115,"EMPRESA DE \nTELECOMUNICACIONES DE BOGOTA SA ESP","GERALDINE YURANI RUBIANO RUBIANO ","CARLOS EMILIANO ROMERO PUENTES","Persona Jurídica",null,null,null,393603818,null,null,null,393603818,17233333,"2021-08-19","2021-08-24","2022-01-23",152,null,null,null,null,null,null,null,"X",null,null,4.3783449783507941E-2]
["CIN-176-2021",2021,"FDRS-CMA-141-2021","https://www.contratos.gov.co/consultas/detalleProceso.do?numConstancia=21-15-12080612&g-recaptcha-response=03AGdBq26LdzWGdzYm6aIBluSOO2OflPgY3DQGUQ6z8IIJkPv4_305B32b7jwytEOyKBTz-fTIhLPCYNP2t0iVKOGbP-YWDj09RXUUTKewsh1L5JpoC2TqaBg_Jz_Le-V6-W8QT0U91GipZzb4C-HuHiNNCC3HuX__7s3Gcsm51sOIl07dQQXOknRlYpmZEom417IfwwlfkNXvcbpS06BGAjfZeqENXChVJOTGMzAQzWRwWGbXwrsALr6UrjVidMSR5eE3sSVwknJYdYOhmji3TMgHvv3FRUUb9S5DUuDBDIw0b1SmwnPs2Ws1QvpFqr5SURqZES0CEX8Mat4vsMZuFqzVJlWoxsXZSQG5sMmi36rkcMI8u_0oGzgvTmaPPhyEQ7v59h3awMfMzXhLz0jtB02er7Fb3f_dQH4Q6aeyOakmQ2AOUopfPPG4b-s_FHf6I3K4QztpfYIllfUvOvwolaY3SXPMivl1_A","Interventoría","Concurso de méritos","No aplica","REALIZAR LA INTERVENTORIA TECNICA ADMINISTRATIVA FINANCIERA JURIDICA Y AMBIENTAL AL CONTRATO DERIVADO DE LA LICITACION PUBLICA No FDRS LP 131 2021 QUE TENDRA POR OBJETO PRESTACIoN DEL SERVICIO DE MANTENIMIENTO DE LA MAQUINARIA Y VEHICULOS PESADOS DE PROPIEDAD GUARDA Y O TENENCIA DEL FONDO DE DESARROLLO RURAL DE SUMAPAZ CON SUMINISTRO DE REPUESTOS LLANTAS INSUMOS ACCESORIOS Y MANO DE OBRA","Inversión","Un Nuevo Contrato Social y Ambiental para la Bogotá del Siglo XXI",49,{"$f":"IF(ISERROR(VLOOKUP(K208,Proposito_programa!$C$2:$E$59,2,FALSE)),\" \",VLOOKUP(K208,Proposito_programa!$C$2:$E$59,2,FALSE))","v":"Movilidad segura, sostenible y accesible"},{"$f":"IF(ISERROR(VLOOKUP(K208,Proposito_programa!$C$2:$E$59,3,FALSE)),\" \",VLOOKUP(K208,Proposito_programa!$C$2:$E$59,3,FALSE))","v":"Propósito 4: Hacer de Bogotá Región un modelo de movilidad multimodal, incluyente y sostenible"},1688,2,3096924,"JAVIER ENRIQUE BUITRAGO GOMEZ","HQ5 SAS","CLAUDIA YAMILE CARREÑO QUIJANO","Persona Natural",null,null,null,48000000,null,null,null,48000000,11000000,"2021-08-10","2021-08-11","2022-04-10",242,null,null,null,null,null,null,null,"X",null,null,{"$f":"IF(ISERROR(AC208/AB208),\"-\",(AC208/AB208))","v":0.22916666666666666}]
["CPS-177-2021",2021,"FDRS-CD-156-2021","https://community.secop.gov.co/Public/Tendering/OpportunityDetail/Index?noticeUID=CO1.NTC.2187435&isFromPublicArea=True&isModal=False","Contratos de prestación de servicios profesionales y de apoyo a la gestión","Contratación directa","Prestación de servicios profesionales y de apoyo a la gestión, o para la ejecución de trabajos artísticos que sólo puedan encomendarse a determinadas personas naturales;","PRESTAR SUS SERVICIOS COMO AUXILIAR ADMINISTRATIVO PARA OPERATIVIZAR LOS CENTROS DE CONECTIVIDAD CAMPESINA DE LA LOCALIDAD DE SUMAPAZ, DEL PROYECTO 1692","Inversión","Un Nuevo Contrato Social y Ambiental para la Bogotá del Siglo XXI",54,{"$f":"IF(ISERROR(VLOOKUP(K209,Proposito_programa!$C$2:$E$59,2,FALSE)),\" \",VLOOKUP(K209,Proposito_programa!$C$2:$E$59,2,FALSE))","v":"Transformación digital y gestión de TIC para un territorio inteligente"},{"$f":"IF(ISERROR(VLOOKUP(K209,Proposito_programa!$C$2:$E$59,3,FALSE)),\" \",VLOOKUP(K209,Proposito_programa!$C$2:$E$59,3,FALSE))","v":"Propósito 5: Construir Bogotá - Región con gobierno abierto, transparente y ciudadanía consciente"},1692,null,1022965898,"NESTOR VILLALBA BAQUERO","CLARA LEONOR CABRERA","ADRIANA LUCIA MARTIN PALACIOS","Persona Natural",null,null,null,13000000,null,null,null,13000000,22800000,"2021-08-20","2021-08-24","2022-01-23",152,null,null,null,null,null,null,null,"X",null,null,1.7538461538461538]
["CPS-178-2021",2021,"FDRS-CD-156-2021","https://community.secop.gov.co/Public/Tendering/OpportunityDetail/Index?noticeUID=CO1.NTC.2187435&isFromPublicArea=True&isModal=False","Contratos de prestación de servicios profesionales y de apoyo a la gestión","Contratación directa","Prestación de servicios profesionales y de apoyo a la gestión, o para la ejecución de trabajos artísticos que sólo puedan encomendarse a determinadas personas naturales;","PRESTAR SUS SERVICIOS COMO AUXILIAR ADMINISTRATIVO PARA OPERATIVIZAR LOS CENTROS DE CONECTIVIDAD CAMPESINA DE LA LOCALIDAD DE SUMAPAZ, DEL PROYECTO 1692","Inversión","Un Nuevo Contrato Social y Ambiental para la Bogotá del Siglo XXI",54,{"$f":"IF(ISERROR(VLOOKUP(K210,Proposito_programa!$C$2:$E$59,2,FALSE)),\" \",VLOOKUP(K210,Proposito_programa!$C$2:$E$59,2,FALSE))","v":"Transformación digital y gestión de TIC para un territorio inteligente"},{"$f":"IF(ISERROR(VLOOKUP(K210,Proposito_programa!$C$2:$E$59,3,FALSE)),\" \",VLOOKUP(K210,Proposito_programa!$C$2:$E$59,3,FALSE))","v":"Propósito 5: Construir Bogotá - Región con gobierno abierto, transparente y ciudadanía consciente"},1692,null,1023022723,"YURI ALEJANDRA MOLINA GARCIA","EMPRESA DE \nTELECOMUNICACIONES DE BOGOTÁ S.A ESP","LUIS GABRIEL RINCON RODRIGUEZ ","Persona Natural",null,null,null,13000000,null,null,null,13000000,5400000,"2021-08-20","2021-08-24","2022-01-23",152,null,null,null,null,null,null,null,"X",null,null,0.41538461538461541]
["CPS-179-2021",2021,"FDRS-CD-156-2021","https://community.secop.gov.co/Public/Tendering/OpportunityDetail/Index?noticeUID=CO1.NTC.2187435&isFromPublicArea=True&isModal=False","Contratos de prestación de servicios profesionales y de apoyo a la gestión","Contratación directa","Prestación de servicios profesionales y de apoyo a la gestión, o para la ejecución de trabajos artísticos que sólo puedan encomendarse a determinadas personas naturales;","PRESTAR SUS SERVICIOS COMO AUXILIAR ADMINISTRATIVO PARA OPERATIVIZAR LOS CENTROS DE CONECTIVIDAD CAMPESINA DE LA LOCALIDAD DE SUMAPAZ, DEL PROYECTO 1692","Inversión","Un Nuevo Contrato Social y Ambiental para la Bogotá del Siglo XXI",54,{"$f":"IF(ISERROR(VLOOKUP(K211,Proposito_programa!$C$2:$E$59,2,FALSE)),\" \",VLOOKUP(K211,Proposito_programa!$C$2:$E$59,2,FALSE))","v":"Transformación digital y gestión de TIC para un territorio inteligente"},{"$f":"IF(ISERROR(VLOOKUP(K211,Proposito_programa!$C$2:$E$59,3,FALSE)),\" \",VLOOKUP(K211,Proposito_programa!$C$2:$E$59,3,FALSE))","v":"Propósito 5: Construir Bogotá - Región con gobierno abierto, transparente y ciudadanía consciente"},1692,null,1023001200,"GLORIA YINET RIVEROS",null,"HELBERTH ENRIQUE BALLESTAS BARRIOS","Persona Natural",null,null,null,13000000,null,null,null,13000000,20350000,"2021-08-20","2021-08-24","2022-01-23",152,null,null,null,null,null,null,null,"X",null,null,1.5653846153846154]
["CPS-180-2021",2021,"FDRS-CD-156-2021","https://community.secop.gov.co/Public/Tendering/OpportunityDetail/Index?noticeUID=CO1.NTC.2187435&isFromPublicArea=True&isModal=False","Contratos de prestación de servicios profesionales y de apoyo a la gestión","Contratación directa","Prestación de servicios profesionales y de apoyo a la gestión, o para la ejecución de trabajos artísticos que sólo puedan encomendarse a determinadas personas naturales;","PRESTAR SUS SERVICIOS COMO AUXILIAR ADMINISTRATIVO PARA OPERATIVIZAR LOS CENTROS DE CONECTIVIDAD CAMPESINA DE LA LOCALIDAD DE SUMAPAZ, DEL PROYECTO 1692","Inversión","Un Nuevo Contrato Social y Ambiental para la Bogotá del Siglo XXI",54,{"$f":"IF(ISERROR(VLOOKUP(K212,Proposito_programa!$C$2:$E$59,2,FALSE)),\" \",VLOOKUP(K212,Proposito_programa!$C$2:$E$59,2,FALSE))","v":"Transformación digital y gestión de TIC para un territorio inteligente"},{"$f":"IF(ISERROR(VLOOKUP(K212,Proposito_programa!$C$2:$E$59,3,FALSE)),\" \",VLOOKUP(K212,Proposito_programa!$C$2:$E$59,3,FALSE))","v":"Propósito 5: Construir Bogotá - Región con gobierno abierto, transparente y ciudadanía consciente"},1692,null,53054010,"MARIA CRISTINA BARBOSA DIAZ ","HYUNDAUTOS SAS","KAREN NATALIA NEIRA BAUTISTA","Persona Natural",null,null,null,13000000,null,null,null,13000000,8700000,"2021-08-20","2021-08-24","2022-01-23",152,null,null,null,null,null,null,null,"X",null,null,0.66923076923076918]
["CPS-181-2021",2021,"FDRS-CD-157-2021","https://community.secop.gov.co/Public/Tendering/OpportunityDetail/Index?noticeUID=CO1.NTC.2187512&isFromPublicArea=True&isModal=False","Contratos de prestación de servicios profesionales y de apoyo a la gestión","Contratación directa","Prestación de servicios profesionales y de apoyo a la gestión, o para la ejecución de trabajos artísticos que sólo puedan encomendarse a determinadas personas naturales;","PRESTAR SUS SERVICIOS PROFESIONALES PARA APOYAR LA EJECUCIÓN DEL PROYECTO REVITALIZACIÓN Y TRANSFORMACIÓN PRODUCTIVA EN LA LOCALIDAD DE SUMAPAZ, EN LA META DE EMPLEO LOCAL","Inversión","Un Nuevo Contrato Social y Ambiental para la Bogotá del Siglo XXI",6,{"$f":"IF(ISERROR(VLOOKUP(K213,Proposito_programa!$C$2:$E$59,2,FALSE)),\" \",VLOOKUP(K213,Proposito_programa!$C$2:$E$59,2,FALSE))","v":"Sistema Distrital de Cuidado"},{"$f":"IF(ISERROR(VLOOKUP(K213,Proposito_programa!$C$2:$E$59,3,FALSE)),\" \",VLOOKUP(K213,Proposito_programa!$C$2:$E$59,3,FALSE))","v":"Propósito 1: Hacer un nuevo contrato social para incrementar la inclusión social, productiva y política"},1637,null,35425308,"DIANA MARCELA CIFUENTES DIAZ","FUNDACIÓN JUNTOS POR UN PAÍS","YASMIN ANDREA CIFUENTES","Persona Natural",null,null,null,27200000,null,null,null,27200000,20716666,"2021-08-20","2021-08-20","2021-12-19",121,null,null,null,null,null,null,null,null,"X",null,0.7616421323529412]
["CPS-183-2021",2021,"FDRS-CD-158-2021","https://community.secop.gov.co/Public/Tendering/OpportunityDetail/Index?noticeUID=CO1.NTC.2204526&isFromPublicArea=True&isModal=False","Contratos de prestación de servicios profesionales y de apoyo a la gestión","Contratación directa","Prestación de servicios profesionales y de apoyo a la gestión, o para la ejecución de trabajos artísticos que sólo puedan encomendarse a determinadas personas naturales;","PRESTAR LOS SERVICIOS PROFESIONALES PARA EL FORTALECIMIENTO DE PROCESOS DE RECONVERSIÓN Y TRANSFORMACIÓN DE INICIATIVAS AGROINDUSTRIALES DEL SECTOR AGROALIMENTARIO, EN LA LOCALIDAD DE SUMAPAZ","Inversión","Un Nuevo Contrato Social y Ambiental para la Bogotá del Siglo XXI",6,{"$f":"IF(ISERROR(VLOOKUP(K214,Proposito_programa!$C$2:$E$59,2,FALSE)),\" \",VLOOKUP(K214,Proposito_programa!$C$2:$E$59,2,FALSE))","v":"Sistema Distrital de Cuidado"},{"$f":"IF(ISERROR(VLOOKUP(K214,Proposito_programa!$C$2:$E$59,3,FALSE)),\" \",VLOOKUP(K214,Proposito_programa!$C$2:$E$59,3,FALSE))","v":"Propósito 1: Hacer un nuevo contrato social para incrementar la inclusión social, productiva y política"},1637,null,38246402,"PIEDAD CONSTANZA CIRO BASTO","NESTOR VILLALBA BAQUERO","NORBEY DANILO MARTINEZ MORALES\n- CEDIDO A \nDANIEL FERNANDO TUSSO CORTES","Persona Natural",null,null,null,22000000,null,null,null,22000000,9186667,"2021-08-27","2021-08-27","2021-12-26",121,null,null,null,null,null,null,null,null,"X",null,0.41757577272727275]
["CPS-182-2021",2021,"FDRS-MC-155-2021","https://community.secop.gov.co/Public/Tendering/OpportunityDetail/Index?noticeUID=CO1.NTC.2168930&isFromPublicArea=True&isModal=False","Contratos de prestación de servicios","Contratación mínima cuantia","No aplica","PRESTAR LOS SERVICIOS LOGÍSTICOS PARA LA REALIZACIÓN DE LAS ACTIVIDADES REQUERIDAS QUE PERMITAN LLEVAR A CABO LA FASE II DE PRESUPUESTOS PARTICIPATIVOS - VIGENCIA 2022, DE LA LOCALIDAD DE SUMAPAZ","Inversión","Un Nuevo Contrato Social y Ambiental para la Bogotá del Siglo XXI",55,{"$f":"IF(ISERROR(VLOOKUP(K215,Proposito_programa!$C$2:$E$59,2,FALSE)),\" \",VLOOKUP(K215,Proposito_programa!$C$2:$E$59,2,FALSE))","v":"Fortalecimiento de cultura ciudadana y su institucionalidad"},{"$f":"IF(ISERROR(VLOOKUP(K215,Proposito_programa!$C$2:$E$59,3,FALSE)),\" \",VLOOKUP(K215,Proposito_programa!$C$2:$E$59,3,FALSE))","v":"Propósito 5: Construir Bogotá - Región con gobierno abierto, transparente y ciudadanía consciente"},1691,3,900693354,"FUNDACION JUNTOS POR UN PAIS","YURI ALEJANDRA MOLINA GARCIA","JHON EDISSON PARDO HERREÑO","Persona Jurídica",null,null,null,16172727,null,1,8086363,{"$f":"+X215+Y215+AA215","v":24259090},6846667,"2021-08-25","2021-08-31","2021-12-30",121,1,30,null,null,null,null,null,null,"X",null,0.28223099052767436]
["CPS-184-2021",2021,"FDRS-CD-159-2021","https://community.secop.gov.co/Public/Tendering/OpportunityDetail/Index?noticeUID=CO1.NTC.2209866&isFromPublicArea=True&isModal=False","Contratos de prestación de servicios profesionales y de apoyo a la gestión","Contratación directa","Prestación de servicios profesionales y de apoyo a la gestión, o para la ejecución de trabajos artísticos que sólo puedan encomendarse a determinadas personas naturales;","PRESTAR LOS SERVICIOS PROFESIONALES AL ÁREA DE GESTIÓN DE DESARROLLO LOCAL PARA APOYAR LA PLANEACIÓN, EJECUCIÓN Y SEGUIMIENTO DEL PROYECTO DE INVERSIÓN 1589","Inversión","Un Nuevo Contrato Social y Ambiental para la Bogotá del Siglo XXI",19,{"$f":"IF(ISERROR(VLOOKUP(K216,Proposito_programa!$C$2:$E$59,2,FALSE)),\" \",VLOOKUP(K216,Proposito_programa!$C$2:$E$59,2,FALSE))","v":"Vivienda y entornos dignos en el territorio urbano y rural"},{"$f":"IF(ISERROR(VLOOKUP(K216,Proposito_programa!$C$2:$E$59,3,FALSE)),\" \",VLOOKUP(K216,Proposito_programa!$C$2:$E$59,3,FALSE))","v":"Propósito 1: Hacer un nuevo contrato social para incrementar la inclusión social, productiva y política"},1589,null,19314816,"CARLOS EMILIANO ROMERO PUENTES","GLORIA YINET RIVEROS","DANIELLA ZABALA AVELLA","Persona Natural",null,null,null,27500000,null,null,null,27500000,13016666,"2021-08-30","2021-08-31","2022-01-30",152,null,null,null,null,null,null,null,"X",null,null,0.47333330909090909]
["CPS-185-2021",2021,"FDRS-CD-160-2021","https://community.secop.gov.co/Public/Tendering/OpportunityDetail/Index?noticeUID=CO1.NTC.2212178&isFromPublicArea=True&isModal=False","Contratos de prestación de servicios profesionales y de apoyo a la gestión","Contratación directa","Prestación de servicios profesionales y de apoyo a la gestión, o para la ejecución de trabajos artísticos que sólo puedan encomendarse a determinadas personas naturales;","PRESTAR SUS SERVICIOS PROFESIONALES PARA APOYAR LOS TEMAS SOCIALES RELACIONADOS CON LA META DE EMPLEO LOCAL DE LA ALCALDÍA LOCAL DE SUMAPAZ","Inversión","Un Nuevo Contrato Social y Ambiental para la Bogotá del Siglo XXI",6,{"$f":"IF(ISERROR(VLOOKUP(K217,Proposito_programa!$C$2:$E$59,2,FALSE)),\" \",VLOOKUP(K217,Proposito_programa!$C$2:$E$59,2,FALSE))","v":"Sistema Distrital de Cuidado"},{"$f":"IF(ISERROR(VLOOKUP(K217,Proposito_programa!$C$2:$E$59,3,FALSE)),\" \",VLOOKUP(K217,Proposito_programa!$C$2:$E$59,3,FALSE))","v":"Propósito 1: Hacer un nuevo contrato social para incrementar la inclusión social, productiva y política"},1637,null,52099210,"CLAUDIA YAMILE CARREÑO QUIJANO","MARIA CRISTINA BARBOSA DIAZ ","KAREN NAYIBE MARTINEZ MOLINA","Persona Natural",null,null,null,28500000,null,null,null,28500000,10767000,"2021-08-31","2021-09-01","2022-01-31",152,null,null,null,null,null,null,null,"X",null,null,0.37778947368421051]
["CPS-186-2021",2021,"FDRS-CD-161-2021","https://community.secop.gov.co/Public/Tendering/OpportunityDetail/Index?noticeUID=CO1.NTC.2213544&isFromPublicArea=True&isModal=False","Contratos de prestación de servicios profesionales y de apoyo a la gestión","Contratación directa","Prestación de servicios profesionales y de apoyo a la gestión, o para la ejecución de trabajos artísticos que sólo puedan encomendarse a determinadas personas naturales;","PRESTAR SUS SERVICIOS COMO AUXILIAR ADMINISTRATIVO PARA OPERATIVIZAR LOS CENTROS DE CONECTIVIDAD CAMPESINA DE LA LOCALIDAD DE SUMAPAZ, DEL PROYECTO 1692","Inversión","Un Nuevo Contrato Social y Ambiental para la Bogotá del Siglo XXI",54,{"$f":"IF(ISERROR(VLOOKUP(K218,Proposito_programa!$C$2:$E$59,2,FALSE)),\" \",VLOOKUP(K218,Proposito_programa!$C$2:$E$59,2,FALSE))","v":"Transformación digital y gestión de TIC para un territorio inteligente"},{"$f":"IF(ISERROR(VLOOKUP(K218,Proposito_programa!$C$2:$E$59,3,FALSE)),\" \",VLOOKUP(K218,Proposito_programa!$C$2:$E$59,3,FALSE))","v":"Propósito 5: Construir Bogotá - Región con gobierno abierto, transparente y ciudadanía consciente"},1692,null,1007297824,"ADRIANA LUCIA MARTIN PALACIOS","DIANA MARCELA CIFUENTES DIAZ","HYUNDAUTOS SAS","Persona Natural",null,null,null,7200000,null,null,null,7200000,12650000,"2021-08-31","2021-09-01","2021-12-31",121,null,null,null,null,null,null,null,"X",null,null,1.7569444444444444]
["CPS-188-2021",2021,"FDRS-CD-163-2021","https://community.secop.gov.co/Public/Tendering/OpportunityDetail/Index?noticeUID=CO1.NTC.2239416&isFromPublicArea=True&isModal=False","Contratos de prestación de servicios profesionales y de apoyo a la gestión","Contratación directa","Prestación de servicios profesionales y de apoyo a la gestión, o para la ejecución de trabajos artísticos que sólo puedan encomendarse a determinadas personas naturales;","PRESTAR LOS SERVICIOS PROFESIONALES PARA ORIENTAR JURÍDICAMENTE A LAS VÍCTIMAS DEL CONFLICTO ARMADO DE LA LOCALIDAD DE SUMAPAZ EN EL MARCO DEL SIVJRNR","Inversión","Un Nuevo Contrato Social y Ambiental para la Bogotá del Siglo XXI",39,{"$f":"IF(ISERROR(VLOOKUP(K219,Proposito_programa!$C$2:$E$59,2,FALSE)),\" \",VLOOKUP(K219,Proposito_programa!$C$2:$E$59,2,FALSE))","v":"Bogotá territorio de paz y atención integral a las víctimas del conflicto armado"},{"$f":"IF(ISERROR(VLOOKUP(K219,Proposito_programa!$C$2:$E$59,3,FALSE)),\" \",VLOOKUP(K219,Proposito_programa!$C$2:$E$59,3,FALSE))","v":"Propósito 3: Inspirar confianza y legitimidad para vivir sin miedo y ser epicentro de cultura ciudadana, paz y reconciliación"},1672,null,79705458,"LUIS GABRIEL RINCON RODRIGUEZ ",null,null,"Persona Natural",null,null,null,22000000,null,null,null,22000000,null,"2021-09-10","2021-09-10","2022-01-09",121,null,null,null,null,null,null,null,"X",null,null,0]
["CPS-189-2021",2021,"FDRS-CD-164-2021","https://community.secop.gov.co/Public/Tendering/OpportunityDetail/Index?noticeUID=CO1.NTC.2220034&isFromPublicArea=True&isModal=False","Contratos de prestación de servicios profesionales y de apoyo a la gestión","Contratación directa","Prestación de servicios profesionales y de apoyo a la gestión, o para la ejecución de trabajos artísticos que sólo puedan encomendarse a determinadas personas naturales;","PRESTAR SUS SERVICIOS ARTÍSTICOS Y MUSICALES PARA APOYAR LA GESTIÓN CULTURAL DE LA LOCALIDAD DE SUMAPAZ","Inversión","Un Nuevo Contrato Social y Ambiental para la Bogotá del Siglo XXI",21,{"$f":"IF(ISERROR(VLOOKUP(K220,Proposito_programa!$C$2:$E$59,2,FALSE)),\" \",VLOOKUP(K220,Proposito_programa!$C$2:$E$59,2,FALSE))","v":"Creación y vida cotidiana: Apropiación ciudadana del arte, la cultura y el patrimonio, para la democracia cultural"},{"$f":"IF(ISERROR(VLOOKUP(K220,Proposito_programa!$C$2:$E$59,3,FALSE)),\" \",VLOOKUP(K220,Proposito_programa!$C$2:$E$59,3,FALSE))","v":"Propósito 1: Hacer un nuevo contrato social para incrementar la inclusión social, productiva y política"},1633,null,11336536,"HELBERTH ENRIQUE BALLESTAS BARRIOS",null,null,"Persona Natural",null,null,null,18000000,null,null,null,18000000,null,"2021-09-02","2021-09-03","2022-01-02",121,null,null,null,null,null,null,null,"X",null,null,0]
["CPS-190-2021",2021,"FDRS-CD-165-2021","https://community.secop.gov.co/Public/Tendering/OpportunityDetail/Index?noticeUID=CO1.NTC.2228920&isFromPublicArea=True&isModal=False","Contratos de prestación de servicios profesionales y de apoyo a la gestión","Contratación directa","Prestación de servicios profesionales y de apoyo a la gestión, o para la ejecución de trabajos artísticos que sólo puedan encomendarse a determinadas personas naturales;","PRESTAR LOS SERVICIOS PROFESIONALES PARA LA ORIENTACIÓN, FORMULACIÓN, ESTRUCTURACIÓN Y PUESTA EN MARCHA DE INICIATIVAS \nPRODUCTIVAS EN FAVOR DE LAS VÍCTIMAS DEL CONFLICTO ARMADO, RECONOCIDAS Y NO RECONOCIDAS DE LA LOCALIDAD DE SUMAPAZ","Inversión","Un Nuevo Contrato Social y Ambiental para la Bogotá del Siglo XXI",39,{"$f":"IF(ISERROR(VLOOKUP(K221,Proposito_programa!$C$2:$E$59,2,FALSE)),\" \",VLOOKUP(K221,Proposito_programa!$C$2:$E$59,2,FALSE))","v":"Bogotá territorio de paz y atención integral a las víctimas del conflicto armado"},{"$f":"IF(ISERROR(VLOOKUP(K221,Proposito_programa!$C$2:$E$59,3,FALSE)),\" \",VLOOKUP(K221,Proposito_programa!$C$2:$E$59,3,FALSE))","v":"Propósito 3: Inspirar confianza y legitimidad para vivir sin miedo y ser epicentro de cultura ciudadana, paz y reconciliación"},1672,null,1014256316,"KAREN NATALIA NEIRA BAUTISTA",null,null,"Persona Natural",null,null,null,22000000,null,null,null,22000000,null,"2021-09-06","2021-09-08","2022-01-07",121,null,null,null,null,null,null,null,"X",null,null,0]
["CPS-191-2021",2021,"FDRS-CD-166-2021","https://community.secop.gov.co/Public/Tendering/OpportunityDetail/Index?noticeUID=CO1.NTC.2245340&isFromPublicArea=True&isModal=False","Contratos de prestación de servicios profesionales y de apoyo a la gestión","Contratación directa","Prestación de servicios profesionales y de apoyo a la gestión, o para la ejecución de trabajos artísticos que sólo puedan encomendarse a determinadas personas naturales;","PRESTAR LOS SERVICIOS COMO AUXILIAR ADMINISTRATIVO EN LA EJECUCIÓN DEL PROYECTO 1587 DE LA ALCALDÍA LOCAL DE SUMAPAZ","Inversión","Un Nuevo Contrato Social y Ambiental para la Bogotá del Siglo XXI",18,{"$f":"IF(ISERROR(VLOOKUP(K222,Proposito_programa!$C$2:$E$59,2,FALSE)),\" \",VLOOKUP(K222,Proposito_programa!$C$2:$E$59,2,FALSE))","v":"Cierre de brechas para la inclusión productiva urbano rural"},{"$f":"IF(ISERROR(VLOOKUP(K222,Proposito_programa!$C$2:$E$59,3,FALSE)),\" \",VLOOKUP(K222,Proposito_programa!$C$2:$E$59,3,FALSE))","v":"Propósito 1: Hacer un nuevo contrato social para incrementar la inclusión social, productiva y política"},1587,null,20645897,"YASMIN ANDREA CIFUENTES",null,null,"Persona Natural",null,null,null,10400000,null,null,null,10400000,null,"2021-09-13","2021-09-15","2022-01-14",121,null,null,null,null,null,null,null,"X",null,null,0]
["CPS-192-2021",2021,"FDRS-CD-166-2021","https://community.secop.gov.co/Public/Tendering/OpportunityDetail/Index?noticeUID=CO1.NTC.2245340&isFromPublicArea=True&isModal=False","Contratos de prestación de servicios profesionales y de apoyo a la gestión","Contratación directa","Prestación de servicios profesionales y de apoyo a la gestión, o para la ejecución de trabajos artísticos que sólo puedan encomendarse a determinadas personas naturales;","PRESTAR LOS SERVICIOS COMO AUXILIAR ADMINISTRATIVO EN LA EJECUCIÓN DEL PROYECTO 1587 DE LA ALCALDÍA LOCAL DE SUMAPAZ","Inversión","Un Nuevo Contrato Social y Ambiental para la Bogotá del Siglo XXI",18,{"$f":"IF(ISERROR(VLOOKUP(K223,Proposito_programa!$C$2:$E$59,2,FALSE)),\" \",VLOOKUP(K223,Proposito_programa!$C$2:$E$59,2,FALSE))","v":"Cierre de brechas para la inclusión productiva urbano rural"},{"$f":"IF(ISERROR(VLOOKUP(K223,Proposito_programa!$C$2:$E$59,3,FALSE)),\" \",VLOOKUP(K223,Proposito_programa!$C$2:$E$59,3,FALSE))","v":"Propósito 1: Hacer un nuevo contrato social para incrementar la inclusión social, productiva y política"},1587,null,1072896239,"NORBEY DANILO MARTINEZ MORALES\n",null,null,"Persona Natural",null,null,null,10400000,null,null,null,10400000,null,"2021-09-13","2021-09-15","2022-01-14",121,null,null,80161199,"DANIEL FERNANDO TUSSO CORTES","2021-10-28",6673334,null,"X",null,null,0]
["CPS-193-2021",2021,"FDRS-CD-167-2021","https://community.secop.gov.co/Public/Tendering/OpportunityDetail/Index?noticeUID=CO1.NTC.2253759&isFromPublicArea=True&isModal=False","Contratos de prestación de servicios profesionales y de apoyo a la gestión","Contratación directa","Prestación de servicios profesionales y de apoyo a la gestión, o para la ejecución de trabajos artísticos que sólo puedan encomendarse a determinadas personas naturales;","PRESTAR LOS SERVICIOS PROFESIONALES PARA APOYAR LA EJECUCIÓN DE LA META “ATENDER A 150 PERSONAS EN ESTRATEGIAS DE ACCESO A LA JUSTICIA INTEGRAL EN LA CIUDAD” DEL PROYECTO 1683 DE LA ALCALDÍA LOCAL DE SUMAPAZ","Inversión","Un Nuevo Contrato Social y Ambiental para la Bogotá del Siglo XXI",48,{"$f":"IF(ISERROR(VLOOKUP(K224,Proposito_programa!$C$2:$E$59,2,FALSE)),\" \",VLOOKUP(K224,Proposito_programa!$C$2:$E$59,2,FALSE))","v":"Plataforma institucional para la seguridad y justicia"},{"$f":"IF(ISERROR(VLOOKUP(K224,Proposito_programa!$C$2:$E$59,3,FALSE)),\" \",VLOOKUP(K224,Proposito_programa!$C$2:$E$59,3,FALSE))","v":"Propósito 3: Inspirar confianza y legitimidad para vivir sin miedo y ser epicentro de cultura ciudadana, paz y reconciliación"},1683,null,13706284,"JHON EDISSON PARDO HERREÑO",null,null,"Persona Natural",null,null,null,22000000,null,null,null,22000000,null,"2021-09-16","2021-09-20","2022-01-19",121,null,null,null,null,null,null,null,"X",null,null,0]
["CPS-194-2021",2021,"FDRS-CD-168-2021","https://community.secop.gov.co/Public/Tendering/OpportunityDetail/Index?noticeUID=CO1.NTC.2253596&isFromPublicArea=True&isModal=False","Contratos de prestación de servicios profesionales y de apoyo a la gestión","Contratación directa","Prestación de servicios profesionales y de apoyo a la gestión, o para la ejecución de trabajos artísticos que sólo puedan encomendarse a determinadas personas naturales;","PRESTAR LOS SERVICIOS PROFESIONALES AL ÁREA DE GESTIÓN DE DESARROLLO LOCAL PARA ORIENTAR A LOS BENEFICIARIOS DEL MEJORAMIENTO HABITACIONAL Y SANEAMIENTO PREDIAL EN EL MARCO DEL PROYECTO DE INVERSIÓN 1589","Inversión","Un Nuevo Contrato Social y Ambiental para la Bogotá del Siglo XXI",19,{"$f":"IF(ISERROR(VLOOKUP(K225,Proposito_programa!$C$2:$E$59,2,FALSE)),\" \",VLOOKUP(K225,Proposito_programa!$C$2:$E$59,2,FALSE))","v":"Vivienda y entornos dignos en el territorio urbano y rural"},{"$f":"IF(ISERROR(VLOOKUP(K225,Proposito_programa!$C$2:$E$59,3,FALSE)),\" \",VLOOKUP(K225,Proposito_programa!$C$2:$E$59,3,FALSE))","v":"Propósito 1: Hacer un nuevo contrato social para incrementar la inclusión social, productiva y política"},1589,null,1018477511,"DANIELLA ZABALA AVELLA",null,null,"Persona Natural",null,null,null,13095000,null,null,null,13095000,null,"2021-09-16","2021-09-17","2021-12-16",90,null,null,null,null,null,null,null,null,"X",null,0]
["CPS-195-2021",2021,"FDRS-CD-169-2021","https://community.secop.gov.co/Public/Tendering/OpportunityDetail/Index?noticeUID=CO1.NTC.2263148&isFromPublicArea=True&isModal=False","Contratos de prestación de servicios profesionales y de apoyo a la gestión","Contratación directa","Prestación de servicios profesionales y de apoyo a la gestión, o para la ejecución de trabajos artísticos que sólo puedan encomendarse a determinadas personas naturales;","PRESTAR LOS SERVICIOS PROFESIONALES PARA APOYAR LA EJECUCIÓN DE LA META ATENDER A 200 PERSONAS EN ESTRATEGIAS DE ACCESO A LA JUSTICIA INTEGRAL EN LA CIUDAD DEL PROYECTO 1683 DE LA ALCALDÍA LOCAL DE SUMAPAZ","Inversión","Un Nuevo Contrato Social y Ambiental para la Bogotá del Siglo XXI",48,{"$f":"IF(ISERROR(VLOOKUP(K226,Proposito_programa!$C$2:$E$59,2,FALSE)),\" \",VLOOKUP(K226,Proposito_programa!$C$2:$E$59,2,FALSE))","v":"Plataforma institucional para la seguridad y justicia"},{"$f":"IF(ISERROR(VLOOKUP(K226,Proposito_programa!$C$2:$E$59,3,FALSE)),\" \",VLOOKUP(K226,Proposito_programa!$C$2:$E$59,3,FALSE))","v":"Propósito 3: Inspirar confianza y legitimidad para vivir sin miedo y ser epicentro de cultura ciudadana, paz y reconciliación"},1683,null,1023029369,"KAREN NAYIBE MARTINEZ MOLINA",null,null,"Persona Natural",null,null,null,22000000,null,null,null,22000000,null,"2021-09-21","2021-09-22","2022-01-21",121,null,null,null,null,null,null,null,"X",null,null,0]
["CPS-196-2022",2021,"FDRS-SAMC-154-2021.","https://community.secop.gov.co/Public/Tendering/OpportunityDetail/Index?noticeUID=CO1.NTC.2214345&isFromPublicArea=True&isModal=False","Contratos de prestación de servicios","Selección abreviada","Selección abreviada por menor cuantía ","PRESTAR EL SERVICIO DE MANTENIMIENTO PREVENTIVO Y CORRECTIVO DE LOS VEHÍCULOS LIVIANOS DE PROPIEDAD, GUARDA O TENENCIA DEL FONDO DE DESARROLLO RURAL DE SUMAPAZ CON SUMINISTRO DE REPUESTOS, LLANTAS, INSUMOS Y MANO DE OBRA","Funcionamiento","Un Nuevo Contrato Social y Ambiental para la Bogotá del Siglo XXI","No aplica",null,null,null,7,830070987,"HYUNDAUTOS SAS",null,null,"Persona Jurídica",null,null,null,126627859,null,null,null,126627859,null,"2021-09-23","2021-09-28","2022-04-27",211,null,null,null,null,null,null,null,"X",null,null,0]
["CPS-197-2021",2021,"FDRS-CD-170-2021","https://community.secop.gov.co/Public/Tendering/OpportunityDetail/Index?noticeUID=CO1.NTC.2279942&isFromPublicArea=True&isModal=False","Contratos de prestación de servicios profesionales y de apoyo a la gestión","Contratación directa","Prestación de servicios profesionales y de apoyo a la gestión, o para la ejecución de trabajos artísticos que sólo puedan encomendarse a determinadas personas naturales;","PRESTAR LOS SERVICIOS PROFESIONALES PARA ORIENTAR JURÍDICAMENTE A LAS VÍCTIMAS DEL CONFLICTO ARMADO DE LA LOCALIDAD DE SUMAPAZ EN EL MARCO DEL SIVJRNR","Inversión","Un Nuevo Contrato Social y Ambiental para la Bogotá del Siglo XXI",39,{"$f":"IF(ISERROR(VLOOKUP(K228,Proposito_programa!$C$2:$E$59,2,FALSE)),\" \",VLOOKUP(K228,Proposito_programa!$C$2:$E$59,2,FALSE))","v":"Bogotá territorio de paz y atención integral a las víctimas del conflicto armado"},{"$f":"IF(ISERROR(VLOOKUP(K228,Proposito_programa!$C$2:$E$59,3,FALSE)),\" \",VLOOKUP(K228,Proposito_programa!$C$2:$E$59,3,FALSE))","v":"Propósito 3: Inspirar confianza y legitimidad para vivir sin miedo y ser epicentro de cultura ciudadana, paz y reconciliación"},1672,null,1030609055,"CARLOS ANDRES AMEZQUITA ANGULO",null,null,"Persona Natural",null,null,null,16500000,null,null,null,16500000,null,"2021-09-28","2021-09-29","2021-12-28",90,null,null,null,null,null,null,null,null,"X",null,0]
["CPS-199-2021",2021,"FDRS-LP-149-2021","https://community.secop.gov.co/Public/Tendering/OpportunityDetail/Index?noticeUID=CO1.NTC.2200801&isFromPublicArea=True&isModal=False","Contratos de prestación de servicios","Licitación pública","No aplica","PRESTAR EL SERVICIO DE EMPLEABILIDAD PARA EL DESARROLLO DE LAS ACTIVIDADES EN MISIÓN DEL FONDO DE DESARROLLO RURAL DE SUMAPAZ","Inversión","Un Nuevo Contrato Social y Ambiental para la Bogotá del Siglo XXI",6,{"$f":"IF(ISERROR(VLOOKUP(K229,Proposito_programa!$C$2:$E$59,2,FALSE)),\" \",VLOOKUP(K229,Proposito_programa!$C$2:$E$59,2,FALSE))","v":"Sistema Distrital de Cuidado"},{"$f":"IF(ISERROR(VLOOKUP(K229,Proposito_programa!$C$2:$E$59,3,FALSE)),\" \",VLOOKUP(K229,Proposito_programa!$C$2:$E$59,3,FALSE))","v":"Propósito 1: Hacer un nuevo contrato social para incrementar la inclusión social, productiva y política"},1637,2,901023218,"HQ5 SAS",null,null,"Persona Jurídica",null,null,null,4356000000,null,1,648200000,5004200000,null,"2021-09-30","2021-10-04","2022-04-03",181,null,null,null,null,null,null,null,"X"]
["CPS-199-2021",2021,"FDRS-LP-149-2021","https://community.secop.gov.co/Public/Tendering/OpportunityDetail/Index?noticeUID=CO1.NTC.2200801&isFromPublicArea=True&isModal=False","Contratos de prestación de servicios","Licitación pública","No aplica","PRESTAR EL SERVICIO DE EMPLEABILIDAD PARA EL DESARROLLO DE LAS ACTIVIDADES EN MISIÓN DEL FONDO DE DESARROLLO RURAL DE SUMAPAZ","Inversión","Un Nuevo Contrato Social y Ambiental para la Bogotá del Siglo XXI",6,{"$f":"IF(ISERROR(VLOOKUP(K230,Proposito_programa!$C$2:$E$59,2,FALSE)),\" \",VLOOKUP(K230,Proposito_programa!$C$2:$E$59,2,FALSE))","v":"Sistema Distrital de Cuidado"},{"$f":"IF(ISERROR(VLOOKUP(K230,Proposito_programa!$C$2:$E$59,3,FALSE)),\" \",VLOOKUP(K230,Proposito_programa!$C$2:$E$59,3,FALSE))","v":"Propósito 1: Hacer un nuevo contrato social para incrementar la inclusión social, productiva y política"},1641,2,901023218,"HQ5 SAS",null,null,"Persona Jurídica",null,null,null,450000000,null,null,null,450000000,null,"2021-09-30","2021-10-04","2022-04-03",181,null,null,null,null,null,null,null,"X"]
["CPS-199-2021",2021,"FDRS-LP-149-2021","https://community.secop.gov.co/Public/Tendering/OpportunityDetail/Index?noticeUID=CO1.NTC.2200801&isFromPublicArea=True&isModal=False","Contratos de prestación de servicios","Licitación pública","No aplica","PRESTAR EL SERVICIO DE EMPLEABILIDAD PARA EL DESARROLLO DE LAS ACTIVIDADES EN MISIÓN DEL FONDO DE DESARROLLO RURAL DE SUMAPAZ","Inversión","Un Nuevo Contrato Social y Ambiental para la Bogotá del Siglo XXI",20,{"$f":"IF(ISERROR(VLOOKUP(K231,Proposito_programa!$C$2:$E$59,2,FALSE)),\" \",VLOOKUP(K231,Proposito_programa!$C$2:$E$59,2,FALSE))","v":"Bogotá, referente en cultura, deporte, recreación y actividad física, con parques para el desarrollo y la salud"},{"$f":"IF(ISERROR(VLOOKUP(K231,Proposito_programa!$C$2:$E$59,3,FALSE)),\" \",VLOOKUP(K231,Proposito_programa!$C$2:$E$59,3,FALSE))","v":"Propósito 1: Hacer un nuevo contrato social para incrementar la inclusión social, productiva y política"},1590,2,901023218,"HQ5 SAS",null,null,"Persona Jurídica",null,null,null,245655830,null,null,null,245655830,null,"2021-09-30","2021-10-04","2022-04-03",181,null,null,null,null,null,null,null,"X"]
["CPS-199-2021",2021,"FDRS-LP-149-2021","https://community.secop.gov.co/Public/Tendering/OpportunityDetail/Index?noticeUID=CO1.NTC.2200801&isFromPublicArea=True&isModal=False","Contratos de prestación de servicios","Licitación pública","No aplica","PRESTAR EL SERVICIO DE EMPLEABILIDAD PARA EL DESARROLLO DE LAS ACTIVIDADES EN MISIÓN DEL FONDO DE DESARROLLO RURAL DE SUMAPAZ","Inversión","Un Nuevo Contrato Social y Ambiental para la Bogotá del Siglo XXI",28,{"$f":"IF(ISERROR(VLOOKUP(K232,Proposito_programa!$C$2:$E$59,2,FALSE)),\" \",VLOOKUP(K232,Proposito_programa!$C$2:$E$59,2,FALSE))","v":"Bogotá protectora de sus recursos naturales"},{"$f":"IF(ISERROR(VLOOKUP(K232,Proposito_programa!$C$2:$E$59,3,FALSE)),\" \",VLOOKUP(K232,Proposito_programa!$C$2:$E$59,3,FALSE))","v":"Propósito 2 : Cambiar Nuestros Hábitos de Vida para Reverdecer a Bogotá y Adaptarnos y Mitigar la Crisis Climática"},1648,2,901023218,"HQ5 SAS",null,null,"Persona Jurídica",null,null,null,48000000,null,null,null,48000000,null,"2021-09-30","2021-10-04","2022-04-03",181,null,null,null,null,null,null,null,"X"]
["CPS-199-2021",2021,"FDRS-LP-149-2021","https://community.secop.gov.co/Public/Tendering/OpportunityDetail/Index?noticeUID=CO1.NTC.2200801&isFromPublicArea=True&isModal=False","Contratos de prestación de servicios","Licitación pública","No aplica","PRESTAR EL SERVICIO DE EMPLEABILIDAD PARA EL DESARROLLO DE LAS ACTIVIDADES EN MISIÓN DEL FONDO DE DESARROLLO RURAL DE SUMAPAZ","Inversión","Un Nuevo Contrato Social y Ambiental para la Bogotá del Siglo XXI",28,{"$f":"IF(ISERROR(VLOOKUP(K233,Proposito_programa!$C$2:$E$59,2,FALSE)),\" \",VLOOKUP(K233,Proposito_programa!$C$2:$E$59,2,FALSE))","v":"Bogotá protectora de sus recursos naturales"},{"$f":"IF(ISERROR(VLOOKUP(K233,Proposito_programa!$C$2:$E$59,3,FALSE)),\" \",VLOOKUP(K233,Proposito_programa!$C$2:$E$59,3,FALSE))","v":"Propósito 2 : Cambiar Nuestros Hábitos de Vida para Reverdecer a Bogotá y Adaptarnos y Mitigar la Crisis Climática"},1651,2,901023218,"HQ5 SAS",null,null,"Persona Jurídica",null,null,null,96000000,null,null,null,96000000,null,"2021-09-30","2021-10-04","2022-04-03",181,null,null,null,null,null,null,null,"X"]
["CPS-199-2021",2021,"FDRS-LP-149-2021","https://community.secop.gov.co/Public/Tendering/OpportunityDetail/Index?noticeUID=CO1.NTC.2200801&isFromPublicArea=True&isModal=False","Contratos de prestación de servicios","Licitación pública","No aplica","PRESTAR EL SERVICIO DE EMPLEABILIDAD PARA EL DESARROLLO DE LAS ACTIVIDADES EN MISIÓN DEL FONDO DE DESARROLLO RURAL DE SUMAPAZ","Inversión","Un Nuevo Contrato Social y Ambiental para la Bogotá del Siglo XXI",30,{"$f":"IF(ISERROR(VLOOKUP(K234,Proposito_programa!$C$2:$E$59,2,FALSE)),\" \",VLOOKUP(K234,Proposito_programa!$C$2:$E$59,2,FALSE))","v":"Eficiencia en la atención de emergencias"},{"$f":"IF(ISERROR(VLOOKUP(K234,Proposito_programa!$C$2:$E$59,3,FALSE)),\" \",VLOOKUP(K234,Proposito_programa!$C$2:$E$59,3,FALSE))","v":"Propósito 2 : Cambiar Nuestros Hábitos de Vida para Reverdecer a Bogotá y Adaptarnos y Mitigar la Crisis Climática"},1652,2,901023218,"HQ5 SAS",null,null,"Persona Jurídica",null,null,null,48000000,null,null,null,48000000,null,"2021-09-30","2021-10-04","2022-04-03",181,null,null,null,null,null,null,null,"X"]
["CPS-200-2021",2021,"FDRS-CD-171-2021","https://community.secop.gov.co/Public/Tendering/OpportunityDetail/Index?noticeUID=CO1.NTC.2332071&isFromPublicArea=True&isModal=False","Contratos de prestación de servicios profesionales y de apoyo a la gestión","Contratación directa","Prestación de servicios profesionales y de apoyo a la gestión, o para la ejecución de trabajos artísticos que sólo puedan encomendarse a determinadas personas naturales;","PRESTAR LOS SERVICIOS PROFESIONALES PARA APOYAR LAS ACTIVIDADES DE RESTAURACIÓN ECOLÓGICA EN LA LOCALIDAD DE SUMAPAZ","Inversión","Un Nuevo Contrato Social y Ambiental para la Bogotá del Siglo XXI",28,{"$f":"IF(ISERROR(VLOOKUP(K235,Proposito_programa!$C$2:$E$59,2,FALSE)),\" \",VLOOKUP(K235,Proposito_programa!$C$2:$E$59,2,FALSE))","v":"Bogotá protectora de sus recursos naturales"},{"$f":"IF(ISERROR(VLOOKUP(K235,Proposito_programa!$C$2:$E$59,3,FALSE)),\" \",VLOOKUP(K235,Proposito_programa!$C$2:$E$59,3,FALSE))","v":"Propósito 2 : Cambiar Nuestros Hábitos de Vida para Reverdecer a Bogotá y Adaptarnos y Mitigar la Crisis Climática"},1651,null,1014280764,"LUIS MARIO REYES MUNEVAR",null,null,"Persona Natural",null,null,null,17460000,null,null,null,17460000,null,"2021-10-21","2021-10-22","2022-02-21",122,null,null,null,null,null,null,null,"X",null,null,0]
["CPS-201-2021",2021,"FDRS-CD-173-2021","https://community.secop.gov.co/Public/Tendering/OpportunityDetail/Index?noticeUID=CO1.NTC.2334550&isFromPublicArea=True&isModal=False","Contratos de prestación de servicios profesionales y de apoyo a la gestión","Contratación directa","Prestación de servicios profesionales y de apoyo a la gestión, o para la ejecución de trabajos artísticos que sólo puedan encomendarse a determinadas personas naturales;","PRESTAR LOS SERVICIOS COMO AUXILIAR DE CONSTRUCCIÓN PARA LAS OBRAS A EJECUTAR EN EL MARCO DEL PROYECTO DE INVERSIÓN 1589","Inversión","Un Nuevo Contrato Social y Ambiental para la Bogotá del Siglo XXI",19,{"$f":"IF(ISERROR(VLOOKUP(K236,Proposito_programa!$C$2:$E$59,2,FALSE)),\" \",VLOOKUP(K236,Proposito_programa!$C$2:$E$59,2,FALSE))","v":"Vivienda y entornos dignos en el territorio urbano y rural"},{"$f":"IF(ISERROR(VLOOKUP(K236,Proposito_programa!$C$2:$E$59,3,FALSE)),\" \",VLOOKUP(K236,Proposito_programa!$C$2:$E$59,3,FALSE))","v":"Propósito 1: Hacer un nuevo contrato social para incrementar la inclusión social, productiva y política"},1589,null,79632427,"HECTOR GERARDO IBAÑEZ QUINTERO",null,null,"Persona Natural",null,null,null,5200000,null,null,null,5200000,null,"2021-10-22","2021-10-25","2021-12-24",60,null,null,null,null,null,null,null,null,"X",null,0]
["CPS-202-2021",2021,"FDRS-CD-174-2021","https://community.secop.gov.co/Public/Tendering/OpportunityDetail/Index?noticeUID=CO1.NTC.2332283&isFromPublicArea=True&isModal=False","Contratos de prestación de servicios profesionales y de apoyo a la gestión","Contratación directa","Prestación de servicios profesionales y de apoyo a la gestión, o para la ejecución de trabajos artísticos que sólo puedan encomendarse a determinadas personas naturales;","PRESTAR SUS SERVICIOS COMO AUXILIAR DE APOYO ADMINISTRATIVO AL ÁREA DE GESTIÓN DEL DESARROLLO LOCAL EN LA ALCALDÍA LOCAL DE SUMAPAZ","Inversión","Un Nuevo Contrato Social y Ambiental para la Bogotá del Siglo XXI",57,{"$f":"IF(ISERROR(VLOOKUP(K237,Proposito_programa!$C$2:$E$59,2,FALSE)),\" \",VLOOKUP(K237,Proposito_programa!$C$2:$E$59,2,FALSE))","v":"Gestión pública local"},{"$f":"IF(ISERROR(VLOOKUP(K237,Proposito_programa!$C$2:$E$59,3,FALSE)),\" \",VLOOKUP(K237,Proposito_programa!$C$2:$E$59,3,FALSE))","v":"Propósito 5: Construir Bogotá - Región con gobierno abierto, transparente y ciudadanía consciente"},1696,null,1013589893,"LINA MARCELA SALAZAR BERMUDEZ",null,null,"Persona Natural",null,null,null,6600000,null,null,null,6600000,null,"2021-10-21","2021-10-25","2022-01-24",91,null,null,null,null,null,null,null,"X",null,null,0]
["CPS-203-2021",2021,"FDRS-CD-176-2021","https://community.secop.gov.co/Public/Tendering/OpportunityDetail/Index?noticeUID=CO1.NTC.2350413&isFromPublicArea=True&isModal=False","Contratos de prestación de servicios profesionales y de apoyo a la gestión","Contratación directa","Prestación de servicios profesionales y de apoyo a la gestión, o para la ejecución de trabajos artísticos que sólo puedan encomendarse a determinadas personas naturales;","PRESTAR LOS SERVICIOS PROFESIONALES ESPECIALIZADOS PARA QUE RINDA DICTAMEN PERICIAL Y LO SUSTENTE EN AUDIENCIA DE PRUEBAS, ANTE EL JUZGADO 32 ADMINISTRATIVO DEL CIRCUITO DE BOGOTÁ, DENTRO DEL PROCESO CONTROVERSIA CONTRACTUAL RADICADO. 11001333603220170011600","Funcionamiento","Un Nuevo Contrato Social y Ambiental para la Bogotá del Siglo XXI","No aplica",{"$f":"IF(ISERROR(VLOOKUP(K238,Proposito_programa!$C$2:$E$59,2,FALSE)),\" \",VLOOKUP(K238,Proposito_programa!$C$2:$E$59,2,FALSE))","v":" "},{"$f":"IF(ISERROR(VLOOKUP(K238,Proposito_programa!$C$2:$E$59,3,FALSE)),\" \",VLOOKUP(K238,Proposito_programa!$C$2:$E$59,3,FALSE))","v":" "},null,null,19156526,"WALDO JESUS ORTIZ ROMERO",null,null,"Persona Natural",null,null,null,10000000,null,null,null,10000000,null,"2021-10-28","2021-10-29","2022-02-15",109,null,null,null,null,null,null,null,"X",null,null,0]
["CPS-205-2021",2021,"FDRS-CD-187-2021","https://community.secop.gov.co/Public/Tendering/OpportunityDetail/Index?noticeUID=CO1.NTC.2417058&isFromPublicArea=True&isModal=False","Contratos de prestación de servicios profesionales y de apoyo a la gestión","Contratación directa","Prestación de servicios profesionales y de apoyo a la gestión, o para la ejecución de trabajos artísticos que sólo puedan encomendarse a determinadas personas naturales;","PRESTAR LOS SERVICIOS PROFESIONALES ESPECIALIZADOS PARA APOYAR LA EJECUCIÓN DEL PROYECTO 1643 \" MEJORES CONDICIONES DE SALUD EN LA RURALIDAD","Inversión","Un Nuevo Contrato Social y Ambiental para la Bogotá del Siglo XXI",6,{"$f":"IF(ISERROR(VLOOKUP(K239,Proposito_programa!$C$2:$E$59,2,FALSE)),\" \",VLOOKUP(K239,Proposito_programa!$C$2:$E$59,2,FALSE))","v":"Sistema Distrital de Cuidado"},{"$f":"IF(ISERROR(VLOOKUP(K239,Proposito_programa!$C$2:$E$59,3,FALSE)),\" \",VLOOKUP(K239,Proposito_programa!$C$2:$E$59,3,FALSE))","v":"Propósito 1: Hacer un nuevo contrato social para incrementar la inclusión social, productiva y política"},1643,null,1022991460,"MARIA CAMILA NIEVES PARRA",null,null,"Persona Natural",null,null,null,14000000,null,null,null,{"$f":"+X239+Y239+AA239","v":14000000},null,"2021-11-24","2021-11-25","2022-01-24",60,null,null,null,null,null,null,null,"X",null,null,0]
["CIA-206-2021",2021,"FDRS-CD-188-2021","https://community.secop.gov.co/Public/Tendering/OpportunityDetail/Index?noticeUID=CO1.NTC.2390093&isFromPublicArea=True&isModal=False","Contratos interadministrativos","Contratación directa","Contratos interadministrativos","AUNAR ESFUERZOS TÉCNICOS, ADMINISTRATIVOS Y FINANCIEROS PARA MEJORAR LAS CONDICIONES DE VIDA DE LOS Y LAS HABITANTES DE LA LOCALIDAD DE SUMAPAZ MEDIANTE LA IMPLEMENTACIÓN DE ACCIONES, ESTRATEGIAS Y ACTIVIDADES DE PROMOCIÓN, PREVENCIÓN E INCLUSIÓN EN MATERIA DE SALUD","Inversión","Un Nuevo Contrato Social y Ambiental para la Bogotá del Siglo XXI",6,{"$f":"IF(ISERROR(VLOOKUP(K240,Proposito_programa!$C$2:$E$59,2,FALSE)),\" \",VLOOKUP(K240,Proposito_programa!$C$2:$E$59,2,FALSE))","v":"Sistema Distrital de Cuidado"},{"$f":"IF(ISERROR(VLOOKUP(K240,Proposito_programa!$C$2:$E$59,3,FALSE)),\" \",VLOOKUP(K240,Proposito_programa!$C$2:$E$59,3,FALSE))","v":"Propósito 1: Hacer un nuevo contrato social para incrementar la inclusión social, productiva y política"},1643,null,900958564,"SUBRED INTEGRADA DE SERVICIOS DE SALUD SUR ESE",null,null,"Persona Jurídica",null,null,null,594957000,null,null,null,{"$f":"+X240+Y240+AA240","v":594957000},null,"2021-11-12","2021-12-29","2022-10-28",303,null,null,null,null,null,null,null,"X",null,null,0]
["CIA-206-2021",2021,"FDRS-CD-188-2021","https://community.secop.gov.co/Public/Tendering/OpportunityDetail/Index?noticeUID=CO1.NTC.2390093&isFromPublicArea=True&isModal=False","Contratos interadministrativos","Contratación directa","Contratos interadministrativos","AUNAR ESFUERZOS TÉCNICOS, ADMINISTRATIVOS Y FINANCIEROS PARA MEJORAR LAS CONDICIONES DE VIDA DE LOS Y LAS HABITANTES DE LA LOCALIDAD DE SUMAPAZ MEDIANTE LA IMPLEMENTACIÓN DE ACCIONES, ESTRATEGIAS Y ACTIVIDADES DE PROMOCIÓN, PREVENCIÓN E INCLUSIÓN EN MATERIA DE SALUD","Inversión","Un Nuevo Contrato Social y Ambiental para la Bogotá del Siglo XXI",8,{"$f":"IF(ISERROR(VLOOKUP(K241,Proposito_programa!$C$2:$E$59,2,FALSE)),\" \",VLOOKUP(K241,Proposito_programa!$C$2:$E$59,2,FALSE))","v":"Prevención y atención de maternidad temprana"},{"$f":"IF(ISERROR(VLOOKUP(K241,Proposito_programa!$C$2:$E$59,3,FALSE)),\" \",VLOOKUP(K241,Proposito_programa!$C$2:$E$59,3,FALSE))","v":"Propósito 1: Hacer un nuevo contrato social para incrementar la inclusión social, productiva y política"},1645,null,900958564,"SUBRED INTEGRADA DE SERVICIOS DE SALUD SUR ESE",null,null,"Persona Jurídica",null,null,null,69586000,null,null,null,{"$f":"+X241+Y241+AA241","v":69586000},null,"2021-11-12","2021-12-29","2022-10-28",303,null,null,null,null,null,null,null,"X",null,null,0]
["CPS-207-2021",2021,"FDRS-MC-179-2021","https://community.secop.gov.co/Public/Tendering/OpportunityDetail/Index?noticeUID=CO1.NTC.2353877&isFromPublicArea=True&isModal=False","Contratos de prestación de servicios","Contratación mínima cuantia","No aplica","PRESTAR LOS SERVICIOS DE MONITOREO VEHICULAR INTEGRAL POR GPS PARA LOS VEHÍCULOS DE PROPIEDAD O TENENCIA DEL FONDO DE DESARROLLO RURAL DE SUMAPAZ","Inversión","Un Nuevo Contrato Social y Ambiental para la Bogotá del Siglo XXI",49,{"$f":"IF(ISERROR(VLOOKUP(K242,Proposito_programa!$C$2:$E$59,2,FALSE)),\" \",VLOOKUP(K242,Proposito_programa!$C$2:$E$59,2,FALSE))","v":"Movilidad segura, sostenible y accesible"},{"$f":"IF(ISERROR(VLOOKUP(K242,Proposito_programa!$C$2:$E$59,3,FALSE)),\" \",VLOOKUP(K242,Proposito_programa!$C$2:$E$59,3,FALSE))","v":"Propósito 4: Hacer de Bogotá Región un modelo de movilidad multimodal, incluyente y sostenible"},1688,3,901035950,"I3 SOLUCIONES SAS",null,null,"Persona Jurídica",null,null,null,8796000,null,null,null,8796000,null,"\t16/11/2021","2021-11-22","2022-05-21",180,null,null,null,null,null,null,null,"X",null,null,0]
["CPS-208-2021",2021,"FDRS-SAMC-183-2021","https://community.secop.gov.co/Public/Tendering/OpportunityDetail/Index?noticeUID=CO1.NTC.2419752&isFromPublicArea=True&isModal=False","Contratos de prestación de servicios","Selección abreviada","Selección abreviada por menor cuantía ","REALIZAR LAS ACTIVIDADES PARA CELEBRAR LA NAVIDAD SUMAPACEÑA Y EXALTAR LA CULTURA CAMPESINA DE NIÑOS, NIÑAS Y SUS FAMILIAS EN LA VIGENCIA 2021","Inversión","Un Nuevo Contrato Social y Ambiental para la Bogotá del Siglo XXI",21,{"$f":"IF(ISERROR(VLOOKUP(K243,Proposito_programa!$C$2:$E$59,2,FALSE)),\" \",VLOOKUP(K243,Proposito_programa!$C$2:$E$59,2,FALSE))","v":"Creación y vida cotidiana: Apropiación ciudadana del arte, la cultura y el patrimonio, para la democracia cultural"},{"$f":"IF(ISERROR(VLOOKUP(K243,Proposito_programa!$C$2:$E$59,3,FALSE)),\" \",VLOOKUP(K243,Proposito_programa!$C$2:$E$59,3,FALSE))","v":"Propósito 1: Hacer un nuevo contrato social para incrementar la inclusión social, productiva y política"},1633,3,900017592,"ASOCIACIÓN ARKAMBIENTAL SIGLA ARKAMBIENTAL",null,null,"Persona Jurídica",null,null,null,248913207,null,1,124333333,{"$f":"+X243+Y243+AA243","v":373246540},null,"2021-12-13","2021-12-16","2022-02-15",62,null,null,null,null,null,null,null,"X",null,null,0]
["CCS-209-2021",2021,"FDRS-CMA-186-2021","https://community.secop.gov.co/Public/Tendering/OpportunityDetail/Index?noticeUID=CO1.NTC.2414731&isFromPublicArea=True&isModal=False","Consultoría","Concurso de méritos","No aplica","Realizar la \"EVALUACIÓN Y VERIFICACIÓN DE LOS DIAGNÓSTICOS EXISTENTES, PARA LA REALIZACIÓN DE LOS ESTUDIOS Y DISEÑOS COMPLEMENTARIOS ENCAMINADOS A LAS OBRAS DE MANTENIMIENTO, REHABILITACIÓN Y FUNCIONAMIENTO DE LOS SISTEMAS DE ACUEDUCTOS VEREDALES, ASÍ COMO, LOS ESTUDIOS Y DISEÑOS PARA LA CONSTRUCCIÓN DE UN TANQUE DE ALMACENAMIENTO EN LA VEREDA DE SAN JUAN EN LA LOCALIDAD DE SUMAPAZ","Inversión","Un Nuevo Contrato Social y Ambiental para la Bogotá del Siglo XXI",37,{"$f":"IF(ISERROR(VLOOKUP(K244,Proposito_programa!$C$2:$E$59,2,FALSE)),\" \",VLOOKUP(K244,Proposito_programa!$C$2:$E$59,2,FALSE))","v":"Provisión y mejoramiento de servicios públicos"},{"$f":"IF(ISERROR(VLOOKUP(K244,Proposito_programa!$C$2:$E$59,3,FALSE)),\" \",VLOOKUP(K244,Proposito_programa!$C$2:$E$59,3,FALSE))","v":"Propósito 2 : Cambiar Nuestros Hábitos de Vida para Reverdecer a Bogotá y Adaptarnos y Mitigar la Crisis Climática"},1668,3,9015530603,"CONSORCIO CITIC",null,null,"Consorcio",79865330,"LUDWIG PÁEZ MUÑOZ ",0.5,297281523,null,null,null,{"$f":"+X244+Y244+AA244","v":297281523},null,"2021-12-30",null,null,null,null,null,null,null,null,null,"X",null,null,null,0]
["CCS-209-2021",2021,"FDRS-CMA-186-2021","https://community.secop.gov.co/Public/Tendering/OpportunityDetail/Index?noticeUID=CO1.NTC.2414731&isFromPublicArea=True&isModal=False","Consultoría","Concurso de méritos","No aplica","Realizar la \"EVALUACIÓN Y VERIFICACIÓN DE LOS DIAGNÓSTICOS EXISTENTES, PARA LA REALIZACIÓN DE LOS ESTUDIOS Y DISEÑOS COMPLEMENTARIOS ENCAMINADOS A LAS OBRAS DE MANTENIMIENTO, REHABILITACIÓN Y FUNCIONAMIENTO DE LOS SISTEMAS DE ACUEDUCTOS VEREDALES, ASÍ COMO, LOS ESTUDIOS Y DISEÑOS PARA LA CONSTRUCCIÓN DE UN TANQUE DE ALMACENAMIENTO EN LA VEREDA DE SAN JUAN EN LA LOCALIDAD DE SUMAPAZ","Inversión","Un Nuevo Contrato Social y Ambiental para la Bogotá del Siglo XXI",37,{"$f":"IF(ISERROR(VLOOKUP(K245,Proposito_programa!$C$2:$E$59,2,FALSE)),\" \",VLOOKUP(K245,Proposito_programa!$C$2:$E$59,2,FALSE))","v":"Provisión y mejoramiento de servicios públicos"},{"$f":"IF(ISERROR(VLOOKUP(K245,Proposito_programa!$C$2:$E$59,3,FALSE)),\" \",VLOOKUP(K245,Proposito_programa!$C$2:$E$59,3,FALSE))","v":"Propósito 2 : Cambiar Nuestros Hábitos de Vida para Reverdecer a Bogotá y Adaptarnos y Mitigar la Crisis Climática"},1668,3,9015530603,"CONSORCIO CITIC",null,null,"Consorcio",8300810781,"COVILCO LTDA",0.5,null,null,null,null,null,null,"2021-12-30",null,null,null,null,null,null,null,null,null,"X",null,null,null,"-"]
["CPS-211-2021",2021,"FDRS-SAMC-172-2021","https://community.secop.gov.co/Public/Tendering/OpportunityDetail/Index?noticeUID=CO1.NTC.2442143&isFromPublicArea=True&isModal=False","Contratos de prestación de servicios","Selección abreviada","Selección abreviada por menor cuantía ","PRESTAR SERVICIOS INTEGRALES DE APOYO LOGÍSTICO Y PROMOCIÓN INSTITUCIONAL A MONTO AGOTABLE REQUERIDOS POR LA ALCALDÍA LOCAL DE SUMAPAZ, EN ESPACIOS, EVENTOS Y ACTIVIDADES CONVOCADOS Y ORGANIZADOS POR","Funcionamiento","Un Nuevo Contrato Social y Ambiental para la Bogotá del Siglo XXI","No aplica",null,null,null,3,900360948,"CORPORACIÓN COLECTIVO DIGERATI",null,null,"Persona Jurídica",null,null,null,214283000,null,null,null,{"$f":"+X246+Y246+AA246","v":214283000},null,"2021-12-28",null,null,null,null,null,null,null,null,null,"X",null,null,null,0]
["CPS-212-2021",2021,"FDRS-LP-180-2021","https://community.secop.gov.co/Public/Tendering/OpportunityDetail/Index?noticeUID=CO1.NTC.2411875&isFromPublicArea=True&isModal=False","Contratos de prestación de servicios","Licitación pública","No aplica","REALIZAR LA SALIDA RECREO-DEPORTIVA PARA ADULTOS MAYORES Y PERSONAS CON DISCAPACIDAD Y LOS JUEGOS RURALES, PARA LA COMUNIDAD DE SUMAPAZ","Inversión","Un Nuevo Contrato Social y Ambiental para la Bogotá del Siglo XXI",20,{"$f":"IF(ISERROR(VLOOKUP(K247,Proposito_programa!$C$2:$E$59,2,FALSE)),\" \",VLOOKUP(K247,Proposito_programa!$C$2:$E$59,2,FALSE))","v":"Bogotá, referente en cultura, deporte, recreación y actividad física, con parques para el desarrollo y la salud"},{"$f":"IF(ISERROR(VLOOKUP(K247,Proposito_programa!$C$2:$E$59,3,FALSE)),\" \",VLOOKUP(K247,Proposito_programa!$C$2:$E$59,3,FALSE))","v":"Propósito 1: Hacer un nuevo contrato social para incrementar la inclusión social, productiva y política"},1590,6,890802221,"ADESCUBRIR TRAVEL & ADVENTURE SAS",null,null,"Persona Jurídica",null,null,null,457173650,null,null,null,{"$f":"+X247+Y247+AA247","v":457173650},null,"2021-12-28",null,null,null,null,null,null,null,null,null,"X",null,null,null,0]
["CCS-213-2021",2021,"FDRS-CMA-184-2021","https://community.secop.gov.co/Public/Tendering/OpportunityDetail/Index?noticeUID=CO1.NTC.2410095&isFromPublicArea=True&isModal=False","Consultoría","Concurso de méritos","No aplica","ESTUDIOS Y DISEÑOS PARA LA CONSERVACIÓN DE LA MALLA VIAL Y OBRAS COMPLEMENTARIAS EN LA LOCALIDAD DE SUMAPAZ","Inversión","Un Nuevo Contrato Social y Ambiental para la Bogotá del Siglo XXI",49,{"$f":"IF(ISERROR(VLOOKUP(K248,Proposito_programa!$C$2:$E$59,2,FALSE)),\" \",VLOOKUP(K248,Proposito_programa!$C$2:$E$59,2,FALSE))","v":"Movilidad segura, sostenible y accesible"},{"$f":"IF(ISERROR(VLOOKUP(K248,Proposito_programa!$C$2:$E$59,3,FALSE)),\" \",VLOOKUP(K248,Proposito_programa!$C$2:$E$59,3,FALSE))","v":"Propósito 4: Hacer de Bogotá Región un modelo de movilidad multimodal, incluyente y sostenible"},1688,8,9015518047,"CONSORCIO CONSERVACION SUMAPAZ",null,null,"Consorcio",8300108934,"GEOCING SAS",0.5,304987941,null,null,null,{"$f":"+X248+Y248+AA248","v":304987941},null,"2021-12-28",null,null,null,null,null,null,null,null,null,"X",null,null,null,0]
["CCS-213-2021",2021,"FDRS-CMA-184-2021","https://community.secop.gov.co/Public/Tendering/OpportunityDetail/Index?noticeUID=CO1.NTC.2410095&isFromPublicArea=True&isModal=False","Consultoría","Concurso de méritos","No aplica","ESTUDIOS Y DISEÑOS PARA LA CONSERVACIÓN DE LA MALLA VIAL Y OBRAS COMPLEMENTARIAS EN LA LOCALIDAD DE SUMAPAZ","Inversión","Un Nuevo Contrato Social y Ambiental para la Bogotá del Siglo XXI",49,{"$f":"IF(ISERROR(VLOOKUP(K249,Proposito_programa!$C$2:$E$59,2,FALSE)),\" \",VLOOKUP(K249,Proposito_programa!$C$2:$E$59,2,FALSE))","v":"Movilidad segura, sostenible y accesible"},{"$f":"IF(ISERROR(VLOOKUP(K249,Proposito_programa!$C$2:$E$59,3,FALSE)),\" \",VLOOKUP(K249,Proposito_programa!$C$2:$E$59,3,FALSE))","v":"Propósito 4: Hacer de Bogotá Región un modelo de movilidad multimodal, incluyente y sostenible"},1688,8,9015518047,"CONSORCIO CONSERVACION SUMAPAZ",null,null,"Consorcio",9011981630,"SHM INGENIERIA SAS",0.5,null,null,null,null,{"$f":"+X249+Y249+AA249","v":0},null,"2021-12-28",null,null,null,null,null,null,null,null,null,"X",null,null,null,"-"]
["CPS-214-2021",2021,"FDRS-LP-175-2021","https://community.secop.gov.co/Public/Tendering/OpportunityDetail/Index?noticeUID=CO1.NTC.2407262&isFromPublicArea=True&isModal=False","Contratos de prestación de servicios","Licitación pública","No aplica","SUMINISTRO E INSTALACIÓN DE SISTEMAS DE GENERACIÓN DE ENERGÍA ELÉCTRICA RENOVABLE MEDIANTE CELDAS FOTOVOLTAICAS EN LA LOCALIDAD DE SUMAPAZ","Inversión","Un Nuevo Contrato Social y Ambiental para la Bogotá del Siglo XXI",38,{"$f":"IF(ISERROR(VLOOKUP(K250,Proposito_programa!$C$2:$E$59,2,FALSE)),\" \",VLOOKUP(K250,Proposito_programa!$C$2:$E$59,2,FALSE))","v":"Ecoeficiencia, reciclaje, manejo de residuos e inclusión de la población recicladora"},{"$f":"IF(ISERROR(VLOOKUP(K250,Proposito_programa!$C$2:$E$59,3,FALSE)),\" \",VLOOKUP(K250,Proposito_programa!$C$2:$E$59,3,FALSE))","v":"Propósito 2 : Cambiar Nuestros Hábitos de Vida para Reverdecer a Bogotá y Adaptarnos y Mitigar la Crisis Climática"},1669,9,9003467799,"A&A CONSULTORIA E INGENIERIA S.A.S",null,null,"Persona Jurídica",null,null,null,786159610,null,null,null,786159610,null,"2021-12-31",null,null,null,null,null,null,null,null,null,"X",null,null,null,0]
["CIN-215-2021",2021,"FDRS-MC-199-2021","https://community.secop.gov.co/Public/Tendering/OpportunityDetail/Index?noticeUID=CO1.NTC.2471357&isFromPublicArea=True&isModal=False","Interventoría","Contratación mínima cuantia","No aplica","REALIZAR LA INTERVENTORÍA TÉCNICA, ADMINISTRATIVA, FINANCIERA Y AMBIENTAL AL CONTRATO CUYO OBJETO ES: REALIZAR LA SALIDA RECREO-DEPORTIVA PARA ADULTOS MAYORES Y PERSONAS CON DISCAPACIDAD Y LOS JUEGOS","Inversión","Un Nuevo Contrato Social y Ambiental para la Bogotá del Siglo XXI",20,{"$f":"IF(ISERROR(VLOOKUP(K251,Proposito_programa!$C$2:$E$59,2,FALSE)),\" \",VLOOKUP(K251,Proposito_programa!$C$2:$E$59,2,FALSE))","v":"Bogotá, referente en cultura, deporte, recreación y actividad física, con parques para el desarrollo y la salud"},{"$f":"IF(ISERROR(VLOOKUP(K251,Proposito_programa!$C$2:$E$59,3,FALSE)),\" \",VLOOKUP(K251,Proposito_programa!$C$2:$E$59,3,FALSE))","v":"Propósito 1: Hacer un nuevo contrato social para incrementar la inclusión social, productiva y política"},1590,2,52268409,"LORENA MENDEZ VALLEJO",null,null,"Persona Natural",null,null,null,12320000,null,null,null,12320000,null,"2021-12-31",null,null,null,null,null,null,null,null,null,"X",null,null,null,0]
["OC-68363-2021",2021,"TIENDA VIRTUAL ","https://colombiacompra.gov.co/tienda-virtual-del-estado-colombiano/ordenes-compra/68363","Otros","Selección abreviada","Acuerdo marco de precios ","CONTRATAR LA PRESTACIÓN DE SERVICIOS DE LIMPIEZA GENERAL Y CAFETERÍA DE LAS SEDES ADMINISTRATIVAS DE LA ALCALDÍA LOCAL DE SUMAPAZ Y LAS CORREGIDURÍAS DE BETANIA, NAZARETH Y SAN JUAN","Operación","Un Nuevo Contrato Social y Ambiental para la Bogotá del Siglo XXI","No aplica",null,null,null,null,860010451,"CASALIMPIA S.A",null,null,"Persona Jurídica",null,null,null,49724390,null,null,null,49724390,null,"2021-04-30"]
["OC-70536-2021",2021,"TIENDA VIRTUAL ","https://colombiacompra.gov.co/tienda-virtual-del-estado-colombiano/ordenes-compra/70536","Otros","Selección abreviada","Acuerdo marco de precios ","ADQUISICIÓN DE LICENCIAS DE MICROSOFT OFFICE 365 POR SUSCRIPCIÓN ANUAL PARA LA ALCALDÍA LOCAL DE SUMAPAZ","Operación","Un Nuevo Contrato Social y Ambiental para la Bogotá del Siglo XXI","No aplica",null,null,null,null,901374618,"UNION TEMPORAL NIMBIT",null,null,"Unión Temporal",null,null,null,43435710,null,null,null,43435710,null,"2021-06-09"]
["OC-70930-2021",2021,"TIENDA VIRTUAL ","https://colombiacompra.gov.co/tienda-virtual-del-estado-colombiano/ordenes-compra/70930","Otros","Selección abreviada","Acuerdo marco de precios ","CONTRATAR LA COMPRA DE TÓNERES Y CARTUCHOS DE IMPRESIÓN CON DESTINO A LAS DIFERENTES DEPENDENCIAS DEL FONDO DE DESARROLLO RURAL DE SUMAPAZ A TRAVÉS DE CONTRATACIÓN CON GRAN ALMACÉN – GRANDES SUPERFICIES EN LA TVEC","Operación","Un Nuevo Contrato Social y Ambiental para la Bogotá del Siglo XXI","No aplica",null,null,null,null,830037946,"PANAMERICANA LIBRERÍA Y PAPELERÍA S.A.",null,null,"Persona Jurídica",null,null,null,4359803,null,null,null,4359803,null,"2021-09-17"]
["OC-72281-2021",2021,"TIENDA VIRTUAL ","https://colombiacompra.gov.co/tienda-virtual-del-estado-colombiano/ordenes-compra/72281","Otros","Selección abreviada","Acuerdo marco de precios ","EL SUMINISTRO DE COMBUSTIBLE PARA LOS VEHÍCULOS LIVIANOS DE PROPIEDAD Y/O TENENCIA DEL FONDO DE DESARROLLO LOCAL DE SUMAPAZ","Operación","Un Nuevo Contrato Social y Ambiental para la Bogotá del Siglo XXI","No aplica",null,null,null,null,830095213,"ORGANIZACIÓN TERPEL S.A.",null,null,"Persona Jurídica",null,null,null,35640197,null,null,null,35640197,null,"2021-07-10"]
["OC-72869-2021",2021,"TIENDA VIRTUAL ","https://colombiacompra.gov.co/tienda-virtual-del-estado-colombiano/ordenes-compra/72869","Otros","Selección abreviada","Acuerdo marco de precios ","CONTRATAR LA COMPRA DE PAPELERÍA, ÚTILES DE OFICINA CON DESTINO A LAS DIFERENTES DEPENDENCIAS DEL FONDO DE DESARROLLO RURAL DE SUMAPAZ A TRAVÉS DE CONTRATACIÓN CON GRAN ALMACÉN EN LA TVEC","Operación","Un Nuevo Contrato Social y Ambiental para la Bogotá del Siglo XXI","No aplica",null,null,null,null,830037946,"PANAMERICANA LIBRERÍA Y PAPELERÍA S.A.",null,null,"Persona Jurídica",null,null,null,9999725,null,null,null,9999725,null,"2021-07-22"]
["OC-74848-2021",2021,"TIENDA VIRTUAL ","https://colombiacompra.gov.co/tienda-virtual-del-estado-colombiano/ordenes-compra/74848","Otros","Selección abreviada","Acuerdo marco de precios ","ADQUISICIÓN DE EQUIPOS Y ELEMENTOS DE TECNOLOGÍA PARA LAS DIFERENTES DEPENDENCIAS DEL FONDO DE DESARROLLO RURAL DE SUMAPAZ.","Operación","Un Nuevo Contrato Social y Ambiental para la Bogotá del Siglo XXI","No aplica",{"$f":"IF(ISERROR(VLOOKUP(K257,Proposito_programa!$C$2:$E$59,2,FALSE)),\" \",VLOOKUP(K257,Proposito_programa!$C$2:$E$59,2,FALSE))","v":" "},{"$f":"IF(ISERROR(VLOOKUP(K257,Proposito_programa!$C$2:$E$59,3,FALSE)),\" \",VLOOKUP(K257,Proposito_programa!$C$2:$E$59,3,FALSE))","v":" "},null,null,830037946,"PANAMERICANA LIBRERÍA Y PAPELERÍA S.A.",null,null,"Persona Jurídica",null,null,null,7974190,null,null,null,7974190,null,"2021-08-24",null,null,null,null,null,null,null,null,null,null,null,null,null,0]
["OC-74849-2021",2021,"TIENDA VIRTUAL ","https://colombiacompra.gov.co/tienda-virtual-del-estado-colombiano/ordenes-compra/74849","Otros","Selección abreviada","Acuerdo marco de precios ","ADQUISICIÓN DE EQUIPOS Y ELEMENTOS DE TECNOLOGÍA PARA LAS DIFERENTES DEPENDENCIAS DEL FONDO DE DESARROLLO RURAL DE SUMAPAZ.","Operación","Un Nuevo Contrato Social y Ambiental para la Bogotá del Siglo XXI","No aplica",{"$f":"IF(ISERROR(VLOOKUP(K258,Proposito_programa!$C$2:$E$59,2,FALSE)),\" \",VLOOKUP(K258,Proposito_programa!$C$2:$E$59,2,FALSE))","v":" "},{"$f":"IF(ISERROR(VLOOKUP(K258,Proposito_programa!$C$2:$E$59,3,FALSE)),\" \",VLOOKUP(K258,Proposito_programa!$C$2:$E$59,3,FALSE))","v":" "},null,null,890900943,"COLOMBIANA DE COMERCIO S.A Y/O ALKOSTO S.A.",null,null,"Persona Jurídica",null,null,null,13995000,null,null,null,13995000,null,"2021-08-24",null,null,null,null,null,null,null,null,null,null,null,null,null,0]
["OC-75887-2021",2021,"TIENDA VIRTUAL ","https://colombiacompra.gov.co/tienda-virtual-del-estado-colombiano/ordenes-compra/75887","Otros","Selección abreviada","Acuerdo marco de precios ","CONTRATAR LA COMPRA DE SUMINISTROS DE PAPELERÍA, ASEO Y BIOSEGURIDAD PARA LOS 6 SEIS CENTROS DE CO-NECTIVIDAD CAMPESINA DEL FONDO DE DESARROLLO RU-RAL DE SUMAPAZ A TRAVÉS DE CONTRATACIÓN CON GRAN ALMACÉN GRANDES SUPERFICIES EN LA TVEC","Operación","Un Nuevo Contrato Social y Ambiental para la Bogotá del Siglo XXI","No aplica",{"$f":"IF(ISERROR(VLOOKUP(K259,Proposito_programa!$C$2:$E$59,2,FALSE)),\" \",VLOOKUP(K259,Proposito_programa!$C$2:$E$59,2,FALSE))","v":" "},{"$f":"IF(ISERROR(VLOOKUP(K259,Proposito_programa!$C$2:$E$59,3,FALSE)),\" \",VLOOKUP(K259,Proposito_programa!$C$2:$E$59,3,FALSE))","v":" "},null,null,830037946,"PANAMERICANA LIBRERÍA Y PAPELERÍA S.A.",null,null,"Persona Jurídica",null,null,null,7124878,null,null,null,7124878,null,"2021-09-13",null,null,null,null,null,null,null,null,null,null,null,null,null,0]
["OC-76346-2021",2021,"TIENDA VIRTUAL ","https://colombiacompra.gov.co/tienda-virtual-del-estado-colombiano/ordenes-compra/76346","Otros","Selección abreviada","Acuerdo marco de precios ","CONTRATAR LA PRESTACIÓN DE SERVICIOS DE LIMPIEZA GENERAL Y CAFETERÍA DE LAS SEDES ADMINISTRATIVAS DE LA ALCALDÍA LOCAL DE SUMAPAZ Y LAS CORREGIDURÍAS DE BETANIA, NAZARETH Y SAN JUAN.","Operación","Un Nuevo Contrato Social y Ambiental para la Bogotá del Siglo XXI","No aplica",{"$f":"IF(ISERROR(VLOOKUP(K260,Proposito_programa!$C$2:$E$59,2,FALSE)),\" \",VLOOKUP(K260,Proposito_programa!$C$2:$E$59,2,FALSE))","v":" "},{"$f":"IF(ISERROR(VLOOKUP(K260,Proposito_programa!$C$2:$E$59,3,FALSE)),\" \",VLOOKUP(K260,Proposito_programa!$C$2:$E$59,3,FALSE))","v":" "},null,null,800242738,"LADOINSA LABORES DOTACIONES INDUSTRIALES S.A.S",null,null,"Persona Jurídica",null,null,null,62361287,null,null,null,62361287,null,"2021-09-21",null,null,null,null,null,null,null,null,null,null,null,null,null,0]
["OC-83389-2021",2021,"TIENDA VIRTUAL ","https://colombiacompra.gov.co/tienda-virtual-del-estado-colombiano/ordenes-compra/83389","Otros","Selección abreviada","Acuerdo marco de precios ","PRESTAR EL SERVICIO DE TRANSPORTE TERRESTRE DE PASAJEROS, CON EL FIN DE ATENDER LOS EVENTOS INSTITUCIONALES PROGRAMADOS POR LA ADMINISTRACIÓN LOCAL, EVENTOS Y ACTIVIDADES DE PROMOCIÓN Y PARTICIPACIÓN.","Operación","Un Nuevo Contrato Social y Ambiental para la Bogotá del Siglo XXI","No aplica",null,null,null,null,901446013,"UNION TEMPORAL ESPECIALES COLOMBIA COMPRA 2020",null,null,"Unión Temporal",null,null,null,274359473.30000001,null,null,null,274359473.30000001,null,"2021-12-22"]
["OC-83390-2021",2021,"TIENDA VIRTUAL ","https://colombiacompra.gov.co/tienda-virtual-del-estado-colombiano/ordenes-compra/83390/1","Otros","Selección abreviada","Acuerdo marco de precios ","CONTRATAR LA COMPRA DE LA LICENCIA ANUAL (12 MESES) DE LA SUITE ADOBE A TRAVES DE LA CONTRATACION CON GRAN ALMACEN DE LA TVCE ","Operación","Un Nuevo Contrato Social y Ambiental para la Bogotá del Siglo XXI","No aplica",null,null,null,null,830037946,"PANAMERICANA LIBRERÍA Y PAPELERÍA S.A.",null,null,"Persona Jurídica",null,null,null,4668528,null,null,null,4668528,null,"2021-12-22"]
["CIN-119-2019",2019,"FDLS-CMA-111-2019","https://community.secop.gov.co/Public/Tendering/OpportunityDetail/Index?noticeUID=CO1.NTC.864610&isFromPublicArea=True&isModal=False","Interventoría","Concurso de méritos","No aplica","REALIZAR LA INTERVENTORÍA TÉCNICA, ADMINISTRATIVA, FINANCIERA, AMBIENTAL, SOCIAL, SISO Y JURÍDICA AL CONTRATO QUE RESULTE DEL PROCESO LICITATORIO FDLS-LP-095-2019, CUYO OBJETO ES: CONTRATAR LAS OBRAS PARA LA CONSERVACIÓN DE LA MALLA VIAL LOCAL DE SUMAPAZ, POR EL SISTEMA DE PRECIOS UNITARIOS FIJOS, SIN FORMULA DE REAJUSTE Y A MONTO AGOTABLE","Inversión","Bogotá Mejor para Todos",18,{"$f":"IF(ISERROR(VLOOKUP(K263,Proposito_programa!$C$2:$E$59,2,FALSE)),\" \",VLOOKUP(K263,Proposito_programa!$C$2:$E$59,2,FALSE))","v":"Cierre de brechas para la inclusión productiva urbano rural"},{"$f":"IF(ISERROR(VLOOKUP(K263,Proposito_programa!$C$2:$E$59,3,FALSE)),\" \",VLOOKUP(K263,Proposito_programa!$C$2:$E$59,3,FALSE))","v":"Propósito 1: Hacer un nuevo contrato social para incrementar la inclusión social, productiva y política"},1364,7,901310016,"CONSORCIO  INTERVIAL SUMAPAZ","PIEDAD CONSTANZA CIRO BASTO","CARLOS ANDRES AMEZQUITA ANGULO","Consorcio",79865330,"LUDWIG PÁEZ MUÑOZ ",0.5,null,null,1,179125690,179125690,null,"2021-05-18","2021-05-18","2021-05-24",null,null,null,null,null,null,null,null,null,"X",null,0]
["CIN-119-2019",2019,"FDLS-CMA-111-2019","https://community.secop.gov.co/Public/Tendering/OpportunityDetail/Index?noticeUID=CO1.NTC.864610&isFromPublicArea=True&isModal=False","Interventoría","Concurso de méritos","No aplica","REALIZAR LA INTERVENTORÍA TÉCNICA, ADMINISTRATIVA, FINANCIERA, AMBIENTAL, SOCIAL, SISO Y JURÍDICA AL CONTRATO QUE RESULTE DEL PROCESO LICITATORIO FDLS-LP-095-2019, CUYO OBJETO ES: CONTRATAR LAS OBRAS PARA LA CONSERVACIÓN DE LA MALLA VIAL LOCAL DE SUMAPAZ, POR EL SISTEMA DE PRECIOS UNITARIOS FIJOS, SIN FORMULA DE REAJUSTE Y A MONTO AGOTABLE","Inversión","Bogotá Mejor para Todos",18,{"$f":"IF(ISERROR(VLOOKUP(K264,Proposito_programa!$C$2:$E$59,2,FALSE)),\" \",VLOOKUP(K264,Proposito_programa!$C$2:$E$59,2,FALSE))","v":"Cierre de brechas para la inclusión productiva urbano rural"},{"$f":"IF(ISERROR(VLOOKUP(K264,Proposito_programa!$C$2:$E$59,3,FALSE)),\" \",VLOOKUP(K264,Proposito_programa!$C$2:$E$59,3,FALSE))","v":"Propósito 1: Hacer un nuevo contrato social para incrementar la inclusión social, productiva y política"},1364,7,901310016,"CONSORCIO  INTERVIAL SUMAPAZ","CARLOS EMILIANO ROMERO PUENTES","CONSORCIO CONTRU PUENTES SUMAPAZ 153","Consorcio",900674490,"INGENIERÍA DEL FUTURO S.A.S ",0.25,null,null,null,null,0,null,null,null,null,null,null,null,null,null,null,null,null,null,null,null,"-"]
["CIN-119-2019",2019,"FDLS-CMA-111-2019","https://community.secop.gov.co/Public/Tendering/OpportunityDetail/Index?noticeUID=CO1.NTC.864610&isFromPublicArea=True&isModal=False","Interventoría","Concurso de méritos","No aplica","REALIZAR LA INTERVENTORÍA TÉCNICA, ADMINISTRATIVA, FINANCIERA, AMBIENTAL, SOCIAL, SISO Y JURÍDICA AL CONTRATO QUE RESULTE DEL PROCESO LICITATORIO FDLS-LP-095-2019, CUYO OBJETO ES: CONTRATAR LAS OBRAS PARA LA CONSERVACIÓN DE LA MALLA VIAL LOCAL DE SUMAPAZ, POR EL SISTEMA DE PRECIOS UNITARIOS FIJOS, SIN FORMULA DE REAJUSTE Y A MONTO AGOTABLE","Inversión","Bogotá Mejor para Todos",18,{"$f":"IF(ISERROR(VLOOKUP(K265,Proposito_programa!$C$2:$E$59,2,FALSE)),\" \",VLOOKUP(K265,Proposito_programa!$C$2:$E$59,2,FALSE))","v":"Cierre de brechas para la inclusión productiva urbano rural"},{"$f":"IF(ISERROR(VLOOKUP(K265,Proposito_programa!$C$2:$E$59,3,FALSE)),\" \",VLOOKUP(K265,Proposito_programa!$C$2:$E$59,3,FALSE))","v":"Propósito 1: Hacer un nuevo contrato social para incrementar la inclusión social, productiva y política"},1364,7,901310016,"CONSORCIO  INTERVIAL SUMAPAZ","CLAUDIA YAMILE CARREÑO QUIJANO","HQ5 SAS","Consorcio",830068724,"ARA INGENIERÍA S.A.S ",0.25,null,null,null,null,0,null,null,null,null,null,null,null,null,null,null,null,null,null,null,null,"-"]
["CIN-167-2019",2019,"FDLS-CMA-168-2019","https://community.secop.gov.co/Public/Tendering/OpportunityDetail/Index?noticeUID=CO1.NTC.953353&isFromPublicArea=True&isModal=False","Interventoría","Concurso de méritos","No aplica","REALIZAR LA INTERVENTORIA TECNICA, ADMINISTRATIVA, FINANCIERA Y AMBIENTAL AL CONTRATO DERIVADO DE LA LICITACION PÚBLICA N° FDLS-LP-142-2019, QUE TENDRÁ POR OBJETO “PRESTACIÓN DEL SERVICIO DE MANTENIMIENTO DE LA MAQUINARIA Y VEHICULOS PESADOS DE PROPIEDAD, GUARDA Y/O TENENCIA DEL FONDO DE DESARROLLO LOCAL DE SUMAPAZ CON SUMINISTRO DE REPUESTOS, LLANTAS, INSUMOS, ACCESORIOS Y MANO DE OBRA","Inversión","Bogotá Mejor para Todos",18,{"$f":"IF(ISERROR(VLOOKUP(K266,Proposito_programa!$C$2:$E$59,2,FALSE)),\" \",VLOOKUP(K266,Proposito_programa!$C$2:$E$59,2,FALSE))","v":"Cierre de brechas para la inclusión productiva urbano rural"},{"$f":"IF(ISERROR(VLOOKUP(K266,Proposito_programa!$C$2:$E$59,3,FALSE)),\" \",VLOOKUP(K266,Proposito_programa!$C$2:$E$59,3,FALSE))","v":"Propósito 1: Hacer un nuevo contrato social para incrementar la inclusión social, productiva y política"},1364,1,3096924,"JAVIER ENRIQUE BUITRAGO GOMEZ\t","ADRIANA LUCIA MARTIN PALACIOS","LUIS MARIO REYES MUNEVAR","Persona Natural",null,null,null,null,null,1,10921000,10921000,null,"2021-02-08","2021-02-08","2021-05-06",null,null,null,null,null,null,null,null,null,null,null,0]
["CIN-167-2019",2019,"FDLS-CMA-168-2019","https://community.secop.gov.co/Public/Tendering/OpportunityDetail/Index?noticeUID=CO1.NTC.953353&isFromPublicArea=True&isModal=False","Interventoría","Concurso de méritos","No aplica","REALIZAR LA INTERVENTORIA TECNICA, ADMINISTRATIVA, FINANCIERA Y AMBIENTAL AL CONTRATO DERIVADO DE LA LICITACION PÚBLICA N° FDLS-LP-142-2019, QUE TENDRÁ POR OBJETO “PRESTACIÓN DEL SERVICIO DE MANTENIMIENTO DE LA MAQUINARIA Y VEHICULOS PESADOS DE PROPIEDAD, GUARDA Y/O TENENCIA DEL FONDO DE DESARROLLO LOCAL DE SUMAPAZ CON SUMINISTRO DE REPUESTOS, LLANTAS, INSUMOS, ACCESORIOS Y MANO DE OBRA","Inversión","Bogotá Mejor para Todos",18,"Cierre de brechas para la inclusión productiva urbano rural","Propósito 1: Hacer un nuevo contrato social para incrementar la inclusión social, productiva y política",1364,1,3096924,"JAVIER ENRIQUE BUITRAGO GOMEZ\t","ADRIANA LUCIA MARTIN PALACIOS","LUIS MARIO REYES MUNEVAR","Persona Natural",null,null,null,null,null,1,5460500000,5460500000,null,"2021-04-06","2021-04-06","2021-05-06",null,null,null,null,null,null,null,null,null,null,null,255.7307648566981]
["CIN-180-2019",2019,"FDLS-CMA-197-2019","https://community.secop.gov.co/Public/Tendering/OpportunityDetail/Index?noticeUID=CO1.NTC.998642&isFromPublicArea=True&isModal=False","Interventoría","Concurso de méritos","No aplica","REALIZAR LA INTERVENTORÍA TÉCNICA, ADMINISTRATIVA, FINANCIERA, JURIDICA, AMBIENTAL Y SISO AL CONTRATO QUE RESULTE DEL PROCESO LICITATORIO FDLS-LP-188-2019, CUYO OBJETO ES: REALIZAR EL DIAGNOSTICO, DEMOLICION, CONSTRUCCION, MANTENIMIENTO Y REPARACIONES LOCATIVAS DE LOS SALONES COMUNALES Y/O EQUIPAMIENTOS COMUNITARIOS POR EL SISTEMA DE PRECIOS FIJOS SIN FORMULA DE REAJUSTE, EN LA LOCALIDAD DE SUMAPAZ, DC","Inversión","Bogotá Mejor para Todos",45,{"$f":"IF(ISERROR(VLOOKUP(K268,Proposito_programa!$C$2:$E$59,2,FALSE)),\" \",VLOOKUP(K268,Proposito_programa!$C$2:$E$59,2,FALSE))","v":"Espacio público más seguro y construido colectivamente"},{"$f":"IF(ISERROR(VLOOKUP(K268,Proposito_programa!$C$2:$E$59,3,FALSE)),\" \",VLOOKUP(K268,Proposito_programa!$C$2:$E$59,3,FALSE))","v":"Propósito 3: Inspirar confianza y legitimidad para vivir sin miedo y ser epicentro de cultura ciudadana, paz y reconciliación"},1377,2,901351433,"CONSORCIO MAJOPE","LUIS GABRIEL RINCON RODRIGUEZ ","HECTOR GERARDO IBAÑEZ QUINTERO","Consorcio",8300779020,"CONSTRUCTORA HEFUS LIMITADA ",0.5,null,null,1,49452038,49452038,null,"2021-03-09","2021-03-09","2021-05-09",null,null,null,null,null,null,null,null,null,null,null,0]
["CIN-180-2019",2019,"FDLS-CMA-197-2019","https://community.secop.gov.co/Public/Tendering/OpportunityDetail/Index?noticeUID=CO1.NTC.998642&isFromPublicArea=True&isModal=False","Interventoría","Concurso de méritos","No aplica","REALIZAR LA INTERVENTORÍA TÉCNICA, ADMINISTRATIVA, FINANCIERA, JURIDICA, AMBIENTAL Y SISO AL CONTRATO QUE RESULTE DEL PROCESO LICITATORIO FDLS-LP-188-2019, CUYO OBJETO ES: REALIZAR EL DIAGNOSTICO, DEMOLICION, CONSTRUCCION, MANTENIMIENTO Y REPARACIONES LOCATIVAS DE LOS SALONES COMUNALES Y/O EQUIPAMIENTOS COMUNITARIOS POR EL SISTEMA DE PRECIOS FIJOS SIN FORMULA DE REAJUSTE, EN LA LOCALIDAD DE SUMAPAZ, DC","Inversión","Bogotá Mejor para Todos",45,{"$f":"IF(ISERROR(VLOOKUP(K269,Proposito_programa!$C$2:$E$59,2,FALSE)),\" \",VLOOKUP(K269,Proposito_programa!$C$2:$E$59,2,FALSE))","v":"Espacio público más seguro y construido colectivamente"},{"$f":"IF(ISERROR(VLOOKUP(K269,Proposito_programa!$C$2:$E$59,3,FALSE)),\" \",VLOOKUP(K269,Proposito_programa!$C$2:$E$59,3,FALSE))","v":"Propósito 3: Inspirar confianza y legitimidad para vivir sin miedo y ser epicentro de cultura ciudadana, paz y reconciliación"},1377,2,901351433,"CONSORCIO MAJOPE","HELBERTH ENRIQUE BALLESTAS BARRIOS","LINA MARCELA SALAZAR BERMUDEZ","Consorcio",79865330,"LUDWIG PAEZ MUÑOZ ",0.5,null,null,null,null,0,null,null,null,null,null,null,null,null,null,null,null,null,null,null,null,"-"]
["CIN-181-2019",2019,"FDLS-CMA-196-2019","https://community.secop.gov.co/Public/Tendering/OpportunityDetail/Index?noticeUID=CO1.NTC.997434&isFromPublicArea=True&isModal=False","Interventoría","Concurso de méritos","No aplica","REALIZAR LA INTERVENTORÍA TÉCNICA, ADMINISTRATIVA, FINANCIERA, AMBIENTAL, SOCIAL, SISO Y JURÍDICA AL CONTRATO QUE RESULTE DEL PROCESO LICITATORIO, CUYO OBJETO ES: REALIZAR POR EL SISTEMA DE PRECIOS UNITARIOS FIJOS SIN FORMULA DE REAJUSTE Y A MONTO AGOTABLE, EL RECONOCIMIENTO, VERIFICACIÓN Y DIAGNÓSTICOS ASI COMO LAS OBRAS DE MANTENIMIENTO REQUERIDAS PARA LA ADECUACIÓN, REHABILITACIÓN Y FUNCIONAMIENTO DE LOS SISTEMAS DE ACUEDUCTOS VEREDALES EN LA LOCALIDAD DE SUMAPAZ","Inversión","Bogotá Mejor para Todos",41,{"$f":"IF(ISERROR(VLOOKUP(K270,Proposito_programa!$C$2:$E$59,2,FALSE)),\" \",VLOOKUP(K270,Proposito_programa!$C$2:$E$59,2,FALSE))","v":"Sin machismo ni violencias contra las mujeres, las niñas y los niños"},{"$f":"IF(ISERROR(VLOOKUP(K270,Proposito_programa!$C$2:$E$59,3,FALSE)),\" \",VLOOKUP(K270,Proposito_programa!$C$2:$E$59,3,FALSE))","v":"Propósito 3: Inspirar confianza y legitimidad para vivir sin miedo y ser epicentro de cultura ciudadana, paz y reconciliación"},1356,1,901350924,"CONSORCIO ORION 126","KAREN NATALIA NEIRA BAUTISTA","MARIA CAMILA NIEVES PARRA","Consorcio",900245275,"HIDROS DE COLOMBIA S.A.S. ",0.5,null,null,1,85403685,85403685,null,"2021-06-10","2021-06-10","2021-09-11",null,null,null,null,null,null,null,null,null,null,null,0]
["CIN-181-2019",2019,"FDLS-CMA-196-2019","https://community.secop.gov.co/Public/Tendering/OpportunityDetail/Index?noticeUID=CO1.NTC.997434&isFromPublicArea=True&isModal=False","Interventoría","Concurso de méritos","No aplica","REALIZAR LA INTERVENTORÍA TÉCNICA, ADMINISTRATIVA, FINANCIERA, AMBIENTAL, SOCIAL, SISO Y JURÍDICA AL CONTRATO QUE RESULTE DEL PROCESO LICITATORIO, CUYO OBJETO ES: REALIZAR POR EL SISTEMA DE PRECIOS UNITARIOS FIJOS SIN FORMULA DE REAJUSTE Y A MONTO AGOTABLE, EL RECONOCIMIENTO, VERIFICACIÓN Y DIAGNÓSTICOS ASI COMO LAS OBRAS DE MANTENIMIENTO REQUERIDAS PARA LA ADECUACIÓN, REHABILITACIÓN Y FUNCIONAMIENTO DE LOS SISTEMAS DE ACUEDUCTOS VEREDALES EN LA LOCALIDAD DE SUMAPAZ","Inversión","Bogotá Mejor para Todos",41,{"$f":"IF(ISERROR(VLOOKUP(K271,Proposito_programa!$C$2:$E$59,2,FALSE)),\" \",VLOOKUP(K271,Proposito_programa!$C$2:$E$59,2,FALSE))","v":"Sin machismo ni violencias contra las mujeres, las niñas y los niños"},{"$f":"IF(ISERROR(VLOOKUP(K271,Proposito_programa!$C$2:$E$59,3,FALSE)),\" \",VLOOKUP(K271,Proposito_programa!$C$2:$E$59,3,FALSE))","v":"Propósito 3: Inspirar confianza y legitimidad para vivir sin miedo y ser epicentro de cultura ciudadana, paz y reconciliación"},1356,1,901350924,"CONSORCIO ORION 126","YASMIN ANDREA CIFUENTES","SUBRED INTEGRADA DE SERVICIOS DE SALUD SUR ESE","Consorcio",816000029,"AGUASANITARIAS S.A.S. ",0.5,null,null,null,null,0,null,null,null,null,null,null,null,null,null,null,null,null,null,null,null,"-"]
["CIN-183-2019",2019,"FDLS-MC-200-2019","https://community.secop.gov.co/Public/Tendering/OpportunityDetail/Index?noticeUID=CO1.NTC.1013206&isFromPublicArea=True&isModal=False","Interventoría","Contratación mínima cuantia","No aplica","REALIZAR LA INTERVENTORÍA TÉCNICA, ADMINISTRATIVA, FINANCIERA, JURÍDICA Y AMBIENTAL AL CONTRATO QUE DERIVA EL PROCESO FDLS-SAMC-190-2019, CUYO OBJETO ES: \"PRESTAR LOS SERVICIOS PARA LA ORGANIZACIÓN, COORDINACIÓN Y EJECUCIÓN DE LA TERCERA FASE DE LA ESCUELAS DE FORMACIÓN ARTÍSTICA Y CULTURAL DE SUMAPAZ” (EFACS III)","Inversión","Bogotá Mejor para Todos",11,{"$f":"IF(ISERROR(VLOOKUP(K272,Proposito_programa!$C$2:$E$59,2,FALSE)),\" \",VLOOKUP(K272,Proposito_programa!$C$2:$E$59,2,FALSE))","v":"Salud y bienestar para niñas y niños"},{"$f":"IF(ISERROR(VLOOKUP(K272,Proposito_programa!$C$2:$E$59,3,FALSE)),\" \",VLOOKUP(K272,Proposito_programa!$C$2:$E$59,3,FALSE))","v":"Propósito 1: Hacer un nuevo contrato social para incrementar la inclusión social, productiva y política"},1353,4,52268409,"LORENA MENDEZ VALLEJO","NORBEY DANILO MARTINEZ MORALES\n- CEDIDO A \nDANIEL FERNANDO TUSSO CORTES","I3 SOLUCIONES SAS","Persona Natural",null,null,null,null,null,1,3506250,3506250,null,"2021-07-14","2021-07-14","2021-09-11",null,null,null,null,null,null,null,null,null,null,null,0]
["CSE-133-2020",2020,"FDLS-CSE-091-2020","https://community.secop.gov.co/Public/Tendering/OpportunityDetail/Index?noticeUID=CO1.NTC.1287243&isFromPublicArea=True&isModal=False","Seguros","Selección abreviada","Selección abreviada por menor cuantía ","CONTRATAR LOS SEGUROS QUE AMPAREN LOS INTERESES PATRIMONIALES ACTUALES Y FUTUROS, ASÍ COMO LOS BIENES DE PROPIEDAD DE LA ALCALDIA LOCAL DE SUMAPAZ, QUE ESTÉN BAJO SU RESPONSABILIDAD Y CUSTODIA Y AQUELLOS QUE SEAN ADQUIRIDOS PARA DESARROLLAR LAS FUNCIONES INHERENTES A SU ACTIVIDAD, ASI COMO CUALQUIER OTRA PÓLIZA DE SEGUROS QUE REQUIERA LA ENTIDAD EN EL DESARROLLO DE SU ACTIVIDAD","Funcionamiento","Bogotá Mejor para Todos","No aplica",{"$f":"IF(ISERROR(VLOOKUP(K273,Proposito_programa!$C$2:$E$59,2,FALSE)),\" \",VLOOKUP(K273,Proposito_programa!$C$2:$E$59,2,FALSE))","v":" "},{"$f":"IF(ISERROR(VLOOKUP(K273,Proposito_programa!$C$2:$E$59,3,FALSE)),\" \",VLOOKUP(K273,Proposito_programa!$C$2:$E$59,3,FALSE))","v":" "},null,1,860524654,"ASEGURADORA SOLIDARIA DE COLOMBIA ENTIDAD COOPERATIVA","JHON EDISSON PARDO HERREÑO","ASOCIACIÓN ARKAMBIENTAL SIGLA ARKAMBIENTAL","Persona Jurídica",null,null,null,null,null,1,1886400,1886400,null,"2021-05-10","2021-05-10","2021-06-10",null,null,null,null,null,null,null,null,null,"X",null,0]
["CSE-133-2020",2020,"FDLS-CSE-091-2020","https://community.secop.gov.co/Public/Tendering/OpportunityDetail/Index?noticeUID=CO1.NTC.1287243&isFromPublicArea=True&isModal=False","Seguros","Selección abreviada","Selección abreviada por menor cuantía ","CONTRATAR LOS SEGUROS QUE AMPAREN LOS INTERESES PATRIMONIALES ACTUALES Y FUTUROS, ASÍ COMO LOS BIENES DE PROPIEDAD DE LA ALCALDIA LOCAL DE SUMAPAZ, QUE ESTÉN BAJO SU RESPONSABILIDAD Y CUSTODIA Y AQUELLOS QUE SEAN ADQUIRIDOS PARA DESARROLLAR LAS FUNCIONES INHERENTES A SU ACTIVIDAD, ASI COMO CUALQUIER OTRA PÓLIZA DE SEGUROS QUE REQUIERA LA ENTIDAD EN EL DESARROLLO DE SU ACTIVIDAD","Funcionamiento","Bogotá Mejor para Todos","No aplica",{"$f":"IF(ISERROR(VLOOKUP(K274,Proposito_programa!$C$2:$E$59,2,FALSE)),\" \",VLOOKUP(K274,Proposito_programa!$C$2:$E$59,2,FALSE))","v":" "}," ",null,1,860524654,"ASEGURADORA SOLIDARIA DE COLOMBIA ENTIDAD COOPERATIVA","JHON EDISSON PARDO HERREÑO","ASOCIACIÓN ARKAMBIENTAL SIGLA ARKAMBIENTAL","Persona Jurídica",null,null,null,null,null,1,4619614,4619614,null,"2021-05-13","2021-05-13","2021-06-10",null,null,null,null,null,null,null,null,null,"X",null,0]
["CPS-168-2020",2020,"FDLS-CD-171-2020","https://community.secop.gov.co/Public/Tendering/OpportunityDetail/Index?noticeUID=CO1.NTC.1372047&isFromPublicArea=True&isModal=False","Contratos de prestación de servicios profesionales y de apoyo a la gestión","Contratación directa","Prestación de servicios profesionales y de apoyo a la gestión, o para la ejecución de trabajos artísticos que sólo puedan encomendarse a determinadas personas naturales;","PRESTAR SUS SERVICIOS COMO TÉCNICO DE APOYO ADMINISTRATIVO AL ÁREA DE GESTIÓN DE DESARROLLO LOCAL DE LA ALCALDÍA LOCAL DE SUMAPAZ","Inversión","Bogotá Mejor para Todos",45,{"$f":"IF(ISERROR(VLOOKUP(K275,Proposito_programa!$C$2:$E$59,2,FALSE)),\" \",VLOOKUP(K275,Proposito_programa!$C$2:$E$59,2,FALSE))","v":"Espacio público más seguro y construido colectivamente"},{"$f":"IF(ISERROR(VLOOKUP(K275,Proposito_programa!$C$2:$E$59,3,FALSE)),\" \",VLOOKUP(K275,Proposito_programa!$C$2:$E$59,3,FALSE))","v":"Propósito 3: Inspirar confianza y legitimidad para vivir sin miedo y ser epicentro de cultura ciudadana, paz y reconciliación"},1375,null,52603721,"SANDRA MILENA RODRIGUEZ SASTOQUE","DANIELLA ZABALA AVELLA","CONSORCIO CITIC","Persona Natural",null,null,null,null,null,1,4876666,4876666,null,"2021-05-31","2021-05-31","2021-07-08",null,null,null,null,null,null,null,null,null,null,null,0]
["CPS-174-2020",2020,"FDLS-MC-169-2020","https://community.secop.gov.co/Public/Tendering/OpportunityDetail/Index?noticeUID=CO1.NTC.1362591&isFromPublicArea=True&isModal=False","Contratos de prestación de servicios","Contratación mínima cuantia","No aplica","PRESTAR LOS SERVICIOS DE MONITOREO VEHICULAR INTEGRAL POR GPS PARA LOS VEHÍCULOS DE PROPIEDAD O TENENCIA DEL FONDO DE DESARROLLO LOCAL DE SUMAPAZ","Inversión","Bogotá Mejor para Todos",45,{"$f":"IF(ISERROR(VLOOKUP(K276,Proposito_programa!$C$2:$E$59,2,FALSE)),\" \",VLOOKUP(K276,Proposito_programa!$C$2:$E$59,2,FALSE))","v":"Espacio público más seguro y construido colectivamente"},{"$f":"IF(ISERROR(VLOOKUP(K276,Proposito_programa!$C$2:$E$59,3,FALSE)),\" \",VLOOKUP(K276,Proposito_programa!$C$2:$E$59,3,FALSE))","v":"Propósito 3: Inspirar confianza y legitimidad para vivir sin miedo y ser epicentro de cultura ciudadana, paz y reconciliación"},1375,3,900465924,"VISATEL DE COLOMBIA SAS","KAREN NAYIBE MARTINEZ MOLINA","Adescubrir Travel & Adventure SAS","Persona Jurídica",null,null,null,null,null,1,7175000,7175000,null,"2021-04-28","2021-04-28","2021-10-06",null,null,null,null,null,null,null,null,null,null,null,0]
["CPS-220-2020",2020,"FDLS-SAMC-135-2020","https://community.secop.gov.co/Public/Tendering/OpportunityDetail/Index?noticeUID=CO1.NTC.1417279&isFromPublicArea=True&isModal=False","Contratos de prestación de servicios","Selección abreviada","Selección abreviada por menor cuantía ","PRESTAR EL SERVICIO DE MANTENIMIENTO PREVENTIVO Y CORRECTIVO DE LOS VEHÍCULOS LIVIANOS DE PROPIEDAD, GUARDA O TENENCIA DEL FONDO DE DESARROLLO LOCAL DE SUMAPAZ CON SUMINISTRO DE REPUESTOS, LLANTAS, INSUMOS Y MANO DE OBRA","Funcionamiento","Bogotá Mejor para Todos","No aplica",{"$f":"IF(ISERROR(VLOOKUP(K277,Proposito_programa!$C$2:$E$59,2,FALSE)),\" \",VLOOKUP(K277,Proposito_programa!$C$2:$E$59,2,FALSE))","v":" "},{"$f":"IF(ISERROR(VLOOKUP(K277,Proposito_programa!$C$2:$E$59,3,FALSE)),\" \",VLOOKUP(K277,Proposito_programa!$C$2:$E$59,3,FALSE))","v":" "},null,10,860515236,"PRECAR LTDA SAS","CARLOS ANDRES AMEZQUITA ANGULO","CONSORCIO CONSERVACION SUMAPAZ","Persona Jurídica",null,null,null,null,null,1,64012338,64012338,null,"2021-04-30","2021-04-30","2021-08-24",null,null,null,null,null,null,null,null,null,null,null,0]
["CIA-255-2020",2020,"FDLS-CD-272-2020.","https://community.secop.gov.co/Public/Tendering/OpportunityDetail/Index?noticeUID=CO1.NTC.1611235&isFromPublicArea=True&isModal=False","Contratos interadministrativos","Contratación directa","Contratos interadministrativos","AUNAR ESFUERZOS TÉCNICOS, ADMINISTRATIVOS Y FINANCIEROS PARA LA CREACIÓN DEL EQUIPO COMUNITARIO DE RESPUESTA EN EMERGENCIAS (ECRE) CON CONOCIMIENTOS ADICIONALES EN MEDIOS DE VIDA Y CONSERVACIÓN AMBIENTAL EN LA LOCALIDAD DE SUMAPAZ","Inversión","Bogotá Mejor para Todos",45,{"$f":"IF(ISERROR(VLOOKUP(K278,Proposito_programa!$C$2:$E$59,2,FALSE)),\" \",VLOOKUP(K278,Proposito_programa!$C$2:$E$59,2,FALSE))","v":"Espacio público más seguro y construido colectivamente"},{"$f":"IF(ISERROR(VLOOKUP(K278,Proposito_programa!$C$2:$E$59,3,FALSE)),\" \",VLOOKUP(K278,Proposito_programa!$C$2:$E$59,3,FALSE))","v":"Propósito 3: Inspirar confianza y legitimidad para vivir sin miedo y ser epicentro de cultura ciudadana, paz y reconciliación"},1377,1,860070301,"CRUZ ROJA BOGOTA SECCIONAL CUNDINAMARCA Y BOGOTA","LUIS MARIO REYES MUNEVAR","A&A CONSULTORIA E INGENIERIA S.A.S","Persona Jurídica",null,null,null,null,null,1,24014192,24014192,null,"2021-03-11","2021-03-11","2021-05-11",null,null,null,null,null,null,null,null,null,null,null,0]
["CPS-271-2020",2020,"FDLS-SAMC-254-2020","https://community.secop.gov.co/Public/Tendering/OpportunityDetail/Index?noticeUID=CO1.NTC.1576109&isFromPublicArea=True&isModal=False","Contratos de prestación de servicios","Selección abreviada","Selección abreviada por menor cuantía ","PRESTAR EL SERVICIO DE TRANSPORTE TERRESTRE DE PASAJEROS, CON EL FIN DE ATENDER LOS EVENTOS INSTITUCIONALES PROGRAMADOS POR LA ADMINISTRACIÓN LOCAL, EVENTOS Y ACTIVIDADES DE PROMOCIÓN Y PARTICIPACIÓN","Funcionamiento","Bogotá Mejor para Todos","No aplica",null,null,null,9,830117701,"TRANSPORTES ESPECIALES FSG SAS",null,null,"Persona Jurídica",null,null,null,null,null,1,25000000,25000000,null,"2021-10-28","2021-10-28","07//12/2021"]
["COP-277-2020",2020,"FDLS-LP-259-2020.","https://community.secop.gov.co/Public/Tendering/OpportunityDetail/Index?noticeUID=CO1.NTC.1578702&isFromPublicArea=True&isModal=False","Obra pública","Licitación pública","No aplica","REALIZAR POR EL SISTEMA DE PRECIOS UNITARIOS FIJOS SIN FORMULA DE REAJUSTE, LA IMPLEMENTACIÓN DE MODELOS DE BIOINGENIERÍA Y SU EJECUCIÓN PARA LA RESTAURACIÓN Y RECUPERACIÓN DE ZONAS CON PROCESOS DE EROSIÓN O FENÓMENOS DE REMOCIÓN EN MASA EN LA LOCALIDAD DE SUMAPAZ","Inversión","Bogotá Mejor para Todos",4,{"$f":"IF(ISERROR(VLOOKUP(K280,Proposito_programa!$C$2:$E$59,2,FALSE)),\" \",VLOOKUP(K280,Proposito_programa!$C$2:$E$59,2,FALSE))","v":"Prevención de la exclusión por razones étnicas, religiosas, sociales, políticas y de orientación sexual"},{"$f":"IF(ISERROR(VLOOKUP(K280,Proposito_programa!$C$2:$E$59,3,FALSE)),\" \",VLOOKUP(K280,Proposito_programa!$C$2:$E$59,3,FALSE))","v":"Propósito 1: Hacer un nuevo contrato social para incrementar la inclusión social, productiva y política"},1340,3,901442968,"CONSORCIO MANVIALES\nBIOINGENIERIA",null,null,"Consorcio",8305097503,"MANTENIMIENTOS VIALES SAS",0.7,null,null,1,655139732,655139732,null,"16/12/2021 ","16/12/2021 ","2022-03-16",null,null,null,null,null,null,null,null,null,0,null,{"$f":"IF(ISERROR(AC280/AB280),\"-\",(AC280/AB280))","v":0}]
["COP-277-2020",2020,"FDLS-LP-259-2020.","https://community.secop.gov.co/Public/Tendering/OpportunityDetail/Index?noticeUID=CO1.NTC.1578702&isFromPublicArea=True&isModal=False","Obra pública","Licitación pública","No aplica","REALIZAR POR EL SISTEMA DE PRECIOS UNITARIOS FIJOS SIN FORMULA DE REAJUSTE, LA IMPLEMENTACIÓN DE MODELOS DE BIOINGENIERÍA Y SU EJECUCIÓN PARA LA RESTAURACIÓN Y RECUPERACIÓN DE ZONAS CON PROCESOS DE EROSIÓN O FENÓMENOS DE REMOCIÓN EN MASA EN LA LOCALIDAD DE SUMAPAZ","Inversión","Bogotá Mejor para Todos",4,{"$f":"IF(ISERROR(VLOOKUP(K281,Proposito_programa!$C$2:$E$59,2,FALSE)),\" \",VLOOKUP(K281,Proposito_programa!$C$2:$E$59,2,FALSE))","v":"Prevención de la exclusión por razones étnicas, religiosas, sociales, políticas y de orientación sexual"},"Propósito 1: Hacer un nuevo contrato social para incrementar la inclusión social, productiva y política",1340,3,901442968,"CONSORCIO MANVIALES\nBIOINGENIERIA",null,null,"Consorcio",79125314,"ALEJANDRO SALAMANCA DELGADO",0.15,null,null,null,null,0,null,null,null,null,null,null,null,null,null,null,null,null,null,0,null,0]
["COP-277-2020",2020,"FDLS-LP-259-2020.","https://community.secop.gov.co/Public/Tendering/OpportunityDetail/Index?noticeUID=CO1.NTC.1578702&isFromPublicArea=True&isModal=False","Obra pública","Licitación pública","No aplica","REALIZAR POR EL SISTEMA DE PRECIOS UNITARIOS FIJOS SIN FORMULA DE REAJUSTE, LA IMPLEMENTACIÓN DE MODELOS DE BIOINGENIERÍA Y SU EJECUCIÓN PARA LA RESTAURACIÓN Y RECUPERACIÓN DE ZONAS CON PROCESOS DE EROSIÓN O FENÓMENOS DE REMOCIÓN EN MASA EN LA LOCALIDAD DE SUMAPAZ","Inversión","Bogotá Mejor para Todos",4,{"$f":"IF(ISERROR(VLOOKUP(K282,Proposito_programa!$C$2:$E$59,2,FALSE)),\" \",VLOOKUP(K282,Proposito_programa!$C$2:$E$59,2,FALSE))","v":"Prevención de la exclusión por razones étnicas, religiosas, sociales, políticas y de orientación sexual"},"Propósito 1: Hacer un nuevo contrato social para incrementar la inclusión social, productiva y política",1340,3,901442968,"CONSORCIO MANVIALES\nBIOINGENIERIA",null,null,"Consorcio",91219285,"FIDEL DIAZ RESTREPO ",0.15,null,null,null,null,0,null,null,null,null,null,null,null,null,null,null,null,null,null,0,null,0]
["CPS-278-2020",2020,"FDLS-LP-262-2020","https://community.secop.gov.co/Public/Tendering/OpportunityDetail/Index?noticeUID=CO1.NTC.1586435&isFromPublicArea=True&isModal=False","Contratos de prestación de servicios","Licitación pública","No aplica","DESARROLLAR EL EVENTO DE IDENTIDAD CULTURAL SUMAPACEÑA - FERIA AGROAMBIENTAL EN SU VIGESIMA VERSIÓN (XX)","Inversión","Bogotá Mejor para Todos",null,{"$f":"IF(ISERROR(VLOOKUP(K283,Proposito_programa!$C$2:$E$59,2,FALSE)),\" \",VLOOKUP(K283,Proposito_programa!$C$2:$E$59,2,FALSE))","v":" "},{"$f":"IF(ISERROR(VLOOKUP(K283,Proposito_programa!$C$2:$E$59,3,FALSE)),\" \",VLOOKUP(K283,Proposito_programa!$C$2:$E$59,3,FALSE))","v":" "},1353,5,800184306,"ROYAL PARK SAS ",null,null,"Persona Jurídica",null,null,null,null,null,1,61993740,{"$f":"+X283+Y283+AA283","v":61993740},null,"2021-12-10","2021-12-10","2021-12-24",null,null,null,null,null,null,null,null,null,0,null,{"$f":"IF(ISERROR(AC283/AB283),\"-\",(AC283/AB283))","v":0}]
["CIN-280-2020",2020,"FDLS-CMA-260-2020","https://community.secop.gov.co/Public/Tendering/OpportunityDetail/Index?noticeUID=CO1.NTC.1580552&isFromPublicArea=True&isModal=False","Interventoría","Concurso de méritos","No aplica","REALIZAR LA INTERVENTORÍA TÉCNICA, ADMINISTRATIVA, FINANCIERA, AMBIENTAL SOCIAL Y JURÍDICA AL CONTRATO CUYO OBJETO ES: “REALIZAR POR EL SISTEMA DE PRECIOS UNITARIOS FIJOS SIN FORMULA DE REAJUSTE, LA IMPLEMENTACIÓN DE MODELOS DE BIOINGENIERÍA Y SU EJECUCIÓN PARA LA RESTAURACIÓN Y RECUPERACIÓN DE ZONAS CON PROCESOS DE EROSION O FENOMENOS DE REMOCIÓN EN MASA EN LA LOCALIDAD DE\nSUMAPAZ","Inversión","Bogotá Mejor para Todos",4,{"$f":"IF(ISERROR(VLOOKUP(K284,Proposito_programa!$C$2:$E$59,2,FALSE)),\" \",VLOOKUP(K284,Proposito_programa!$C$2:$E$59,2,FALSE))","v":"Prevención de la exclusión por razones étnicas, religiosas, sociales, políticas y de orientación sexual"},{"$f":"IF(ISERROR(VLOOKUP(K284,Proposito_programa!$C$2:$E$59,3,FALSE)),\" \",VLOOKUP(K284,Proposito_programa!$C$2:$E$59,3,FALSE))","v":"Propósito 1: Hacer un nuevo contrato social para incrementar la inclusión social, productiva y política"},1340,4,9014433131,"CONSORCIO\nINTERVENTORIA SUMAPAZ 248",null,null,"Consorcio",9004243063,"SEGO INGENIERIA SAS ",0.5,null,null,1,67968981,67968981,null,"2021-12-23","2021-12-23","2022-04-07",null,null,null,null,null,null,null,null,null,0,null,0]
["CIN-280-2020",2020,"FDLS-CMA-260-2020","https://community.secop.gov.co/Public/Tendering/OpportunityDetail/Index?noticeUID=CO1.NTC.1580552&isFromPublicArea=True&isModal=False","Interventoría","Concurso de méritos","No aplica","REALIZAR LA INTERVENTORÍA TÉCNICA, ADMINISTRATIVA, FINANCIERA, AMBIENTAL SOCIAL Y JURÍDICA AL CONTRATO CUYO OBJETO ES: “REALIZAR POR EL SISTEMA DE PRECIOS UNITARIOS FIJOS SIN FORMULA DE REAJUSTE, LA IMPLEMENTACIÓN DE MODELOS DE BIOINGENIERÍA Y SU EJECUCIÓN PARA LA RESTAURACIÓN Y RECUPERACIÓN DE ZONAS CON PROCESOS DE EROSION O FENOMENOS DE REMOCIÓN EN MASA EN LA LOCALIDAD DE\nSUMAPAZ","Inversión","Bogotá Mejor para Todos",4,{"$f":"IF(ISERROR(VLOOKUP(K285,Proposito_programa!$C$2:$E$59,2,FALSE)),\" \",VLOOKUP(K285,Proposito_programa!$C$2:$E$59,2,FALSE))","v":"Prevención de la exclusión por razones étnicas, religiosas, sociales, políticas y de orientación sexual"},"Propósito 1: Hacer un nuevo contrato social para incrementar la inclusión social, productiva y política",1340,4,9014433131,"CONSORCIO\nINTERVENTORIA SUMAPAZ 248",null,null,"Consorcio",9011981630,"SHM INGENIERIA SAS ",0.5,null,null,null,null,0,null,null,null,null,null,null,null,null,null,null,null,null,null,0,null,0]
[null,null,null,null,null,null,null,null,null,"Un Nuevo Contrato Social y Ambiental para la Bogotá del Siglo XXI",null,{"$f":"IF(ISERROR(VLOOKUP(K286,Proposito_programa!$C$2:$E$59,2,FALSE)),\" \",VLOOKUP(K286,Proposito_programa!$C$2:$E$59,2,FALSE))","v":" "},{"$f":"IF(ISERROR(VLOOKUP(K286,Proposito_programa!$C$2:$E$59,3,FALSE)),\" \",VLOOKUP(K286,Proposito_programa!$C$2:$E$59,3,FALSE))","v":" "},null,null,null,null,null,null,null,null,null,null,null,null,null,null,0,null,null,null,null,null,null,null,null,null,null,null,null,null,null,null,"-"]
[null,null,null,null,null,null,null,null,null,"Un Nuevo Contrato Social y Ambiental para la Bogotá del Siglo XXI",null,{"$f":"IF(ISERROR(VLOOKUP(K287,Proposito_programa!$C$2:$E$59,2,FALSE)),\" \",VLOOKUP(K287,Proposito_programa!$C$2:$E$59,2,FALSE))","v":" "},{"$f":"IF(ISERROR(VLOOKUP(K287,Proposito_programa!$C$2:$E$59,3,FALSE)),\" \",VLOOKUP(K287,Proposito_programa!$C$2:$E$59,3,FALSE))","v":" "},null,null,null,null,"ASOCIACIÓN ARKAMBIENTAL SIGLA ARKAMBIENTAL",null,null,null,null,null,null,null,null,null,0,null,null,null,null,null,null,null,null,null,null,null,null,null,null,null,"-"]
[null,null,null,null,null,null,null,null,null,"Un Nuevo Contrato Social y Ambiental para la Bogotá del Siglo XXI",null,{"$f":"IF(ISERROR(VLOOKUP(K288,Proposito_programa!$C$2:$E$59,2,FALSE)),\" \",VLOOKUP(K288,Proposito_programa!$C$2:$E$59,2,FALSE))","v":" "},{"$f":"IF(ISERROR(VLOOKUP(K288,Proposito_programa!$C$2:$E$59,3,FALSE)),\" \",VLOOKUP(K288,Proposito_programa!$C$2:$E$59,3,FALSE))","v":" "},null,null,null,null,null,null,null,null,null,null,null,null,null,null,0,null,null,null,null,null,null,null,null,null,null,null,null,null,null,null,"-"]
[null,null,null,null,null,null,null,null,null,"Un Nuevo Contrato Social y Ambiental para la Bogotá del Siglo XXI",null,{"$f":"IF(ISERROR(VLOOKUP(K289,Proposito_programa!$C$2:$E$59,2,FALSE)),\" \",VLOOKUP(K289,Proposito_programa!$C$2:$E$59,2,FALSE))","v":" "},{"$f":"IF(ISERROR(VLOOKUP(K289,Proposito_programa!$C$2:$E$59,3,FALSE)),\" \",VLOOKUP(K289,Proposito_programa!$C$2:$E$59,3,FALSE))","v":" "},null,null,null,null,null,null,null,null,null,null,null,null,null,null,0,null,null,null,null,null,null,null,null,null,null,null,null,null,null,null,"-"]
[null,null,null,null,null,null,null,null,null,"Un Nuevo Contrato Social y Ambiental para la Bogotá del Siglo XXI",null,{"$f":"IF(ISERROR(VLOOKUP(K290,Proposito_programa!$C$2:$E$59,2,FALSE)),\" \",VLOOKUP(K290,Proposito_programa!$C$2:$E$59,2,FALSE))","v":" "},{"$f":"IF(ISERROR(VLOOKUP(K290,Proposito_programa!$C$2:$E$59,3,FALSE)),\" \",VLOOKUP(K290,Proposito_programa!$C$2:$E$59,3,FALSE))","v":" "},null,null,null,null,null,null,null,null,null,null,null,null,null,null,0,null,null,null,null,null,null,null,null,null,null,null,null,null,null,null,"-"]
[null,null,null,null,null,null,null,null,null,"Un Nuevo Contrato Social y Ambiental para la Bogotá del Siglo XXI",null,{"$f":"IF(ISERROR(VLOOKUP(K291,Proposito_programa!$C$2:$E$59,2,FALSE)),\" \",VLOOKUP(K291,Proposito_programa!$C$2:$E$59,2,FALSE))","v":" "},{"$f":"IF(ISERROR(VLOOKUP(K291,Proposito_programa!$C$2:$E$59,3,FALSE)),\" \",VLOOKUP(K291,Proposito_programa!$C$2:$E$59,3,FALSE))","v":" "},null,null,null,null,"MARIA CAMILA NIEVES PARRA",null,null,null,null,null,null,null,null,null,0,null,null,null,null,null,null,null,null,null,null,null,null,null,null,null,"-"]
[null,null,null,null,null,null,null,null,null,"Un Nuevo Contrato Social y Ambiental para la Bogotá del Siglo XXI",null,{"$f":"IF(ISERROR(VLOOKUP(K292,Proposito_programa!$C$2:$E$59,2,FALSE)),\" \",VLOOKUP(K292,Proposito_programa!$C$2:$E$59,2,FALSE))","v":" "},{"$f":"IF(ISERROR(VLOOKUP(K292,Proposito_programa!$C$2:$E$59,3,FALSE)),\" \",VLOOKUP(K292,Proposito_programa!$C$2:$E$59,3,FALSE))","v":" "},null,null,null,null,"SUBRED INTEGRADA DE SERVICIOS DE SALUD SUR ESE",null,null,null,null,null,null,null,null,null,0,null,null,null,null,null,null,null,null,null,null,null,null,null,null,null,"-"]
[null,null,null,null,null,null,null,null,null,"Un Nuevo Contrato Social y Ambiental para la Bogotá del Siglo XXI",null,{"$f":"IF(ISERROR(VLOOKUP(K293,Proposito_programa!$C$2:$E$59,2,FALSE)),\" \",VLOOKUP(K293,Proposito_programa!$C$2:$E$59,2,FALSE))","v":" "},{"$f":"IF(ISERROR(VLOOKUP(K293,Proposito_programa!$C$2:$E$59,3,FALSE)),\" \",VLOOKUP(K293,Proposito_programa!$C$2:$E$59,3,FALSE))","v":" "},null,null,null,null,null,null,null,null,null,null,null,null,null,null,0,null,null,null,null,null,null,null,null,null,null,null,null,null,null,null,"-"]
[null,null,null,null,null,null,null,null,null,"Un Nuevo Contrato Social y Ambiental para la Bogotá del Siglo XXI",null,{"$f":"IF(ISERROR(VLOOKUP(K294,Proposito_programa!$C$2:$E$59,2,FALSE)),\" \",VLOOKUP(K294,Proposito_programa!$C$2:$E$59,2,FALSE))","v":" "},{"$f":"IF(ISERROR(VLOOKUP(K294,Proposito_programa!$C$2:$E$59,3,FALSE)),\" \",VLOOKUP(K294,Proposito_programa!$C$2:$E$59,3,FALSE))","v":" "},null,null,null,null,null,null,null,null,null,null,null,null,null,null,0,null,null,null,null,null,null,null,null,null,null,null,null,null,null,null,"-"]
[null,null,null,null,null,null,null,null,null,"Un Nuevo Contrato Social y Ambiental para la Bogotá del Siglo XXI",null,{"$f":"IF(ISERROR(VLOOKUP(K295,Proposito_programa!$C$2:$E$59,2,FALSE)),\" \",VLOOKUP(K295,Proposito_programa!$C$2:$E$59,2,FALSE))","v":" "},{"$f":"IF(ISERROR(VLOOKUP(K295,Proposito_programa!$C$2:$E$59,3,FALSE)),\" \",VLOOKUP(K295,Proposito_programa!$C$2:$E$59,3,FALSE))","v":" "},null,null,null,null,null,null,null,null,null,null,null,null,null,null,0,null,null,null,null,null,null,null,null,null,null,null,null,null,null,null,"-"]
[null,null,null,null,null,null,null,null,null,"Un Nuevo Contrato Social y Ambiental para la Bogotá del Siglo XXI",null,{"$f":"IF(ISERROR(VLOOKUP(K296,Proposito_programa!$C$2:$E$59,2,FALSE)),\" \",VLOOKUP(K296,Proposito_programa!$C$2:$E$59,2,FALSE))","v":" "},{"$f":"IF(ISERROR(VLOOKUP(K296,Proposito_programa!$C$2:$E$59,3,FALSE)),\" \",VLOOKUP(K296,Proposito_programa!$C$2:$E$59,3,FALSE))","v":" "},null,null,null,null,null,null,null,null,null,null,null,null,null,null,0,null,null,null,null,null,null,null,null,null,null,null,null,null,null,null,"-"]
[null,null,null,null,null,null,null,null,null,"Un Nuevo Contrato Social y Ambiental para la Bogotá del Siglo XXI",null,{"$f":"IF(ISERROR(VLOOKUP(K297,Proposito_programa!$C$2:$E$59,2,FALSE)),\" \",VLOOKUP(K297,Proposito_programa!$C$2:$E$59,2,FALSE))","v":" "},{"$f":"IF(ISERROR(VLOOKUP(K297,Proposito_programa!$C$2:$E$59,3,FALSE)),\" \",VLOOKUP(K297,Proposito_programa!$C$2:$E$59,3,FALSE))","v":" "},null,null,null,null,null,null,null,null,null,null,null,null,null,null,0,null,null,null,null,null,null,null,null,null,null,null,null,null,null,null,"-"]
[null,null,null,null,null,null,null,null,null,"Un Nuevo Contrato Social y Ambiental para la Bogotá del Siglo XXI",null,{"$f":"IF(ISERROR(VLOOKUP(K298,Proposito_programa!$C$2:$E$59,2,FALSE)),\" \",VLOOKUP(K298,Proposito_programa!$C$2:$E$59,2,FALSE))","v":" "},{"$f":"IF(ISERROR(VLOOKUP(K298,Proposito_programa!$C$2:$E$59,3,FALSE)),\" \",VLOOKUP(K298,Proposito_programa!$C$2:$E$59,3,FALSE))","v":" "},null,null,null,null,null,null,null,null,null,null,null,null,null,null,0,null,null,null,null,null,null,null,null,null,null,null,null,null,null,null,"-"]
[null,null,null,null,null,null,null,null,null,"Un Nuevo Contrato Social y Ambiental para la Bogotá del Siglo XXI",null,{"$f":"IF(ISERROR(VLOOKUP(K299,Proposito_programa!$C$2:$E$59,2,FALSE)),\" \",VLOOKUP(K299,Proposito_programa!$C$2:$E$59,2,FALSE))","v":" "},{"$f":"IF(ISERROR(VLOOKUP(K299,Proposito_programa!$C$2:$E$59,3,FALSE)),\" \",VLOOKUP(K299,Proposito_programa!$C$2:$E$59,3,FALSE))","v":" "},null,null,null,null,null,null,null,null,null,null,null,null,null,null,0,null,null,null,null,null,null,null,null,null,null,null,null,null,null,null,"-"]
[null,null,null,null,null,null,null,null,null,"Un Nuevo Contrato Social y Ambiental para la Bogotá del Siglo XXI",null,{"$f":"IF(ISERROR(VLOOKUP(K300,Proposito_programa!$C$2:$E$59,2,FALSE)),\" \",VLOOKUP(K300,Proposito_programa!$C$2:$E$59,2,FALSE))","v":" "},{"$f":"IF(ISERROR(VLOOKUP(K300,Proposito_programa!$C$2:$E$59,3,FALSE)),\" \",VLOOKUP(K300,Proposito_programa!$C$2:$E$59,3,FALSE))","v":" "},null,null,null,null,null,null,null,null,null,null,null,null,null,null,0,null,null,null,null,null,null,null,null,null,null,null,null,null,null,null,"-"]
[null,null,null,null,null,null,null,null,null,"Un Nuevo Contrato Social y Ambiental para la Bogotá del Siglo XXI",null,{"$f":"IF(ISERROR(VLOOKUP(K301,Proposito_programa!$C$2:$E$59,2,FALSE)),\" \",VLOOKUP(K301,Proposito_programa!$C$2:$E$59,2,FALSE))","v":" "},{"$f":"IF(ISERROR(VLOOKUP(K301,Proposito_programa!$C$2:$E$59,3,FALSE)),\" \",VLOOKUP(K301,Proposito_programa!$C$2:$E$59,3,FALSE))","v":" "},null,null,null,null,null,null,null,null,null,null,null,null,null,null,0,null,null,null,null,null,null,null,null,null,null,null,null,null,null,null,"-"]
[null,null,null,null,null,null,null,null,null,"Un Nuevo Contrato Social y Ambiental para la Bogotá del Siglo XXI",null,{"$f":"IF(ISERROR(VLOOKUP(K302,Proposito_programa!$C$2:$E$59,2,FALSE)),\" \",VLOOKUP(K302,Proposito_programa!$C$2:$E$59,2,FALSE))","v":" "},{"$f":"IF(ISERROR(VLOOKUP(K302,Proposito_programa!$C$2:$E$59,3,FALSE)),\" \",VLOOKUP(K302,Proposito_programa!$C$2:$E$59,3,FALSE))","v":" "},null,null,null,null,null,null,null,null,null,null,null,null,null,null,0,null,null,null,null,null,null,null,null,null,null,null,null,null,null,null,"-"]
[null,null,null,null,null,null,null,null,null,"Un Nuevo Contrato Social y Ambiental para la Bogotá del Siglo XXI",null,{"$f":"IF(ISERROR(VLOOKUP(K303,Proposito_programa!$C$2:$E$59,2,FALSE)),\" \",VLOOKUP(K303,Proposito_programa!$C$2:$E$59,2,FALSE))","v":" "},{"$f":"IF(ISERROR(VLOOKUP(K303,Proposito_programa!$C$2:$E$59,3,FALSE)),\" \",VLOOKUP(K303,Proposito_programa!$C$2:$E$59,3,FALSE))","v":" "},null,null,null,null,null,null,null,null,null,null,null,null,null,null,0,null,null,null,null,null,null,null,null,null,null,null,null,null,null,null,"-"]
[null,null,null,null,null,null,null,null,null,"Un Nuevo Contrato Social y Ambiental para la Bogotá del Siglo XXI",null,{"$f":"IF(ISERROR(VLOOKUP(K304,Proposito_programa!$C$2:$E$59,2,FALSE)),\" \",VLOOKUP(K304,Proposito_programa!$C$2:$E$59,2,FALSE))","v":" "},{"$f":"IF(ISERROR(VLOOKUP(K304,Proposito_programa!$C$2:$E$59,3,FALSE)),\" \",VLOOKUP(K304,Proposito_programa!$C$2:$E$59,3,FALSE))","v":" "},null,null,null,null,null,null,null,null,null,null,null,null,null,null,0,null,null,null,null,null,null,null,null,null,null,null,null,null,null,null,"-"]
[null,null,null,null,null,null,null,null,null,"Un Nuevo Contrato Social y Ambiental para la Bogotá del Siglo XXI",null,{"$f":"IF(ISERROR(VLOOKUP(K305,Proposito_programa!$C$2:$E$59,2,FALSE)),\" \",VLOOKUP(K305,Proposito_programa!$C$2:$E$59,2,FALSE))","v":" "},{"$f":"IF(ISERROR(VLOOKUP(K305,Proposito_programa!$C$2:$E$59,3,FALSE)),\" \",VLOOKUP(K305,Proposito_programa!$C$2:$E$59,3,FALSE))","v":" "},null,null,null,null,null,null,null,null,null,null,null,null,null,null,0,null,null,null,null,null,null,null,null,null,null,null,null,null,null,null,"-"]
[null,null,null,null,null,null,null,null,null,"Un Nuevo Contrato Social y Ambiental para la Bogotá del Siglo XXI",null,{"$f":"IF(ISERROR(VLOOKUP(K306,Proposito_programa!$C$2:$E$59,2,FALSE)),\" \",VLOOKUP(K306,Proposito_programa!$C$2:$E$59,2,FALSE))","v":" "},{"$f":"IF(ISERROR(VLOOKUP(K306,Proposito_programa!$C$2:$E$59,3,FALSE)),\" \",VLOOKUP(K306,Proposito_programa!$C$2:$E$59,3,FALSE))","v":" "},null,null,null,null,null,null,null,null,null,null,null,null,null,null,0,null,null,null,null,null,null,null,null,null,null,null,null,null,null,null,"-"]
[null,null,null,null,null,null,null,null,null,"Un Nuevo Contrato Social y Ambiental para la Bogotá del Siglo XXI",null,{"$f":"IF(ISERROR(VLOOKUP(K307,Proposito_programa!$C$2:$E$59,2,FALSE)),\" \",VLOOKUP(K307,Proposito_programa!$C$2:$E$59,2,FALSE))","v":" "},{"$f":"IF(ISERROR(VLOOKUP(K307,Proposito_programa!$C$2:$E$59,3,FALSE)),\" \",VLOOKUP(K307,Proposito_programa!$C$2:$E$59,3,FALSE))","v":" "},null,null,null,null,null,null,null,null,null,null,null,null,null,null,0,null,null,null,null,null,null,null,null,null,null,null,null,null,null,null,"-"]
[null,null,null,null,null,null,null,null,null,"Un Nuevo Contrato Social y Ambiental para la Bogotá del Siglo XXI",null,{"$f":"IF(ISERROR(VLOOKUP(K308,Proposito_programa!$C$2:$E$59,2,FALSE)),\" \",VLOOKUP(K308,Proposito_programa!$C$2:$E$59,2,FALSE))","v":" "},{"$f":"IF(ISERROR(VLOOKUP(K308,Proposito_programa!$C$2:$E$59,3,FALSE)),\" \",VLOOKUP(K308,Proposito_programa!$C$2:$E$59,3,FALSE))","v":" "},null,null,null,null,null,null,null,null,null,null,null,null,null,null,0,null,null,null,null,null,null,null,null,null,null,null,null,null,null,null,"-"]
[null,null,null,null,null,null,null,null,null,"Un Nuevo Contrato Social y Ambiental para la Bogotá del Siglo XXI",null,{"$f":"IF(ISERROR(VLOOKUP(K309,Proposito_programa!$C$2:$E$59,2,FALSE)),\" \",VLOOKUP(K309,Proposito_programa!$C$2:$E$59,2,FALSE))","v":" "},{"$f":"IF(ISERROR(VLOOKUP(K309,Proposito_programa!$C$2:$E$59,3,FALSE)),\" \",VLOOKUP(K309,Proposito_programa!$C$2:$E$59,3,FALSE))","v":" "},null,null,null,null,null,null,null,null,null,null,null,null,null,null,0,null,null,null,null,null,null,null,null,null,null,null,null,null,null,null,"-"]
[null,null,null,null,null,null,null,null,null,"Un Nuevo Contrato Social y Ambiental para la Bogotá del Siglo XXI",null,{"$f":"IF(ISERROR(VLOOKUP(K310,Proposito_programa!$C$2:$E$59,2,FALSE)),\" \",VLOOKUP(K310,Proposito_programa!$C$2:$E$59,2,FALSE))","v":" "},{"$f":"IF(ISERROR(VLOOKUP(K310,Proposito_programa!$C$2:$E$59,3,FALSE)),\" \",VLOOKUP(K310,Proposito_programa!$C$2:$E$59,3,FALSE))","v":" "},null,null,null,null,null,null,null,null,null,null,null,null,null,null,0,null,null,null,null,null,null,null,null,null,null,null,null,null,null,null,"-"]
[null,null,null,null,null,null,null,null,null,"Un Nuevo Contrato Social y Ambiental para la Bogotá del Siglo XXI",null,{"$f":"IF(ISERROR(VLOOKUP(K311,Proposito_programa!$C$2:$E$59,2,FALSE)),\" \",VLOOKUP(K311,Proposito_programa!$C$2:$E$59,2,FALSE))","v":" "},{"$f":"IF(ISERROR(VLOOKUP(K311,Proposito_programa!$C$2:$E$59,3,FALSE)),\" \",VLOOKUP(K311,Proposito_programa!$C$2:$E$59,3,FALSE))","v":" "},null,null,null,null,null,null,null,null,null,null,null,null,null,null,0,null,null,null,null,null,null,null,null,null,null,null,null,null,null,null,"-"]
[null,null,null,null,null,null,null,null,null,"Un Nuevo Contrato Social y Ambiental para la Bogotá del Siglo XXI",null,{"$f":"IF(ISERROR(VLOOKUP(K312,Proposito_programa!$C$2:$E$59,2,FALSE)),\" \",VLOOKUP(K312,Proposito_programa!$C$2:$E$59,2,FALSE))","v":" "},{"$f":"IF(ISERROR(VLOOKUP(K312,Proposito_programa!$C$2:$E$59,3,FALSE)),\" \",VLOOKUP(K312,Proposito_programa!$C$2:$E$59,3,FALSE))","v":" "},null,null,null,null,null,null,null,null,null,null,null,null,null,null,0,null,null,null,null,null,null,null,null,null,null,null,null,null,null,null,"-"]
[null,null,null,null,null,null,null,null,null,"Un Nuevo Contrato Social y Ambiental para la Bogotá del Siglo XXI",null,{"$f":"IF(ISERROR(VLOOKUP(K313,Proposito_programa!$C$2:$E$59,2,FALSE)),\" \",VLOOKUP(K313,Proposito_programa!$C$2:$E$59,2,FALSE))","v":" "},{"$f":"IF(ISERROR(VLOOKUP(K313,Proposito_programa!$C$2:$E$59,3,FALSE)),\" \",VLOOKUP(K313,Proposito_programa!$C$2:$E$59,3,FALSE))","v":" "},null,null,null,null,null,null,null,null,null,null,null,null,null,null,0,null,null,null,null,null,null,null,null,null,null,null,null,null,null,null,"-"]
[null,null,null,null,null,null,null,null,null,"Un Nuevo Contrato Social y Ambiental para la Bogotá del Siglo XXI",null,{"$f":"IF(ISERROR(VLOOKUP(K314,Proposito_programa!$C$2:$E$59,2,FALSE)),\" \",VLOOKUP(K314,Proposito_programa!$C$2:$E$59,2,FALSE))","v":" "},{"$f":"IF(ISERROR(VLOOKUP(K314,Proposito_programa!$C$2:$E$59,3,FALSE)),\" \",VLOOKUP(K314,Proposito_programa!$C$2:$E$59,3,FALSE))","v":" "},null,null,null,null,null,null,null,null,null,null,null,null,null,null,0,null,null,null,null,null,null,null,null,null,null,null,null,null,null,null,"-"]
[null,null,null,null,null,null,null,null,null,"Un Nuevo Contrato Social y Ambiental para la Bogotá del Siglo XXI",null,{"$f":"IF(ISERROR(VLOOKUP(K315,Proposito_programa!$C$2:$E$59,2,FALSE)),\" \",VLOOKUP(K315,Proposito_programa!$C$2:$E$59,2,FALSE))","v":" "},{"$f":"IF(ISERROR(VLOOKUP(K315,Proposito_programa!$C$2:$E$59,3,FALSE)),\" \",VLOOKUP(K315,Proposito_programa!$C$2:$E$59,3,FALSE))","v":" "},null,null,null,null,null,null,null,null,null,null,null,null,null,null,0,null,null,null,null,null,null,null,null,null,null,null,null,null,null,null,"-"]
[null,null,null,null,null,null,null,null,null,"Un Nuevo Contrato Social y Ambiental para la Bogotá del Siglo XXI",null,{"$f":"IF(ISERROR(VLOOKUP(K316,Proposito_programa!$C$2:$E$59,2,FALSE)),\" \",VLOOKUP(K316,Proposito_programa!$C$2:$E$59,2,FALSE))","v":" "},{"$f":"IF(ISERROR(VLOOKUP(K316,Proposito_programa!$C$2:$E$59,3,FALSE)),\" \",VLOOKUP(K316,Proposito_programa!$C$2:$E$59,3,FALSE))","v":" "},null,null,null,null,null,null,null,null,null,null,null,null,null,null,0,null,null,null,null,null,null,null,null,null,null,null,null,null,null,null,"-"]
[null,null,null,null,null,null,null,null,null,"Un Nuevo Contrato Social y Ambiental para la Bogotá del Siglo XXI",null,{"$f":"IF(ISERROR(VLOOKUP(K317,Proposito_programa!$C$2:$E$59,2,FALSE)),\" \",VLOOKUP(K317,Proposito_programa!$C$2:$E$59,2,FALSE))","v":" "},{"$f":"IF(ISERROR(VLOOKUP(K317,Proposito_programa!$C$2:$E$59,3,FALSE)),\" \",VLOOKUP(K317,Proposito_programa!$C$2:$E$59,3,FALSE))","v":" "},null,null,null,null,null,null,null,null,null,null,null,null,null,null,0,null,null,null,null,null,null,null,null,null,null,null,null,null,null,null,"-"]
[null,null,null,null,null,null,null,null,null,"Un Nuevo Contrato Social y Ambiental para la Bogotá del Siglo XXI",null,{"$f":"IF(ISERROR(VLOOKUP(K318,Proposito_programa!$C$2:$E$59,2,FALSE)),\" \",VLOOKUP(K318,Proposito_programa!$C$2:$E$59,2,FALSE))","v":" "},{"$f":"IF(ISERROR(VLOOKUP(K318,Proposito_programa!$C$2:$E$59,3,FALSE)),\" \",VLOOKUP(K318,Proposito_programa!$C$2:$E$59,3,FALSE))","v":" "},null,null,null,null,null,null,null,null,null,null,null,null,null,null,{"$f":"+X318+Y318+AA318","v":0},null,null,null,null,null,null,null,null,null,null,null,null,null,null,null,"-"]
[null,null,null,null,null,null,null,null,null,"Un Nuevo Contrato Social y Ambiental para la Bogotá del Siglo XXI",null,{"$f":"IF(ISERROR(VLOOKUP(K319,Proposito_programa!$C$2:$E$59,2,FALSE)),\" \",VLOOKUP(K319,Proposito_programa!$C$2:$E$59,2,FALSE))","v":" "},{"$f":"IF(ISERROR(VLOOKUP(K319,Proposito_programa!$C$2:$E$59,3,FALSE)),\" \",VLOOKUP(K319,Proposito_programa!$C$2:$E$59,3,FALSE))","v":" "},null,null,null,null,null,null,null,null,null,null,null,null,null,null,0,null,null,null,null,null,null,null,null,null,null,null,null,null,null,null,"-"]
[null,null,null,null,null,null,null,null,null,"Un Nuevo Contrato Social y Ambiental para la Bogotá del Siglo XXI",null,{"$f":"IF(ISERROR(VLOOKUP(K320,Proposito_programa!$C$2:$E$59,2,FALSE)),\" \",VLOOKUP(K320,Proposito_programa!$C$2:$E$59,2,FALSE))","v":" "},{"$f":"IF(ISERROR(VLOOKUP(K320,Proposito_programa!$C$2:$E$59,3,FALSE)),\" \",VLOOKUP(K320,Proposito_programa!$C$2:$E$59,3,FALSE))","v":" "},null,null,null,null,null,null,null,null,null,null,null,null,null,null,0,null,null,null,null,null,null,null,null,null,null,null,null,null,null,null,"-"]
[null,null,null,null,null,null,null,null,null,"Un Nuevo Contrato Social y Ambiental para la Bogotá del Siglo XXI",null,{"$f":"IF(ISERROR(VLOOKUP(K321,Proposito_programa!$C$2:$E$59,2,FALSE)),\" \",VLOOKUP(K321,Proposito_programa!$C$2:$E$59,2,FALSE))","v":" "},{"$f":"IF(ISERROR(VLOOKUP(K321,Proposito_programa!$C$2:$E$59,3,FALSE)),\" \",VLOOKUP(K321,Proposito_programa!$C$2:$E$59,3,FALSE))","v":" "},null,null,null,null,null,null,null,null,null,null,null,null,null,null,0,null,null,null,null,null,null,null,null,null,null,null,null,null,null,null,"-"]
[null,null,null,null,null,null,null,null,null,"Un Nuevo Contrato Social y Ambiental para la Bogotá del Siglo XXI",null,{"$f":"IF(ISERROR(VLOOKUP(K322,Proposito_programa!$C$2:$E$59,2,FALSE)),\" \",VLOOKUP(K322,Proposito_programa!$C$2:$E$59,2,FALSE))","v":" "},{"$f":"IF(ISERROR(VLOOKUP(K322,Proposito_programa!$C$2:$E$59,3,FALSE)),\" \",VLOOKUP(K322,Proposito_programa!$C$2:$E$59,3,FALSE))","v":" "},null,null,null,null,null,null,null,null,null,null,null,null,null,null,0,null,null,null,null,null,null,null,null,null,null,null,null,null,null,null,{"$f":"IF(ISERROR(AC323/AB322),\"-\",(AC323/AB322))","v":"-"}]
[null,null,null,null,null,null,null,null,null,"Un Nuevo Contrato Social y Ambiental para la Bogotá del Siglo XXI",null,{"$f":"IF(ISERROR(VLOOKUP(K323,Proposito_programa!$C$2:$E$59,2,FALSE)),\" \",VLOOKUP(K323,Proposito_programa!$C$2:$E$59,2,FALSE))","v":" "},{"$f":"IF(ISERROR(VLOOKUP(K323,Proposito_programa!$C$2:$E$59,3,FALSE)),\" \",VLOOKUP(K323,Proposito_programa!$C$2:$E$59,3,FALSE))","v":" "},null,null,null,null,null,null,null,null,null,null,null,null,null,null,0,null,null,null,null,null,null,null,null,null,null,null,null,null,null,null,"-"]
[null,null,null,null,null,null,null,null,null,"Un Nuevo Contrato Social y Ambiental para la Bogotá del Siglo XXI",null,{"$f":"IF(ISERROR(VLOOKUP(K324,Proposito_programa!$C$2:$E$59,2,FALSE)),\" \",VLOOKUP(K324,Proposito_programa!$C$2:$E$59,2,FALSE))","v":" "},{"$f":"IF(ISERROR(VLOOKUP(K324,Proposito_programa!$C$2:$E$59,3,FALSE)),\" \",VLOOKUP(K324,Proposito_programa!$C$2:$E$59,3,FALSE))","v":" "},null,null,null,null,null,null,null,null,null,null,null,null,null,null,0,null,null,null,null,null,null,null,null,null,null,null,null,null,null,null,"-"]
[null,null,null,null,null,null,null,null,null,"Un Nuevo Contrato Social y Ambiental para la Bogotá del Siglo XXI",null,{"$f":"IF(ISERROR(VLOOKUP(K325,Proposito_programa!$C$2:$E$59,2,FALSE)),\" \",VLOOKUP(K325,Proposito_programa!$C$2:$E$59,2,FALSE))","v":" "},{"$f":"IF(ISERROR(VLOOKUP(K325,Proposito_programa!$C$2:$E$59,3,FALSE)),\" \",VLOOKUP(K325,Proposito_programa!$C$2:$E$59,3,FALSE))","v":" "},null,null,null,null,null,null,null,null,null,null,null,null,null,null,0,null,null,null,null,null,null,null,null,null,null,null,null,null,null,null,"-"]
[null,null,null,null,null,null,null,null,null,"Un Nuevo Contrato Social y Ambiental para la Bogotá del Siglo XXI",null,{"$f":"IF(ISERROR(VLOOKUP(K326,Proposito_programa!$C$2:$E$59,2,FALSE)),\" \",VLOOKUP(K326,Proposito_programa!$C$2:$E$59,2,FALSE))","v":" "},{"$f":"IF(ISERROR(VLOOKUP(K326,Proposito_programa!$C$2:$E$59,3,FALSE)),\" \",VLOOKUP(K326,Proposito_programa!$C$2:$E$59,3,FALSE))","v":" "},null,null,null,null,null,null,null,null,null,null,null,null,null,null,0,null,null,null,null,null,null,null,null,null,null,null,null,null,null,null,"-"]
[null,null,null,null,null,null,null,null,null,"Un Nuevo Contrato Social y Ambiental para la Bogotá del Siglo XXI",null,{"$f":"IF(ISERROR(VLOOKUP(K327,Proposito_programa!$C$2:$E$59,2,FALSE)),\" \",VLOOKUP(K327,Proposito_programa!$C$2:$E$59,2,FALSE))","v":" "},{"$f":"IF(ISERROR(VLOOKUP(K327,Proposito_programa!$C$2:$E$59,3,FALSE)),\" \",VLOOKUP(K327,Proposito_programa!$C$2:$E$59,3,FALSE))","v":" "},null,null,null,null,null,null,null,null,null,null,null,null,null,null,0,null,null,null,null,null,null,null,null,null,null,null,null,null,null,null,"-"]
[null,null,null,null,null,null,null,null,null,"Un Nuevo Contrato Social y Ambiental para la Bogotá del Siglo XXI",null,{"$f":"IF(ISERROR(VLOOKUP(K328,Proposito_programa!$C$2:$E$59,2,FALSE)),\" \",VLOOKUP(K328,Proposito_programa!$C$2:$E$59,2,FALSE))","v":" "},{"$f":"IF(ISERROR(VLOOKUP(K328,Proposito_programa!$C$2:$E$59,3,FALSE)),\" \",VLOOKUP(K328,Proposito_programa!$C$2:$E$59,3,FALSE))","v":" "},null,null,null,null,null,null,null,null,null,null,null,null,null,null,0,null,null,null,null,null,null,null,null,null,null,null,null,null,null,null,"-"]
[null,null,null,null,null,null,null,null,null,"Un Nuevo Contrato Social y Ambiental para la Bogotá del Siglo XXI",null,{"$f":"IF(ISERROR(VLOOKUP(K329,Proposito_programa!$C$2:$E$59,2,FALSE)),\" \",VLOOKUP(K329,Proposito_programa!$C$2:$E$59,2,FALSE))","v":" "},{"$f":"IF(ISERROR(VLOOKUP(K329,Proposito_programa!$C$2:$E$59,3,FALSE)),\" \",VLOOKUP(K329,Proposito_programa!$C$2:$E$59,3,FALSE))","v":" "},null,null,null,null,null,null,null,null,null,null,null,null,null,null,0,null,null,null,null,null,null,null,null,null,null,null,null,null,null,null,"-"]
[null,null,null,null,null,null,null,null,null,"Un Nuevo Contrato Social y Ambiental para la Bogotá del Siglo XXI",null,{"$f":"IF(ISERROR(VLOOKUP(K330,Proposito_programa!$C$2:$E$59,2,FALSE)),\" \",VLOOKUP(K330,Proposito_programa!$C$2:$E$59,2,FALSE))","v":" "},{"$f":"IF(ISERROR(VLOOKUP(K330,Proposito_programa!$C$2:$E$59,3,FALSE)),\" \",VLOOKUP(K330,Proposito_programa!$C$2:$E$59,3,FALSE))","v":" "},null,null,null,null,null,null,null,null,null,null,null,null,null,null,0,null,null,null,null,null,null,null,null,null,null,null,null,null,null,null,"-"]
[null,null,null,null,null,null,null,null,null,"Un Nuevo Contrato Social y Ambiental para la Bogotá del Siglo XXI",null,{"$f":"IF(ISERROR(VLOOKUP(K331,Proposito_programa!$C$2:$E$59,2,FALSE)),\" \",VLOOKUP(K331,Proposito_programa!$C$2:$E$59,2,FALSE))","v":" "},{"$f":"IF(ISERROR(VLOOKUP(K331,Proposito_programa!$C$2:$E$59,3,FALSE)),\" \",VLOOKUP(K331,Proposito_programa!$C$2:$E$59,3,FALSE))","v":" "},null,null,null,null,null,null,null,null,null,null,null,null,null,null,0,null,null,null,null,null,null,null,null,null,null,null,null,null,null,null,"-"]
[null,null,null,null,null,null,null,null,null,"Un Nuevo Contrato Social y Ambiental para la Bogotá del Siglo XXI",null,{"$f":"IF(ISERROR(VLOOKUP(K332,Proposito_programa!$C$2:$E$59,2,FALSE)),\" \",VLOOKUP(K332,Proposito_programa!$C$2:$E$59,2,FALSE))","v":" "},{"$f":"IF(ISERROR(VLOOKUP(K332,Proposito_programa!$C$2:$E$59,3,FALSE)),\" \",VLOOKUP(K332,Proposito_programa!$C$2:$E$59,3,FALSE))","v":" "},null,null,null,null,null,null,null,null,null,null,null,null,null,null,0,null,null,null,null,null,null,null,null,null,null,null,null,null,null,null,"-"]
[null,null,null,null,null,null,null,null,null,"Un Nuevo Contrato Social y Ambiental para la Bogotá del Siglo XXI",null,{"$f":"IF(ISERROR(VLOOKUP(K333,Proposito_programa!$C$2:$E$59,2,FALSE)),\" \",VLOOKUP(K333,Proposito_programa!$C$2:$E$59,2,FALSE))","v":" "},{"$f":"IF(ISERROR(VLOOKUP(K333,Proposito_programa!$C$2:$E$59,3,FALSE)),\" \",VLOOKUP(K333,Proposito_programa!$C$2:$E$59,3,FALSE))","v":" "},null,null,null,null,null,null,null,null,null,null,null,null,null,null,0,null,null,null,null,null,null,null,null,null,null,null,null,null,null,null,"-"]
[null,null,null,null,null,null,null,null,null,"Un Nuevo Contrato Social y Ambiental para la Bogotá del Siglo XXI",null,{"$f":"IF(ISERROR(VLOOKUP(K334,Proposito_programa!$C$2:$E$59,2,FALSE)),\" \",VLOOKUP(K334,Proposito_programa!$C$2:$E$59,2,FALSE))","v":" "},{"$f":"IF(ISERROR(VLOOKUP(K334,Proposito_programa!$C$2:$E$59,3,FALSE)),\" \",VLOOKUP(K334,Proposito_programa!$C$2:$E$59,3,FALSE))","v":" "},null,null,null,null,null,null,null,null,null,null,null,null,null,null,0,null,null,null,null,null,null,null,null,null,null,null,null,null,null,null,"-"]
[null,null,null,null,null,null,null,null,null,"Un Nuevo Contrato Social y Ambiental para la Bogotá del Siglo XXI",null,{"$f":"IF(ISERROR(VLOOKUP(K335,Proposito_programa!$C$2:$E$59,2,FALSE)),\" \",VLOOKUP(K335,Proposito_programa!$C$2:$E$59,2,FALSE))","v":" "},{"$f":"IF(ISERROR(VLOOKUP(K335,Proposito_programa!$C$2:$E$59,3,FALSE)),\" \",VLOOKUP(K335,Proposito_programa!$C$2:$E$59,3,FALSE))","v":" "},null,null,null,null,null,null,null,null,null,null,null,null,null,null,0,null,null,null,null,null,null,null,null,null,null,null,null,null,null,null,"-"]
[null,null,null,null,null,null,null,null,null,"Un Nuevo Contrato Social y Ambiental para la Bogotá del Siglo XXI",null,{"$f":"IF(ISERROR(VLOOKUP(K336,Proposito_programa!$C$2:$E$59,2,FALSE)),\" \",VLOOKUP(K336,Proposito_programa!$C$2:$E$59,2,FALSE))","v":" "},{"$f":"IF(ISERROR(VLOOKUP(K336,Proposito_programa!$C$2:$E$59,3,FALSE)),\" \",VLOOKUP(K336,Proposito_programa!$C$2:$E$59,3,FALSE))","v":" "},null,null,null,null,null,null,null,null,null,null,null,null,null,null,{"$f":"+X336+Y336+AA336","v":0},null,null,null,null,null,null,null,null,null,null,null,null,null,null,null,"-"]
[null,null,null,null,null,null,null,null,null,"Un Nuevo Contrato Social y Ambiental para la Bogotá del Siglo XXI",null,{"$f":"IF(ISERROR(VLOOKUP(K337,Proposito_programa!$C$2:$E$59,2,FALSE)),\" \",VLOOKUP(K337,Proposito_programa!$C$2:$E$59,2,FALSE))","v":" "},{"$f":"IF(ISERROR(VLOOKUP(K337,Proposito_programa!$C$2:$E$59,3,FALSE)),\" \",VLOOKUP(K337,Proposito_programa!$C$2:$E$59,3,FALSE))","v":" "},null,null,null,null,null,null,null,null,null,null,null,null,null,null,0,null,null,null,null,null,null,null,null,null,null,null,null,null,null,null,"-"]
[null,null,null,null,null,null,null,null,null,"Un Nuevo Contrato Social y Ambiental para la Bogotá del Siglo XXI",null,{"$f":"IF(ISERROR(VLOOKUP(K338,Proposito_programa!$C$2:$E$59,2,FALSE)),\" \",VLOOKUP(K338,Proposito_programa!$C$2:$E$59,2,FALSE))","v":" "},{"$f":"IF(ISERROR(VLOOKUP(K338,Proposito_programa!$C$2:$E$59,3,FALSE)),\" \",VLOOKUP(K338,Proposito_programa!$C$2:$E$59,3,FALSE))","v":" "},null,null,null,null,null,null,null,null,null,null,null,null,null,null,0,null,null,null,null,null,null,null,null,null,null,null,null,null,null,null,"-"]
[null,null,null,null,null,null,null,null,null,"Un Nuevo Contrato Social y Ambiental para la Bogotá del Siglo XXI",null,{"$f":"IF(ISERROR(VLOOKUP(K339,Proposito_programa!$C$2:$E$59,2,FALSE)),\" \",VLOOKUP(K339,Proposito_programa!$C$2:$E$59,2,FALSE))","v":" "},{"$f":"IF(ISERROR(VLOOKUP(K339,Proposito_programa!$C$2:$E$59,3,FALSE)),\" \",VLOOKUP(K339,Proposito_programa!$C$2:$E$59,3,FALSE))","v":" "},null,null,null,null,null,null,null,null,null,null,null,null,null,null,0,null,null,null,null,null,null,null,null,null,null,null,null,null,null,null,"-"]
[null,null,null,null,null,null,null,null,null,"Un Nuevo Contrato Social y Ambiental para la Bogotá del Siglo XXI",null,{"$f":"IF(ISERROR(VLOOKUP(K340,Proposito_programa!$C$2:$E$59,2,FALSE)),\" \",VLOOKUP(K340,Proposito_programa!$C$2:$E$59,2,FALSE))","v":" "},{"$f":"IF(ISERROR(VLOOKUP(K340,Proposito_programa!$C$2:$E$59,3,FALSE)),\" \",VLOOKUP(K340,Proposito_programa!$C$2:$E$59,3,FALSE))","v":" "},null,null,null,null,null,null,null,null,null,null,null,null,null,null,{"$f":"+X340+Y340+AA340","v":0},null,null,null,null,null,null,null,null,null,null,null,null,null,null,null,"-"]
[null,null,null,null,null,null,null,null,null,"Un Nuevo Contrato Social y Ambiental para la Bogotá del Siglo XXI",null,{"$f":"IF(ISERROR(VLOOKUP(K341,Proposito_programa!$C$2:$E$59,2,FALSE)),\" \",VLOOKUP(K341,Proposito_programa!$C$2:$E$59,2,FALSE))","v":" "},{"$f":"IF(ISERROR(VLOOKUP(K341,Proposito_programa!$C$2:$E$59,3,FALSE)),\" \",VLOOKUP(K341,Proposito_programa!$C$2:$E$59,3,FALSE))","v":" "},null,null,null,null,null,null,null,null,null,null,null,null,null,null,0,null,null,null,null,null,null,null,null,null,null,null,null,null,null,null,"-"]
[null,null,null,null,null,null,null,null,null,"Un Nuevo Contrato Social y Ambiental para la Bogotá del Siglo XXI",null,{"$f":"IF(ISERROR(VLOOKUP(K342,Proposito_programa!$C$2:$E$59,2,FALSE)),\" \",VLOOKUP(K342,Proposito_programa!$C$2:$E$59,2,FALSE))","v":" "},{"$f":"IF(ISERROR(VLOOKUP(K342,Proposito_programa!$C$2:$E$59,3,FALSE)),\" \",VLOOKUP(K342,Proposito_programa!$C$2:$E$59,3,FALSE))","v":" "},null,null,null,null,null,null,null,null,null,null,null,null,null,null,0,null,null,null,null,null,null,null,null,null,null,null,null,null,null,null,"-"]
[null,null,null,null,null,null,null,null,null,"Un Nuevo Contrato Social y Ambiental para la Bogotá del Siglo XXI",null,{"$f":"IF(ISERROR(VLOOKUP(K343,Proposito_programa!$C$2:$E$59,2,FALSE)),\" \",VLOOKUP(K343,Proposito_programa!$C$2:$E$59,2,FALSE))","v":" "},{"$f":"IF(ISERROR(VLOOKUP(K343,Proposito_programa!$C$2:$E$59,3,FALSE)),\" \",VLOOKUP(K343,Proposito_programa!$C$2:$E$59,3,FALSE))","v":" "},null,null,null,null,null,null,null,null,null,null,null,null,null,null,0,null,null,null,null,null,null,null,null,null,null,null,null,null,null,null,"-"]
[null,null,null,null,null,null,null,null,null,"Un Nuevo Contrato Social y Ambiental para la Bogotá del Siglo XXI",null,{"$f":"IF(ISERROR(VLOOKUP(K344,Proposito_programa!$C$2:$E$59,2,FALSE)),\" \",VLOOKUP(K344,Proposito_programa!$C$2:$E$59,2,FALSE))","v":" "},{"$f":"IF(ISERROR(VLOOKUP(K344,Proposito_programa!$C$2:$E$59,3,FALSE)),\" \",VLOOKUP(K344,Proposito_programa!$C$2:$E$59,3,FALSE))","v":" "},null,null,null,null,null,null,null,null,null,null,null,null,null,null,0,null,null,null,null,null,null,null,null,null,null,null,null,null,null,null,"-"]
[null,null,null,null,null,null,null,null,null,"Un Nuevo Contrato Social y Ambiental para la Bogotá del Siglo XXI",null,{"$f":"IF(ISERROR(VLOOKUP(K345,Proposito_programa!$C$2:$E$59,2,FALSE)),\" \",VLOOKUP(K345,Proposito_programa!$C$2:$E$59,2,FALSE))","v":" "},{"$f":"IF(ISERROR(VLOOKUP(K345,Proposito_programa!$C$2:$E$59,3,FALSE)),\" \",VLOOKUP(K345,Proposito_programa!$C$2:$E$59,3,FALSE))","v":" "},null,null,null,null,null,null,null,null,null,null,null,null,null,null,0,null,null,null,null,null,null,null,null,null,null,null,null,null,null,null,"-"]
[null,null,null,null,null,null,null,null,null,"Un Nuevo Contrato Social y Ambiental para la Bogotá del Siglo XXI",null,{"$f":"IF(ISERROR(VLOOKUP(K346,Proposito_programa!$C$2:$E$59,2,FALSE)),\" \",VLOOKUP(K346,Proposito_programa!$C$2:$E$59,2,FALSE))","v":" "},{"$f":"IF(ISERROR(VLOOKUP(K346,Proposito_programa!$C$2:$E$59,3,FALSE)),\" \",VLOOKUP(K346,Proposito_programa!$C$2:$E$59,3,FALSE))","v":" "},null,null,null,null,null,null,null,null,null,null,null,null,null,null,0,null,null,null,null,null,null,null,null,null,null,null,null,null,null,null,"-"]
[null,null,null,null,null,null,null,null,null,"Un Nuevo Contrato Social y Ambiental para la Bogotá del Siglo XXI",null,{"$f":"IF(ISERROR(VLOOKUP(K347,Proposito_programa!$C$2:$E$59,2,FALSE)),\" \",VLOOKUP(K347,Proposito_programa!$C$2:$E$59,2,FALSE))","v":" "},{"$f":"IF(ISERROR(VLOOKUP(K347,Proposito_programa!$C$2:$E$59,3,FALSE)),\" \",VLOOKUP(K347,Proposito_programa!$C$2:$E$59,3,FALSE))","v":" "},null,null,null,null,null,null,null,null,null,null,null,null,null,null,0,null,null,null,null,null,null,null,null,null,null,null,null,null,null,null,"-"]
[null,null,null,null,null,null,null,null,null,"Un Nuevo Contrato Social y Ambiental para la Bogotá del Siglo XXI",null,{"$f":"IF(ISERROR(VLOOKUP(K348,Proposito_programa!$C$2:$E$59,2,FALSE)),\" \",VLOOKUP(K348,Proposito_programa!$C$2:$E$59,2,FALSE))","v":" "},{"$f":"IF(ISERROR(VLOOKUP(K348,Proposito_programa!$C$2:$E$59,3,FALSE)),\" \",VLOOKUP(K348,Proposito_programa!$C$2:$E$59,3,FALSE))","v":" "},null,null,null,null,null,null,null,null,null,null,null,null,null,null,0,null,null,null,null,null,null,null,null,null,null,null,null,null,null,null,"-"]
[null,null,null,null,null,null,null,null,null,"Un Nuevo Contrato Social y Ambiental para la Bogotá del Siglo XXI",null,{"$f":"IF(ISERROR(VLOOKUP(K349,Proposito_programa!$C$2:$E$59,2,FALSE)),\" \",VLOOKUP(K349,Proposito_programa!$C$2:$E$59,2,FALSE))","v":" "},{"$f":"IF(ISERROR(VLOOKUP(K349,Proposito_programa!$C$2:$E$59,3,FALSE)),\" \",VLOOKUP(K349,Proposito_programa!$C$2:$E$59,3,FALSE))","v":" "},null,null,null,null,null,null,null,null,null,null,null,null,null,null,0,null,null,null,null,null,null,null,null,null,null,null,null,null,null,null,"-"]
[null,null,null,null,null,null,null,null,null,"Un Nuevo Contrato Social y Ambiental para la Bogotá del Siglo XXI",null,{"$f":"IF(ISERROR(VLOOKUP(K350,Proposito_programa!$C$2:$E$59,2,FALSE)),\" \",VLOOKUP(K350,Proposito_programa!$C$2:$E$59,2,FALSE))","v":" "},{"$f":"IF(ISERROR(VLOOKUP(K350,Proposito_programa!$C$2:$E$59,3,FALSE)),\" \",VLOOKUP(K350,Proposito_programa!$C$2:$E$59,3,FALSE))","v":" "},null,null,null,null,null,null,null,null,null,null,null,null,null,null,0,null,null,null,null,null,null,null,null,null,null,null,null,null,null,null,"-"]
[null,null,null,null,null,null,null,null,null,"Un Nuevo Contrato Social y Ambiental para la Bogotá del Siglo XXI",null,{"$f":"IF(ISERROR(VLOOKUP(K351,Proposito_programa!$C$2:$E$59,2,FALSE)),\" \",VLOOKUP(K351,Proposito_programa!$C$2:$E$59,2,FALSE))","v":" "},{"$f":"IF(ISERROR(VLOOKUP(K351,Proposito_programa!$C$2:$E$59,3,FALSE)),\" \",VLOOKUP(K351,Proposito_programa!$C$2:$E$59,3,FALSE))","v":" "},null,null,null,null,null,null,null,null,null,null,null,null,null,null,0,null,null,null,null,null,null,null,null,null,null,null,null,null,null,null,"-"]
[null,null,null,null,null,null,null,null,null,"Un Nuevo Contrato Social y Ambiental para la Bogotá del Siglo XXI",null,{"$f":"IF(ISERROR(VLOOKUP(K352,Proposito_programa!$C$2:$E$59,2,FALSE)),\" \",VLOOKUP(K352,Proposito_programa!$C$2:$E$59,2,FALSE))","v":" "},{"$f":"IF(ISERROR(VLOOKUP(K352,Proposito_programa!$C$2:$E$59,3,FALSE)),\" \",VLOOKUP(K352,Proposito_programa!$C$2:$E$59,3,FALSE))","v":" "},null,null,null,null,null,null,null,null,null,null,null,null,null,null,0,null,null,null,null,null,null,null,null,null,null,null,null,null,null,null,"-"]
[null,null,null,null,null,null,null,null,null,"Un Nuevo Contrato Social y Ambiental para la Bogotá del Siglo XXI",null,{"$f":"IF(ISERROR(VLOOKUP(K353,Proposito_programa!$C$2:$E$59,2,FALSE)),\" \",VLOOKUP(K353,Proposito_programa!$C$2:$E$59,2,FALSE))","v":" "},{"$f":"IF(ISERROR(VLOOKUP(K353,Proposito_programa!$C$2:$E$59,3,FALSE)),\" \",VLOOKUP(K353,Proposito_programa!$C$2:$E$59,3,FALSE))","v":" "},null,null,null,null,null,null,null,null,null,null,null,null,null,null,0,null,null,null,null,null,null,null,null,null,null,null,null,null,null,null,"-"]
[null,null,null,null,null,null,null,null,null,"Un Nuevo Contrato Social y Ambiental para la Bogotá del Siglo XXI",null,{"$f":"IF(ISERROR(VLOOKUP(K354,Proposito_programa!$C$2:$E$59,2,FALSE)),\" \",VLOOKUP(K354,Proposito_programa!$C$2:$E$59,2,FALSE))","v":" "},{"$f":"IF(ISERROR(VLOOKUP(K354,Proposito_programa!$C$2:$E$59,3,FALSE)),\" \",VLOOKUP(K354,Proposito_programa!$C$2:$E$59,3,FALSE))","v":" "},null,null,null,null,null,null,null,null,null,null,null,null,null,null,0,null,null,null,null,null,null,null,null,null,null,null,null,null,null,null,"-"]
[null,null,null,null,null,null,null,null,null,"Un Nuevo Contrato Social y Ambiental para la Bogotá del Siglo XXI",null,{"$f":"IF(ISERROR(VLOOKUP(K355,Proposito_programa!$C$2:$E$59,2,FALSE)),\" \",VLOOKUP(K355,Proposito_programa!$C$2:$E$59,2,FALSE))","v":" "},{"$f":"IF(ISERROR(VLOOKUP(K355,Proposito_programa!$C$2:$E$59,3,FALSE)),\" \",VLOOKUP(K355,Proposito_programa!$C$2:$E$59,3,FALSE))","v":" "},null,null,null,null,null,null,null,null,null,null,null,null,null,null,0,null,null,null,null,null,null,null,null,null,null,null,null,null,null,null,"-"]
[null,null,null,null,null,null,null,null,null,"Un Nuevo Contrato Social y Ambiental para la Bogotá del Siglo XXI",null,{"$f":"IF(ISERROR(VLOOKUP(K356,Proposito_programa!$C$2:$E$59,2,FALSE)),\" \",VLOOKUP(K356,Proposito_programa!$C$2:$E$59,2,FALSE))","v":" "},{"$f":"IF(ISERROR(VLOOKUP(K356,Proposito_programa!$C$2:$E$59,3,FALSE)),\" \",VLOOKUP(K356,Proposito_programa!$C$2:$E$59,3,FALSE))","v":" "},null,null,null,null,null,null,null,null,null,null,null,null,null,null,0,null,null,null,null,null,null,null,null,null,null,null,null,null,null,null,"-"]
[null,null,null,null,null,null,null,null,null,"Un Nuevo Contrato Social y Ambiental para la Bogotá del Siglo XXI",null,{"$f":"IF(ISERROR(VLOOKUP(K357,Proposito_programa!$C$2:$E$59,2,FALSE)),\" \",VLOOKUP(K357,Proposito_programa!$C$2:$E$59,2,FALSE))","v":" "},{"$f":"IF(ISERROR(VLOOKUP(K357,Proposito_programa!$C$2:$E$59,3,FALSE)),\" \",VLOOKUP(K357,Proposito_programa!$C$2:$E$59,3,FALSE))","v":" "},null,null,null,null,null,null,null,null,null,null,null,null,null,null,0,null,null,null,null,null,null,null,null,null,null,null,null,null,null,null,"-"]
[null,null,null,null,null,null,null,null,null,"Un Nuevo Contrato Social y Ambiental para la Bogotá del Siglo XXI",null,{"$f":"IF(ISERROR(VLOOKUP(K358,Proposito_programa!$C$2:$E$59,2,FALSE)),\" \",VLOOKUP(K358,Proposito_programa!$C$2:$E$59,2,FALSE))","v":" "},{"$f":"IF(ISERROR(VLOOKUP(K358,Proposito_programa!$C$2:$E$59,3,FALSE)),\" \",VLOOKUP(K358,Proposito_programa!$C$2:$E$59,3,FALSE))","v":" "},null,null,null,null,null,null,null,null,null,null,null,null,null,null,0,null,null,null,null,null,null,null,null,null,null,null,null,null,null,null,"-"]
[null,null,null,null,null,null,null,null,null,"Un Nuevo Contrato Social y Ambiental para la Bogotá del Siglo XXI",null,{"$f":"IF(ISERROR(VLOOKUP(K359,Proposito_programa!$C$2:$E$59,2,FALSE)),\" \",VLOOKUP(K359,Proposito_programa!$C$2:$E$59,2,FALSE))","v":" "},{"$f":"IF(ISERROR(VLOOKUP(K359,Proposito_programa!$C$2:$E$59,3,FALSE)),\" \",VLOOKUP(K359,Proposito_programa!$C$2:$E$59,3,FALSE))","v":" "},null,null,null,null,null,null,null,null,null,null,null,null,null,null,0,null,null,null,null,null,null,null,null,null,null,null,null,null,null,null,"-"]
[null,null,null,null,null,null,null,null,null,"Un Nuevo Contrato Social y Ambiental para la Bogotá del Siglo XXI",null,{"$f":"IF(ISERROR(VLOOKUP(K360,Proposito_programa!$C$2:$E$59,2,FALSE)),\" \",VLOOKUP(K360,Proposito_programa!$C$2:$E$59,2,FALSE))","v":" "},{"$f":"IF(ISERROR(VLOOKUP(K360,Proposito_programa!$C$2:$E$59,3,FALSE)),\" \",VLOOKUP(K360,Proposito_programa!$C$2:$E$59,3,FALSE))","v":" "},null,null,null,null,null,null,null,null,null,null,null,null,null,null,0,null,null,null,null,null,null,null,null,null,null,null,null,null,null,null,"-"]
[null,null,null,null,null,null,null,null,null,"Un Nuevo Contrato Social y Ambiental para la Bogotá del Siglo XXI",null,{"$f":"IF(ISERROR(VLOOKUP(K361,Proposito_programa!$C$2:$E$59,2,FALSE)),\" \",VLOOKUP(K361,Proposito_programa!$C$2:$E$59,2,FALSE))","v":" "},{"$f":"IF(ISERROR(VLOOKUP(K361,Proposito_programa!$C$2:$E$59,3,FALSE)),\" \",VLOOKUP(K361,Proposito_programa!$C$2:$E$59,3,FALSE))","v":" "},null,null,null,null,null,null,null,null,null,null,null,null,null,null,0,null,null,null,null,null,null,null,null,null,null,null,null,null,null,null,{"$f":"IF(ISERROR(#REF!/AB361),\"-\",(#REF!/AB361))","v":"-"}]
[null,null,null,null,null,null,null,null,null,"Un Nuevo Contrato Social y Ambiental para la Bogotá del Siglo XXI",null,{"$f":"IF(ISERROR(VLOOKUP(K362,Proposito_programa!$C$2:$E$59,2,FALSE)),\" \",VLOOKUP(K362,Proposito_programa!$C$2:$E$59,2,FALSE))","v":" "},{"$f":"IF(ISERROR(VLOOKUP(K362,Proposito_programa!$C$2:$E$59,3,FALSE)),\" \",VLOOKUP(K362,Proposito_programa!$C$2:$E$59,3,FALSE))","v":" "},null,null,null,null,null,null,null,null,null,null,null,null,null,null,0,null,null,null,null,null,null,null,null,null,null,null,null,null,null,null,{"$f":"IF(ISERROR(AC362/AB362),\"-\",(AC362/AB362))","v":"-"}]
[null,null,null,null,null,null,null,null,null,"Un Nuevo Contrato Social y Ambiental para la Bogotá del Siglo XXI",null,{"$f":"IF(ISERROR(VLOOKUP(K363,Proposito_programa!$C$2:$E$59,2,FALSE)),\" \",VLOOKUP(K363,Proposito_programa!$C$2:$E$59,2,FALSE))","v":" "},{"$f":"IF(ISERROR(VLOOKUP(K363,Proposito_programa!$C$2:$E$59,3,FALSE)),\" \",VLOOKUP(K363,Proposito_programa!$C$2:$E$59,3,FALSE))","v":" "},null,null,null,null,null,null,null,null,null,null,null,null,null,null,0,null,null,null,null,null,null,null,null,null,null,null,null,null,null,null,"-"]
[null,null,null,null,null,null,null,null,null,"Un Nuevo Contrato Social y Ambiental para la Bogotá del Siglo XXI",null,{"$f":"IF(ISERROR(VLOOKUP(K364,Proposito_programa!$C$2:$E$59,2,FALSE)),\" \",VLOOKUP(K364,Proposito_programa!$C$2:$E$59,2,FALSE))","v":" "},{"$f":"IF(ISERROR(VLOOKUP(K364,Proposito_programa!$C$2:$E$59,3,FALSE)),\" \",VLOOKUP(K364,Proposito_programa!$C$2:$E$59,3,FALSE))","v":" "},null,null,null,null,null,null,null,null,null,null,null,null,null,null,0,null,null,null,null,null,null,null,null,null,null,null,null,null,null,null,"-"]
[null,null,null,null,null,null,null,null,null,"Un Nuevo Contrato Social y Ambiental para la Bogotá del Siglo XXI",null,{"$f":"IF(ISERROR(VLOOKUP(K365,Proposito_programa!$C$2:$E$59,2,FALSE)),\" \",VLOOKUP(K365,Proposito_programa!$C$2:$E$59,2,FALSE))","v":" "},{"$f":"IF(ISERROR(VLOOKUP(K365,Proposito_programa!$C$2:$E$59,3,FALSE)),\" \",VLOOKUP(K365,Proposito_programa!$C$2:$E$59,3,FALSE))","v":" "},null,null,null,null,null,null,null,null,null,null,null,null,null,null,0,null,null,null,null,null,null,null,null,null,null,null,null,null,null,null,"-"]
[null,null,null,null,null,null,null,null,null,"Un Nuevo Contrato Social y Ambiental para la Bogotá del Siglo XXI",null,{"$f":"IF(ISERROR(VLOOKUP(K366,Proposito_programa!$C$2:$E$59,2,FALSE)),\" \",VLOOKUP(K366,Proposito_programa!$C$2:$E$59,2,FALSE))","v":" "},{"$f":"IF(ISERROR(VLOOKUP(K366,Proposito_programa!$C$2:$E$59,3,FALSE)),\" \",VLOOKUP(K366,Proposito_programa!$C$2:$E$59,3,FALSE))","v":" "},null,null,null,null,null,null,null,null,null,null,null,null,null,null,0,null,null,null,null,null,null,null,null,null,null,null,null,null,null,null,"-"]
[null,null,null,null,null,null,null,null,null,"Un Nuevo Contrato Social y Ambiental para la Bogotá del Siglo XXI",null,{"$f":"IF(ISERROR(VLOOKUP(K367,Proposito_programa!$C$2:$E$59,2,FALSE)),\" \",VLOOKUP(K367,Proposito_programa!$C$2:$E$59,2,FALSE))","v":" "},{"$f":"IF(ISERROR(VLOOKUP(K367,Proposito_programa!$C$2:$E$59,3,FALSE)),\" \",VLOOKUP(K367,Proposito_programa!$C$2:$E$59,3,FALSE))","v":" "},null,null,null,null,null,null,null,null,null,null,null,null,null,null,0,null,null,null,null,null,null,null,null,null,null,null,null,null,null,null,"-"]
[null,null,null,null,null,null,null,null,null,"Un Nuevo Contrato Social y Ambiental para la Bogotá del Siglo XXI",null,{"$f":"IF(ISERROR(VLOOKUP(K368,Proposito_programa!$C$2:$E$59,2,FALSE)),\" \",VLOOKUP(K368,Proposito_programa!$C$2:$E$59,2,FALSE))","v":" "},{"$f":"IF(ISERROR(VLOOKUP(K368,Proposito_programa!$C$2:$E$59,3,FALSE)),\" \",VLOOKUP(K368,Proposito_programa!$C$2:$E$59,3,FALSE))","v":" "},null,null,null,null,null,null,null,null,null,null,null,null,null,null,0,null,null,null,null,null,null,null,null,null,null,null,null,null,null,null,"-"]
[null,null,null,null,null,null,null,null,null,"Un Nuevo Contrato Social y Ambiental para la Bogotá del Siglo XXI",null,{"$f":"IF(ISERROR(VLOOKUP(K369,Proposito_programa!$C$2:$E$59,2,FALSE)),\" \",VLOOKUP(K369,Proposito_programa!$C$2:$E$59,2,FALSE))","v":" "},{"$f":"IF(ISERROR(VLOOKUP(K369,Proposito_programa!$C$2:$E$59,3,FALSE)),\" \",VLOOKUP(K369,Proposito_programa!$C$2:$E$59,3,FALSE))","v":" "},null,null,null,null,null,null,null,null,null,null,null,null,null,null,0,null,null,null,null,null,null,null,null,null,null,null,null,null,null,null,"-"]
[null,null,null,null,null,null,null,null,null,"Un Nuevo Contrato Social y Ambiental para la Bogotá del Siglo XXI",null,{"$f":"IF(ISERROR(VLOOKUP(K370,Proposito_programa!$C$2:$E$59,2,FALSE)),\" \",VLOOKUP(K370,Proposito_programa!$C$2:$E$59,2,FALSE))","v":" "},{"$f":"IF(ISERROR(VLOOKUP(K370,Proposito_programa!$C$2:$E$59,3,FALSE)),\" \",VLOOKUP(K370,Proposito_programa!$C$2:$E$59,3,FALSE))","v":" "},null,null,null,null,null,null,null,null,null,null,null,null,null,null,0,null,null,null,null,null,null,null,null,null,null,null,null,null,null,null,"-"]
[null,null,null,null,null,null,null,null,null,"Un Nuevo Contrato Social y Ambiental para la Bogotá del Siglo XXI",null,{"$f":"IF(ISERROR(VLOOKUP(K371,Proposito_programa!$C$2:$E$59,2,FALSE)),\" \",VLOOKUP(K371,Proposito_programa!$C$2:$E$59,2,FALSE))","v":" "},{"$f":"IF(ISERROR(VLOOKUP(K371,Proposito_programa!$C$2:$E$59,3,FALSE)),\" \",VLOOKUP(K371,Proposito_programa!$C$2:$E$59,3,FALSE))","v":" "},null,null,null,null,null,null,null,null,null,null,null,null,null,null,0,null,null,null,null,null,null,null,null,null,null,null,null,null,null,null,"-"]
[null,null,null,null,null,null,null,null,null,"Un Nuevo Contrato Social y Ambiental para la Bogotá del Siglo XXI",null,{"$f":"IF(ISERROR(VLOOKUP(K372,Proposito_programa!$C$2:$E$59,2,FALSE)),\" \",VLOOKUP(K372,Proposito_programa!$C$2:$E$59,2,FALSE))","v":" "},{"$f":"IF(ISERROR(VLOOKUP(K372,Proposito_programa!$C$2:$E$59,3,FALSE)),\" \",VLOOKUP(K372,Proposito_programa!$C$2:$E$59,3,FALSE))","v":" "},null,null,null,null,null,null,null,null,null,null,null,null,null,null,0,null,null,null,null,null,null,null,null,null,null,null,null,null,null,null,"-"]
[null,null,null,null,null,null,null,null,null,"Un Nuevo Contrato Social y Ambiental para la Bogotá del Siglo XXI",null,{"$f":"IF(ISERROR(VLOOKUP(K373,Proposito_programa!$C$2:$E$59,2,FALSE)),\" \",VLOOKUP(K373,Proposito_programa!$C$2:$E$59,2,FALSE))","v":" "},{"$f":"IF(ISERROR(VLOOKUP(K373,Proposito_programa!$C$2:$E$59,3,FALSE)),\" \",VLOOKUP(K373,Proposito_programa!$C$2:$E$59,3,FALSE))","v":" "},null,null,null,null,null,null,null,null,null,null,null,null,null,null,0,null,null,null,null,null,null,null,null,null,null,null,null,null,null,null,"-"]
[null,null,null,null,null,null,null,null,null,"Un Nuevo Contrato Social y Ambiental para la Bogotá del Siglo XXI",null,{"$f":"IF(ISERROR(VLOOKUP(K374,Proposito_programa!$C$2:$E$59,2,FALSE)),\" \",VLOOKUP(K374,Proposito_programa!$C$2:$E$59,2,FALSE))","v":" "},{"$f":"IF(ISERROR(VLOOKUP(K374,Proposito_programa!$C$2:$E$59,3,FALSE)),\" \",VLOOKUP(K374,Proposito_programa!$C$2:$E$59,3,FALSE))","v":" "},null,null,null,null,null,null,null,null,null,null,null,null,null,null,0,null,null,null,null,null,null,null,null,null,null,null,null,null,null,null,"-"]
[null,null,null,null,null,null,null,null,null,"Un Nuevo Contrato Social y Ambiental para la Bogotá del Siglo XXI",null,{"$f":"IF(ISERROR(VLOOKUP(K375,Proposito_programa!$C$2:$E$59,2,FALSE)),\" \",VLOOKUP(K375,Proposito_programa!$C$2:$E$59,2,FALSE))","v":" "},{"$f":"IF(ISERROR(VLOOKUP(K375,Proposito_programa!$C$2:$E$59,3,FALSE)),\" \",VLOOKUP(K375,Proposito_programa!$C$2:$E$59,3,FALSE))","v":" "},null,null,null,null,null,null,null,null,null,null,null,null,null,null,0,null,null,null,null,null,null,null,null,null,null,null,null,null,null,null,"-"]
[null,null,null,null,null,null,null,null,null,"Un Nuevo Contrato Social y Ambiental para la Bogotá del Siglo XXI",null,{"$f":"IF(ISERROR(VLOOKUP(K376,Proposito_programa!$C$2:$E$59,2,FALSE)),\" \",VLOOKUP(K376,Proposito_programa!$C$2:$E$59,2,FALSE))","v":" "},{"$f":"IF(ISERROR(VLOOKUP(K376,Proposito_programa!$C$2:$E$59,3,FALSE)),\" \",VLOOKUP(K376,Proposito_programa!$C$2:$E$59,3,FALSE))","v":" "},null,null,null,null,null,null,null,null,null,null,null,null,null,null,0,null,null,null,null,null,null,null,null,null,null,null,null,null,null,null,"-"]
[null,null,null,null,null,null,null,null,null,"Un Nuevo Contrato Social y Ambiental para la Bogotá del Siglo XXI",null,{"$f":"IF(ISERROR(VLOOKUP(K377,Proposito_programa!$C$2:$E$59,2,FALSE)),\" \",VLOOKUP(K377,Proposito_programa!$C$2:$E$59,2,FALSE))","v":" "},{"$f":"IF(ISERROR(VLOOKUP(K377,Proposito_programa!$C$2:$E$59,3,FALSE)),\" \",VLOOKUP(K377,Proposito_programa!$C$2:$E$59,3,FALSE))","v":" "},null,null,null,null,null,null,null,null,null,null,null,null,null,null,0,null,null,null,null,null,null,null,null,null,null,null,null,null,null,null,"-"]
[null,null,null,null,null,null,null,null,null,"Un Nuevo Contrato Social y Ambiental para la Bogotá del Siglo XXI",null,{"$f":"IF(ISERROR(VLOOKUP(K378,Proposito_programa!$C$2:$E$59,2,FALSE)),\" \",VLOOKUP(K378,Proposito_programa!$C$2:$E$59,2,FALSE))","v":" "},{"$f":"IF(ISERROR(VLOOKUP(K378,Proposito_programa!$C$2:$E$59,3,FALSE)),\" \",VLOOKUP(K378,Proposito_programa!$C$2:$E$59,3,FALSE))","v":" "},null,null,null,null,null,null,null,null,null,null,null,null,null,null,0,null,null,null,null,null,null,null,null,null,null,null,null,null,null,null,"-"]
[null,null,null,null,null,null,null,null,null,"Un Nuevo Contrato Social y Ambiental para la Bogotá del Siglo XXI",null,{"$f":"IF(ISERROR(VLOOKUP(K379,Proposito_programa!$C$2:$E$59,2,FALSE)),\" \",VLOOKUP(K379,Proposito_programa!$C$2:$E$59,2,FALSE))","v":" "},{"$f":"IF(ISERROR(VLOOKUP(K379,Proposito_programa!$C$2:$E$59,3,FALSE)),\" \",VLOOKUP(K379,Proposito_programa!$C$2:$E$59,3,FALSE))","v":" "},null,null,null,null,null,null,null,null,null,null,null,null,null,null,0,null,null,null,null,null,null,null,null,null,null,null,null,null,null,null,"-"]
[null,null,null,null,null,null,null,null,null,"Un Nuevo Contrato Social y Ambiental para la Bogotá del Siglo XXI",null,{"$f":"IF(ISERROR(VLOOKUP(K380,Proposito_programa!$C$2:$E$59,2,FALSE)),\" \",VLOOKUP(K380,Proposito_programa!$C$2:$E$59,2,FALSE))","v":" "},{"$f":"IF(ISERROR(VLOOKUP(K380,Proposito_programa!$C$2:$E$59,3,FALSE)),\" \",VLOOKUP(K380,Proposito_programa!$C$2:$E$59,3,FALSE))","v":" "},null,null,null,null,null,null,null,null,null,null,null,null,null,null,0,null,null,null,null,null,null,null,null,null,null,null,null,null,null,null,"-"]
[null,null,null,null,null,null,null,null,null,"Un Nuevo Contrato Social y Ambiental para la Bogotá del Siglo XXI",null,{"$f":"IF(ISERROR(VLOOKUP(K381,Proposito_programa!$C$2:$E$59,2,FALSE)),\" \",VLOOKUP(K381,Proposito_programa!$C$2:$E$59,2,FALSE))","v":" "},{"$f":"IF(ISERROR(VLOOKUP(K381,Proposito_programa!$C$2:$E$59,3,FALSE)),\" \",VLOOKUP(K381,Proposito_programa!$C$2:$E$59,3,FALSE))","v":" "},null,null,null,null,null,null,null,null,null,null,null,null,null,null,0,null,null,null,null,null,null,null,null,null,null,null,null,null,null,null,"-"]
[null,null,null,null,null,null,null,null,null,"Un Nuevo Contrato Social y Ambiental para la Bogotá del Siglo XXI",null,{"$f":"IF(ISERROR(VLOOKUP(K382,Proposito_programa!$C$2:$E$59,2,FALSE)),\" \",VLOOKUP(K382,Proposito_programa!$C$2:$E$59,2,FALSE))","v":" "},{"$f":"IF(ISERROR(VLOOKUP(K382,Proposito_programa!$C$2:$E$59,3,FALSE)),\" \",VLOOKUP(K382,Proposito_programa!$C$2:$E$59,3,FALSE))","v":" "},null,null,null,null,null,null,null,null,null,null,null,null,null,null,0,null,null,null,null,null,null,null,null,null,null,null,null,null,null,null,"-"]
[null,null,null,null,null,null,null,null,null,"Un Nuevo Contrato Social y Ambiental para la Bogotá del Siglo XXI",null,{"$f":"IF(ISERROR(VLOOKUP(K383,Proposito_programa!$C$2:$E$59,2,FALSE)),\" \",VLOOKUP(K383,Proposito_programa!$C$2:$E$59,2,FALSE))","v":" "},{"$f":"IF(ISERROR(VLOOKUP(K383,Proposito_programa!$C$2:$E$59,3,FALSE)),\" \",VLOOKUP(K383,Proposito_programa!$C$2:$E$59,3,FALSE))","v":" "},null,null,null,null,null,null,null,null,null,null,null,null,null,null,0,null,null,null,null,null,null,null,null,null,null,null,null,null,null,null,"-"]
[null,null,null,null,null,null,null,null,null,"Un Nuevo Contrato Social y Ambiental para la Bogotá del Siglo XXI",null,{"$f":"IF(ISERROR(VLOOKUP(K384,Proposito_programa!$C$2:$E$59,2,FALSE)),\" \",VLOOKUP(K384,Proposito_programa!$C$2:$E$59,2,FALSE))","v":" "},{"$f":"IF(ISERROR(VLOOKUP(K384,Proposito_programa!$C$2:$E$59,3,FALSE)),\" \",VLOOKUP(K384,Proposito_programa!$C$2:$E$59,3,FALSE))","v":" "},null,null,null,null,null,null,null,null,null,null,null,null,null,null,0,null,null,null,null,null,null,null,null,null,null,null,null,null,null,null,"-"]
[null,null,null,null,null,null,null,null,null,"Un Nuevo Contrato Social y Ambiental para la Bogotá del Siglo XXI",null,{"$f":"IF(ISERROR(VLOOKUP(K385,Proposito_programa!$C$2:$E$59,2,FALSE)),\" \",VLOOKUP(K385,Proposito_programa!$C$2:$E$59,2,FALSE))","v":" "},{"$f":"IF(ISERROR(VLOOKUP(K385,Proposito_programa!$C$2:$E$59,3,FALSE)),\" \",VLOOKUP(K385,Proposito_programa!$C$2:$E$59,3,FALSE))","v":" "},null,null,null,null,null,null,null,null,null,null,null,null,null,null,0,null,null,null,null,null,null,null,null,null,null,null,null,null,null,null,"-"]
[null,null,null,null,null,null,null,null,null,"Un Nuevo Contrato Social y Ambiental para la Bogotá del Siglo XXI",null,{"$f":"IF(ISERROR(VLOOKUP(K386,Proposito_programa!$C$2:$E$59,2,FALSE)),\" \",VLOOKUP(K386,Proposito_programa!$C$2:$E$59,2,FALSE))","v":" "},{"$f":"IF(ISERROR(VLOOKUP(K386,Proposito_programa!$C$2:$E$59,3,FALSE)),\" \",VLOOKUP(K386,Proposito_programa!$C$2:$E$59,3,FALSE))","v":" "},null,null,null,null,null,null,null,null,null,null,null,null,null,null,0,null,null,null,null,null,null,null,null,null,null,null,null,null,null,null,"-"]
[null,null,null,null,null,null,null,null,null,"Un Nuevo Contrato Social y Ambiental para la Bogotá del Siglo XXI",null,{"$f":"IF(ISERROR(VLOOKUP(K387,Proposito_programa!$C$2:$E$59,2,FALSE)),\" \",VLOOKUP(K387,Proposito_programa!$C$2:$E$59,2,FALSE))","v":" "},{"$f":"IF(ISERROR(VLOOKUP(K387,Proposito_programa!$C$2:$E$59,3,FALSE)),\" \",VLOOKUP(K387,Proposito_programa!$C$2:$E$59,3,FALSE))","v":" "},null,null,null,null,null,null,null,null,null,null,null,null,null,null,0,null,null,null,null,null,null,null,null,null,null,null,null,null,null,null,"-"]
[null,null,null,null,null,null,null,null,null,"Un Nuevo Contrato Social y Ambiental para la Bogotá del Siglo XXI",null,{"$f":"IF(ISERROR(VLOOKUP(K388,Proposito_programa!$C$2:$E$59,2,FALSE)),\" \",VLOOKUP(K388,Proposito_programa!$C$2:$E$59,2,FALSE))","v":" "},{"$f":"IF(ISERROR(VLOOKUP(K388,Proposito_programa!$C$2:$E$59,3,FALSE)),\" \",VLOOKUP(K388,Proposito_programa!$C$2:$E$59,3,FALSE))","v":" "},null,null,null,null,null,null,null,null,null,null,null,null,null,null,0,null,null,null,null,null,null,null,null,null,null,null,null,null,null,null,"-"]
[null,null,null,null,null,null,null,null,null,"Un Nuevo Contrato Social y Ambiental para la Bogotá del Siglo XXI",null,{"$f":"IF(ISERROR(VLOOKUP(K389,Proposito_programa!$C$2:$E$59,2,FALSE)),\" \",VLOOKUP(K389,Proposito_programa!$C$2:$E$59,2,FALSE))","v":" "},{"$f":"IF(ISERROR(VLOOKUP(K389,Proposito_programa!$C$2:$E$59,3,FALSE)),\" \",VLOOKUP(K389,Proposito_programa!$C$2:$E$59,3,FALSE))","v":" "},null,null,null,null,null,null,null,null,null,null,null,null,null,null,0,null,null,null,null,null,null,null,null,null,null,null,null,null,null,null,"-"]
[null,null,null,null,null,null,null,null,null,"Un Nuevo Contrato Social y Ambiental para la Bogotá del Siglo XXI",null,{"$f":"IF(ISERROR(VLOOKUP(K390,Proposito_programa!$C$2:$E$59,2,FALSE)),\" \",VLOOKUP(K390,Proposito_programa!$C$2:$E$59,2,FALSE))","v":" "},{"$f":"IF(ISERROR(VLOOKUP(K390,Proposito_programa!$C$2:$E$59,3,FALSE)),\" \",VLOOKUP(K390,Proposito_programa!$C$2:$E$59,3,FALSE))","v":" "},null,null,null,null,null,null,null,null,null,null,null,null,null,null,0,null,null,null,null,null,null,null,null,null,null,null,null,null,null,null,"-"]
[null,null,null,null,null,null,null,null,null,"Un Nuevo Contrato Social y Ambiental para la Bogotá del Siglo XXI",null,{"$f":"IF(ISERROR(VLOOKUP(K391,Proposito_programa!$C$2:$E$59,2,FALSE)),\" \",VLOOKUP(K391,Proposito_programa!$C$2:$E$59,2,FALSE))","v":" "},{"$f":"IF(ISERROR(VLOOKUP(K391,Proposito_programa!$C$2:$E$59,3,FALSE)),\" \",VLOOKUP(K391,Proposito_programa!$C$2:$E$59,3,FALSE))","v":" "},null,null,null,null,null,null,null,null,null,null,null,null,null,null,0,null,null,null,null,null,null,null,null,null,null,null,null,null,null,null,"-"]
[null,null,null,null,null,null,null,null,null,"Un Nuevo Contrato Social y Ambiental para la Bogotá del Siglo XXI",null,{"$f":"IF(ISERROR(VLOOKUP(K392,Proposito_programa!$C$2:$E$59,2,FALSE)),\" \",VLOOKUP(K392,Proposito_programa!$C$2:$E$59,2,FALSE))","v":" "},{"$f":"IF(ISERROR(VLOOKUP(K392,Proposito_programa!$C$2:$E$59,3,FALSE)),\" \",VLOOKUP(K392,Proposito_programa!$C$2:$E$59,3,FALSE))","v":" "},null,null,null,null,null,null,null,null,null,null,null,null,null,null,0,null,null,null,null,null,null,null,null,null,null,null,null,null,null,null,"-"]
[null,null,null,null,null,null,null,null,null,"Un Nuevo Contrato Social y Ambiental para la Bogotá del Siglo XXI",null,{"$f":"IF(ISERROR(VLOOKUP(K393,Proposito_programa!$C$2:$E$59,2,FALSE)),\" \",VLOOKUP(K393,Proposito_programa!$C$2:$E$59,2,FALSE))","v":" "},{"$f":"IF(ISERROR(VLOOKUP(K393,Proposito_programa!$C$2:$E$59,3,FALSE)),\" \",VLOOKUP(K393,Proposito_programa!$C$2:$E$59,3,FALSE))","v":" "},null,null,null,null,null,null,null,null,null,null,null,null,null,null,0,null,null,null,null,null,null,null,null,null,null,null,null,null,null,null,"-"]
[null,null,null,null,null,null,null,null,null,"Un Nuevo Contrato Social y Ambiental para la Bogotá del Siglo XXI",null,{"$f":"IF(ISERROR(VLOOKUP(K394,Proposito_programa!$C$2:$E$59,2,FALSE)),\" \",VLOOKUP(K394,Proposito_programa!$C$2:$E$59,2,FALSE))","v":" "},{"$f":"IF(ISERROR(VLOOKUP(K394,Proposito_programa!$C$2:$E$59,3,FALSE)),\" \",VLOOKUP(K394,Proposito_programa!$C$2:$E$59,3,FALSE))","v":" "},null,null,null,null,null,null,null,null,null,null,null,null,null,null,0,null,null,null,null,null,null,null,null,null,null,null,null,null,null,null,"-"]
[null,null,null,null,null,null,null,null,null,"Un Nuevo Contrato Social y Ambiental para la Bogotá del Siglo XXI",null,{"$f":"IF(ISERROR(VLOOKUP(K395,Proposito_programa!$C$2:$E$59,2,FALSE)),\" \",VLOOKUP(K395,Proposito_programa!$C$2:$E$59,2,FALSE))","v":" "},{"$f":"IF(ISERROR(VLOOKUP(K395,Proposito_programa!$C$2:$E$59,3,FALSE)),\" \",VLOOKUP(K395,Proposito_programa!$C$2:$E$59,3,FALSE))","v":" "},null,null,null,null,null,null,null,null,null,null,null,null,null,null,0,null,null,null,null,null,null,null,null,null,null,null,null,null,null,null,"-"]
[null,null,null,null,null,null,null,null,null,"Un Nuevo Contrato Social y Ambiental para la Bogotá del Siglo XXI",null,{"$f":"IF(ISERROR(VLOOKUP(K396,Proposito_programa!$C$2:$E$59,2,FALSE)),\" \",VLOOKUP(K396,Proposito_programa!$C$2:$E$59,2,FALSE))","v":" "},{"$f":"IF(ISERROR(VLOOKUP(K396,Proposito_programa!$C$2:$E$59,3,FALSE)),\" \",VLOOKUP(K396,Proposito_programa!$C$2:$E$59,3,FALSE))","v":" "},null,null,null,null,null,null,null,null,null,null,null,null,null,null,0,null,null,null,null,null,null,null,null,null,null,null,null,null,null,null,"-"]
[null,null,null,null,null,null,null,null,null,"Un Nuevo Contrato Social y Ambiental para la Bogotá del Siglo XXI",null,{"$f":"IF(ISERROR(VLOOKUP(K397,Proposito_programa!$C$2:$E$59,2,FALSE)),\" \",VLOOKUP(K397,Proposito_programa!$C$2:$E$59,2,FALSE))","v":" "},{"$f":"IF(ISERROR(VLOOKUP(K397,Proposito_programa!$C$2:$E$59,3,FALSE)),\" \",VLOOKUP(K397,Proposito_programa!$C$2:$E$59,3,FALSE))","v":" "},null,null,null,null,null,null,null,null,null,null,null,null,null,null,0,null,null,null,null,null,null,null,null,null,null,null,null,null,null,null,"-"]
[null,null,null,null,null,null,null,null,null,"Un Nuevo Contrato Social y Ambiental para la Bogotá del Siglo XXI",null,{"$f":"IF(ISERROR(VLOOKUP(K398,Proposito_programa!$C$2:$E$59,2,FALSE)),\" \",VLOOKUP(K398,Proposito_programa!$C$2:$E$59,2,FALSE))","v":" "},{"$f":"IF(ISERROR(VLOOKUP(K398,Proposito_programa!$C$2:$E$59,3,FALSE)),\" \",VLOOKUP(K398,Proposito_programa!$C$2:$E$59,3,FALSE))","v":" "},null,null,null,null,null,null,null,null,null,null,null,null,null,null,0,null,null,null,null,null,null,null,null,null,null,null,null,null,null,null,"-"]
[null,null,null,null,null,null,null,null,null,"Un Nuevo Contrato Social y Ambiental para la Bogotá del Siglo XXI",null,{"$f":"IF(ISERROR(VLOOKUP(K399,Proposito_programa!$C$2:$E$59,2,FALSE)),\" \",VLOOKUP(K399,Proposito_programa!$C$2:$E$59,2,FALSE))","v":" "},{"$f":"IF(ISERROR(VLOOKUP(K399,Proposito_programa!$C$2:$E$59,3,FALSE)),\" \",VLOOKUP(K399,Proposito_programa!$C$2:$E$59,3,FALSE))","v":" "},null,null,null,null,null,null,null,null,null,null,null,null,null,null,0,null,null,null,null,null,null,null,null,null,null,null,null,null,null,null,"-"]
[null,null,null,null,null,null,null,null,null,"Un Nuevo Contrato Social y Ambiental para la Bogotá del Siglo XXI",null,{"$f":"IF(ISERROR(VLOOKUP(K400,Proposito_programa!$C$2:$E$59,2,FALSE)),\" \",VLOOKUP(K400,Proposito_programa!$C$2:$E$59,2,FALSE))","v":" "},{"$f":"IF(ISERROR(VLOOKUP(K400,Proposito_programa!$C$2:$E$59,3,FALSE)),\" \",VLOOKUP(K400,Proposito_programa!$C$2:$E$59,3,FALSE))","v":" "},null,null,null,null,null,null,null,null,null,null,null,null,null,null,0,null,null,null,null,null,null,null,null,null,null,null,null,null,null,null,"-"]
[null,null,null,null,null,null,null,null,null,"Un Nuevo Contrato Social y Ambiental para la Bogotá del Siglo XXI",null,{"$f":"IF(ISERROR(VLOOKUP(K401,Proposito_programa!$C$2:$E$59,2,FALSE)),\" \",VLOOKUP(K401,Proposito_programa!$C$2:$E$59,2,FALSE))","v":" "},{"$f":"IF(ISERROR(VLOOKUP(K401,Proposito_programa!$C$2:$E$59,3,FALSE)),\" \",VLOOKUP(K401,Proposito_programa!$C$2:$E$59,3,FALSE))","v":" "},null,null,null,null,null,null,null,null,null,null,null,null,null,null,0,null,null,null,null,null,null,null,null,null,null,null,null,null,null,null,"-"]
[null,null,null,null,null,null,null,null,null,"Un Nuevo Contrato Social y Ambiental para la Bogotá del Siglo XXI",null,{"$f":"IF(ISERROR(VLOOKUP(K402,Proposito_programa!$C$2:$E$59,2,FALSE)),\" \",VLOOKUP(K402,Proposito_programa!$C$2:$E$59,2,FALSE))","v":" "},{"$f":"IF(ISERROR(VLOOKUP(K402,Proposito_programa!$C$2:$E$59,3,FALSE)),\" \",VLOOKUP(K402,Proposito_programa!$C$2:$E$59,3,FALSE))","v":" "},null,null,null,null,null,null,null,null,null,null,null,null,null,null,0,null,null,null,null,null,null,null,null,null,null,null,null,null,null,null,"-"]
[null,null,null,null,null,null,null,null,null,"Un Nuevo Contrato Social y Ambiental para la Bogotá del Siglo XXI",null,{"$f":"IF(ISERROR(VLOOKUP(K403,Proposito_programa!$C$2:$E$59,2,FALSE)),\" \",VLOOKUP(K403,Proposito_programa!$C$2:$E$59,2,FALSE))","v":" "},{"$f":"IF(ISERROR(VLOOKUP(K403,Proposito_programa!$C$2:$E$59,3,FALSE)),\" \",VLOOKUP(K403,Proposito_programa!$C$2:$E$59,3,FALSE))","v":" "},null,null,null,null,null,null,null,null,null,null,null,null,null,null,0,null,null,null,null,null,null,null,null,null,null,null,null,null,null,null,"-"]
[null,null,null,null,null,null,null,null,null,"Un Nuevo Contrato Social y Ambiental para la Bogotá del Siglo XXI",null,{"$f":"IF(ISERROR(VLOOKUP(K404,Proposito_programa!$C$2:$E$59,2,FALSE)),\" \",VLOOKUP(K404,Proposito_programa!$C$2:$E$59,2,FALSE))","v":" "},{"$f":"IF(ISERROR(VLOOKUP(K404,Proposito_programa!$C$2:$E$59,3,FALSE)),\" \",VLOOKUP(K404,Proposito_programa!$C$2:$E$59,3,FALSE))","v":" "},null,null,null,null,null,null,null,null,null,null,null,null,null,null,0,null,null,null,null,null,null,null,null,null,null,null,null,null,null,null,"-"]
[null,null,null,null,null,null,null,null,null,"Un Nuevo Contrato Social y Ambiental para la Bogotá del Siglo XXI",null,{"$f":"IF(ISERROR(VLOOKUP(K405,Proposito_programa!$C$2:$E$59,2,FALSE)),\" \",VLOOKUP(K405,Proposito_programa!$C$2:$E$59,2,FALSE))","v":" "},{"$f":"IF(ISERROR(VLOOKUP(K405,Proposito_programa!$C$2:$E$59,3,FALSE)),\" \",VLOOKUP(K405,Proposito_programa!$C$2:$E$59,3,FALSE))","v":" "},null,null,null,null,null,null,null,null,null,null,null,null,null,null,0,null,null,null,null,null,null,null,null,null,null,null,null,null,null,null,"-"]
[null,null,null,null,null,null,null,null,null,"Un Nuevo Contrato Social y Ambiental para la Bogotá del Siglo XXI",null,{"$f":"IF(ISERROR(VLOOKUP(K406,Proposito_programa!$C$2:$E$59,2,FALSE)),\" \",VLOOKUP(K406,Proposito_programa!$C$2:$E$59,2,FALSE))","v":" "},{"$f":"IF(ISERROR(VLOOKUP(K406,Proposito_programa!$C$2:$E$59,3,FALSE)),\" \",VLOOKUP(K406,Proposito_programa!$C$2:$E$59,3,FALSE))","v":" "},null,null,null,null,null,null,null,null,null,null,null,null,null,null,0,null,null,null,null,null,null,null,null,null,null,null,null,null,null,null,"-"]
[null,null,null,null,null,null,null,null,null,"Un Nuevo Contrato Social y Ambiental para la Bogotá del Siglo XXI",null,{"$f":"IF(ISERROR(VLOOKUP(K407,Proposito_programa!$C$2:$E$59,2,FALSE)),\" \",VLOOKUP(K407,Proposito_programa!$C$2:$E$59,2,FALSE))","v":" "},{"$f":"IF(ISERROR(VLOOKUP(K407,Proposito_programa!$C$2:$E$59,3,FALSE)),\" \",VLOOKUP(K407,Proposito_programa!$C$2:$E$59,3,FALSE))","v":" "},null,null,null,null,null,null,null,null,null,null,null,null,null,null,0,null,null,null,null,null,null,null,null,null,null,null,null,null,null,null,"-"]
[null,null,null,null,null,null,null,null,null,"Un Nuevo Contrato Social y Ambiental para la Bogotá del Siglo XXI",null,{"$f":"IF(ISERROR(VLOOKUP(K408,Proposito_programa!$C$2:$E$59,2,FALSE)),\" \",VLOOKUP(K408,Proposito_programa!$C$2:$E$59,2,FALSE))","v":" "},{"$f":"IF(ISERROR(VLOOKUP(K408,Proposito_programa!$C$2:$E$59,3,FALSE)),\" \",VLOOKUP(K408,Proposito_programa!$C$2:$E$59,3,FALSE))","v":" "},null,null,null,null,null,null,null,null,null,null,null,null,null,null,0,null,null,null,null,null,null,null,null,null,null,null,null,null,null,null,"-"]
[null,null,null,null,null,null,null,null,null,"Un Nuevo Contrato Social y Ambiental para la Bogotá del Siglo XXI",null,{"$f":"IF(ISERROR(VLOOKUP(K409,Proposito_programa!$C$2:$E$59,2,FALSE)),\" \",VLOOKUP(K409,Proposito_programa!$C$2:$E$59,2,FALSE))","v":" "},{"$f":"IF(ISERROR(VLOOKUP(K409,Proposito_programa!$C$2:$E$59,3,FALSE)),\" \",VLOOKUP(K409,Proposito_programa!$C$2:$E$59,3,FALSE))","v":" "},null,null,null,null,null,null,null,null,null,null,null,null,null,null,0,null,null,null,null,null,null,null,null,null,null,null,null,null,null,null,"-"]
[null,null,null,null,null,null,null,null,null,"Un Nuevo Contrato Social y Ambiental para la Bogotá del Siglo XXI",null,{"$f":"IF(ISERROR(VLOOKUP(K410,Proposito_programa!$C$2:$E$59,2,FALSE)),\" \",VLOOKUP(K410,Proposito_programa!$C$2:$E$59,2,FALSE))","v":" "},{"$f":"IF(ISERROR(VLOOKUP(K410,Proposito_programa!$C$2:$E$59,3,FALSE)),\" \",VLOOKUP(K410,Proposito_programa!$C$2:$E$59,3,FALSE))","v":" "},null,null,null,null,null,null,null,null,null,null,null,null,null,null,0,null,null,null,null,null,null,null,null,null,null,null,null,null,null,null,"-"]
[null,null,null,null,null,null,null,null,null,"Un Nuevo Contrato Social y Ambiental para la Bogotá del Siglo XXI",null,{"$f":"IF(ISERROR(VLOOKUP(K411,Proposito_programa!$C$2:$E$59,2,FALSE)),\" \",VLOOKUP(K411,Proposito_programa!$C$2:$E$59,2,FALSE))","v":" "},{"$f":"IF(ISERROR(VLOOKUP(K411,Proposito_programa!$C$2:$E$59,3,FALSE)),\" \",VLOOKUP(K411,Proposito_programa!$C$2:$E$59,3,FALSE))","v":" "},null,null,null,null,null,null,null,null,null,null,null,null,null,null,0,null,null,null,null,null,null,null,null,null,null,null,null,null,null,null,"-"]
[null,null,null,null,null,null,null,null,null,"Un Nuevo Contrato Social y Ambiental para la Bogotá del Siglo XXI",null,{"$f":"IF(ISERROR(VLOOKUP(K412,Proposito_programa!$C$2:$E$59,2,FALSE)),\" \",VLOOKUP(K412,Proposito_programa!$C$2:$E$59,2,FALSE))","v":" "},{"$f":"IF(ISERROR(VLOOKUP(K412,Proposito_programa!$C$2:$E$59,3,FALSE)),\" \",VLOOKUP(K412,Proposito_programa!$C$2:$E$59,3,FALSE))","v":" "},null,null,null,null,null,null,null,null,null,null,null,null,null,null,0,null,null,null,null,null,null,null,null,null,null,null,null,null,null,null,"-"]
[null,null,null,null,null,null,null,null,null,"Un Nuevo Contrato Social y Ambiental para la Bogotá del Siglo XXI",null,{"$f":"IF(ISERROR(VLOOKUP(K413,Proposito_programa!$C$2:$E$59,2,FALSE)),\" \",VLOOKUP(K413,Proposito_programa!$C$2:$E$59,2,FALSE))","v":" "},{"$f":"IF(ISERROR(VLOOKUP(K413,Proposito_programa!$C$2:$E$59,3,FALSE)),\" \",VLOOKUP(K413,Proposito_programa!$C$2:$E$59,3,FALSE))","v":" "},null,null,null,null,null,null,null,null,null,null,null,null,null,null,0,null,null,null,null,null,null,null,null,null,null,null,null,null,null,null,"-"]
[null,null,null,null,null,null,null,null,null,"Un Nuevo Contrato Social y Ambiental para la Bogotá del Siglo XXI",null,{"$f":"IF(ISERROR(VLOOKUP(K414,Proposito_programa!$C$2:$E$59,2,FALSE)),\" \",VLOOKUP(K414,Proposito_programa!$C$2:$E$59,2,FALSE))","v":" "},{"$f":"IF(ISERROR(VLOOKUP(K414,Proposito_programa!$C$2:$E$59,3,FALSE)),\" \",VLOOKUP(K414,Proposito_programa!$C$2:$E$59,3,FALSE))","v":" "},null,null,null,null,null,null,null,null,null,null,null,null,null,null,0,null,null,null,null,null,null,null,null,null,null,null,null,null,null,null,"-"]
[null,null,null,null,null,null,null,null,null,"Un Nuevo Contrato Social y Ambiental para la Bogotá del Siglo XXI",null,{"$f":"IF(ISERROR(VLOOKUP(K415,Proposito_programa!$C$2:$E$59,2,FALSE)),\" \",VLOOKUP(K415,Proposito_programa!$C$2:$E$59,2,FALSE))","v":" "},{"$f":"IF(ISERROR(VLOOKUP(K415,Proposito_programa!$C$2:$E$59,3,FALSE)),\" \",VLOOKUP(K415,Proposito_programa!$C$2:$E$59,3,FALSE))","v":" "},null,null,null,null,null,null,null,null,null,null,null,null,null,null,0,null,null,null,null,null,null,null,null,null,null,null,null,null,null,null,"-"]
[null,null,null,null,null,null,null,null,null,"Un Nuevo Contrato Social y Ambiental para la Bogotá del Siglo XXI",null,{"$f":"IF(ISERROR(VLOOKUP(K416,Proposito_programa!$C$2:$E$59,2,FALSE)),\" \",VLOOKUP(K416,Proposito_programa!$C$2:$E$59,2,FALSE))","v":" "},{"$f":"IF(ISERROR(VLOOKUP(K416,Proposito_programa!$C$2:$E$59,3,FALSE)),\" \",VLOOKUP(K416,Proposito_programa!$C$2:$E$59,3,FALSE))","v":" "},null,null,null,null,null,null,null,null,null,null,null,null,null,null,0,null,null,null,null,null,null,null,null,null,null,null,null,null,null,null,"-"]
[null,null,null,null,null,null,null,null,null,"Un Nuevo Contrato Social y Ambiental para la Bogotá del Siglo XXI",null,{"$f":"IF(ISERROR(VLOOKUP(K417,Proposito_programa!$C$2:$E$59,2,FALSE)),\" \",VLOOKUP(K417,Proposito_programa!$C$2:$E$59,2,FALSE))","v":" "},{"$f":"IF(ISERROR(VLOOKUP(K417,Proposito_programa!$C$2:$E$59,3,FALSE)),\" \",VLOOKUP(K417,Proposito_programa!$C$2:$E$59,3,FALSE))","v":" "},null,null,null,null,null,null,null,null,null,null,null,null,null,null,0,null,null,null,null,null,null,null,null,null,null,null,null,null,null,null,"-"]
[null,null,null,null,null,null,null,null,null,"Un Nuevo Contrato Social y Ambiental para la Bogotá del Siglo XXI",null,{"$f":"IF(ISERROR(VLOOKUP(K418,Proposito_programa!$C$2:$E$59,2,FALSE)),\" \",VLOOKUP(K418,Proposito_programa!$C$2:$E$59,2,FALSE))","v":" "},{"$f":"IF(ISERROR(VLOOKUP(K418,Proposito_programa!$C$2:$E$59,3,FALSE)),\" \",VLOOKUP(K418,Proposito_programa!$C$2:$E$59,3,FALSE))","v":" "},null,null,null,null,null,null,null,null,null,null,null,null,null,null,0,null,null,null,null,null,null,null,null,null,null,null,null,null,null,null,"-"]
[null,null,null,null,null,null,null,null,null,"Un Nuevo Contrato Social y Ambiental para la Bogotá del Siglo XXI",null,{"$f":"IF(ISERROR(VLOOKUP(K419,Proposito_programa!$C$2:$E$59,2,FALSE)),\" \",VLOOKUP(K419,Proposito_programa!$C$2:$E$59,2,FALSE))","v":" "},{"$f":"IF(ISERROR(VLOOKUP(K419,Proposito_programa!$C$2:$E$59,3,FALSE)),\" \",VLOOKUP(K419,Proposito_programa!$C$2:$E$59,3,FALSE))","v":" "},null,null,null,null,null,null,null,null,null,null,null,null,null,null,0,null,null,null,null,null,null,null,null,null,null,null,null,null,null,null,"-"]
[null,null,null,null,null,null,null,null,null,"Un Nuevo Contrato Social y Ambiental para la Bogotá del Siglo XXI",null,{"$f":"IF(ISERROR(VLOOKUP(K420,Proposito_programa!$C$2:$E$59,2,FALSE)),\" \",VLOOKUP(K420,Proposito_programa!$C$2:$E$59,2,FALSE))","v":" "},{"$f":"IF(ISERROR(VLOOKUP(K420,Proposito_programa!$C$2:$E$59,3,FALSE)),\" \",VLOOKUP(K420,Proposito_programa!$C$2:$E$59,3,FALSE))","v":" "},null,null,null,null,null,null,null,null,null,null,null,null,null,null,0,null,null,null,null,null,null,null,null,null,null,null,null,null,null,null,"-"]
[null,null,null,null,null,null,null,null,null,"Un Nuevo Contrato Social y Ambiental para la Bogotá del Siglo XXI",null,{"$f":"IF(ISERROR(VLOOKUP(K421,Proposito_programa!$C$2:$E$59,2,FALSE)),\" \",VLOOKUP(K421,Proposito_programa!$C$2:$E$59,2,FALSE))","v":" "},{"$f":"IF(ISERROR(VLOOKUP(K421,Proposito_programa!$C$2:$E$59,3,FALSE)),\" \",VLOOKUP(K421,Proposito_programa!$C$2:$E$59,3,FALSE))","v":" "},null,null,null,null,null,null,null,null,null,null,null,null,null,null,0,null,null,null,null,null,null,null,null,null,null,null,null,null,null,null,"-"]
[null,null,null,null,null,null,null,null,null,"Un Nuevo Contrato Social y Ambiental para la Bogotá del Siglo XXI",null,{"$f":"IF(ISERROR(VLOOKUP(K422,Proposito_programa!$C$2:$E$59,2,FALSE)),\" \",VLOOKUP(K422,Proposito_programa!$C$2:$E$59,2,FALSE))","v":" "},{"$f":"IF(ISERROR(VLOOKUP(K422,Proposito_programa!$C$2:$E$59,3,FALSE)),\" \",VLOOKUP(K422,Proposito_programa!$C$2:$E$59,3,FALSE))","v":" "},null,null,null,null,null,null,null,null,null,null,null,null,null,null,0,null,null,null,null,null,null,null,null,null,null,null,null,null,null,null,"-"]
[null,null,null,null,null,null,null,null,null,"Un Nuevo Contrato Social y Ambiental para la Bogotá del Siglo XXI",null,{"$f":"IF(ISERROR(VLOOKUP(K423,Proposito_programa!$C$2:$E$59,2,FALSE)),\" \",VLOOKUP(K423,Proposito_programa!$C$2:$E$59,2,FALSE))","v":" "},{"$f":"IF(ISERROR(VLOOKUP(K423,Proposito_programa!$C$2:$E$59,3,FALSE)),\" \",VLOOKUP(K423,Proposito_programa!$C$2:$E$59,3,FALSE))","v":" "},null,null,null,null,null,null,null,null,null,null,null,null,null,null,0,null,null,null,null,null,null,null,null,null,null,null,null,null,null,null,"-"]
[null,null,null,null,null,null,null,null,null,"Un Nuevo Contrato Social y Ambiental para la Bogotá del Siglo XXI",null,{"$f":"IF(ISERROR(VLOOKUP(K424,Proposito_programa!$C$2:$E$59,2,FALSE)),\" \",VLOOKUP(K424,Proposito_programa!$C$2:$E$59,2,FALSE))","v":" "},{"$f":"IF(ISERROR(VLOOKUP(K424,Proposito_programa!$C$2:$E$59,3,FALSE)),\" \",VLOOKUP(K424,Proposito_programa!$C$2:$E$59,3,FALSE))","v":" "},null,null,null,null,null,null,null,null,null,null,null,null,null,null,0,null,null,null,null,null,null,null,null,null,null,null,null,null,null,null,"-"]
[null,null,null,null,null,null,null,null,null,"Un Nuevo Contrato Social y Ambiental para la Bogotá del Siglo XXI",null,{"$f":"IF(ISERROR(VLOOKUP(K425,Proposito_programa!$C$2:$E$59,2,FALSE)),\" \",VLOOKUP(K425,Proposito_programa!$C$2:$E$59,2,FALSE))","v":" "},{"$f":"IF(ISERROR(VLOOKUP(K425,Proposito_programa!$C$2:$E$59,3,FALSE)),\" \",VLOOKUP(K425,Proposito_programa!$C$2:$E$59,3,FALSE))","v":" "},null,null,null,null,null,null,null,null,null,null,null,null,null,null,0,null,null,null,null,null,null,null,null,null,null,null,null,null,null,null,"-"]
[null,null,null,null,null,null,null,null,null,"Un Nuevo Contrato Social y Ambiental para la Bogotá del Siglo XXI",null,{"$f":"IF(ISERROR(VLOOKUP(K426,Proposito_programa!$C$2:$E$59,2,FALSE)),\" \",VLOOKUP(K426,Proposito_programa!$C$2:$E$59,2,FALSE))","v":" "},{"$f":"IF(ISERROR(VLOOKUP(K426,Proposito_programa!$C$2:$E$59,3,FALSE)),\" \",VLOOKUP(K426,Proposito_programa!$C$2:$E$59,3,FALSE))","v":" "},null,null,null,null,null,null,null,null,null,null,null,null,null,null,0,null,null,null,null,null,null,null,null,null,null,null,null,null,null,null,"-"]
[null,null,null,null,null,null,null,null,null,"Un Nuevo Contrato Social y Ambiental para la Bogotá del Siglo XXI",null,{"$f":"IF(ISERROR(VLOOKUP(K427,Proposito_programa!$C$2:$E$59,2,FALSE)),\" \",VLOOKUP(K427,Proposito_programa!$C$2:$E$59,2,FALSE))","v":" "},{"$f":"IF(ISERROR(VLOOKUP(K427,Proposito_programa!$C$2:$E$59,3,FALSE)),\" \",VLOOKUP(K427,Proposito_programa!$C$2:$E$59,3,FALSE))","v":" "},null,null,null,null,null,null,null,null,null,null,null,null,null,null,0,null,null,null,null,null,null,null,null,null,null,null,null,null,null,null,"-"]
[null,null,null,null,null,null,null,null,null,"Un Nuevo Contrato Social y Ambiental para la Bogotá del Siglo XXI",null,{"$f":"IF(ISERROR(VLOOKUP(K428,Proposito_programa!$C$2:$E$59,2,FALSE)),\" \",VLOOKUP(K428,Proposito_programa!$C$2:$E$59,2,FALSE))","v":" "},{"$f":"IF(ISERROR(VLOOKUP(K428,Proposito_programa!$C$2:$E$59,3,FALSE)),\" \",VLOOKUP(K428,Proposito_programa!$C$2:$E$59,3,FALSE))","v":" "},null,null,null,null,null,null,null,null,null,null,null,null,null,null,0,null,null,null,null,null,null,null,null,null,null,null,null,null,null,null,"-"]
[null,null,null,null,null,null,null,null,null,"Un Nuevo Contrato Social y Ambiental para la Bogotá del Siglo XXI",null,{"$f":"IF(ISERROR(VLOOKUP(K429,Proposito_programa!$C$2:$E$59,2,FALSE)),\" \",VLOOKUP(K429,Proposito_programa!$C$2:$E$59,2,FALSE))","v":" "},{"$f":"IF(ISERROR(VLOOKUP(K429,Proposito_programa!$C$2:$E$59,3,FALSE)),\" \",VLOOKUP(K429,Proposito_programa!$C$2:$E$59,3,FALSE))","v":" "},null,null,null,null,null,null,null,null,null,null,null,null,null,null,0,null,null,null,null,null,null,null,null,null,null,null,null,null,null,null,"-"]
[null,null,null,null,null,null,null,null,null,"Un Nuevo Contrato Social y Ambiental para la Bogotá del Siglo XXI",null,{"$f":"IF(ISERROR(VLOOKUP(K430,Proposito_programa!$C$2:$E$59,2,FALSE)),\" \",VLOOKUP(K430,Proposito_programa!$C$2:$E$59,2,FALSE))","v":" "},{"$f":"IF(ISERROR(VLOOKUP(K430,Proposito_programa!$C$2:$E$59,3,FALSE)),\" \",VLOOKUP(K430,Proposito_programa!$C$2:$E$59,3,FALSE))","v":" "},null,null,null,null,null,null,null,null,null,null,null,null,null,null,0,null,null,null,null,null,null,null,null,null,null,null,null,null,null,null,"-"]
[null,null,null,null,null,null,null,null,null,"Un Nuevo Contrato Social y Ambiental para la Bogotá del Siglo XXI",null,{"$f":"IF(ISERROR(VLOOKUP(K431,Proposito_programa!$C$2:$E$59,2,FALSE)),\" \",VLOOKUP(K431,Proposito_programa!$C$2:$E$59,2,FALSE))","v":" "},{"$f":"IF(ISERROR(VLOOKUP(K431,Proposito_programa!$C$2:$E$59,3,FALSE)),\" \",VLOOKUP(K431,Proposito_programa!$C$2:$E$59,3,FALSE))","v":" "},null,null,null,null,null,null,null,null,null,null,null,null,null,null,0,null,null,null,null,null,null,null,null,null,null,null,null,null,null,null,"-"]
[null,null,null,null,null,null,null,null,null,"Un Nuevo Contrato Social y Ambiental para la Bogotá del Siglo XXI",null,{"$f":"IF(ISERROR(VLOOKUP(K432,Proposito_programa!$C$2:$E$59,2,FALSE)),\" \",VLOOKUP(K432,Proposito_programa!$C$2:$E$59,2,FALSE))","v":" "},{"$f":"IF(ISERROR(VLOOKUP(K432,Proposito_programa!$C$2:$E$59,3,FALSE)),\" \",VLOOKUP(K432,Proposito_programa!$C$2:$E$59,3,FALSE))","v":" "},null,null,null,null,null,null,null,null,null,null,null,null,null,null,0,null,null,null,null,null,null,null,null,null,null,null,null,null,null,null,"-"]
[null,null,null,null,null,null,null,null,null,"Un Nuevo Contrato Social y Ambiental para la Bogotá del Siglo XXI",null,{"$f":"IF(ISERROR(VLOOKUP(K433,Proposito_programa!$C$2:$E$59,2,FALSE)),\" \",VLOOKUP(K433,Proposito_programa!$C$2:$E$59,2,FALSE))","v":" "},{"$f":"IF(ISERROR(VLOOKUP(K433,Proposito_programa!$C$2:$E$59,3,FALSE)),\" \",VLOOKUP(K433,Proposito_programa!$C$2:$E$59,3,FALSE))","v":" "},null,null,null,null,null,null,null,null,null,null,null,null,null,null,0,null,null,null,null,null,null,null,null,null,null,null,null,null,null,null,"-"]
[null,null,null,null,null,null,null,null,null,"Un Nuevo Contrato Social y Ambiental para la Bogotá del Siglo XXI",null,{"$f":"IF(ISERROR(VLOOKUP(K434,Proposito_programa!$C$2:$E$59,2,FALSE)),\" \",VLOOKUP(K434,Proposito_programa!$C$2:$E$59,2,FALSE))","v":" "},{"$f":"IF(ISERROR(VLOOKUP(K434,Proposito_programa!$C$2:$E$59,3,FALSE)),\" \",VLOOKUP(K434,Proposito_programa!$C$2:$E$59,3,FALSE))","v":" "},null,null,null,null,null,null,null,null,null,null,null,null,null,null,0,null,null,null,null,null,null,null,null,null,null,null,null,null,null,null,"-"]
[null,null,null,null,null,null,null,null,null,"Un Nuevo Contrato Social y Ambiental para la Bogotá del Siglo XXI",null,{"$f":"IF(ISERROR(VLOOKUP(K435,Proposito_programa!$C$2:$E$59,2,FALSE)),\" \",VLOOKUP(K435,Proposito_programa!$C$2:$E$59,2,FALSE))","v":" "},{"$f":"IF(ISERROR(VLOOKUP(K435,Proposito_programa!$C$2:$E$59,3,FALSE)),\" \",VLOOKUP(K435,Proposito_programa!$C$2:$E$59,3,FALSE))","v":" "},null,null,null,null,null,null,null,null,null,null,null,null,null,null,0,null,null,null,null,null,null,null,null,null,null,null,null,null,null,null,"-"]
[null,null,null,null,null,null,null,null,null,"Un Nuevo Contrato Social y Ambiental para la Bogotá del Siglo XXI",null,{"$f":"IF(ISERROR(VLOOKUP(K436,Proposito_programa!$C$2:$E$59,2,FALSE)),\" \",VLOOKUP(K436,Proposito_programa!$C$2:$E$59,2,FALSE))","v":" "},{"$f":"IF(ISERROR(VLOOKUP(K436,Proposito_programa!$C$2:$E$59,3,FALSE)),\" \",VLOOKUP(K436,Proposito_programa!$C$2:$E$59,3,FALSE))","v":" "},null,null,null,null,null,null,null,null,null,null,null,null,null,null,0,null,null,null,null,null,null,null,null,null,null,null,null,null,null,null,"-"]
[null,null,null,null,null,null,null,null,null,"Un Nuevo Contrato Social y Ambiental para la Bogotá del Siglo XXI",null,{"$f":"IF(ISERROR(VLOOKUP(K437,Proposito_programa!$C$2:$E$59,2,FALSE)),\" \",VLOOKUP(K437,Proposito_programa!$C$2:$E$59,2,FALSE))","v":" "},{"$f":"IF(ISERROR(VLOOKUP(K437,Proposito_programa!$C$2:$E$59,3,FALSE)),\" \",VLOOKUP(K437,Proposito_programa!$C$2:$E$59,3,FALSE))","v":" "},null,null,null,null,null,null,null,null,null,null,null,null,null,null,0,null,null,null,null,null,null,null,null,null,null,null,null,null,null,null,"-"]
[null,null,null,null,null,null,null,null,null,"Un Nuevo Contrato Social y Ambiental para la Bogotá del Siglo XXI",null,{"$f":"IF(ISERROR(VLOOKUP(K438,Proposito_programa!$C$2:$E$59,2,FALSE)),\" \",VLOOKUP(K438,Proposito_programa!$C$2:$E$59,2,FALSE))","v":" "},{"$f":"IF(ISERROR(VLOOKUP(K438,Proposito_programa!$C$2:$E$59,3,FALSE)),\" \",VLOOKUP(K438,Proposito_programa!$C$2:$E$59,3,FALSE))","v":" "},null,null,null,null,null,null,null,null,null,null,null,null,null,null,0,null,null,null,null,null,null,null,null,null,null,null,null,null,null,null,"-"]
[null,null,null,null,null,null,null,null,null,"Un Nuevo Contrato Social y Ambiental para la Bogotá del Siglo XXI",null,{"$f":"IF(ISERROR(VLOOKUP(K439,Proposito_programa!$C$2:$E$59,2,FALSE)),\" \",VLOOKUP(K439,Proposito_programa!$C$2:$E$59,2,FALSE))","v":" "},{"$f":"IF(ISERROR(VLOOKUP(K439,Proposito_programa!$C$2:$E$59,3,FALSE)),\" \",VLOOKUP(K439,Proposito_programa!$C$2:$E$59,3,FALSE))","v":" "},null,null,null,null,null,null,null,null,null,null,null,null,null,null,0,null,null,null,null,null,null,null,null,null,null,null,null,null,null,null,"-"]
[null,null,null,null,null,null,null,null,null,"Un Nuevo Contrato Social y Ambiental para la Bogotá del Siglo XXI",null,{"$f":"IF(ISERROR(VLOOKUP(K440,Proposito_programa!$C$2:$E$59,2,FALSE)),\" \",VLOOKUP(K440,Proposito_programa!$C$2:$E$59,2,FALSE))","v":" "},{"$f":"IF(ISERROR(VLOOKUP(K440,Proposito_programa!$C$2:$E$59,3,FALSE)),\" \",VLOOKUP(K440,Proposito_programa!$C$2:$E$59,3,FALSE))","v":" "},null,null,null,null,null,null,null,null,null,null,null,null,null,null,0,null,null,null,null,null,null,null,null,null,null,null,null,null,null,null,"-"]
[null,null,null,null,null,null,null,null,null,"Un Nuevo Contrato Social y Ambiental para la Bogotá del Siglo XXI",null,{"$f":"IF(ISERROR(VLOOKUP(K441,Proposito_programa!$C$2:$E$59,2,FALSE)),\" \",VLOOKUP(K441,Proposito_programa!$C$2:$E$59,2,FALSE))","v":" "},{"$f":"IF(ISERROR(VLOOKUP(K441,Proposito_programa!$C$2:$E$59,3,FALSE)),\" \",VLOOKUP(K441,Proposito_programa!$C$2:$E$59,3,FALSE))","v":" "},null,null,null,null,null,null,null,null,null,null,null,null,null,null,0,null,null,null,null,null,null,null,null,null,null,null,null,null,null,null,"-"]
[null,null,null,null,null,null,null,null,null,"Un Nuevo Contrato Social y Ambiental para la Bogotá del Siglo XXI",null,{"$f":"IF(ISERROR(VLOOKUP(K442,Proposito_programa!$C$2:$E$59,2,FALSE)),\" \",VLOOKUP(K442,Proposito_programa!$C$2:$E$59,2,FALSE))","v":" "},{"$f":"IF(ISERROR(VLOOKUP(K442,Proposito_programa!$C$2:$E$59,3,FALSE)),\" \",VLOOKUP(K442,Proposito_programa!$C$2:$E$59,3,FALSE))","v":" "},null,null,null,null,null,null,null,null,null,null,null,null,null,null,0,null,null,null,null,null,null,null,null,null,null,null,null,null,null,null,"-"]
[null,null,null,null,null,null,null,null,null,"Un Nuevo Contrato Social y Ambiental para la Bogotá del Siglo XXI",null,{"$f":"IF(ISERROR(VLOOKUP(K443,Proposito_programa!$C$2:$E$59,2,FALSE)),\" \",VLOOKUP(K443,Proposito_programa!$C$2:$E$59,2,FALSE))","v":" "},{"$f":"IF(ISERROR(VLOOKUP(K443,Proposito_programa!$C$2:$E$59,3,FALSE)),\" \",VLOOKUP(K443,Proposito_programa!$C$2:$E$59,3,FALSE))","v":" "},null,null,null,null,null,null,null,null,null,null,null,null,null,null,0,null,null,null,null,null,null,null,null,null,null,null,null,null,null,null,"-"]
[null,null,null,null,null,null,null,null,null,"Un Nuevo Contrato Social y Ambiental para la Bogotá del Siglo XXI",null,{"$f":"IF(ISERROR(VLOOKUP(K444,Proposito_programa!$C$2:$E$59,2,FALSE)),\" \",VLOOKUP(K444,Proposito_programa!$C$2:$E$59,2,FALSE))","v":" "},{"$f":"IF(ISERROR(VLOOKUP(K444,Proposito_programa!$C$2:$E$59,3,FALSE)),\" \",VLOOKUP(K444,Proposito_programa!$C$2:$E$59,3,FALSE))","v":" "},null,null,null,null,null,null,null,null,null,null,null,null,null,null,0,null,null,null,null,null,null,null,null,null,null,null,null,null,null,null,"-"]
[null,null,null,null,null,null,null,null,null,"Un Nuevo Contrato Social y Ambiental para la Bogotá del Siglo XXI",null,{"$f":"IF(ISERROR(VLOOKUP(K445,Proposito_programa!$C$2:$E$59,2,FALSE)),\" \",VLOOKUP(K445,Proposito_programa!$C$2:$E$59,2,FALSE))","v":" "},{"$f":"IF(ISERROR(VLOOKUP(K445,Proposito_programa!$C$2:$E$59,3,FALSE)),\" \",VLOOKUP(K445,Proposito_programa!$C$2:$E$59,3,FALSE))","v":" "},null,null,null,null,null,null,null,null,null,null,null,null,null,null,0,null,null,null,null,null,null,null,null,null,null,null,null,null,null,null,"-"]
[null,null,null,null,null,null,null,null,null,"Un Nuevo Contrato Social y Ambiental para la Bogotá del Siglo XXI",null,{"$f":"IF(ISERROR(VLOOKUP(K446,Proposito_programa!$C$2:$E$59,2,FALSE)),\" \",VLOOKUP(K446,Proposito_programa!$C$2:$E$59,2,FALSE))","v":" "},{"$f":"IF(ISERROR(VLOOKUP(K446,Proposito_programa!$C$2:$E$59,3,FALSE)),\" \",VLOOKUP(K446,Proposito_programa!$C$2:$E$59,3,FALSE))","v":" "},null,null,null,null,null,null,null,null,null,null,null,null,null,null,0,null,null,null,null,null,null,null,null,null,null,null,null,null,null,null,"-"]
[null,null,null,null,null,null,null,null,null,"Un Nuevo Contrato Social y Ambiental para la Bogotá del Siglo XXI",null,{"$f":"IF(ISERROR(VLOOKUP(K447,Proposito_programa!$C$2:$E$59,2,FALSE)),\" \",VLOOKUP(K447,Proposito_programa!$C$2:$E$59,2,FALSE))","v":" "},{"$f":"IF(ISERROR(VLOOKUP(K447,Proposito_programa!$C$2:$E$59,3,FALSE)),\" \",VLOOKUP(K447,Proposito_programa!$C$2:$E$59,3,FALSE))","v":" "},null,null,null,null,null,null,null,null,null,null,null,null,null,null,0,null,null,null,null,null,null,null,null,null,null,null,null,null,null,null,"-"]
[null,null,null,null,null,null,null,null,null,"Un Nuevo Contrato Social y Ambiental para la Bogotá del Siglo XXI",null,{"$f":"IF(ISERROR(VLOOKUP(K448,Proposito_programa!$C$2:$E$59,2,FALSE)),\" \",VLOOKUP(K448,Proposito_programa!$C$2:$E$59,2,FALSE))","v":" "},{"$f":"IF(ISERROR(VLOOKUP(K448,Proposito_programa!$C$2:$E$59,3,FALSE)),\" \",VLOOKUP(K448,Proposito_programa!$C$2:$E$59,3,FALSE))","v":" "},null,null,null,null,null,null,null,null,null,null,null,null,null,null,0,null,null,null,null,null,null,null,null,null,null,null,null,null,null,null,"-"]
[null,null,null,null,null,null,null,null,null,"Un Nuevo Contrato Social y Ambiental para la Bogotá del Siglo XXI",null,{"$f":"IF(ISERROR(VLOOKUP(K449,Proposito_programa!$C$2:$E$59,2,FALSE)),\" \",VLOOKUP(K449,Proposito_programa!$C$2:$E$59,2,FALSE))","v":" "},{"$f":"IF(ISERROR(VLOOKUP(K449,Proposito_programa!$C$2:$E$59,3,FALSE)),\" \",VLOOKUP(K449,Proposito_programa!$C$2:$E$59,3,FALSE))","v":" "},null,null,null,null,null,null,null,null,null,null,null,null,null,null,0,null,null,null,null,null,null,null,null,null,null,null,null,null,null,null,"-"]
[null,null,null,null,null,null,null,null,null,"Un Nuevo Contrato Social y Ambiental para la Bogotá del Siglo XXI",null,{"$f":"IF(ISERROR(VLOOKUP(K450,Proposito_programa!$C$2:$E$59,2,FALSE)),\" \",VLOOKUP(K450,Proposito_programa!$C$2:$E$59,2,FALSE))","v":" "},{"$f":"IF(ISERROR(VLOOKUP(K450,Proposito_programa!$C$2:$E$59,3,FALSE)),\" \",VLOOKUP(K450,Proposito_programa!$C$2:$E$59,3,FALSE))","v":" "},null,null,null,null,null,null,null,null,null,null,null,null,null,null,0,null,null,null,null,null,null,null,null,null,null,null,null,null,null,null,"-"]
[null,null,null,null,null,null,null,null,null,"Un Nuevo Contrato Social y Ambiental para la Bogotá del Siglo XXI",null,{"$f":"IF(ISERROR(VLOOKUP(K451,Proposito_programa!$C$2:$E$59,2,FALSE)),\" \",VLOOKUP(K451,Proposito_programa!$C$2:$E$59,2,FALSE))","v":" "},{"$f":"IF(ISERROR(VLOOKUP(K451,Proposito_programa!$C$2:$E$59,3,FALSE)),\" \",VLOOKUP(K451,Proposito_programa!$C$2:$E$59,3,FALSE))","v":" "},null,null,null,null,null,null,null,null,null,null,null,null,null,null,0,null,null,null,null,null,null,null,null,null,null,null,null,null,null,null,"-"]
[null,null,null,null,null,null,null,null,null,"Un Nuevo Contrato Social y Ambiental para la Bogotá del Siglo XXI",null,{"$f":"IF(ISERROR(VLOOKUP(K452,Proposito_programa!$C$2:$E$59,2,FALSE)),\" \",VLOOKUP(K452,Proposito_programa!$C$2:$E$59,2,FALSE))","v":" "},{"$f":"IF(ISERROR(VLOOKUP(K452,Proposito_programa!$C$2:$E$59,3,FALSE)),\" \",VLOOKUP(K452,Proposito_programa!$C$2:$E$59,3,FALSE))","v":" "},null,null,null,null,null,null,null,null,null,null,null,null,null,null,0,null,null,null,null,null,null,null,null,null,null,null,null,null,null,null,"-"]
[null,null,null,null,null,null,null,null,null,"Un Nuevo Contrato Social y Ambiental para la Bogotá del Siglo XXI",null,{"$f":"IF(ISERROR(VLOOKUP(K453,Proposito_programa!$C$2:$E$59,2,FALSE)),\" \",VLOOKUP(K453,Proposito_programa!$C$2:$E$59,2,FALSE))","v":" "},{"$f":"IF(ISERROR(VLOOKUP(K453,Proposito_programa!$C$2:$E$59,3,FALSE)),\" \",VLOOKUP(K453,Proposito_programa!$C$2:$E$59,3,FALSE))","v":" "},null,null,null,null,null,null,null,null,null,null,null,null,null,null,0,null,null,null,null,null,null,null,null,null,null,null,null,null,null,null,"-"]
[null,null,null,null,null,null,null,null,null,"Un Nuevo Contrato Social y Ambiental para la Bogotá del Siglo XXI",null,{"$f":"IF(ISERROR(VLOOKUP(K454,Proposito_programa!$C$2:$E$59,2,FALSE)),\" \",VLOOKUP(K454,Proposito_programa!$C$2:$E$59,2,FALSE))","v":" "},{"$f":"IF(ISERROR(VLOOKUP(K454,Proposito_programa!$C$2:$E$59,3,FALSE)),\" \",VLOOKUP(K454,Proposito_programa!$C$2:$E$59,3,FALSE))","v":" "},null,null,null,null,null,null,null,null,null,null,null,null,null,null,0,null,null,null,null,null,null,null,null,null,null,null,null,null,null,null,"-"]
[null,null,null,null,null,null,null,null,null,"Un Nuevo Contrato Social y Ambiental para la Bogotá del Siglo XXI",null,{"$f":"IF(ISERROR(VLOOKUP(K455,Proposito_programa!$C$2:$E$59,2,FALSE)),\" \",VLOOKUP(K455,Proposito_programa!$C$2:$E$59,2,FALSE))","v":" "},{"$f":"IF(ISERROR(VLOOKUP(K455,Proposito_programa!$C$2:$E$59,3,FALSE)),\" \",VLOOKUP(K455,Proposito_programa!$C$2:$E$59,3,FALSE))","v":" "},null,null,null,null,null,null,null,null,null,null,null,null,null,null,0,null,null,null,null,null,null,null,null,null,null,null,null,null,null,null,"-"]
[null,null,null,null,null,null,null,null,null,"Un Nuevo Contrato Social y Ambiental para la Bogotá del Siglo XXI",null,{"$f":"IF(ISERROR(VLOOKUP(K456,Proposito_programa!$C$2:$E$59,2,FALSE)),\" \",VLOOKUP(K456,Proposito_programa!$C$2:$E$59,2,FALSE))","v":" "},{"$f":"IF(ISERROR(VLOOKUP(K456,Proposito_programa!$C$2:$E$59,3,FALSE)),\" \",VLOOKUP(K456,Proposito_programa!$C$2:$E$59,3,FALSE))","v":" "},null,null,null,null,null,null,null,null,null,null,null,null,null,null,0,null,null,null,null,null,null,null,null,null,null,null,null,null,null,null,"-"]
[null,null,null,null,null,null,null,null,null,"Un Nuevo Contrato Social y Ambiental para la Bogotá del Siglo XXI",null,{"$f":"IF(ISERROR(VLOOKUP(K457,Proposito_programa!$C$2:$E$59,2,FALSE)),\" \",VLOOKUP(K457,Proposito_programa!$C$2:$E$59,2,FALSE))","v":" "},{"$f":"IF(ISERROR(VLOOKUP(K457,Proposito_programa!$C$2:$E$59,3,FALSE)),\" \",VLOOKUP(K457,Proposito_programa!$C$2:$E$59,3,FALSE))","v":" "},null,null,null,null,null,null,null,null,null,null,null,null,null,null,0,null,null,null,null,null,null,null,null,null,null,null,null,null,null,null,"-"]
[null,null,null,null,null,null,null,null,null,"Un Nuevo Contrato Social y Ambiental para la Bogotá del Siglo XXI",null,{"$f":"IF(ISERROR(VLOOKUP(K458,Proposito_programa!$C$2:$E$59,2,FALSE)),\" \",VLOOKUP(K458,Proposito_programa!$C$2:$E$59,2,FALSE))","v":" "},{"$f":"IF(ISERROR(VLOOKUP(K458,Proposito_programa!$C$2:$E$59,3,FALSE)),\" \",VLOOKUP(K458,Proposito_programa!$C$2:$E$59,3,FALSE))","v":" "},null,null,null,null,null,null,null,null,null,null,null,null,null,null,0,null,null,null,null,null,null,null,null,null,null,null,null,null,null,null,"-"]
[null,null,null,null,null,null,null,null,null,"Un Nuevo Contrato Social y Ambiental para la Bogotá del Siglo XXI",null,{"$f":"IF(ISERROR(VLOOKUP(K459,Proposito_programa!$C$2:$E$59,2,FALSE)),\" \",VLOOKUP(K459,Proposito_programa!$C$2:$E$59,2,FALSE))","v":" "},{"$f":"IF(ISERROR(VLOOKUP(K459,Proposito_programa!$C$2:$E$59,3,FALSE)),\" \",VLOOKUP(K459,Proposito_programa!$C$2:$E$59,3,FALSE))","v":" "},null,null,null,null,null,null,null,null,null,null,null,null,null,null,0,null,null,null,null,null,null,null,null,null,null,null,null,null,null,null,"-"]
[null,null,null,null,null,null,null,null,null,"Un Nuevo Contrato Social y Ambiental para la Bogotá del Siglo XXI",null,{"$f":"IF(ISERROR(VLOOKUP(K460,Proposito_programa!$C$2:$E$59,2,FALSE)),\" \",VLOOKUP(K460,Proposito_programa!$C$2:$E$59,2,FALSE))","v":" "},{"$f":"IF(ISERROR(VLOOKUP(K460,Proposito_programa!$C$2:$E$59,3,FALSE)),\" \",VLOOKUP(K460,Proposito_programa!$C$2:$E$59,3,FALSE))","v":" "},null,null,null,null,null,null,null,null,null,null,null,null,null,null,0,null,null,null,null,null,null,null,null,null,null,null,null,null,null,null,"-"]
[null,null,null,null,null,null,null,null,null,"Un Nuevo Contrato Social y Ambiental para la Bogotá del Siglo XXI",null,{"$f":"IF(ISERROR(VLOOKUP(K461,Proposito_programa!$C$2:$E$59,2,FALSE)),\" \",VLOOKUP(K461,Proposito_programa!$C$2:$E$59,2,FALSE))","v":" "},{"$f":"IF(ISERROR(VLOOKUP(K461,Proposito_programa!$C$2:$E$59,3,FALSE)),\" \",VLOOKUP(K461,Proposito_programa!$C$2:$E$59,3,FALSE))","v":" "},null,null,null,null,null,null,null,null,null,null,null,null,null,null,0,null,null,null,null,null,null,null,null,null,null,null,null,null,null,null,"-"]
[null,null,null,null,null,null,null,null,null,"Un Nuevo Contrato Social y Ambiental para la Bogotá del Siglo XXI",null,{"$f":"IF(ISERROR(VLOOKUP(K462,Proposito_programa!$C$2:$E$59,2,FALSE)),\" \",VLOOKUP(K462,Proposito_programa!$C$2:$E$59,2,FALSE))","v":" "},{"$f":"IF(ISERROR(VLOOKUP(K462,Proposito_programa!$C$2:$E$59,3,FALSE)),\" \",VLOOKUP(K462,Proposito_programa!$C$2:$E$59,3,FALSE))","v":" "},null,null,null,null,null,null,null,null,null,null,null,null,null,null,0,null,null,null,null,null,null,null,null,null,null,null,null,null,null,null,"-"]
[null,null,null,null,null,null,null,null,null,"Un Nuevo Contrato Social y Ambiental para la Bogotá del Siglo XXI",null,{"$f":"IF(ISERROR(VLOOKUP(K463,Proposito_programa!$C$2:$E$59,2,FALSE)),\" \",VLOOKUP(K463,Proposito_programa!$C$2:$E$59,2,FALSE))","v":" "},{"$f":"IF(ISERROR(VLOOKUP(K463,Proposito_programa!$C$2:$E$59,3,FALSE)),\" \",VLOOKUP(K463,Proposito_programa!$C$2:$E$59,3,FALSE))","v":" "},null,null,null,null,null,null,null,null,null,null,null,null,null,null,0,null,null,null,null,null,null,null,null,null,null,null,null,null,null,null,"-"]
[null,null,null,null,null,null,null,null,null,"Un Nuevo Contrato Social y Ambiental para la Bogotá del Siglo XXI",null,{"$f":"IF(ISERROR(VLOOKUP(K464,Proposito_programa!$C$2:$E$59,2,FALSE)),\" \",VLOOKUP(K464,Proposito_programa!$C$2:$E$59,2,FALSE))","v":" "},{"$f":"IF(ISERROR(VLOOKUP(K464,Proposito_programa!$C$2:$E$59,3,FALSE)),\" \",VLOOKUP(K464,Proposito_programa!$C$2:$E$59,3,FALSE))","v":" "},null,null,null,null,null,null,null,null,null,null,null,null,null,null,0,null,null,null,null,null,null,null,null,null,null,null,null,null,null,null,"-"]
[null,null,null,null,null,null,null,null,null,"Un Nuevo Contrato Social y Ambiental para la Bogotá del Siglo XXI",null,{"$f":"IF(ISERROR(VLOOKUP(K465,Proposito_programa!$C$2:$E$59,2,FALSE)),\" \",VLOOKUP(K465,Proposito_programa!$C$2:$E$59,2,FALSE))","v":" "},{"$f":"IF(ISERROR(VLOOKUP(K465,Proposito_programa!$C$2:$E$59,3,FALSE)),\" \",VLOOKUP(K465,Proposito_programa!$C$2:$E$59,3,FALSE))","v":" "},null,null,null,null,null,null,null,null,null,null,null,null,null,null,0,null,null,null,null,null,null,null,null,null,null,null,null,null,null,null,"-"]
[null,null,null,null,null,null,null,null,null,"Un Nuevo Contrato Social y Ambiental para la Bogotá del Siglo XXI",null,{"$f":"IF(ISERROR(VLOOKUP(K466,Proposito_programa!$C$2:$E$59,2,FALSE)),\" \",VLOOKUP(K466,Proposito_programa!$C$2:$E$59,2,FALSE))","v":" "},{"$f":"IF(ISERROR(VLOOKUP(K466,Proposito_programa!$C$2:$E$59,3,FALSE)),\" \",VLOOKUP(K466,Proposito_programa!$C$2:$E$59,3,FALSE))","v":" "},null,null,null,null,null,null,null,null,null,null,null,null,null,null,0,null,null,null,null,null,null,null,null,null,null,null,null,null,null,null,"-"]
[null,null,null,null,null,null,null,null,null,"Un Nuevo Contrato Social y Ambiental para la Bogotá del Siglo XXI",null,{"$f":"IF(ISERROR(VLOOKUP(K467,Proposito_programa!$C$2:$E$59,2,FALSE)),\" \",VLOOKUP(K467,Proposito_programa!$C$2:$E$59,2,FALSE))","v":" "},{"$f":"IF(ISERROR(VLOOKUP(K467,Proposito_programa!$C$2:$E$59,3,FALSE)),\" \",VLOOKUP(K467,Proposito_programa!$C$2:$E$59,3,FALSE))","v":" "},null,null,null,null,null,null,null,null,null,null,null,null,null,null,0,null,null,null,null,null,null,null,null,null,null,null,null,null,null,null,"-"]
[null,null,null,null,null,null,null,null,null,"Un Nuevo Contrato Social y Ambiental para la Bogotá del Siglo XXI",null,{"$f":"IF(ISERROR(VLOOKUP(K468,Proposito_programa!$C$2:$E$59,2,FALSE)),\" \",VLOOKUP(K468,Proposito_programa!$C$2:$E$59,2,FALSE))","v":" "},{"$f":"IF(ISERROR(VLOOKUP(K468,Proposito_programa!$C$2:$E$59,3,FALSE)),\" \",VLOOKUP(K468,Proposito_programa!$C$2:$E$59,3,FALSE))","v":" "},null,null,null,null,null,null,null,null,null,null,null,null,null,null,0,null,null,null,null,null,null,null,null,null,null,null,null,null,null,null,"-"]
[null,null,null,null,null,null,null,null,null,"Un Nuevo Contrato Social y Ambiental para la Bogotá del Siglo XXI",null,{"$f":"IF(ISERROR(VLOOKUP(K469,Proposito_programa!$C$2:$E$59,2,FALSE)),\" \",VLOOKUP(K469,Proposito_programa!$C$2:$E$59,2,FALSE))","v":" "},{"$f":"IF(ISERROR(VLOOKUP(K469,Proposito_programa!$C$2:$E$59,3,FALSE)),\" \",VLOOKUP(K469,Proposito_programa!$C$2:$E$59,3,FALSE))","v":" "},null,null,null,null,null,null,null,null,null,null,null,null,null,null,0,null,null,null,null,null,null,null,null,null,null,null,null,null,null,null,"-"]
[null,null,null,null,null,null,null,null,null,"Un Nuevo Contrato Social y Ambiental para la Bogotá del Siglo XXI",null,{"$f":"IF(ISERROR(VLOOKUP(K470,Proposito_programa!$C$2:$E$59,2,FALSE)),\" \",VLOOKUP(K470,Proposito_programa!$C$2:$E$59,2,FALSE))","v":" "},{"$f":"IF(ISERROR(VLOOKUP(K470,Proposito_programa!$C$2:$E$59,3,FALSE)),\" \",VLOOKUP(K470,Proposito_programa!$C$2:$E$59,3,FALSE))","v":" "},null,null,null,null,null,null,null,null,null,null,null,null,null,null,0,null,null,null,null,null,null,null,null,null,null,null,null,null,null,null,"-"]
[null,null,null,null,null,null,null,null,null,"Un Nuevo Contrato Social y Ambiental para la Bogotá del Siglo XXI",null,{"$f":"IF(ISERROR(VLOOKUP(K471,Proposito_programa!$C$2:$E$59,2,FALSE)),\" \",VLOOKUP(K471,Proposito_programa!$C$2:$E$59,2,FALSE))","v":" "},{"$f":"IF(ISERROR(VLOOKUP(K471,Proposito_programa!$C$2:$E$59,3,FALSE)),\" \",VLOOKUP(K471,Proposito_programa!$C$2:$E$59,3,FALSE))","v":" "},null,null,null,null,null,null,null,null,null,null,null,null,null,null,0,null,null,null,null,null,null,null,null,null,null,null,null,null,null,null,"-"]
[null,null,null,null,null,null,null,null,null,"Un Nuevo Contrato Social y Ambiental para la Bogotá del Siglo XXI",null,{"$f":"IF(ISERROR(VLOOKUP(K472,Proposito_programa!$C$2:$E$59,2,FALSE)),\" \",VLOOKUP(K472,Proposito_programa!$C$2:$E$59,2,FALSE))","v":" "},{"$f":"IF(ISERROR(VLOOKUP(K472,Proposito_programa!$C$2:$E$59,3,FALSE)),\" \",VLOOKUP(K472,Proposito_programa!$C$2:$E$59,3,FALSE))","v":" "},null,null,null,null,null,null,null,null,null,null,null,null,null,null,0,null,null,null,null,null,null,null,null,null,null,null,null,null,null,null,"-"]
[null,null,null,null,null,null,null,null,null,"Un Nuevo Contrato Social y Ambiental para la Bogotá del Siglo XXI",null,{"$f":"IF(ISERROR(VLOOKUP(K473,Proposito_programa!$C$2:$E$59,2,FALSE)),\" \",VLOOKUP(K473,Proposito_programa!$C$2:$E$59,2,FALSE))","v":" "},{"$f":"IF(ISERROR(VLOOKUP(K473,Proposito_programa!$C$2:$E$59,3,FALSE)),\" \",VLOOKUP(K473,Proposito_programa!$C$2:$E$59,3,FALSE))","v":" "},null,null,null,null,null,null,null,null,null,null,null,null,null,null,0,null,null,null,null,null,null,null,null,null,null,null,null,null,null,null,"-"]
[null,null,null,null,null,null,null,null,null,"Un Nuevo Contrato Social y Ambiental para la Bogotá del Siglo XXI",null,{"$f":"IF(ISERROR(VLOOKUP(K474,Proposito_programa!$C$2:$E$59,2,FALSE)),\" \",VLOOKUP(K474,Proposito_programa!$C$2:$E$59,2,FALSE))","v":" "},{"$f":"IF(ISERROR(VLOOKUP(K474,Proposito_programa!$C$2:$E$59,3,FALSE)),\" \",VLOOKUP(K474,Proposito_programa!$C$2:$E$59,3,FALSE))","v":" "},null,null,null,null,null,null,null,null,null,null,null,null,null,null,0,null,null,null,null,null,null,null,null,null,null,null,null,null,null,null,"-"]
[null,null,null,null,null,null,null,null,null,"Un Nuevo Contrato Social y Ambiental para la Bogotá del Siglo XXI",null,{"$f":"IF(ISERROR(VLOOKUP(K475,Proposito_programa!$C$2:$E$59,2,FALSE)),\" \",VLOOKUP(K475,Proposito_programa!$C$2:$E$59,2,FALSE))","v":" "},{"$f":"IF(ISERROR(VLOOKUP(K475,Proposito_programa!$C$2:$E$59,3,FALSE)),\" \",VLOOKUP(K475,Proposito_programa!$C$2:$E$59,3,FALSE))","v":" "},null,null,null,null,null,null,null,null,null,null,null,null,null,null,0,null,null,null,null,null,null,null,null,null,null,null,null,null,null,null,"-"]
[null,null,null,null,null,null,null,null,null,"Un Nuevo Contrato Social y Ambiental para la Bogotá del Siglo XXI",null,{"$f":"IF(ISERROR(VLOOKUP(K476,Proposito_programa!$C$2:$E$59,2,FALSE)),\" \",VLOOKUP(K476,Proposito_programa!$C$2:$E$59,2,FALSE))","v":" "},{"$f":"IF(ISERROR(VLOOKUP(K476,Proposito_programa!$C$2:$E$59,3,FALSE)),\" \",VLOOKUP(K476,Proposito_programa!$C$2:$E$59,3,FALSE))","v":" "},null,null,null,null,null,null,null,null,null,null,null,null,null,null,0,null,null,null,null,null,null,null,null,null,null,null,null,null,null,null,"-"]
[null,null,null,null,null,null,null,null,null,"Un Nuevo Contrato Social y Ambiental para la Bogotá del Siglo XXI",null,{"$f":"IF(ISERROR(VLOOKUP(K477,Proposito_programa!$C$2:$E$59,2,FALSE)),\" \",VLOOKUP(K477,Proposito_programa!$C$2:$E$59,2,FALSE))","v":" "},{"$f":"IF(ISERROR(VLOOKUP(K477,Proposito_programa!$C$2:$E$59,3,FALSE)),\" \",VLOOKUP(K477,Proposito_programa!$C$2:$E$59,3,FALSE))","v":" "},null,null,null,null,null,null,null,null,null,null,null,null,null,null,0,null,null,null,null,null,null,null,null,null,null,null,null,null,null,null,"-"]
[null,null,null,null,null,null,null,null,null,"Un Nuevo Contrato Social y Ambiental para la Bogotá del Siglo XXI",null,{"$f":"IF(ISERROR(VLOOKUP(K478,Proposito_programa!$C$2:$E$59,2,FALSE)),\" \",VLOOKUP(K478,Proposito_programa!$C$2:$E$59,2,FALSE))","v":" "},{"$f":"IF(ISERROR(VLOOKUP(K478,Proposito_programa!$C$2:$E$59,3,FALSE)),\" \",VLOOKUP(K478,Proposito_programa!$C$2:$E$59,3,FALSE))","v":" "},null,null,null,null,null,null,null,null,null,null,null,null,null,null,0,null,null,null,null,null,null,null,null,null,null,null,null,null,null,null,"-"]
[null,null,null,null,null,null,null,null,null,"Un Nuevo Contrato Social y Ambiental para la Bogotá del Siglo XXI",null,{"$f":"IF(ISERROR(VLOOKUP(K479,Proposito_programa!$C$2:$E$59,2,FALSE)),\" \",VLOOKUP(K479,Proposito_programa!$C$2:$E$59,2,FALSE))","v":" "},{"$f":"IF(ISERROR(VLOOKUP(K479,Proposito_programa!$C$2:$E$59,3,FALSE)),\" \",VLOOKUP(K479,Proposito_programa!$C$2:$E$59,3,FALSE))","v":" "},null,null,null,null,null,null,null,null,null,null,null,null,null,null,0,null,null,null,null,null,null,null,null,null,null,null,null,null,null,null,"-"]
[null,null,null,null,null,null,null,null,null,"Un Nuevo Contrato Social y Ambiental para la Bogotá del Siglo XXI",null,{"$f":"IF(ISERROR(VLOOKUP(K480,Proposito_programa!$C$2:$E$59,2,FALSE)),\" \",VLOOKUP(K480,Proposito_programa!$C$2:$E$59,2,FALSE))","v":" "},{"$f":"IF(ISERROR(VLOOKUP(K480,Proposito_programa!$C$2:$E$59,3,FALSE)),\" \",VLOOKUP(K480,Proposito_programa!$C$2:$E$59,3,FALSE))","v":" "},null,null,null,null,null,null,null,null,null,null,null,null,null,null,0,null,null,null,null,null,null,null,null,null,null,null,null,null,null,null,"-"]
[null,null,null,null,null,null,null,null,null,"Un Nuevo Contrato Social y Ambiental para la Bogotá del Siglo XXI",null,{"$f":"IF(ISERROR(VLOOKUP(K481,Proposito_programa!$C$2:$E$59,2,FALSE)),\" \",VLOOKUP(K481,Proposito_programa!$C$2:$E$59,2,FALSE))","v":" "},{"$f":"IF(ISERROR(VLOOKUP(K481,Proposito_programa!$C$2:$E$59,3,FALSE)),\" \",VLOOKUP(K481,Proposito_programa!$C$2:$E$59,3,FALSE))","v":" "},null,null,null,null,null,null,null,null,null,null,null,null,null,null,0,null,null,null,null,null,null,null,null,null,null,null,null,null,null,null,"-"]
[null,null,null,null,null,null,null,null,null,"Un Nuevo Contrato Social y Ambiental para la Bogotá del Siglo XXI",null,{"$f":"IF(ISERROR(VLOOKUP(K482,Proposito_programa!$C$2:$E$59,2,FALSE)),\" \",VLOOKUP(K482,Proposito_programa!$C$2:$E$59,2,FALSE))","v":" "},{"$f":"IF(ISERROR(VLOOKUP(K482,Proposito_programa!$C$2:$E$59,3,FALSE)),\" \",VLOOKUP(K482,Proposito_programa!$C$2:$E$59,3,FALSE))","v":" "},null,null,null,null,null,null,null,null,null,null,null,null,null,null,0,null,null,null,null,null,null,null,null,null,null,null,null,null,null,null,"-"]
[null,null,null,null,null,null,null,null,null,"Un Nuevo Contrato Social y Ambiental para la Bogotá del Siglo XXI",null,{"$f":"IF(ISERROR(VLOOKUP(K483,Proposito_programa!$C$2:$E$59,2,FALSE)),\" \",VLOOKUP(K483,Proposito_programa!$C$2:$E$59,2,FALSE))","v":" "},{"$f":"IF(ISERROR(VLOOKUP(K483,Proposito_programa!$C$2:$E$59,3,FALSE)),\" \",VLOOKUP(K483,Proposito_programa!$C$2:$E$59,3,FALSE))","v":" "},null,null,null,null,null,null,null,null,null,null,null,null,null,null,0,null,null,null,null,null,null,null,null,null,null,null,null,null,null,null,"-"]
[null,null,null,null,null,null,null,null,null,"Un Nuevo Contrato Social y Ambiental para la Bogotá del Siglo XXI",null,{"$f":"IF(ISERROR(VLOOKUP(K484,Proposito_programa!$C$2:$E$59,2,FALSE)),\" \",VLOOKUP(K484,Proposito_programa!$C$2:$E$59,2,FALSE))","v":" "},{"$f":"IF(ISERROR(VLOOKUP(K484,Proposito_programa!$C$2:$E$59,3,FALSE)),\" \",VLOOKUP(K484,Proposito_programa!$C$2:$E$59,3,FALSE))","v":" "},null,null,null,null,null,null,null,null,null,null,null,null,null,null,0,null,null,null,null,null,null,null,null,null,null,null,null,null,null,null,"-"]
[null,null,null,null,null,null,null,null,null,"Un Nuevo Contrato Social y Ambiental para la Bogotá del Siglo XXI",null,{"$f":"IF(ISERROR(VLOOKUP(K485,Proposito_programa!$C$2:$E$59,2,FALSE)),\" \",VLOOKUP(K485,Proposito_programa!$C$2:$E$59,2,FALSE))","v":" "},{"$f":"IF(ISERROR(VLOOKUP(K485,Proposito_programa!$C$2:$E$59,3,FALSE)),\" \",VLOOKUP(K485,Proposito_programa!$C$2:$E$59,3,FALSE))","v":" "},null,null,null,null,null,null,null,null,null,null,null,null,null,null,0,null,null,null,null,null,null,null,null,null,null,null,null,null,null,null,"-"]
[null,null,null,null,null,null,null,null,null,"Un Nuevo Contrato Social y Ambiental para la Bogotá del Siglo XXI",null,{"$f":"IF(ISERROR(VLOOKUP(K486,Proposito_programa!$C$2:$E$59,2,FALSE)),\" \",VLOOKUP(K486,Proposito_programa!$C$2:$E$59,2,FALSE))","v":" "},{"$f":"IF(ISERROR(VLOOKUP(K486,Proposito_programa!$C$2:$E$59,3,FALSE)),\" \",VLOOKUP(K486,Proposito_programa!$C$2:$E$59,3,FALSE))","v":" "},null,null,null,null,null,null,null,null,null,null,null,null,null,null,0,null,null,null,null,null,null,null,null,null,null,null,null,null,null,null,"-"]
[null,null,null,null,null,null,null,null,null,"Un Nuevo Contrato Social y Ambiental para la Bogotá del Siglo XXI",null,{"$f":"IF(ISERROR(VLOOKUP(K487,Proposito_programa!$C$2:$E$59,2,FALSE)),\" \",VLOOKUP(K487,Proposito_programa!$C$2:$E$59,2,FALSE))","v":" "},{"$f":"IF(ISERROR(VLOOKUP(K487,Proposito_programa!$C$2:$E$59,3,FALSE)),\" \",VLOOKUP(K487,Proposito_programa!$C$2:$E$59,3,FALSE))","v":" "},null,null,null,null,null,null,null,null,null,null,null,null,null,null,0,null,null,null,null,null,null,null,null,null,null,null,null,null,null,null,"-"]
[null,null,null,null,null,null,null,null,null,"Un Nuevo Contrato Social y Ambiental para la Bogotá del Siglo XXI",null,{"$f":"IF(ISERROR(VLOOKUP(K488,Proposito_programa!$C$2:$E$59,2,FALSE)),\" \",VLOOKUP(K488,Proposito_programa!$C$2:$E$59,2,FALSE))","v":" "},{"$f":"IF(ISERROR(VLOOKUP(K488,Proposito_programa!$C$2:$E$59,3,FALSE)),\" \",VLOOKUP(K488,Proposito_programa!$C$2:$E$59,3,FALSE))","v":" "},null,null,null,null,null,null,null,null,null,null,null,null,null,null,0,null,null,null,null,null,null,null,null,null,null,null,null,null,null,null,"-"]
[null,null,null,null,null,null,null,null,null,"Un Nuevo Contrato Social y Ambiental para la Bogotá del Siglo XXI",null,{"$f":"IF(ISERROR(VLOOKUP(K489,Proposito_programa!$C$2:$E$59,2,FALSE)),\" \",VLOOKUP(K489,Proposito_programa!$C$2:$E$59,2,FALSE))","v":" "},{"$f":"IF(ISERROR(VLOOKUP(K489,Proposito_programa!$C$2:$E$59,3,FALSE)),\" \",VLOOKUP(K489,Proposito_programa!$C$2:$E$59,3,FALSE))","v":" "},null,null,null,null,null,null,null,null,null,null,null,null,null,null,0,null,null,null,null,null,null,null,null,null,null,null,null,null,null,null,"-"]
[null,null,null,null,null,null,null,null,null,"Un Nuevo Contrato Social y Ambiental para la Bogotá del Siglo XXI",null,{"$f":"IF(ISERROR(VLOOKUP(K490,Proposito_programa!$C$2:$E$59,2,FALSE)),\" \",VLOOKUP(K490,Proposito_programa!$C$2:$E$59,2,FALSE))","v":" "},{"$f":"IF(ISERROR(VLOOKUP(K490,Proposito_programa!$C$2:$E$59,3,FALSE)),\" \",VLOOKUP(K490,Proposito_programa!$C$2:$E$59,3,FALSE))","v":" "},null,null,null,null,null,null,null,null,null,null,null,null,null,null,0,null,null,null,null,null,null,null,null,null,null,null,null,null,null,null,"-"]
[null,null,null,null,null,null,null,null,null,"Un Nuevo Contrato Social y Ambiental para la Bogotá del Siglo XXI",null,{"$f":"IF(ISERROR(VLOOKUP(K491,Proposito_programa!$C$2:$E$59,2,FALSE)),\" \",VLOOKUP(K491,Proposito_programa!$C$2:$E$59,2,FALSE))","v":" "},{"$f":"IF(ISERROR(VLOOKUP(K491,Proposito_programa!$C$2:$E$59,3,FALSE)),\" \",VLOOKUP(K491,Proposito_programa!$C$2:$E$59,3,FALSE))","v":" "},null,null,null,null,null,null,null,null,null,null,null,null,null,null,0,null,null,null,null,null,null,null,null,null,null,null,null,null,null,null,"-"]
[null,null,null,null,null,null,null,null,null,"Un Nuevo Contrato Social y Ambiental para la Bogotá del Siglo XXI",null,{"$f":"IF(ISERROR(VLOOKUP(K492,Proposito_programa!$C$2:$E$59,2,FALSE)),\" \",VLOOKUP(K492,Proposito_programa!$C$2:$E$59,2,FALSE))","v":" "},{"$f":"IF(ISERROR(VLOOKUP(K492,Proposito_programa!$C$2:$E$59,3,FALSE)),\" \",VLOOKUP(K492,Proposito_programa!$C$2:$E$59,3,FALSE))","v":" "},null,null,null,null,null,null,null,null,null,null,null,null,null,null,0,null,null,null,null,null,null,null,null,null,null,null,null,null,null,null,"-"]
[null,null,null,null,null,null,null,null,null,"Un Nuevo Contrato Social y Ambiental para la Bogotá del Siglo XXI",null,{"$f":"IF(ISERROR(VLOOKUP(K493,Proposito_programa!$C$2:$E$59,2,FALSE)),\" \",VLOOKUP(K493,Proposito_programa!$C$2:$E$59,2,FALSE))","v":" "},{"$f":"IF(ISERROR(VLOOKUP(K493,Proposito_programa!$C$2:$E$59,3,FALSE)),\" \",VLOOKUP(K493,Proposito_programa!$C$2:$E$59,3,FALSE))","v":" "},null,null,null,null,null,null,null,null,null,null,null,null,null,null,0,null,null,null,null,null,null,null,null,null,null,null,null,null,null,null,"-"]
[null,null,null,null,null,null,null,null,null,"Un Nuevo Contrato Social y Ambiental para la Bogotá del Siglo XXI",null,{"$f":"IF(ISERROR(VLOOKUP(K494,Proposito_programa!$C$2:$E$59,2,FALSE)),\" \",VLOOKUP(K494,Proposito_programa!$C$2:$E$59,2,FALSE))","v":" "},{"$f":"IF(ISERROR(VLOOKUP(K494,Proposito_programa!$C$2:$E$59,3,FALSE)),\" \",VLOOKUP(K494,Proposito_programa!$C$2:$E$59,3,FALSE))","v":" "},null,null,null,null,null,null,null,null,null,null,null,null,null,null,0,null,null,null,null,null,null,null,null,null,null,null,null,null,null,null,"-"]
[null,null,null,null,null,null,null,null,null,"Un Nuevo Contrato Social y Ambiental para la Bogotá del Siglo XXI",null,{"$f":"IF(ISERROR(VLOOKUP(K495,Proposito_programa!$C$2:$E$59,2,FALSE)),\" \",VLOOKUP(K495,Proposito_programa!$C$2:$E$59,2,FALSE))","v":" "},{"$f":"IF(ISERROR(VLOOKUP(K495,Proposito_programa!$C$2:$E$59,3,FALSE)),\" \",VLOOKUP(K495,Proposito_programa!$C$2:$E$59,3,FALSE))","v":" "},null,null,null,null,null,null,null,null,null,null,null,null,null,null,0,null,null,null,null,null,null,null,null,null,null,null,null,null,null,null,"-"]
[null,null,null,null,null,null,null,null,null,"Un Nuevo Contrato Social y Ambiental para la Bogotá del Siglo XXI",null,{"$f":"IF(ISERROR(VLOOKUP(K496,Proposito_programa!$C$2:$E$59,2,FALSE)),\" \",VLOOKUP(K496,Proposito_programa!$C$2:$E$59,2,FALSE))","v":" "},{"$f":"IF(ISERROR(VLOOKUP(K496,Proposito_programa!$C$2:$E$59,3,FALSE)),\" \",VLOOKUP(K496,Proposito_programa!$C$2:$E$59,3,FALSE))","v":" "},null,null,null,null,null,null,null,null,null,null,null,null,null,null,0,null,null,null,null,null,null,null,null,null,null,null,null,null,null,null,"-"]
[null,null,null,null,null,null,null,null,null,"Un Nuevo Contrato Social y Ambiental para la Bogotá del Siglo XXI",null,{"$f":"IF(ISERROR(VLOOKUP(K497,Proposito_programa!$C$2:$E$59,2,FALSE)),\" \",VLOOKUP(K497,Proposito_programa!$C$2:$E$59,2,FALSE))","v":" "},{"$f":"IF(ISERROR(VLOOKUP(K497,Proposito_programa!$C$2:$E$59,3,FALSE)),\" \",VLOOKUP(K497,Proposito_programa!$C$2:$E$59,3,FALSE))","v":" "},null,null,null,null,null,null,null,null,null,null,null,null,null,null,0,null,null,null,null,null,null,null,null,null,null,null,null,null,null,null,"-"]
[null,null,null,null,null,null,null,null,null,"Un Nuevo Contrato Social y Ambiental para la Bogotá del Siglo XXI",null,{"$f":"IF(ISERROR(VLOOKUP(K498,Proposito_programa!$C$2:$E$59,2,FALSE)),\" \",VLOOKUP(K498,Proposito_programa!$C$2:$E$59,2,FALSE))","v":" "},{"$f":"IF(ISERROR(VLOOKUP(K498,Proposito_programa!$C$2:$E$59,3,FALSE)),\" \",VLOOKUP(K498,Proposito_programa!$C$2:$E$59,3,FALSE))","v":" "},null,null,null,null,null,null,null,null,null,null,null,null,null,null,0,null,null,null,null,null,null,null,null,null,null,null,null,null,null,null,"-"]
[null,null,null,null,null,null,null,null,null,"Un Nuevo Contrato Social y Ambiental para la Bogotá del Siglo XXI",null,{"$f":"IF(ISERROR(VLOOKUP(K499,Proposito_programa!$C$2:$E$59,2,FALSE)),\" \",VLOOKUP(K499,Proposito_programa!$C$2:$E$59,2,FALSE))","v":" "},{"$f":"IF(ISERROR(VLOOKUP(K499,Proposito_programa!$C$2:$E$59,3,FALSE)),\" \",VLOOKUP(K499,Proposito_programa!$C$2:$E$59,3,FALSE))","v":" "},null,null,null,null,null,null,null,null,null,null,null,null,null,null,0,null,null,null,null,null,null,null,null,null,null,null,null,null,null,null,"-"]
[null,null,null,null,null,null,null,null,null,"Un Nuevo Contrato Social y Ambiental para la Bogotá del Siglo XXI",null,{"$f":"IF(ISERROR(VLOOKUP(K500,Proposito_programa!$C$2:$E$59,2,FALSE)),\" \",VLOOKUP(K500,Proposito_programa!$C$2:$E$59,2,FALSE))","v":" "},{"$f":"IF(ISERROR(VLOOKUP(K500,Proposito_programa!$C$2:$E$59,3,FALSE)),\" \",VLOOKUP(K500,Proposito_programa!$C$2:$E$59,3,FALSE))","v":" "},null,null,null,null,null,null,null,null,null,null,null,null,null,null,0,null,null,null,null,null,null,null,null,null,null,null,null,null,null,null,"-"]
[null,null,null,null,null,null,null,null,null,"Un Nuevo Contrato Social y Ambiental para la Bogotá del Siglo XXI",null,{"$f":"IF(ISERROR(VLOOKUP(K501,Proposito_programa!$C$2:$E$59,2,FALSE)),\" \",VLOOKUP(K501,Proposito_programa!$C$2:$E$59,2,FALSE))","v":" "},{"$f":"IF(ISERROR(VLOOKUP(K501,Proposito_programa!$C$2:$E$59,3,FALSE)),\" \",VLOOKUP(K501,Proposito_programa!$C$2:$E$59,3,FALSE))","v":" "},null,null,null,null,null,null,null,null,null,null,null,null,null,null,0,null,null,null,null,null,null,null,null,null,null,null,null,null,null,null,"-"]
[null,null,null,null,null,null,null,null,null,"Un Nuevo Contrato Social y Ambiental para la Bogotá del Siglo XXI",null,{"$f":"IF(ISERROR(VLOOKUP(K502,Proposito_programa!$C$2:$E$59,2,FALSE)),\" \",VLOOKUP(K502,Proposito_programa!$C$2:$E$59,2,FALSE))","v":" "},{"$f":"IF(ISERROR(VLOOKUP(K502,Proposito_programa!$C$2:$E$59,3,FALSE)),\" \",VLOOKUP(K502,Proposito_programa!$C$2:$E$59,3,FALSE))","v":" "},null,null,null,null,null,null,null,null,null,null,null,null,null,null,0,null,null,null,null,null,null,null,null,null,null,null,null,null,null,null,"-"]
[null,null,null,null,null,null,null,null,null,"Un Nuevo Contrato Social y Ambiental para la Bogotá del Siglo XXI",null,{"$f":"IF(ISERROR(VLOOKUP(K503,Proposito_programa!$C$2:$E$59,2,FALSE)),\" \",VLOOKUP(K503,Proposito_programa!$C$2:$E$59,2,FALSE))","v":" "},{"$f":"IF(ISERROR(VLOOKUP(K503,Proposito_programa!$C$2:$E$59,3,FALSE)),\" \",VLOOKUP(K503,Proposito_programa!$C$2:$E$59,3,FALSE))","v":" "},null,null,null,null,null,null,null,null,null,null,null,null,null,null,0,null,null,null,null,null,null,null,null,null,null,null,null,null,null,null,"-"]
["Total",null,null,null,null,null,null,null,null,null,null,null,null,null,null,null,null,null,null,null,null,null,null,{"$f":"SUM(X14:X503)","v":24016622719.299999},{"$f":"SUM(Y14:Y503)","v":0},95,8912930266,{"$f":"SUM(AB14:AB503)","v":32929552985.299999},null,null,null,null,null,null,null,null,null,null,null,null,null,null,null,{"$f":"SUM(AR14:AR503)","v":639.93639066061564}]
[null,null,null,null,null,null,null,null,null,null,null,null,null,null,null,null,null,null,null,null,null,null,null,null,null,2021,{"$f":"SUBTOTAL(9,AA14:AA284)-AA154-AA109","v":8887887412},{"$f":"SUBTOTAL(9,AB14:AB285)","v":32929552985.299999}]
[null,null,null,null,null,null,null,null,null,null,null,null,null,null,null,null,null,null,null,null,null,null,null,null,null,2020,"SUBTOTAL",{"$f":"SUBTOTAL(9,AB279:AB283)","v":742133472}]

{"sheet":"2. PAA","index":2,"n_rows":13,"n_cols":7,"rows_kept":13,"cut":false,"hidden":false,"merged":[[9,1,9,6],[6,2,6,3],[6,5,6,6],[2,1,2,7],[3,1,3,7],[4,1,4,7],[5,2,5,3],[5,5,5,6]]}
[]
[]
[null,"PLAN ANUAL DE ADQUISIONES"]
[null,2021]
[]
[null,"Entidad","FONDO DE DESARROLLO RURAL DE SUMAPAZ",null,"Sector","ALCALDIA LOCAL"]
[null,"Responsable diligenciamiento","GERMAN HUMBERTO MEDELLIN MORA",null,"Número contacto y correo electrónico","german.medellin@gobiernobogota.gov.co"]
[]
[]
[null,"A continuación registre la información del Plan Anual de Adquisiciones vigencia 2021,  diligencie el presupuesto total,  el presupuesto programado y contratado del 1 de septiembre al 31 de diciembre de 2021, igualmente la fecha de la primera y ultima públicación del PAA en SECOP, y el número de modificaciones realizadas."]
[]
[null,"Presupuesto Total PAA","Presupuesto programado\nSeptiembre 1 a 31 de diciembre de 2021","Presupuesto contratado\nSeptiembre 1 a 31 de diciembre de 2021","Fecha Primera Publicación\nD/M/A","Última fecha de modificación\nD/M/A","Número modificaciones"]
[null,40007976011,10675343964,9708599922,"2021-01-04","2021-10-26",23]

{"sheet":"3. CONSOLIDADO","index":3,"n_rows":33,"n_cols":20,"rows_kept":33,"cut":false,"hidden":false,"merged":[[16,2,16,16],[17,17,17,19],[19,2,21,2],[19,3,21,3],[11,9,11,10],[17,2,17,16],[11,15,11,16],[19,4,19,17],[19,18,20,19],[20,4,20,5],[20,6,20,7],[20,8,20,9],[20,10,20,11],[20,12,20,13],[20,14,20,15],[20,16,20,17],[11,21,11,22],[1,4,1,18],[2,4,2,18],[7,2,8,16],[10,2,12,2],[10,3,12,3],[10,4,10,8],[10,9,10,16],[11,4,11,5],[11,6,11,8],[11,19,11,20],[11,11,11,12],[11,13,11,14],[11,17,11,18],[9,2,9,16],[4,2,5,16],[27,2,27,11],[50,2,52,5],[29,2,31,2],[30,3,30,4],[30,5,30,6],[30,7,30,8],[29,3,29,8]]}
[]
[null,null,null,null,"GESTIÓN CONTRACTUAL "]
[null,null,null,null,"Período de Evaluación: Septiembre 1 a 31 de diciembre de 2021"]
[]
[null,null,"La información consolidada que registra en esta hoja debe coincidir con la información que reporta en las hojas 1 \"INFORMACION ACUMULADA\" y 2 \"INFORMACION II CUATRIMESTRE\". En relación con las adiciones a contratos de años anteriores con cargo al periodo a reportar deben registrarse en filas independientes en los numerales 1 (información general, naturaleza jurídica) y 2 (modalidad). Ej. vigencia =2019; No. Contratos Adicionados:3; Número de adiciones: 4"]
[]
[]
[null,null,"1. Diligenciar en Información General el total de contratos que la entidad suscribió del 1 de septiembre al 31 de diciembre de 2021 y el valor total de ellos, igual el número de contratos que presentaron adiciones, el número de adiciones y el valor total de ellas. Respecto a la Naturaleza jurídica del contratista, diligenciar el número total de contratos suscritos y su valor por: personas naturales, jurídicas, consorcios y uniones temporales"]
[]
[]
[null,null,"Entidad","Vigencia","Información General",null,null,null,null,"Naturaleza jurídica del contratista"]
[null,null,null,null,"Contratos Suscritos",null,"Adiciones",null,null,"Contratos suscritos con personas naturales",null,"Contratos suscritos con personas jurídicas",null,"Contratos suscritos con uniones temporales",null,"Contratos suscritos con consorcios"]
[null,null,null,null,"Número Contratos","Valor Total","Número Contratos Adicionados","Número de Adiciones","Valor Total","Número Contratos y/o adiciones","Valor Total","Número Contratos y/o adiciones","Valor Total","Número Contratos y/o adiciones","Valor Total","Número Contratos y/o adiciones","Valor Total"]
[null,null,"FONDO DE DESARROLLO RURAL DE SUMAPAZ",2020,0,0,1,1,25000000,0,0,2,86993740,0,0,1,67968981]
[null,null,"FONDO DE DESARROLLO RURAL DE SUMAPAZ",2021,20,6966527657,74,76,2182292086,15,221975000,14,8522685489,1,274359473.30000001,2,602269464]
[]
[]
[null,null,"2. Registrar el número y valor total de los contratos y/o adiciones que se suscribieron del 1 de septiembre al 31 de diciembre de 2021 por cada modalidad. Igualmente en la tipología de contratos de prestación de servicios profesionales y de apoyo a la gestión."]
[]
[null,null,"Entidad","Vigencia","Modalidad",null,null,null,null,null,null,null,null,null,null,null,null,null,"Contratos realizados mediante la tipología de contratos de prestación de servicios profesionales y de apoyo a la gestión"]
[null,null,null,null,"Concurso de méritos",null,"Contratación directa",null,"Contratación mínima cuantia",null,"Selección abreviada",null,"Licitación pública",null,"Régimen privado",null,"Régimen especial"]
[null,null,null,null,"Número Contratos","Valor Total","Número Contratos","Valor Total","Número Contratos","Valor Total","Número Contratos","Valor Total","Número Contratos","Valor Total","Número Contratos","Valor Total","Número Contratos","Valor Total","Número Contratos","Valor Total"]
[null,null,"FONDO DE DESARROLLO RURAL DE SUMAPAZ",2019]
[null,null,{"$f":"C14","v":"FONDO DE DESARROLLO RURAL DE SUMAPAZ"},{"$f":"D14","v":2020},null,null,null,null,null,null,1,25000000]
[null,null,{"$f":"C15","v":"FONDO DE DESARROLLO RURAL DE SUMAPAZ"},{"$f":"D15","v":2021},null,null,15,874198000,null,null,4,200473827,1,5891855830,null,null,null,null,14,209655000]
[]
[]
[null,null,"3. Detalle cada uno de los procesos de selección adelantados en el cuatrimestre por la entidad de acuerdo a cada modalidad de selección (licitación pública, selección abreviada o concurso de méritos), y diligencie el número de proponentes que se presentaron en cada uno de ellos"]
[]
[null,null,"Entidad","Proponentes (que se presentaron a los proceso de selección)"]
[null,null,null,"Concurso de méritos",null,"Selección abreviada",null,"Licitación pública"]
[null,null,null,"Número del proceso contractual en SECOP","Número de proponentes","Número del proceso contractual en SECOP","Número de proponentes","Número del proceso contractual en SECOP","Número de proponentes"]
[null,null,"FONDO DE DESARROLLO RURAL DE SUMAPAZ",0,0,"FDRS-SAMC-154-2021",7,"FDRS-LP-149-2021",2]

{"sheet":"4. INSTRUCTIVO","index":4,"n_rows":105,"n_cols":4,"rows_kept":105,"cut":false,"hidden":false,"merged":[[76,1,77,1],[76,2,77,2],[71,1,71,3],[103,1,103,3],[85,1,85,3],[86,1,87,1],[86,2,87,2],[100,1,100,3],[94,1,94,3],[72,1,74,1],[72,2,74,2],[79,2,82,2],[79,1,82,1],[57,1,60,1],[59,2,60,2],[63,1,68,1],[8,1,8,3],[12,1,12,3],[23,1,23,3],[52,1,54,1],[52,2,54,2],[33,2,34,2],[29,2,30,2],[27,1,28,1],[24,1,25,1],[24,2,25,2],[29,1,51,1],[10,1,10,3],[1,1,1,3],[2,1,2,3],[9,1,9,3],[3,1,3,3],[4,1,4,3],[5,1,5,3],[7,1,7,3],[6,1,6,3]]}
[]
[null,"INSTRUCTIVO FORMATO"]
[null,"Recomendamos leer cuidadosamente y poner en práctica las instrucciones que se explican en este instructivo. De la calidad de la información que se registre, depende en gran medida la calidad del informe de rendición de cuentas de la Gestión Contractual que presenta el Alcalde Mayor, consolidado por la Veeduría Distrital.\nEn este formato se deberán relacionar:\nHoja 1. \"INFORMACION ACUMULADA\", diligenciar en esta hoja la totalidad de la información contractual desde el 1 de enero al 31 de diciembre de 2021.\nHoja 2. “PLAN ANUAL DE ADQUISICIONES – PAA”, se pide información sobre el Plan Anual de Adquisiciones y sus modificaciones, por lo cual se deberá precisar el presupuesto total del plan; el programado del 1 de septiembre al 31 de diciembre de 2021; el efectivamente contratado en este período; la primera fecha de publicación del PAA; la última fecha de modificación y el número total de modificaciones realizadas durante este mismo período. \nHoja 3. “CONSOLIDADO”, se pide totalizar la información reportada en la hoja 1, sólo respecto a los contratos y adiciones suscritas entre el 1 de septiembre y el 31 de diciembre de 2021, por lo cual debe coincidir. Es así que en el numeral 1, se debe diligenciar el total de contratos suscritos por la entidad entre el 1 de septiembre y el 31 de diciembre de 2021, periodo de evaluación y su valor; el número total de contratos adicionados, el número total de adiciones y su valor; el número total de contratos celebrados con personas naturales, jurídicas, uniones temporales y consorcios, y su valor; en el numeral 2, se debe registrar en el periodo mencionado, el número total de contratos celebrados según la modalidad de selección y el valor total por cada modalidad; igualmente, es necesario precisar que se deberán relacionar los contratos celebrados mediante la tipología de prestación de servicios profesionales y de apoyo a la gestión y el valor total de ellos. En el numeral 3, se deberá indicar en las modalidades de licitación pública, concurso de méritos y selección abreviada, el número de procesos de selección en los que se presentaron 1 o más proponentes.\nHoja 4.“INSTRUCTIVO”, se dan las instrucciones para el diligenciamiento de la información, explicando paso a paso cada uno de los datos de la base y la manera de diligenciarla para efectos de que la información reportada sea veraz y no presente inconsistencias."]
[null,"La base en Excel a diligenciar NO debe modificarse, debe utilizar versión Excel 2010 o posteriores, la versión 2007 no habilita los macros. El formato está controlado y algunas celdas tienen opciones de selección y solo se debe escoger una de ellas.  El nombre de las hojas no se debe modificar o renombrar debido a que tiene macros. No incluya columnas con otro tipo de información que la Veeduría Distrital no está solicitando o que cambie el formato de celda establecido. Debe diliigencar la totalidad de las celdas, no combinarlas, registrar la información contractual en filas independientes. Las celdas donde se requieren relacionar valores, deben diligenciarse sin puntos, tildes, comas, ni caracteres especiales."]
[null,"Para insertar una o varias filas, en el encabezado del formato, se encuentra un botón denominado \"Insertar Filas\" en el cual se debe hacer click  y digite el número de filas a insertar. Si usted no sigue este procedimiento las filas que inserte no tomarán el formato de las filas anteriores. Se recomienda que antes de iniciar el registro de información inserte las filas que requiera, sin embargo, en cualquier momento que necesite puede hacer este paso"]
[null,"Si requiere insertar una o varias filas realícelo después de la fila A14 para que tomen el formato de las filas anteriores."]
[null,"Si necesita pegar información debe hacerlo por secciones debido a que hay columnas formuladas que están protegidas que no permiten realizar esta opción. Utilice la opción de pegado especial valores para no borrar las listas desplegables ni los formatos de las columnas. Si al pegar quedan textos en rojo,  verifique y ajuste la información, el dato que adiciono no se encuentra en la lista desplegable o no corresponde con el criterio definido en el columna."]
[null,"En primer lugar, diligencie toda la información correspondiente a los contratos suscritos con cargo la vigencia 2021."]
[null,"Una vez incluidos todos los contratos  de la vigencia 2021, a continuación diligencie el formato completo con la información correspondiente a las adiciones efectuadas con cargo a la vigencia 2021 de contratos suscritos en vigencias anteriores. La información general del contrato como: modalidad de selección, tipología contractual, objeto, entre otros, debe corresponder a la información del contrato adicionado o modificado. Respecto al valor, sólo se diligencia el valor en la columna adición, es decir, la columna de valor inicial debe quedar en blanco. No olvide registrar el número de adiciones realizadas en la columna correspondiente."]
[null,"La información que se registre en esta base de datos debe coincidir con los reportes en BOGDATA  y adicionalmente con SECOP.  Es así que la sumatoria del valor final de los contratos y adiciones, por eje/pilar/propósito, programa y proyecto registrada por la Entidad, debe coincidir con la ejecución presupuestal de la entidad, reporte de BOGDATA con corte a 31 de diciembre de 2021, es decir, se debe verificar su coincidencia por rubro con el total del compromiso acumulado; igualmente respecto al valor acumulado de los giros."]
[null,"En caso de haber realizado apropiaciones presupuestales en la vigencia a través de resoluciones, caja menor, honorarios ediles, servicios públicos, debe relacionar dicha información en una sola fila al final de la base, indicando de que se trata la apropiación y número de proyecto si hay lugar a ello. En el tipo de contrato se registra con la opción \"Otros gastos\"."]
[]
[null,"ENCABEZADO DEL FORMATO"]
[null,1,"Entidad","Indique el nombre completo de la Entidad."]
[null,2,"Sector","Seleccione el sector al cual pertenece la Entidad."]
[null,3,"Presupuesto Disponible Inversión Directa","Indique el valor total del presupuesto disponible de inversión directa, de acuerdo con el Informe de ejecución presupuestal de la entidad (BOGDATA), a 31 de diciembre de 2021."]
[null,4,"Presupuesto Comprometido de Inversión Directa ","Escriba el valor total del presupuesto comprometido de inversión directa, de acuerdo con el Informe de ejecución presupuestal de la entidad (BOGDATA), a 31 de diciembre de 2021."]
[null,5,"Presupuesto Disponible Funcionamiento","Indique el valor total del presupuesto de funcionamiento disponible, de acuerdo con el con el Informe de ejecución presupuestal de la entidad (BOGDATA), a 31 de diciembre de 2021."]
[null,6,"Presupuesto Comprometido funcionamiento ","Escriba el monto del presupuesto de funcionamiento, comprometido mediante contratos, de acuerdo con el Informe de ejecución presupuestal de la entidad (BOGDATA), a 31 de diciembre de 2021."]
[null,7,"Presupuesto Disponible Operación","Coloque el monto del presupuesto de operación disponible, de acuerdo con el Informe de ejecución presupuestal de la entidad (BOGDATA), a 31 de diciembre de 2021. Los gastos de operación corresponden solamente a aquellas entidades de régimen de contratación  privado."]
[null,8,"Presupuesto Comprometido operación mediante contratos","Escriba el monto del presupuesto de operación comprometido mediante contratos a 31 de diciembre de 2021."]
[null,9,"Nombre de quien diligencia el formato","Indique el nombre completo, cargo, número de teléfono con extensión y correo electrónico del profesional que diligencia el formato y que posteriormente realizará los ajustes y aclaraciones a que haya lugar por solicitud de la Veeduría Distrital."]
[]
[null,"1- INFORMACIÓN GENERAL"]
[null,1,"Número de Contrato","En estricto orden consecutivo registre el número del contrato, sin incluir los contratos que fueron anulados, ni comodatos."]
[null,null,null,"Una vez terminado el registro de los contratos celebrados con cargo a la vigencia 2021, en las siguientes filas registre la información correspondiente a las adiciones efectuadas con cargo a la vigencia 2021 de contratos suscritos en vigencias anteriores, especificando el año de suscripción en la columna dos."]
[null,2,"Año","Registre el año de celebración del contrato."]
[null,3,"Número de proceso en el SECOP","Relacione el número de proceso de selección con el cual se encuentra publicado el contrato en el SECOP, mas no el link o enlace. Ejemplo IDU-CMA-DTDP-240-2021"]
[null,null,"Link proceso SECOP","Registre el enlace del proceso en SECOP. Ejemplo  https://community.secop.gov.co/Public/xxxxxx"]
[null,4,"Tipo de Contrato","En esta columna seleccione de la lista, el tipo de contrato que corresponde al contrato suscrito. El formato no permite incluir tipo de contratos diferentes a los señaladas en la lista desplegable.  Se debe escoger de las tipologías contractuales que se relacionan a continuación:  "]
[null,null,null,"Para las adiciones a contratos suscritos en la vigencia 2021 y adiciones a contratos sucritos de años anteriores se debe diligenciar la tipología del contrato adicionado o modificado"]
[null,null,"Obra ","Son contratos de obra los que celebren las entidades estatales para la construcción, mantenimiento, instalación y, en general, para la realización de cualquier otro trabajo material sobre bienes inmuebles, cualquiera que sea la modalidad de ejecución y pago. Numeral 1 del artículo 32 de la Ley 80 de 1993"]
[null,null,"Consultoría","Aquellos que celebran las entidades estatales, referidos a los estudios necesarios para la ejecución de proyectos de inversión, de diagnósticos, prefactibilidad o factibilidad para programas o proyectos específicos, así como  las asesorías técnicas de coordinación, control y supervisión. Numeral 2 del artículo 32 de la Ley 80 de 1993"]
[null,null,"Interventoría","Son también  contratos de consultoría los que tienen por objeto la Interventoría, asesoría, gerencia de obras o de proyectos, dirección, programación y la ejecución de diseños, planos, anteproyectos y proyectos. Numeral 2 del artículo 32 de la Ley 80 de 1993"]
[null,null,null,"El contrato de Interventoría tiene por objeto la  supervisión, seguimiento y vigilancia a la ejecución material de un contrato principal"]
[null,null,"Contrato de Prestación de servicios","Son contratos de prestación de servicios los que celebren las entidades estatales para desarrollar actividades relacionadas con la administración o funcionamiento de la entidad. Numeral 3 del artículo 32 de la Ley 80 de 1993"]
[null,null,"Contrato de Prestación de servicios profesionales y de apoyo a la gestión","Corresponden a aquellos de naturaleza intelectual diferentes a los de consultoría que se derivan del cumplimiento de las funciones de la entidad estatal; así como los relacionados con actividades operativas, logísticas, o asistenciales. Art. 2.2.1.2.1.4.9. del Decreto 1082 de 2015"]
[null,null,"Compraventa de bienes muebles","Son aquellos contratos donde se transfiere el dominio de un bien mueble (aquellos susceptibles de ser trasladadas de un lugar a otro sin alterar ni su forma ni su esencia, tal es el caso del mobiliario y equipo de oficina, maquinaria, automóviles, etc.), cuya ejecución se agota de manera instantánea. Artículo 660, Código Civil"]
[null,null,"Compraventa de bienes inmuebles","Son aquellos contratos donde se transfiere el dominio de un bien inmueble (todos aquellos bienes considerados bienes raíces, por tener de común la circunstancia de estar íntimamente ligados al suelo, unidos de modo inseparable, física o jurídicamente, al terreno). Artículo 656, Código Civil"]
[null,null,"Arrendamiento de bienes muebles","Es un contrato que tiene por objeto, conceder el uso y goce de un bien mueble a cambio de un precio determinado. Artículo 1974, Código Civil"]
[null,null,"Arrendamiento de bienes inmuebles","Es un contrato que tiene por objeto, conceder el uso y goce de un bien inmueble a cambio de un precio determinado. Artículo 2.2.1.2.1.4.11 del Decreto 1082 de 2015"]
[null,null,"Seguros","El seguro es un contrato, en virtud del cual una persona jurídica llamada asegurador, asume, a cambio de una prima, un riesgo que le es trasladado por una persona natural o jurídica llamado tomador y en el cual éste tiene un interés asegurable, con el fin de indemnizarlo, en el evento de que ocurra la realización del riesgo amparado, de conformidad con el Título V, del Libro Cuarto del Código de Comercio"]
[null,null,"Suministro","El suministro es el contrato por el cual una parte se obliga, a cambio de una contraprestación, a cumplir en favor de otra, en forma independiente, prestaciones periódicas o continuadas de cosas o servicios. Artículo 968, Código de Comercio"]
[null,null,"Empréstitos","Son contratos de empréstito los que tienen por objeto proveer a la entidad estatal contratante de recursos en moneda nacional o extranjera con plazo para su pago. Artículo 7, Decreto 2681 de 1993"]
[null,null,"Fiducia mercantil o encargo fiduciario","Son contratos que tienen por objeto la administración o el manejo de los recursos vinculados a los contratos que tales entidades celebren. Numeral 5 del artículo 32 de la Ley 80 de 1993"]
[null,null,"Concesión","Este contrato tiene por objeto otorgar a una persona llamada concesionario la prestación, operación, explotación, organización o gestión, total o parcial, de un servicio público, o la construcción, explotación o conservación total o parcial, de una obra o bien destinados al servicio o uso público, así como todas aquellas actividades necesarias para la adecuada prestación o funcionamiento de la obra o servicio por cuenta y riesgo del concesionario, y bajo la vigilancia y control de la entidad concedente, a cambio de una remuneración que puede consistir en derechos, tarifas, tasas, valorización, o en la participación que se le otorgue en la explotación del bien, obra o servicio, o en una suma periódica, única o porcentual, y en general, en cualquier otra modalidad de contraprestación que las partes acuerden. Numeral 4 del artículo 32 de la Ley 80 de 1993"]
[null,null,"Convenios de cooperación","Son aquellos mediante los cuales se formaliza la asistencia, ayuda, auxilio, soporte o colaboración entre entidades de una misma nación, de distintos países o por parte de organizaciones internacionales de naturaleza pública o privada a favor de entidades públicas. Artículo 20 de la Ley 1150 de 2007"]
[null,null,"Convenios/Contratos interadministrativos","El convenio interadministrativo es el negocio jurídico en el cual están presentes dos entidades públicas en desarrollo de relaciones interadministrativas cuyo objeto es coordinar, cooperar, colaborar o distribuir competencias en la realización de funciones administrativas de interés común a los sujetos negociales. Artículo 95 de la Ley 489 de 1998"]
[null,null,"Convenios de Apoyo y/o Convenios de Asociación","Los contratos que en desarrollo de lo dispuesto en el segundo inciso del artículo 355 de la Constitución Política celebren la Nación, los Departamentos, Distritos y Municipios con entidades privadas sin ánimo de lucro y de reconocida idoneidad, con el propósito de impulsar programas y actividades de interés público. Reglamentado mediante Decreto 92 de 2017"]
[null,null,"Asociaciones Público Privadas","Los contratos con personas naturales o jurídicas que se celebran en desarrollo de lo dispuesto en la Ley 1508 de 2012"]
[null,null,"Otros","Los demás tipos de contratos que no se encuentren definidos en las anteriores tipologías"]
[null,null,"Otros gastos","Incluye los gastos no contractuales, estos se registran al final de la base, no cuentan con número de contrato, tipo, proceso o modalidad.  Estos gastos en los que no media un acuerdo de voluntades, en caso de ser del rubro de inversiòn, se deben discriminar por programa y proyecto. En el caso de ser del rubro de funcionamiento no requieren ser discriminados sino totalizados en una sola fila."]
[null,5,"Modalidad de Selección","Al ubicarse en la celda, se despliega una lista de modalidades de selección, de las cuales debe seleccionar la indicada"]
[null,null,null,"Para las adiciones a contratos suscritos en vigencias anteriores se debe diligenciar la modalidad de selección del contrato adicionado o modificado"]
[null,null,null,"La modalidad régimen especial se refiere a todos los contratos realizados en cumplimiento del Decreto 92 de 2017, convenios de asociación con ESAL. Régimen privado es para todas aquellas entidades que no se rigen por el Estatuto General de Contratación Pública (Ley 80 de 1993 y normas complementarias), caso en el que todos sus contratos deben ser identificados con esta modalidad"]
[null,6,"Procedimiento o causal","Esta columna solo se habilita y debe ser diligenciada, para las modalidades de selección abreviada y contratación directa. Al ubicarse en la celda, se despliega una lista de procedimientos o causales, de las cuales debe seleccionar la indicada. El formato no permite incluir procedimientos o causales diferentes a las señaladas en la lista desplegable.  "]
[null,7,"Objeto","Registre el objeto del contrato"]
[null,8,"Afectación ","Registre la afectación según la clasificación de cuentas del presupuesto de gastos. Funcionamiento, Inversión y Operación, esta última aplica únicamente para entidades de régimen privado. La celda solamente permite registrar estas tres opciones."]
[null,null,"Planes de Desarrollo Distrital","Seleccionar el PDD de acuerdo con los diferentes contratos suscritos, automáticamente en la columna K se activan  los números de programa de acuerdo al PDD."]
[null,null,"Número Programa","Si en la columna anterior “Afectación”,  indicó funcionamiento u operación deje en blanco el número de programa, es decir esta columna solamente aplica para gastos de Inversión."]
[null,null,null,"Identifíquelo de acuerdo con el código presupuestal del Plan de Desarrollo  \"Un Nuevo Contrato Social y Ambiental para la Bogotá del Siglo XXI\". Si un mismo contrato afecta más de un código presupuestal discrimine el contrato por cada código que afecte en filas separadas. Si se registra el número del programa, automáticamente en la columna L y M se despliega el nombre del programa y el  propósito según corresponda. "]
[null,9,"Número Proyecto","Indique el código presupuestal con el que se identifica el proyecto. Si un mismo contrato afecta más de un proyecto, discriminar el contrato por cada proyecto que afecte en filas separadas."]
[null,10,"Número de proponentes","Diligencie el número de proponentes que participaron en el proceso de selección adelantado que dio como resultado el contrato que se está diligenciando"]
[null,11,"Número de Identificación del contratista","Indicar el número de identificación del contratista persona natural o jurídica o contratistas plurales (uniones temporales y consorcios) con quien se suscribió el contrato, sin comas, tildes, puntos ni caracteres especiales, y si es NIT sin dígito de verificación"]
[null,null,"Nombre del Contratista","Indicar el nombre del contratista, persona natural o jurídica  o contratistas plurales (uniones temporales y consorcios) en mayúscula sostenida, sin comas, tildes, puntos ni caracteres especiales. Si se trata de personas jurídicas, diligenciar razón social y tipo societario, sin comas, tildes, puntos ni caracteres especiales. Si se trata de personas naturales diligenciar primero los nombres seguidos de los apellidos en la misma columna (nombre 1, nombre 2, apellido 1 y apellido 2)"]
[null,null,"Naturaleza Jurídica","Seleccione la naturaleza jurídica que corresponde al contratista, según las opciones"]
[null,null,"Número  de Identificación de los integrantes del Consorcio o U.T.\n(NIT sin digito de verificación)","Diligenciar este numeral sólo en los casos en que el contratista sea un Consorcio o Union Temporal, relacione en filas independientes (si son varios integrantes puede insertar filas adicionales), cada uno de los números de identificación de los integrantes de los consorcios o uniones temporales sin comas, tildes, puntos ni caracteres especiales, y si es NIT sin dígito de verificación. "]
[null,null,"Nombre del Integrante del Consorcio o U.T.","Diligenciar este numeral sólo en los casos en que el contratista sea un Consorcio o Union Temporal, relacione en filas independientes cada uno de los nombres de los integrantes de los consorcios o uniones temporales, si es persona jurídica la Razón social, es decir el nombre legal de la Empresa; si es persona natural relacione los nombres seguidos de los apellidos en mayúscula sostenida, sin comas, tildes, puntos ni caracteres especiales. Igualmente en el nombre relacione el Tipo societario de cada uno de ellos, entre los cuales se encuentra Sociedades por Acciones Simplificadas (SAS), Sociedad de Responsabilidad Limitada (LTDA), Sociedad en Comandita simple (SCS), Sociedad en Comandita por Acciones (SCA), Sociedad Colectiva, a manera de ejemplo: SOCIEDAD 1 LTDA"]
[null,null,"% Participación","Registre el porcentaje de participación de cada integrante del consorcio o unión temporal, registre sólo números, sin caracteres especiales"]
[]
[]
[null,"2- INFORMACIÓN FINANCIERA"]
[null,12,"Valor Inicial ","Registre el valor inicial del contrato con cargo al segundo cuatrimestre de la vigencia 2021. Esta columna sólo debe contener información numérica"]
[null,null,null,"En el caso de adiciones a contratos de años anteriores, no diligencie esta columna, registrar el valor en la columna 15 \"Valor Total Adiciones\".\nEn caso de adiciones a contratos suscritos en el primer cuatrimestre del 2021, no diligencie esta columna, registrar el valor en la columna 15 \"Valor Total Adiciones\""]
[null,null,null,"Excluya las reservas de apropiación y cuentas por pagar"]
[null,13,"Valor total reducciones (En valor negativo)","Registre el valor de la reducción del contrato en caso de haberse realizado, en negativo, durante la vigencia 2021"]
[null,14,"Número de adiciones ","Diligencie esta columna solo en el caso de adiciones al valor inicial que aumenten el valor del contrato con cargo a la vigencia."]
[null,null,null,"Registre en esta celda el número de adiciones que se realizaron al contrato"]
[null,15,"Valor total de adiciones","Registre el valor total de las adiciones que se realizaron al contrato,  el formato de celda no permite guiones, comas o texto. Esta columna solo debe contener información numérica."]
[null,16,"Valor Final","Esta columna se encuentra formulada por favor no modifique ni quite la fórmula; la fórmula suma las columnas valor inicial, valor de reducciones y valor de adiciones"]
[null,null,null,"La sumatoria de la columna 16 (valor final) para los contratos de Inversión Directa, de funcionamiento y/o operación, cuando aplique, deberán coincidir con el valor del rubro registrado en el encabezado 4, Presupuesto comprometido de inversión según BOGDATA, con el encabezado 6, Presupuesto Comprometido Funcionamiento según BOGDATA y con el encabezado 8, Presupuesto Comprometido Operación mediante contratos, respectivamente. A la vez, estos valores deben coincidir con los informes de ejecución presupuestal del BOGDATA.  "]
[null,null,null,"Si los valores no coinciden debe especificarse al final del formato en qué está representada la diferencia Otros gastos(discriminando los conceptos por Programa y Proyecto de inversión, si es el caso), con sus respectivos valores."]
[null,null,null,"Las bases donde dichos valores no coincidan serán devueltas por la Veeduría Distrital a cada entidad para los respectivos ajustes."]
[null,17,"Giros","Registre el valor total de los giros que se realizaron al contrato,  el formato de celda no permite guiones, comas o texto. Esta columna solo debe contener información numérica."]
[]
[null,"3- PLAZOS"]
[null,18,"Fecha de suscripción","Relacionar la fecha en que se suscribió el contrato original. La celda solo admite el formato Día/Mes/Año, por ejemplo: 17/02/2021"]
[null,null,null,"Para las adiciones a contratos de años anteriores se debe registrar en esta columna la fecha de suscripción de la adición en la vigencia 2021"]
[null,19,"Fecha de inicio","Indicar la fecha de inicio del contrato. Para las adiciones a contratos de años anteriores se debe diligenciar la fecha de inicio de la adición en la vigencia 2021. La celda solo admite el formato Día/Mes/Año así  13/03/2021."]
[null,20,"Fecha de terminación","Indicar la fecha efectiva de terminación del contrato. La celda solo admite el formato Día/Mes/Año así  15/02/2021."]
[null,21,"Plazo en días","Esta columna contiene el plazo inicial del contrato con el número total de días a ejecutar (sólo número de días, no mes, no texto). "]
[null,22,"Número de prórrogas","Registre en esta celda el número de prórrogas que se realizaron al contrato en la vigencia 2021."]
[null,23,"Prórroga en días","En caso de presentarse este evento, indicar en días, el tiempo por el cual se prorrogó el contrato a partir de la fecha inicial de terminación (sólo número de días, no mes, no texto)."]
[]
[null,"4- CESIÓN"]
[null,24,"Número  de Identificación del cesionario\n(NIT con digito de verificación)","Indicar el número de identificación del cesionario persona natural o jurídica con quien se suscribió la cesión, con digito de verificación (DV), el formato de celda no permite guiones o comas, solo números. Si hay más de una cesión adicione una fila y registre número de contrato, año, número proceso contractual SECOP y demás información que corresponda."]
[null,25,"Nombre cesionario","Indicar el nombre del cesionario, persona natural o jurídica."]
[null,26,"Fecha cesión","Relacionar la fecha en que se suscribió la cesión del contrato. La celda solo admite el formato Día/Mes/Año así  17/02/2021."]
[null,27,"Valor cesión","Registre el valor correspondiente a la cesión con cargo a la vigencia 2021, el formato de celda no permite guiones, comas o texto. Esta columna solo debe contener información numérica."]
[]
[null,"5- ESTADO A 31 DE DICIEMBRE DE 2021"]
[null,28,"Estado","Marque con una X en la respectiva columna si el contrato se encuentra a 31 de diciembre de 2021 Celebrado o por Iniciar, En Ejecución, Terminado o Liquidado."]
[]
[null,"5- PORCENTAJE DE AVANCE Y/O CUMPLIMIENTO"]
[null,29,"% Avance y/o cumplimiento","Indica el porcentaje de avance o de cumplimiento en términos presupuestales a 31 de diciembre de 2021, es decir lo efectivamente pagado al contratista. Si no se ha iniciado la ejecución, el % de avance es 0%. La celda se encuentra formulada y protegida. Es la relación entre el valor de los giros y el valor final del contrato. Si el porcentaje de avance no coincide, se debe revisar los valores que se registraron en estas columnas.  Este porcentaje no debe ser superior al 100%"]

{"sheet":"Proposito_programa","index":5,"n_rows":59,"n_cols":5,"rows_kept":59,"cut":false,"hidden":false,"merged":[]}
[]
[null,"PDD","No. Programa","Programa","Propósito"]
["Acuerdo 761 2020","Un Nuevo Contrato Social y Ambiental para la Bogotá del Siglo XXI",1,"Subsidios y transferencias para la equidad","Propósito 1: Hacer un nuevo contrato social para incrementar la inclusión social, productiva y política"]
["Pag. 51","Un Nuevo Contrato Social y Ambiental para la Bogotá del Siglo XXI",{"$f":"+C3+1","v":2},"Igualdad de oportunidades y desarrollo de capacidades para las mujeres","Propósito 1: Hacer un nuevo contrato social para incrementar la inclusión social, productiva y política"]
[null,"Un Nuevo Contrato Social y Ambiental para la Bogotá del Siglo XXI",{"$f":"+C4+1","v":3},"Movilidad social integral","Propósito 1: Hacer un nuevo contrato social para incrementar la inclusión social, productiva y política"]
[null,"Un Nuevo Contrato Social y Ambiental para la Bogotá del Siglo XXI",4,"Prevención de la exclusión por razones étnicas, religiosas, sociales, políticas y de orientación sexual","Propósito 1: Hacer un nuevo contrato social para incrementar la inclusión social, productiva y política"]
[null,"Un Nuevo Contrato Social y Ambiental para la Bogotá del Siglo XXI",5,"Promoción de la igualdad, el desarrollo de capacidades y el reconocimiento de las mujeres","Propósito 1: Hacer un nuevo contrato social para incrementar la inclusión social, productiva y política"]
[null,"Un Nuevo Contrato Social y Ambiental para la Bogotá del Siglo XXI",6,"Sistema Distrital de Cuidado","Propósito 1: Hacer un nuevo contrato social para incrementar la inclusión social, productiva y política"]
[null,"Un Nuevo Contrato Social y Ambiental para la Bogotá del Siglo XXI",7,"Mejora de la gestión de instituciones de salud","Propósito 1: Hacer un nuevo contrato social para incrementar la inclusión social, productiva y política"]
[null,"Un Nuevo Contrato Social y Ambiental para la Bogotá del Siglo XXI",8,"Prevención y atención de maternidad temprana","Propósito 1: Hacer un nuevo contrato social para incrementar la inclusión social, productiva y política"]
[null,"Un Nuevo Contrato Social y Ambiental para la Bogotá del Siglo XXI",9,"Prevención y cambios para mejorar la salud de la población","Propósito 1: Hacer un nuevo contrato social para incrementar la inclusión social, productiva y política"]
[null,"Un Nuevo Contrato Social y Ambiental para la Bogotá del Siglo XXI",10,"Salud para la vida y el bienestar","Propósito 1: Hacer un nuevo contrato social para incrementar la inclusión social, productiva y política"]
[null,"Un Nuevo Contrato Social y Ambiental para la Bogotá del Siglo XXI",11,"Salud y bienestar para niñas y niños","Propósito 1: Hacer un nuevo contrato social para incrementar la inclusión social, productiva y política"]
[null,"Un Nuevo Contrato Social y Ambiental para la Bogotá del Siglo XXI",12,"Educación inicial: Bases sólidas para la vida.","Propósito 1: Hacer un nuevo contrato social para incrementar la inclusión social, productiva y política"]
[null,"Un Nuevo Contrato Social y Ambiental para la Bogotá del Siglo XXI",13,"Educación para todos y todas: acceso y permanencia con equidad y énfasis en educación rural","Propósito 1: Hacer un nuevo contrato social para incrementar la inclusión social, productiva y política"]
[null,"Un Nuevo Contrato Social y Ambiental para la Bogotá del Siglo XXI",14,"Formación integral: más y mejor tiempo en los colegios","Propósito 1: Hacer un nuevo contrato social para incrementar la inclusión social, productiva y política"]
[null,"Un Nuevo Contrato Social y Ambiental para la Bogotá del Siglo XXI",15,"Plan Distrital de Lectura, Escritura y Oralidad: \"Leer para la vida\"","Propósito 1: Hacer un nuevo contrato social para incrementar la inclusión social, productiva y política"]
[null,"Un Nuevo Contrato Social y Ambiental para la Bogotá del Siglo XXI",16,"Transformación pedagógica y mejoramiento de la gestión educativa. Es con los maestros y maestras.","Propósito 1: Hacer un nuevo contrato social para incrementar la inclusión social, productiva y política"]
[null,"Un Nuevo Contrato Social y Ambiental para la Bogotá del Siglo XXI",17,"Jóvenes con capacidades: Proyecto de vida para la ciudadanía, la innovación y el trabajo del siglo XXI","Propósito 1: Hacer un nuevo contrato social para incrementar la inclusión social, productiva y política"]
[null,"Un Nuevo Contrato Social y Ambiental para la Bogotá del Siglo XXI",18,"Cierre de brechas para la inclusión productiva urbano rural","Propósito 1: Hacer un nuevo contrato social para incrementar la inclusión social, productiva y política"]
[null,"Un Nuevo Contrato Social y Ambiental para la Bogotá del Siglo XXI",19,"Vivienda y entornos dignos en el territorio urbano y rural","Propósito 1: Hacer un nuevo contrato social para incrementar la inclusión social, productiva y política"]
[null,"Un Nuevo Contrato Social y Ambiental para la Bogotá del Siglo XXI",20,"Bogotá, referente en cultura, deporte, recreación y actividad física, con parques para el desarrollo y la salud","Propósito 1: Hacer un nuevo contrato social para incrementar la inclusión social, productiva y política"]
[null,"Un Nuevo Contrato Social y Ambiental para la Bogotá del Siglo XXI",21,"Creación y vida cotidiana: Apropiación ciudadana del arte, la cultura y el patrimonio, para la democracia cultural","Propósito 1: Hacer un nuevo contrato social para incrementar la inclusión social, productiva y política"]
[null,"Un Nuevo Contrato Social y Ambiental para la Bogotá del Siglo XXI",22,"Transformación cultural para la conciencia ambiental y el cuidado de la fauna doméstica","Propósito 1: Hacer un nuevo contrato social para incrementar la inclusión social, productiva y política"]
[null,"Un Nuevo Contrato Social y Ambiental para la Bogotá del Siglo XXI",23,"Bogotá rural","Propósito 1: Hacer un nuevo contrato social para incrementar la inclusión social, productiva y política"]
[null,"Un Nuevo Contrato Social y Ambiental para la Bogotá del Siglo XXI",24,"Bogotá región emprendedora e innovadora","Propósito 1: Hacer un nuevo contrato social para incrementar la inclusión social, productiva y política"]
[null,"Un Nuevo Contrato Social y Ambiental para la Bogotá del Siglo XXI",25,"Bogotá región productiva y competitiva","Propósito 1: Hacer un nuevo contrato social para incrementar la inclusión social, productiva y política"]
[null,"Un Nuevo Contrato Social y Ambiental para la Bogotá del Siglo XXI",26,"Bogotá - región, el mejor destino para visitar","Propósito 1: Hacer un nuevo contrato social para incrementar la inclusión social, productiva y política"]
[null,"Un Nuevo Contrato Social y Ambiental para la Bogotá del Siglo XXI",27,"Cambio cultural para la gestión de la crisis climática","Propósito 2 : Cambiar Nuestros Hábitos de Vida para Reverdecer a Bogotá y Adaptarnos y Mitigar la Crisis Climática"]
[null,"Un Nuevo Contrato Social y Ambiental para la Bogotá del Siglo XXI",{"$f":"+C29+1","v":28},"Bogotá protectora de sus recursos naturales","Propósito 2 : Cambiar Nuestros Hábitos de Vida para Reverdecer a Bogotá y Adaptarnos y Mitigar la Crisis Climática"]
[null,"Un Nuevo Contrato Social y Ambiental para la Bogotá del Siglo XXI",{"$f":"+C30+1","v":29},"Asentamientos y entornos protectores","Propósito 2 : Cambiar Nuestros Hábitos de Vida para Reverdecer a Bogotá y Adaptarnos y Mitigar la Crisis Climática"]
[null,"Un Nuevo Contrato Social y Ambiental para la Bogotá del Siglo XXI",30,"Eficiencia en la atención de emergencias","Propósito 2 : Cambiar Nuestros Hábitos de Vida para Reverdecer a Bogotá y Adaptarnos y Mitigar la Crisis Climática"]
[null,"Un Nuevo Contrato Social y Ambiental para la Bogotá del Siglo XXI",31," Protección y valoración del patrimonio tangible e intangible en Bogotá y la región","Propósito 2 : Cambiar Nuestros Hábitos de Vida para Reverdecer a Bogotá y Adaptarnos y Mitigar la Crisis Climática"]
[null,"Un Nuevo Contrato Social y Ambiental para la Bogotá del Siglo XXI",32,"Revitalización urbana para la competitividad","Propósito 2 : Cambiar Nuestros Hábitos de Vida para Reverdecer a Bogotá y Adaptarnos y Mitigar la Crisis Climática"]
[null,"Un Nuevo Contrato Social y Ambiental para la Bogotá del Siglo XXI",33,"Más árboles y más y mejor espacio público","Propósito 2 : Cambiar Nuestros Hábitos de Vida para Reverdecer a Bogotá y Adaptarnos y Mitigar la Crisis Climática"]
[null,"Un Nuevo Contrato Social y Ambiental para la Bogotá del Siglo XXI",34,"Bogotá protectora de los animales","Propósito 2 : Cambiar Nuestros Hábitos de Vida para Reverdecer a Bogotá y Adaptarnos y Mitigar la Crisis Climática"]
[null,"Un Nuevo Contrato Social y Ambiental para la Bogotá del Siglo XXI",35,"Manejo y prevención de contaminación","Propósito 2 : Cambiar Nuestros Hábitos de Vida para Reverdecer a Bogotá y Adaptarnos y Mitigar la Crisis Climática"]
[null,"Un Nuevo Contrato Social y Ambiental para la Bogotá del Siglo XXI",36,"Manejo y saneamiento de los cuerpos de agua","Propósito 2 : Cambiar Nuestros Hábitos de Vida para Reverdecer a Bogotá y Adaptarnos y Mitigar la Crisis Climática"]
[null,"Un Nuevo Contrato Social y Ambiental para la Bogotá del Siglo XXI",37,"Provisión y mejoramiento de servicios públicos","Propósito 2 : Cambiar Nuestros Hábitos de Vida para Reverdecer a Bogotá y Adaptarnos y Mitigar la Crisis Climática"]
[null,"Un Nuevo Contrato Social y Ambiental para la Bogotá del Siglo XXI",38,"Ecoeficiencia, reciclaje, manejo de residuos e inclusión de la población recicladora","Propósito 2 : Cambiar Nuestros Hábitos de Vida para Reverdecer a Bogotá y Adaptarnos y Mitigar la Crisis Climática"]
[null,"Un Nuevo Contrato Social y Ambiental para la Bogotá del Siglo XXI",39,"Bogotá territorio de paz y atención integral a las víctimas del conflicto armado","Propósito 3: Inspirar confianza y legitimidad para vivir sin miedo y ser epicentro de cultura ciudadana, paz y reconciliación"]
[null,"Un Nuevo Contrato Social y Ambiental para la Bogotá del Siglo XXI",{"$f":"+C41+1","v":40},"Más mujeres viven una vida libre de violencias, se sienten seguras y acceden con confianza al sistema de justicia","Propósito 3: Inspirar confianza y legitimidad para vivir sin miedo y ser epicentro de cultura ciudadana, paz y reconciliación"]
[null,"Un Nuevo Contrato Social y Ambiental para la Bogotá del Siglo XXI",{"$f":"+C42+1","v":41},"Sin machismo ni violencias contra las mujeres, las niñas y los niños","Propósito 3: Inspirar confianza y legitimidad para vivir sin miedo y ser epicentro de cultura ciudadana, paz y reconciliación"]
[null,"Un Nuevo Contrato Social y Ambiental para la Bogotá del Siglo XXI",42,"Conciencia y cultura ciudadana para la seguridad, la convivencia y la construcción de confianza","Propósito 3: Inspirar confianza y legitimidad para vivir sin miedo y ser epicentro de cultura ciudadana, paz y reconciliación"]
[null,"Un Nuevo Contrato Social y Ambiental para la Bogotá del Siglo XXI",43,"Cultura ciudadana para la confianza, la convivencia y la participación desde la vida cotidiana","Propósito 3: Inspirar confianza y legitimidad para vivir sin miedo y ser epicentro de cultura ciudadana, paz y reconciliación"]
[null,"Un Nuevo Contrato Social y Ambiental para la Bogotá del Siglo XXI",44,"Autoconciencia, respeto y cuidado en el espacio público","Propósito 3: Inspirar confianza y legitimidad para vivir sin miedo y ser epicentro de cultura ciudadana, paz y reconciliación"]
[null,"Un Nuevo Contrato Social y Ambiental para la Bogotá del Siglo XXI",45,"Espacio público más seguro y construido colectivamente","Propósito 3: Inspirar confianza y legitimidad para vivir sin miedo y ser epicentro de cultura ciudadana, paz y reconciliación"]
[null,"Un Nuevo Contrato Social y Ambiental para la Bogotá del Siglo XXI",46,"Atención a jóvenes y adultos infractores con impacto en su proyecto de vida","Propósito 3: Inspirar confianza y legitimidad para vivir sin miedo y ser epicentro de cultura ciudadana, paz y reconciliación"]
[null,"Un Nuevo Contrato Social y Ambiental para la Bogotá del Siglo XXI",47,"Calidad de Vida y Derechos de la Población privada de la libertad","Propósito 3: Inspirar confianza y legitimidad para vivir sin miedo y ser epicentro de cultura ciudadana, paz y reconciliación"]
[null,"Un Nuevo Contrato Social y Ambiental para la Bogotá del Siglo XXI",48,"Plataforma institucional para la seguridad y justicia","Propósito 3: Inspirar confianza y legitimidad para vivir sin miedo y ser epicentro de cultura ciudadana, paz y reconciliación"]
[null,"Un Nuevo Contrato Social y Ambiental para la Bogotá del Siglo XXI",49,"Movilidad segura, sostenible y accesible","Propósito 4: Hacer de Bogotá Región un modelo de movilidad multimodal, incluyente y sostenible"]
[null,"Un Nuevo Contrato Social y Ambiental para la Bogotá del Siglo XXI",{"$f":"+C51+1","v":50},"Red de metros","Propósito 4: Hacer de Bogotá Región un modelo de movilidad multimodal, incluyente y sostenible"]
[null,"Un Nuevo Contrato Social y Ambiental para la Bogotá del Siglo XXI",51,"Gobierno Abierto","Propósito 5: Construir Bogotá - Región con gobierno abierto, transparente y ciudadanía consciente"]
[null,"Un Nuevo Contrato Social y Ambiental para la Bogotá del Siglo XXI",{"$f":"+C53+1","v":52},"Integración regional, distrital y local","Propósito 5: Construir Bogotá - Región con gobierno abierto, transparente y ciudadanía consciente"]
[null,"Un Nuevo Contrato Social y Ambiental para la Bogotá del Siglo XXI",{"$f":"+C54+1","v":53},"Información para la toma de decisiones","Propósito 5: Construir Bogotá - Región con gobierno abierto, transparente y ciudadanía consciente"]
[null,"Un Nuevo Contrato Social y Ambiental para la Bogotá del Siglo XXI",54,"Transformación digital y gestión de TIC para un territorio inteligente","Propósito 5: Construir Bogotá - Región con gobierno abierto, transparente y ciudadanía consciente"]
[null,"Un Nuevo Contrato Social y Ambiental para la Bogotá del Siglo XXI",55,"Fortalecimiento de cultura ciudadana y su institucionalidad","Propósito 5: Construir Bogotá - Región con gobierno abierto, transparente y ciudadanía consciente"]
[null,"Un Nuevo Contrato Social y Ambiental para la Bogotá del Siglo XXI",56,"Gestión pública efectiva","Propósito 5: Construir Bogotá - Región con gobierno abierto, transparente y ciudadanía consciente"]
[null,"Un Nuevo Contrato Social y Ambiental para la Bogotá del Siglo XXI",57,"Gestión pública local","Propósito 5: Construir Bogotá - Región con gobierno abierto, transparente y ciudadanía consciente"]

{"sheet":"Tipo","index":6,"n_rows":40,"n_cols":5,"rows_kept":40,"cut":false,"hidden":true,"merged":[]}
[null,"Tipo","Modalidad de Selección","afectacion","Naturaleza Jurídica"]
[1,"Obra pública","Concurso de méritos","Funcionamiento","Persona Natural"]
[2,"Consultoría","Contratación directa","Inversión","Persona Jurídica"]
[3,"Interventoría","Contratación mínima cuantia","Operación","Unión Temporal"]
[4,"Contratos de prestación de servicios","Selección abreviada",null,"Consorcio"]
[5,"Contratos de prestación de servicios profesionales y de apoyo a la gestión","Licitación pública"]
[6,"Compraventa de bienes muebles","Régimen privado"]
[7,"Compraventa de bienes inmuebles","Régimen especial"]
[8,"Arrendamiento de bienes muebles"]
[9,"Arrendamiento de bienes inmuebles"]
[10,"Seguros","Selección abreviada"]
[11,"Suministro","Subasta inversa "]
[12,"Empréstitos","Bolsas de productos"]
[13,"Fiducia mercantil o encargo fiduciario","Acuerdo marco de precios "]
[14,"Concesión ","Selección abreviada por menor cuantía "]
[15,"Convenios de cooperacion"]
[16,"Contratos interadministrativos","contratacion directa"]
[17,"Convenios de apoyo y/o convenios de asociación ","Urgencia manifiesta"]
[18,"Asociaciones público privadas","Contratación de empréstitos"]
[19,"Otros","Contratos interadministrativos"]
[20,"Otros gastos","Contratación de bienes y servicios en el sector Defensa y en el Departamento Administrativo de Seguridad, DAS"]
[null,"SECTOR","Contratos para el desarrollo de actividades científicas y tecnológicas"]
[1,"Gestión Pública","Contratos de encargo fiduciario que celebren las entidades territoriales cuando inician el Acuerdo de Reestructuración de Pasivos"]
[{"$f":"+A23+1","v":2},"Gobierno","Cuando no exista pluralidad de oferentes en el mercado"]
[{"$f":"+A24+1","v":3},"Hacienda","Prestación de servicios profesionales y de apoyo a la gestión, o para la ejecución de trabajos artísticos que sólo puedan encomendarse a determinadas personas naturales;"]
[4,"Planeación","El arrendamiento o adquisición de inmuebles"]
[5,"Desarrollo Económico, Industria y Turismo","Contratación de bienes y servicios de la Dirección Nacional de Inteligencia (DNI)"]
[6,"Educación"]
[7,"Salud"]
[8,"Integración Social","Decreto 92 de 2017"]
[9,"Cultura, Recreación y Deporte","No aplica"]
[10,"Ambiente"]
[11,"Movilidad","SECOP I"]
[12,"Hábitat","SECOP II"]
[13,"Mujeres"]
[14,"Seguridad, Convivencia y Justicia","Bogotá Mejor para Todos"]
[15,"Gestión Juridíca","Un Nuevo Contrato Social y Ambiental para la Bogotá del Siglo XXI"]
[16,"descentralizado territorialmente"]
[]
[null,"16 - AL"]

{"sheet":"Eje_Pilar_Prop1","index":7,"n_rows":104,"n_cols":5,"rows_kept":104,"cut":false,"hidden":true,"merged":[]}
[]
[null,"PDD","No. Programa","Programa","Pilar /Eje / propósito"]
[null,"Bogotá Mejor para Todos",1,"Prevención y atención de la maternidad y la paternidad tempranas","Pilar 1 Igualdad de Calidad de Vida"]
[null,"Bogotá Mejor para Todos",2,"Desarrollo integral desde la gestación hasta la adolescencia","Pilar 1 Igualdad de Calidad de Vida"]
[null,"Bogotá Mejor para Todos",3,"Igualdad y autonomía para una Bogotá incluyente","Pilar 1 Igualdad de Calidad de Vida"]
[null,"Bogotá Mejor para Todos",4,"Familias protegidas y adaptadas al cambio climático","Pilar 1 Igualdad de Calidad de Vida"]
[null,"Bogotá Mejor para Todos",5,"Desarrollo integral para la felicidad y el ejercicio de la ciudadanía","Pilar 1 Igualdad de Calidad de Vida"]
[null,"Bogotá Mejor para Todos",6,"Calidad educativa para todos","Pilar 1 Igualdad de Calidad de Vida"]
[null,"Bogotá Mejor para Todos",7,"Inclusión educativa para la equidad","Pilar 1 Igualdad de Calidad de Vida"]
[null,"Bogotá Mejor para Todos",8,"Acceso con calidad a la educación superior","Pilar 1 Igualdad de Calidad de Vida"]
[null,"Bogotá Mejor para Todos",9,"Atención integral y eficiente en salud","Pilar 1 Igualdad de Calidad de Vida"]
[null,"Bogotá Mejor para Todos",10,"Modernización de la infraestructura física y tecnológica en salud","Pilar 1 Igualdad de Calidad de Vida"]
[null,"Bogotá Mejor para Todos",11,"Mejores oportunidades para el desarrollo a través de la cultura, la recreación y el deporte","Pilar 1 Igualdad de Calidad de Vida"]
[null,"Bogotá Mejor para Todos",12,"Mujeres protagonistas, activas y empoderadas en el cierre de brechas de género","Pilar 1 Igualdad de Calidad de Vida"]
[null,"Bogotá Mejor para Todos",13,"Infraestructura para el desarrollo del hábitat","Pilar 2 Democracía Urbana"]
[null,"Bogotá Mejor para Todos",14,"Intervenciones integrales del hábitat","Pilar 2 Democracía Urbana"]
[null,"Bogotá Mejor para Todos",15,"Recuperación, incorporación, vida urbana y control de la ilegalidad","Pilar 2 Democracía Urbana"]
[null,"Bogotá Mejor para Todos",16,"Integración social para una ciudad de oportunidades","Pilar 2 Democracía Urbana"]
[null,"Bogotá Mejor para Todos",17,"Espacio público, derecho de todos","Pilar 2 Democracía Urbana"]
[null,"Bogotá Mejor para Todos",18,"Mejor movilidad para todos","Pilar 2 Democracía Urbana"]
[null,"Bogotá Mejor para Todos",19,"Seguridad y convivencia para todos","Pilar 3 Construcción de Comunidad y Cultura Ciudadana"]
[null,"Bogotá Mejor para Todos",20,"Fortalecimiento del Sistema de Protección Integral a Mujeres Víctimas de Violencia - SOFIA","Pilar 3 Construcción de Comunidad y Cultura Ciudadana"]
[null,"Bogotá Mejor para Todos",21,"Justicia para todos: consolidación del Sistema Distrital de Justicia","Pilar 3 Construcción de Comunidad y Cultura Ciudadana"]
[null,"Bogotá Mejor para Todos",22,"Bogotá vive los derechos humanos","Pilar 3 Construcción de Comunidad y Cultura Ciudadana"]
[null,"Bogotá Mejor para Todos",23,"Bogotá mejor para las víctimas, la paz y la reconciliación","Pilar 3 Construcción de Comunidad y Cultura Ciudadana"]
[null,"Bogotá Mejor para Todos",24,"Equipo por la educación para el reencuentro, la reconciliación y la paz","Pilar 3 Construcción de Comunidad y Cultura Ciudadana"]
[null,"Bogotá Mejor para Todos",25,"Cambio cultural y construcción del tejido social para la vida","Pilar 3 Construcción de Comunidad y Cultura Ciudadana"]
[null,"Bogotá Mejor para Todos",26,"Información relevante e integral para la planeación territorial","Eje Transversal 1 Nuevo Ordenamiento Territorial"]
[null,"Bogotá Mejor para Todos",27,"Proyectos urbanos integrales con visión de ciudad","Eje Transversal 1 Nuevo Ordenamiento Territorial"]
[null,"Bogotá Mejor para Todos",28,"Suelo para reducir el déficit habitacional de suelo urbanizable, vivienda y soportes urbanos","Eje Transversal 1 Nuevo Ordenamiento Territorial"]
[null,"Bogotá Mejor para Todos",29,"Articulación regional y planeación integral del transporte","Eje Transversal 1 Nuevo Ordenamiento Territorial"]
[null,"Bogotá Mejor para Todos",30,"Financiación para el Desarrollo Territorial","Eje Transversal 1 Nuevo Ordenamiento Territorial"]
[null,"Bogotá Mejor para Todos",31,"Fundamentar el desarrollo económico en la generación y uso del conocimiento para mejorar la competitividad de la Ciudad Región","Eje Transversal 2 Desarrollo Económico basado en el conocimiento"]
[null,"Bogotá Mejor para Todos",32,"Generar alternativas de ingreso y empleo de mejor calidad","Eje Transversal 2 Desarrollo Económico basado en el conocimiento"]
[null,"Bogotá Mejor para Todos",33,"Elevar la eficiencia de los mercados de la ciudad","Eje Transversal 2 Desarrollo Económico basado en el conocimiento"]
[null,"Bogotá Mejor para Todos",34,"Mejorar y fortalecer el recaudo tributario de la ciudad e impulsar el uso de mecanismos de vinculación de capital privado","Eje Transversal 2 Desarrollo Económico basado en el conocimiento"]
[null,"Bogotá Mejor para Todos",35,"Bogotá, ciudad inteligente","Eje Transversal 2 Desarrollo Económico basado en el conocimiento"]
[null,"Bogotá Mejor para Todos",36,"Bogotá, una ciudad digital","Eje Transversal 2 Desarrollo Económico basado en el conocimiento"]
[null,"Bogotá Mejor para Todos",37,"Consolidar el turismo como factor de desarrollo, confianza y felicidad para Bogotá Región","Eje Transversal 2 Desarrollo Económico basado en el conocimiento"]
[null,"Bogotá Mejor para Todos",38,"Recuperación y manejo de la Estructura Ecológica Principal","Eje Transversal 3 Sostenibilidad Ambiental basada en la eficiencia energética"]
[null,"Bogotá Mejor para Todos",39,"Ambiente sano para la equidad y disfrute del ciudadano","Eje Transversal 3 Sostenibilidad Ambiental basada en la eficiencia energética"]
[null,"Bogotá Mejor para Todos",40,"Gestión de la huella ambiental urbana","Eje Transversal 3 Sostenibilidad Ambiental basada en la eficiencia energética"]
[null,"Bogotá Mejor para Todos",41,"Desarrollo rural sostenible","Eje Transversal 3 Sostenibilidad Ambiental basada en la eficiencia energética"]
[null,"Bogotá Mejor para Todos",42,"Transparencia, gestión pública y servicio a la ciudadanía","Eje Transversal 4 Gobierno Legitimo, Fortalecimiento Local y Eficiencia"]
[null,"Bogotá Mejor para Todos",43,"Modernización institucional","Eje Transversal 4 Gobierno Legitimo, Fortalecimiento Local y Eficiencia"]
[null,"Bogotá Mejor para Todos",44,"Gobierno y ciudadanía digital","Eje Transversal 4 Gobierno Legitimo, Fortalecimiento Local y Eficiencia"]
[null,"Bogotá Mejor para Todos",45,"Gobernanza e influencia local, regional e internacional","Eje Transversal 4 Gobierno Legitimo, Fortalecimiento Local y Eficiencia"]
["Acuerdo 761 2020","Un Nuevo Contrato Social y Ambiental para la Bogotá del Siglo XXI","1.","Subsidios y transferencias para la equidad","Propósito 1: Hacer un nuevo contrato social para incrementar la inclusión social, productiva y política"]
["Pag. 51","Un Nuevo Contrato Social y Ambiental para la Bogotá del Siglo XXI","2.","Igualdad de oportunidades y desarrollo de capacidades para las mujeres","Propósito 1: Hacer un nuevo contrato social para incrementar la inclusión social, productiva y política"]
[null,"Un Nuevo Contrato Social y Ambiental para la Bogotá del Siglo XXI","3.","Movilidad social integral","Propósito 1: Hacer un nuevo contrato social para incrementar la inclusión social, productiva y política"]
[null,"Un Nuevo Contrato Social y Ambiental para la Bogotá del Siglo XXI","4.","Prevención de la exclusión por razones étnicas, religiosas, sociales, políticas y de orientación sexual","Propósito 1: Hacer un nuevo contrato social para incrementar la inclusión social, productiva y política"]
[null,"Un Nuevo Contrato Social y Ambiental para la Bogotá del Siglo XXI","5.","Promoción de la igualdad, el desarrollo de capacidades y el reconocimiento de las mujeres","Propósito 1: Hacer un nuevo contrato social para incrementar la inclusión social, productiva y política"]
[null,"Un Nuevo Contrato Social y Ambiental para la Bogotá del Siglo XXI","6.","Sistema Distrital de Cuidado","Propósito 1: Hacer un nuevo contrato social para incrementar la inclusión social, productiva y política"]
[null,"Un Nuevo Contrato Social y Ambiental para la Bogotá del Siglo XXI","7.","Mejora de la gestión de instituciones de salud","Propósito 1: Hacer un nuevo contrato social para incrementar la inclusión social, productiva y política"]
[null,"Un Nuevo Contrato Social y Ambiental para la Bogotá del Siglo XXI","8.","Prevención y atención de maternidad temprana","Propósito 1: Hacer un nuevo contrato social para incrementar la inclusión social, productiva y política"]
[null,"Un Nuevo Contrato Social y Ambiental para la Bogotá del Siglo XXI","9.","Prevención y cambios para mejorar la salud de la población","Propósito 1: Hacer un nuevo contrato social para incrementar la inclusión social, productiva y política"]
[null,"Un Nuevo Contrato Social y Ambiental para la Bogotá del Siglo XXI","10.","Salud para la vida y el bienestar","Propósito 1: Hacer un nuevo contrato social para incrementar la inclusión social, productiva y política"]
[null,"Un Nuevo Contrato Social y Ambiental para la Bogotá del Siglo XXI","11.","Salud y bienestar para niñas y niños","Propósito 1: Hacer un nuevo contrato social para incrementar la inclusión social, productiva y política"]
[null,"Un Nuevo Contrato Social y Ambiental para la Bogotá del Siglo XXI","12.","Educación inicial: Bases sólidas para la vida.","Propósito 1: Hacer un nuevo contrato social para incrementar la inclusión social, productiva y política"]
[null,"Un Nuevo Contrato Social y Ambiental para la Bogotá del Siglo XXI","13.","Educación para todos y todas: acceso y permanencia con equidad y énfasis en educación rural","Propósito 1: Hacer un nuevo contrato social para incrementar la inclusión social, productiva y política"]
[null,"Un Nuevo Contrato Social y Ambiental para la Bogotá del Siglo XXI","14.","Formación integral: más y mejor tiempo en los colegios","Propósito 1: Hacer un nuevo contrato social para incrementar la inclusión social, productiva y política"]
[null,"Un Nuevo Contrato Social y Ambiental para la Bogotá del Siglo XXI","15.","Plan Distrital de Lectura, Escritura y Oralidad: \"Leer para la vida\"","Propósito 1: Hacer un nuevo contrato social para incrementar la inclusión social, productiva y política"]
[null,"Un Nuevo Contrato Social y Ambiental para la Bogotá del Siglo XXI","16.","Transformación pedagógica y mejoramiento de la gestión educativa. Es con los maestros y maestras.","Propósito 1: Hacer un nuevo contrato social para incrementar la inclusión social, productiva y política"]
[null,"Un Nuevo Contrato Social y Ambiental para la Bogotá del Siglo XXI","17.","Jóvenes con capacidades: Proyecto de vida para la ciudadanía, la innovación y el trabajo del siglo XXI","Propósito 1: Hacer un nuevo contrato social para incrementar la inclusión social, productiva y política"]
[null,"Un Nuevo Contrato Social y Ambiental para la Bogotá del Siglo XXI","18.","Cierre de brechas para la inclusión productiva urbano rural","Propósito 1: Hacer un nuevo contrato social para incrementar la inclusión social, productiva y política"]
[null,"Un Nuevo Contrato Social y Ambiental para la Bogotá del Siglo XXI","19.","Vivienda y entornos dignos en el territorio urbano y rural","Propósito 1: Hacer un nuevo contrato social para incrementar la inclusión social, productiva y política"]
[null,"Un Nuevo Contrato Social y Ambiental para la Bogotá del Siglo XXI","20.","Bogotá, referente en cultura, deporte, recreación y actividad física, con parques para el desarrollo y la salud","Propósito 1: Hacer un nuevo contrato social para incrementar la inclusión social, productiva y política"]
[null,"Un Nuevo Contrato Social y Ambiental para la Bogotá del Siglo XXI","21.","Creación y vida cotidiana: Apropiación ciudadana del arte, la cultura y el patrimonio, para la democracia cultural","Propósito 1: Hacer un nuevo contrato social para incrementar la inclusión social, productiva y política"]
[null,"Un Nuevo Contrato Social y Ambiental para la Bogotá del Siglo XXI","22.","Transformación cultural para la conciencia ambiental y el cuidado de la fauna doméstica","Propósito 1: Hacer un nuevo contrato social para incrementar la inclusión social, productiva y política"]
[null,"Un Nuevo Contrato Social y Ambiental para la Bogotá del Siglo XXI","23.","Bogotá rural","Propósito 1: Hacer un nuevo contrato social para incrementar la inclusión social, productiva y política"]
[null,"Un Nuevo Contrato Social y Ambiental para la Bogotá del Siglo XXI","24.","Bogotá región emprendedora e innovadora","Propósito 1: Hacer un nuevo contrato social para incrementar la inclusión social, productiva y política"]
[null,"Un Nuevo Contrato Social y Ambiental para la Bogotá del Siglo XXI","25.","Bogotá región productiva y competitiva","Propósito 1: Hacer un nuevo contrato social para incrementar la inclusión social, productiva y política"]
[null,"Un Nuevo Contrato Social y Ambiental para la Bogotá del Siglo XXI","26.","Bogotá - región, el mejor destino para visitar","Propósito 1: Hacer un nuevo contrato social para incrementar la inclusión social, productiva y política"]
[null,"Un Nuevo Contrato Social y Ambiental para la Bogotá del Siglo XXI","27.","Cambio cultural para la gestión de la crisis climática","Propósito 2 : Cambiar Nuestros Hábitos de Vida para Reverdecer a Bogotá y Adaptarnos y Mitigar la Crisis Climática"]
[null,"Un Nuevo Contrato Social y Ambiental para la Bogotá del Siglo XXI","28.","Bogotá protectora de sus recursos naturales","Propósito 2 : Cambiar Nuestros Hábitos de Vida para Reverdecer a Bogotá y Adaptarnos y Mitigar la Crisis Climática"]
[null,"Un Nuevo Contrato Social y Ambiental para la Bogotá del Siglo XXI","29.","Asentamientos y entornos protectores","Propósito 2 : Cambiar Nuestros Hábitos de Vida para Reverdecer a Bogotá y Adaptarnos y Mitigar la Crisis Climática"]
[null,"Un Nuevo Contrato Social y Ambiental para la Bogotá del Siglo XXI","30.","Eficiencia en la atención de emergencias","Propósito 2 : Cambiar Nuestros Hábitos de Vida para Reverdecer a Bogotá y Adaptarnos y Mitigar la Crisis Climática"]
[null,"Un Nuevo Contrato Social y Ambiental para la Bogotá del Siglo XXI","31."," Protección y valoración del patrimonio tangible e intangible en Bogotá y la región","Propósito 2 : Cambiar Nuestros Hábitos de Vida para Reverdecer a Bogotá y Adaptarnos y Mitigar la Crisis Climática"]
[null,"Un Nuevo Contrato Social y Ambiental para la Bogotá del Siglo XXI","32.","Revitalización urbana para la competitividad","Propósito 2 : Cambiar Nuestros Hábitos de Vida para Reverdecer a Bogotá y Adaptarnos y Mitigar la Crisis Climática"]
[null,"Un Nuevo Contrato Social y Ambiental para la Bogotá del Siglo XXI","33.","Más árboles y más y mejor espacio público","Propósito 2 : Cambiar Nuestros Hábitos de Vida para Reverdecer a Bogotá y Adaptarnos y Mitigar la Crisis Climática"]
[null,"Un Nuevo Contrato Social y Ambiental para la Bogotá del Siglo XXI","34.","Bogotá protectora de los animales","Propósito 2 : Cambiar Nuestros Hábitos de Vida para Reverdecer a Bogotá y Adaptarnos y Mitigar la Crisis Climática"]
[null,"Un Nuevo Contrato Social y Ambiental para la Bogotá del Siglo XXI","35.","Manejo y prevención de contaminación","Propósito 2 : Cambiar Nuestros Hábitos de Vida para Reverdecer a Bogotá y Adaptarnos y Mitigar la Crisis Climática"]
[null,"Un Nuevo Contrato Social y Ambiental para la Bogotá del Siglo XXI","36.","Manejo y saneamiento de los cuerpos de agua","Propósito 2 : Cambiar Nuestros Hábitos de Vida para Reverdecer a Bogotá y Adaptarnos y Mitigar la Crisis Climática"]
[null,"Un Nuevo Contrato Social y Ambiental para la Bogotá del Siglo XXI","37.","Provisión y mejoramiento de servicios públicos","Propósito 2 : Cambiar Nuestros Hábitos de Vida para Reverdecer a Bogotá y Adaptarnos y Mitigar la Crisis Climática"]
[null,"Un Nuevo Contrato Social y Ambiental para la Bogotá del Siglo XXI","38.","Ecoeficiencia, reciclaje, manejo de residuos e inclusión de la población recicladora","Propósito 2 : Cambiar Nuestros Hábitos de Vida para Reverdecer a Bogotá y Adaptarnos y Mitigar la Crisis Climática"]
[null,"Un Nuevo Contrato Social y Ambiental para la Bogotá del Siglo XXI","39.","Bogotá territorio de paz y atención integral a las víctimas del conflicto armado","Propósito 3: Inspirar confianza y legitimidad para vivir sin miedo y ser epicentro de cultura ciudadana, paz y reconciliación"]
[null,"Un Nuevo Contrato Social y Ambiental para la Bogotá del Siglo XXI","40.","Más mujeres viven una vida libre de violencias, se sienten seguras y acceden con confianza al sistema de justicia","Propósito 3: Inspirar confianza y legitimidad para vivir sin miedo y ser epicentro de cultura ciudadana, paz y reconciliación"]
[null,"Un Nuevo Contrato Social y Ambiental para la Bogotá del Siglo XXI","41.","Sin machismo ni violencias contra las mujeres, las niñas y los niños","Propósito 3: Inspirar confianza y legitimidad para vivir sin miedo y ser epicentro de cultura ciudadana, paz y reconciliación"]
[null,"Un Nuevo Contrato Social y Ambiental para la Bogotá del Siglo XXI","42.","Conciencia y cultura ciudadana para la seguridad, la convivencia y la construcción de confianza","Propósito 3: Inspirar confianza y legitimidad para vivir sin miedo y ser epicentro de cultura ciudadana, paz y reconciliación"]
[null,"Un Nuevo Contrato Social y Ambiental para la Bogotá del Siglo XXI","43.","Cultura ciudadana para la confianza, la convivencia y la participación desde la vida cotidiana","Propósito 3: Inspirar confianza y legitimidad para vivir sin miedo y ser epicentro de cultura ciudadana, paz y reconciliación"]
[null,"Un Nuevo Contrato Social y Ambiental para la Bogotá del Siglo XXI","44.","Autoconciencia, respeto y cuidado en el espacio público","Propósito 3: Inspirar confianza y legitimidad para vivir sin miedo y ser epicentro de cultura ciudadana, paz y reconciliación"]
[null,"Un Nuevo Contrato Social y Ambiental para la Bogotá del Siglo XXI","45.","Espacio público más seguro y construido colectivamente","Propósito 3: Inspirar confianza y legitimidad para vivir sin miedo y ser epicentro de cultura ciudadana, paz y reconciliación"]
[null,"Un Nuevo Contrato Social y Ambiental para la Bogotá del Siglo XXI","46.","Atención a jóvenes y adultos infractores con impacto en su proyecto de vida","Propósito 3: Inspirar confianza y legitimidad para vivir sin miedo y ser epicentro de cultura ciudadana, paz y reconciliación"]
[null,"Un Nuevo Contrato Social y Ambiental para la Bogotá del Siglo XXI","47.","Calidad de Vida y Derechos de la Población privada de la libertad","Propósito 3: Inspirar confianza y legitimidad para vivir sin miedo y ser epicentro de cultura ciudadana, paz y reconciliación"]
[null,"Un Nuevo Contrato Social y Ambiental para la Bogotá del Siglo XXI","48.","Plataforma institucional para la seguridad y justicia","Propósito 3: Inspirar confianza y legitimidad para vivir sin miedo y ser epicentro de cultura ciudadana, paz y reconciliación"]
[null,"Un Nuevo Contrato Social y Ambiental para la Bogotá del Siglo XXI","49.","Movilidad segura, sostenible y accesible","Propósito 4: Hacer de Bogotá Región un modelo de movilidad multimodal, incluyente y sostenible"]
[null,"Un Nuevo Contrato Social y Ambiental para la Bogotá del Siglo XXI","50.","Red de metros","Propósito 4: Hacer de Bogotá Región un modelo de movilidad multimodal, incluyente y sostenible"]
[null,"Un Nuevo Contrato Social y Ambiental para la Bogotá del Siglo XXI","51.","Gobierno Abierto","Propósito 5: Construir Bogotá - Región con gobierno abierto, transparente y ciudadanía consciente"]
[null,"Un Nuevo Contrato Social y Ambiental para la Bogotá del Siglo XXI","52.","Integración regional, distrital y local","Propósito 5: Construir Bogotá - Región con gobierno abierto, transparente y ciudadanía consciente"]
[null,"Un Nuevo Contrato Social y Ambiental para la Bogotá del Siglo XXI","53.","Información para la toma de decisiones","Propósito 5: Construir Bogotá - Región con gobierno abierto, transparente y ciudadanía consciente"]
[null,"Un Nuevo Contrato Social y Ambiental para la Bogotá del Siglo XXI","54.","Transformación digital y gestión de TIC para un territorio inteligente","Propósito 5: Construir Bogotá - Región con gobierno abierto, transparente y ciudadanía consciente"]
[null,"Un Nuevo Contrato Social y Ambiental para la Bogotá del Siglo XXI","55.","Fortalecimiento de cultura ciudadana y su institucionalidad","Propósito 5: Construir Bogotá - Región con gobierno abierto, transparente y ciudadanía consciente"]
[null,"Un Nuevo Contrato Social y Ambiental para la Bogotá del Siglo XXI","56.","Gestión pública efectiva","Propósito 5: Construir Bogotá - Región con gobierno abierto, transparente y ciudadanía consciente"]
[null,"Un Nuevo Contrato Social y Ambiental para la Bogotá del Siglo XXI","57.","Gestión pública local","Propósito 5: Construir Bogotá - Región con gobierno abierto, transparente y ciudadanía consciente"]