{"text_format":"1","workbook":"xlsx","n_sheets":4,"sheets":["Formato2019","Instructivo","Tipo","Eje_Pilar"],"not_rendered":{"charts":0,"images":1,"macros":1,"external_links":0,"defined_names":10,"comments":0,"pivot_tables":0},"unopened":[],"bounds":{"document_bytes":16777216,"sheet_cells":100000,"rows_first":2000,"rows_last":500,"rows_between":2000,"halvings":0,"cell_chars":16384,"cell_head_chars":4096},"cells_cut":0,"cells_raw":0,"read":"whole","date_system":"1900"}

{"sheet":"Formato2019","index":0,"n_rows":435,"n_cols":39,"rows_kept":435,"cut":false,"hidden":false,"merged":[[10,0,10,13],[10,14,10,20],[10,21,10,25],[10,26,10,30],[11,7,11,10],[11,12,11,13],[11,26,11,30],[5,22,5,31],[6,20,6,21],[6,22,6,31],[1,0,1,31],[2,0,2,31],[4,0,4,2],[4,8,4,9],[4,12,4,13],[4,20,4,31],[5,0,5,2],[5,8,5,9],[6,0,6,2],[6,8,6,9],[5,20,5,21],[7,20,7,21],[7,22,7,31],[8,20,8,21],[8,22,8,31],[9,20,9,21],[9,22,9,31],[7,0,7,13],[8,0,8,2],[8,4,8,6],[8,8,9,13],[9,0,9,2],[9,4,9,6]]}
[]
["VEEDURIA DISTRITAL - RENDICION DE CUENTAS DE LA GESTION CONTRACTUAL EN EL DISTRITO CAPITAL (Acuerdo 380 de 2009)"]
["INFORMACION GENERAL DE CONTRATACION ENTIDADES DISTRITALES  -  ENERO 1 A 31 DICIEMBRE DE 2019"]
[]
["1. Entidad:",null,null,"Alcaldía Local de Sumapaz",null,null,"2. Sector","Gobierno"]
["3. Presupuesto Disponible Inversión Directa PREDIS",null,null,34698468000,null,null,"5. Presupuesto Disponible Funcionamiento PREDIS",2730661047,null,null,null,null,null,null,null,null,null,null,null,null,"9. Nombre de quien diligencia el formato",null,"Manuel Alejandro Gómez Roa"]
["4. Presupuesto Comprometido de Inversión Directa según PREDIS ",null,null,33721525093,null,null,"6. Presupuesto Comprometido Funcionamiento según PREDIS",2523882823,null,null,null,null,null,null,null,null,null,null,null,null,"Cargo",null,"Contratista"]
[null,null,null,null,null,null,null,null,null,null,null,null,null,null,null,null,null,null,null,null,"Dependencia",null,"Planeación"]
["7. Presupuesto Disponible Operación (Regimen Privado)",null,null,null,null,null,null,null,null,null,null,null,null,null,null,null,null,null,null,null,"Teléfono",null,3105876283]
["8. Presupuesto Comprometido Operación mediante contratos",null,null,null,null,null,null,null,null,null,null,null,null,null,null,null,null,null,null,null,"Correo Electrónico",null,"manuel.gomez@gobiernobogota.gov.co"]
["1- INFORMACION GENERAL",null,null,null,null,null,null,null,null,null,null,null,null,null,"2- INFORMACION FINANCIERA",null,null,null,null,null,null,"3 - PLAZOS ",null,null,null,null,"4 - ESTADO ",null,null,null,null,"5. %  Avance y/o cumplimiento"]
[1,2,3,4,5,6,7,8,null,null,null,9,10,null,11,12,13,14,15,16,17,18,19,20,21,22,23,null,null,null,null,24]
["Número Contrato","Año","Número de proceso contractual","Tipo de contrato ","Modalidad de Selección","Procedimiento o causal","Objeto","Afectación","Número Programa","Equivalencia número de programa","Eje / Pilar","Número Proyecto","Número  de Identificación del contratista\n(NIT con digito de verificación)","Nombre del contratista","Valor Inicial del contrato","Número de reducciones","Valor total reducciones (En valor negativo)","Número de adiciones","Valor total de adiciones ","Valor Final ","Giros\n(Valor en pesos)","Fecha de suscripción (DD/MM/AAAA)","Fecha de inicio (DD/MM/AAAA)","Fecha de terminación (DD/MM/AAAA)","Plazo en días","Prorroga en días","Anulado","Celebrado o por iniciar","En Ejecución","Terminado","Liquidado","% Avance y/o Cumplimiento",null,"Total Contratos","Validación Tipo","Validación Modalidad","Validación procedimiento","Validación afectación","Validación programa"]
["CPS-001-2019",2019,"FDLS-CD-001-2019","Contratos de prestación de servicios profesionales y de apoyo a la gestión","Contratación directa","Prestación de servicios profesionales y de apoyo a la gestión, o para la ejecución de trabajos artísticos que sólo puedan encomendarse a determinadas personas naturales;","Prestar los servicios profesionales jurídicos para apoyar los asuntos legales y contractuales de la Alcaldía Local de Sumapaz de los proyectos de inversión 1331, 1340, 1349, 1353 y 1375, así como las declaratorias de incumplimiento y los demás asuntos que le sean designados.","Inversión",45,"Gobernanza e influencia local, regional e internacional","Eje Transversal 4 Gobierno Legitimo, Fortalecimiento Local y Eficiencia",1375,52900762,"JENNY CAROLINA GIRON CUERVO",59220000,null,0,null,null,{"$f":"O14+Q14+S14","v":59220000},50995000,"2019-01-15","2019-01-16","2020-01-20",360,null,null,null,"x",null,null,0.86111111111111116,null,{"$f":"IF(SUMPRODUCT((A$14:A14=A14)*(B$14:B14=B14)*(C$14:C14=C14))>1,0,1)","v":1},{"$f":"IFERROR(VLOOKUP(D14,tipo,1,FALSE),\"NO\")","v":"Contratos de prestación de servicios profesionales y de apoyo a la gestión"},{"$f":"IFERROR(VLOOKUP(E14,modal,1,FALSE),\"NO\")","v":"Contratación directa"},{"$f":"IFERROR(VLOOKUP(F14,Tipo!$C$12:$C$27,1,FALSE),\"NO\")","v":"Prestación de servicios profesionales y de apoyo a la gestión, o para la ejecución de trabajos artísticos que sólo puedan encomendarse a determinadas personas naturales;"},{"$f":"IFERROR(VLOOKUP(H14,afectacion,1,FALSE),\"NO\")","v":"Inversión"},{"$f":"IFERROR(VLOOKUP(I14,programa,1,FALSE),\"NO\")","v":45}]
["CPS-002-2019",2019,"FDLS-CD-002-2019","Contratos de prestación de servicios profesionales y de apoyo a la gestión","Contratación directa","Prestación de servicios profesionales y de apoyo a la gestión, o para la ejecución de trabajos artísticos que sólo puedan encomendarse a determinadas personas naturales;","Prestar sus servicios como técnico de apoyo administrativo a la gestión al Despacho de la Alcaldesa Local de Sumapaz.","Inversión",45,"Gobernanza e influencia local, regional e internacional","Eje Transversal 4 Gobierno Legitimo, Fortalecimiento Local y Eficiencia",1375,52603721,"SANDRA MILENA RODRIGUEZ SASTOQUE",48000000,null,0,1,8000000,{"$f":"O15+Q15+S15","v":56000000},42000000,"2019-01-15","2019-01-16","2020-03-15",360,60,null,null,"x",null,null,0.75,null,{"$f":"IF(SUMPRODUCT((A$14:A15=A15)*(B$14:B15=B15)*(C$14:C15=C15))>1,0,1)","v":1},"Contratos de prestación de servicios profesionales y de apoyo a la gestión","Contratación directa",{"$f":"IFERROR(VLOOKUP(F15,Tipo!$C$12:$C$27,1,FALSE),\"NO\")","v":"Prestación de servicios profesionales y de apoyo a la gestión, o para la ejecución de trabajos artísticos que sólo puedan encomendarse a determinadas personas naturales;"},"Inversión",45]
["CPS-003-2019",2019,"FDLS-CD-003-2018 (2019)","Contratos de prestación de servicios profesionales y de apoyo a la gestión","Contratación directa","Prestación de servicios profesionales y de apoyo a la gestión, o para la ejecución de trabajos artísticos que sólo puedan encomendarse a determinadas personas naturales;","Prestar los servicios profesionales especializados jurídicos en la revisión de todos los proyectos de inversión del Plan de Desarrollo Local 2017-2020 y elaboración de estudios previos, pliegos, evaluaciones y modificaciones proyecto 1364,1375,1334 elaboración y actualización Plan Anual de Adquisiciones vigencia 2019.","Inversión",45,"Gobernanza e influencia local, regional e internacional","Eje Transversal 4 Gobierno Legitimo, Fortalecimiento Local y Eficiencia",1375,51552857,"YASMINA GRACIELA ARAUJO RODRIGUEZ",88200000,null,0,null,null,88200000,77175000,"2019-01-16","2019-01-16","2020-01-15",360,null,null,null,"x",null,null,0.875,null,{"$f":"IF(SUMPRODUCT((A$14:A16=A16)*(B$14:B16=B16)*(C$14:C16=C16))>1,0,1)","v":1},"Contratos de prestación de servicios profesionales y de apoyo a la gestión","Contratación directa",{"$f":"IFERROR(VLOOKUP(F16,Tipo!$C$12:$C$27,1,FALSE),\"NO\")","v":"Prestación de servicios profesionales y de apoyo a la gestión, o para la ejecución de trabajos artísticos que sólo puedan encomendarse a determinadas personas naturales;"},"Inversión",45]
["CPS-004-2019",2019,"FDLS-CD-004-2019","Contratos de prestación de servicios profesionales y de apoyo a la gestión","Contratación directa","Prestación de servicios profesionales y de apoyo a la gestión, o para la ejecución de trabajos artísticos que sólo puedan encomendarse a determinadas personas naturales;","Prestar los servicios profesionales jurídicos para apoyar los asuntos legales y contractuales de la Alcaldía Local de Sumapaz de los proyectos de inversión 1379, 1356, 1382, 1377, 1375 y seguimiento Cuentas por Pagar y Actas de Liquidación.","Inversión",45,"Gobernanza e influencia local, regional e internacional","Eje Transversal 4 Gobierno Legitimo, Fortalecimiento Local y Eficiencia",1375,516577917,"MARTHA LUCIA SUAREZ MORALES",59220000,null,0,null,null,59220000,51653000,"2019-01-16","2019-01-17","2020-01-16",360,null,null,null,"x",null,null,0.87222222222222223,null,{"$f":"IF(SUMPRODUCT((A$14:A17=A17)*(B$14:B17=B17)*(C$14:C17=C17))>1,0,1)","v":1},"Contratos de prestación de servicios profesionales y de apoyo a la gestión","Contratación directa",{"$f":"IFERROR(VLOOKUP(F17,Tipo!$C$12:$C$27,1,FALSE),\"NO\")","v":"Prestación de servicios profesionales y de apoyo a la gestión, o para la ejecución de trabajos artísticos que sólo puedan encomendarse a determinadas personas naturales;"},"Inversión",45]
["CPS-005-2019",2019,"FDLS-CD-005-2019","Contratos de prestación de servicios profesionales y de apoyo a la gestión","Contratación directa","Prestación de servicios profesionales y de apoyo a la gestión, o para la ejecución de trabajos artísticos que sólo puedan encomendarse a determinadas personas naturales;","Prestar los servicios para operar el vehículo asignado, realizando de manera oportuna eficiente y segura los desplazamientos de los funcionarios del Fondo de Desarrollo Local del Sumapaz y/o demás personal que requiera ser trasladado en la zona urbana y rural de la localidad en cumplimiento de las actividades propias de la administración local.¿.","Inversión",45,"Gobernanza e influencia local, regional e internacional","Eje Transversal 4 Gobierno Legitimo, Fortalecimiento Local y Eficiencia",1375,80143954,"OSCAR FABIAN PINEDA CASTRO",28224000,null,0,1,14112000,42336000,24696000,"2019-01-16","2019-01-16","2020-07-15",360,180,null,null,"x",null,null,0.58333333333333337,null,{"$f":"IF(SUMPRODUCT((A$14:A18=A18)*(B$14:B18=B18)*(C$14:C18=C18))>1,0,1)","v":1},"Contratos de prestación de servicios profesionales y de apoyo a la gestión","Contratación directa",{"$f":"IFERROR(VLOOKUP(F18,Tipo!$C$12:$C$27,1,FALSE),\"NO\")","v":"Prestación de servicios profesionales y de apoyo a la gestión, o para la ejecución de trabajos artísticos que sólo puedan encomendarse a determinadas personas naturales;"},"Inversión",45]
["CPS-006-2019",2019,"FDLS-CD-006-2019","Contratos de prestación de servicios profesionales y de apoyo a la gestión","Contratación directa","Prestación de servicios profesionales y de apoyo a la gestión, o para la ejecución de trabajos artísticos que sólo puedan encomendarse a determinadas personas naturales;","Prestar los servicios profesionales jurídicos para apoyar los asuntos legales y contractuales de la Alcaldía Local de Sumapaz de los proyectos de inversión 1358, 1366, 1368, 1364 y 1375 y manejo y reporte de la información contractual y pagos al SIVICOF.","Inversión",45,"Gobernanza e influencia local, regional e internacional","Eje Transversal 4 Gobierno Legitimo, Fortalecimiento Local y Eficiencia",1375,1032375829,"KAREN DAYANA PATIÑO SAENZ",71820000,null,0,null,null,71820000,62443500,"2019-01-17","2019-01-18","2020-01-27",360,null,null,null,"x",null,null,0.86944444444444446,null,{"$f":"IF(SUMPRODUCT((A$14:A19=A19)*(B$14:B19=B19)*(C$14:C19=C19))>1,0,1)","v":1},{"$f":"IFERROR(VLOOKUP(D19,tipo,1,FALSE),\"NO\")","v":"Contratos de prestación de servicios profesionales y de apoyo a la gestión"},{"$f":"IFERROR(VLOOKUP(E19,modal,1,FALSE),\"NO\")","v":"Contratación directa"},{"$f":"IFERROR(VLOOKUP(F19,Tipo!$C$12:$C$27,1,FALSE),\"NO\")","v":"Prestación de servicios profesionales y de apoyo a la gestión, o para la ejecución de trabajos artísticos que sólo puedan encomendarse a determinadas personas naturales;"},{"$f":"IFERROR(VLOOKUP(H19,afectacion,1,FALSE),\"NO\")","v":"Inversión"},{"$f":"IFERROR(VLOOKUP(I19,programa,1,FALSE),\"NO\")","v":45}]
["CPS-007-2019",2019,"FDLS-CD-007-2019","Contratos de prestación de servicios profesionales y de apoyo a la gestión","Contratación directa","Prestación de servicios profesionales y de apoyo a la gestión, o para la ejecución de trabajos artísticos que sólo puedan encomendarse a determinadas personas naturales;","Prestar los servicios profesionales especializados al Despacho de la Alcaldesa Local en el seguimiento y coordinación a la formulación, evaluación y control de proyectos de inversión que componen los planes, programas y proyectos del Fondo de Desarrollo Local de Sumapaz.","Inversión",45,"Gobernanza e influencia local, regional e internacional","Eje Transversal 4 Gobierno Legitimo, Fortalecimiento Local y Eficiencia",1375,39624329,"VILMA AMPARO LOPEZ HERRERA",113280000,null,0,1,26746667,140026667,98490667,"2019-01-17","2019-01-18","2020-04-11",360,85,null,null,"x",null,null,0.70337078722297941,null,{"$f":"IF(SUMPRODUCT((A$14:A20=A20)*(B$14:B20=B20)*(C$14:C20=C20))>1,0,1)","v":1}]
{"$rows_left_out":416}
{"sheet":"Instructivo","index":1,"n_rows":90,"n_cols":4,"rows_kept":90,"cut":false,"hidden":false,"merged":[[1,1,1,3],[2,1,2,3],[4,1,4,3],[5,1,5,3],[6,1,6,3],[8,1,8,3],[9,1,9,3],[10,1,10,3],[3,1,3,3],[23,1,23,3],[12,1,12,3],[7,1,7,3],[63,1,63,3],[24,1,25,1],[24,2,25,2],[28,1,29,1],[28,2,29,2],[30,1,50,1],[32,2,33,2],[51,1,53,1],[51,2,53,2],[56,1,58,1],[57,2,58,2],[60,1,61,1],[87,1,87,3],[64,1,66,1],[64,2,66,2],[67,1,68,1],[67,2,68,2],[70,1,71,1],[70,2,71,2],[73,1,76,1],[73,2,76,2],[79,1,79,3],[80,1,81,1],[80,2,81,2]]}
[]
[null,"OBSERVACIONES INICIALES"]
[null,"Recomendamos leer cuidadosamente y poner en práctica las instrucciones que se explican en este instructivo. De la calidad de la información que se registre, depende en gran medida la calidad del informe de rendición de cuentas de la Gestión Contractual que presenta el Alcalde Mayor, consolidado por la Veeduría Distrital."]
[null,"La base en Excel a diligenciar es inmodificable, debe utilizar versión Excel 2010 o posteriores, la versión 2007 no habilita los macros.  La base no permite que se incluyan columnas con otro tipo de información que la Veeduría Distrital no está solicitando o que se cambie el formato de celda establecido. Tenga en cuenta que muchas celdas están bloqueadas y/o solo permiten el registro de una información determinada."]
[null,"La información que se registre en la base, debe coincidir con los reportes realizados en PREDIS y en el SECOP"]
[null,"Diligencie la totalidad de celdas."]
[null,"Para insertar una o varias filas, haga click  en el opción Insertar Filas y digite el número de filas a insertar. Si usted no sigue este procedimiento las filas que copie no tomaran el formato de las filas anteriores."]
[null,"Si requiere inserte una o varias filas realícelo despues de la fila A15 y antes de la fila de Totales para que tomen el formato de las filas anteriores."]
[null,"En primer lugar diligencie toda la información correspondiente a los contratos suscritos con cargo a la vigencia 2019."]
[null,"Una vez incluidos todos los contratos de la vigencia 2019, a continuación diligencie el formato completo con la información correspondiente a las adiciones efectuadas con cargo a la vigencia 2019 de contratos suscritos en vigencias anteriores. La información general del contrato como: modalidad de selección, tipología contractual, objeto, entre otros, debe corresponder a la información del contrato adicionado o modificado. Respecto al valor solo se diligencia el valor en la columna adiciòn, es decir la columna de valor inicial debe quedar en blanco. No olvide registrar el nùmero de adiciones realizadas, en la columna correspondiente."]
[null,"En caso de haber realizado apropiaciones presupuestales en la vigencia a través de resoluciones, caja menor, honorarios ediles, servicios públicos, debe relacionar dicha información en una sola fila al final de la base, indicando de que se trata la apropiación y número de proyecto si hay lugar a ello. En el tipo de contrato se registra Otros gastos."]
[]
[null,"ENCABEZADO DEL FORMATO"]
[null,1,"Entidad","Indique el nombre completo de la Entidad."]
[null,2,"Sector","Relacione el sector al cual pertenece la Entidad."]
[null,3,"Presupuesto Disponible Inversión Directa","Indique el valor total del presupuesto disponible de inversión directa, de acuerdo con el PREDIS, a 31 de diciembre de 2019."]
[null,4,"Presupuesto Comprometido de Inversión Directa ","Escriba el valor total del presupuesto comprometido de inversión directa, de acuerdo con el PREDIS a 31 de diciembre de 2019."]
[null,5,"Presupuesto Disponible Funcionamiento","Indique el valor total del presupuesto de funcionamiento disponible, de acuerdo con el PREDIS a 31 de diciembre de 2019."]
[null,6,"Presupuesto Comprometido funcionamiento ","Escriba el monto del presupuesto de funcionamiento, comprometido mediante contratos, de acuerdo con el PREDIS a 31 de diciembre de 2019."]
[null,7,"Presupuesto Disponible Operación","Coloque el monto del presupuesto de operación disponible, de acuerdo con el PREDIS, a 31 de diciembre de 2019. Los gastos de operación corresponden solamente a aquellas entidades de régimen de contratación  privado."]
{"$rows_left_out":71}
{"sheet":"Tipo","index":2,"n_rows":31,"n_cols":4,"rows_kept":31,"cut":false,"hidden":true,"merged":[]}
[null,"Tipo","Modalidad de Selección","afectacion"]
[1,"Obra pública","Concurso de méritos","Funcionamiento"]
[2,"Consultoría","Contratación directa","Inversión"]
[3,"Interventoría","Contratación mínima cuantia","Operación"]
[4,"Contratos de prestación de servicios","Selección abreviada"]
[5,"Contratos de prestación de servicios profesionales y de apoyo a la gestión","Licitación pública"]
[6,"Compraventa de bienes muebles","Régimen privado"]
[7,"Compraventa de bienes inmuebles","Régimen especial"]
[8,"Arrendamiento de bienes muebles"]
[9,"Arrendamiento de bienes inmuebles"]
[10,"Seguros","Selección abreviada"]
[11,"Suministro","Subasta inversa "]
[12,"Empréstitos","Bolsas de productos"]
[13,"Fiducia mercantil o encargo fiduciario","Acuerdo marco de precios "]
[14,"Concesión ","Selección abreviada por menor cuantía "]
[15,"Convenios de cooperacion"]
[16,"Contratos interadministrativos","contratacion directa"]
[17,"Convenios de apoyo y/o convenios de asociación ","Urgencia manifiesta"]
[18,"Asociaciones público privadas","Contratación de empréstitos"]
[19,"Otros","Contratos interadministrativos"]
{"$rows_left_out":12}
{"sheet":"Eje_Pilar","index":3,"n_rows":47,"n_cols":5,"rows_kept":47,"cut":false,"hidden":false,"merged":[]}
[]
[null,null,"Código","Programa - Bogotá Mejor para Todos","Pilar /Eje"]
[null,null,1,"Prevención y atención de la maternidad y la paternidad tempranas","Pilar 1 Igualdad de Calidad de Vida"]
[null,null,2,"Desarrollo integral desde la gestación hasta la adolescencia","Pilar 1 Igualdad de Calidad de Vida"]
[null,null,3,"Igualdad y autonomía para una Bogotá incluyente","Pilar 1 Igualdad de Calidad de Vida"]
[null,null,4,"Familias protegidas y adaptadas al cambio climático","Pilar 1 Igualdad de Calidad de Vida"]
[null,null,5,"Desarrollo integral para la felicidad y el ejercicio de la ciudadanía","Pilar 1 Igualdad de Calidad de Vida"]
[null,null,6,"Calidad educativa para todos","Pilar 1 Igualdad de Calidad de Vida"]
[null,null,7,"Inclusión educativa para la equidad","Pilar 1 Igualdad de Calidad de Vida"]
[null,null,8,"Acceso con calidad a la educación superior","Pilar 1 Igualdad de Calidad de Vida"]
[null,null,9,"Atención integral y eficiente en salud","Pilar 1 Igualdad de Calidad de Vida"]
[null,null,10,"Modernización de la infraestructura física y tecnológica en salud","Pilar 1 Igualdad de Calidad de Vida"]
[null,null,11,"Mejores oportunidades para el desarrollo a través de la cultura, la recreación y el deporte","Pilar 1 Igualdad de Calidad de Vida"]
[null,null,12,"Mujeres protagonistas, activas y empoderadas en el cierre de brechas de género","Pilar 1 Igualdad de Calidad de Vida"]
[null,null,13,"Infraestructura para el desarrollo del hábitat","Pilar 2 Democracía Urbana"]
[null,null,14,"Intervenciones integrales del hábitat","Pilar 2 Democracía Urbana"]
[null,null,15,"Recuperación, incorporación, vida urbana y control de la ilegalidad","Pilar 2 Democracía Urbana"]
[null,null,16,"Integración social para una ciudad de oportunidades","Pilar 2 Democracía Urbana"]
[null,null,17,"Espacio público, derecho de todos","Pilar 2 Democracía Urbana"]
[null,null,18,"Mejor movilidad para todos","Pilar 2 Democracía Urbana"]
{"$rows_left_out":27}