{"text_format":"1","workbook":"xlsx","n_sheets":4,"sheets":["Formato2019","Instructivo","Tipo","Eje_Pilar"],"not_rendered":{"charts":0,"images":1,"macros":1,"external_links":0,"defined_names":10,"comments":0,"pivot_tables":0},"unopened":[],"bounds":{"document_bytes":16777216,"sheet_cells":100000,"rows_first":2000,"rows_last":500,"rows_between":2000,"halvings":0,"cell_chars":16384,"cell_head_chars":4096},"cells_cut":0,"cells_raw":0,"read":"whole","date_system":"1900"}

{"sheet":"Formato2019","index":0,"n_rows":435,"n_cols":39,"rows_kept":435,"cut":false,"hidden":false,"merged":[[10,0,10,13],[10,14,10,20],[10,21,10,25],[10,26,10,30],[11,7,11,10],[11,12,11,13],[11,26,11,30],[5,22,5,31],[6,20,6,21],[6,22,6,31],[1,0,1,31],[2,0,2,31],[4,0,4,2],[4,8,4,9],[4,12,4,13],[4,20,4,31],[5,0,5,2],[5,8,5,9],[6,0,6,2],[6,8,6,9],[5,20,5,21],[7,20,7,21],[7,22,7,31],[8,20,8,21],[8,22,8,31],[9,20,9,21],[9,22,9,31],[7,0,7,13],[8,0,8,2],[8,4,8,6],[8,8,9,13],[9,0,9,2],[9,4,9,6]]}
[]
["VEEDURIA DISTRITAL - RENDICION DE CUENTAS DE LA GESTION CONTRACTUAL EN EL DISTRITO CAPITAL (Acuerdo 380 de 2009)"]
["INFORMACION GENERAL DE CONTRATACION ENTIDADES DISTRITALES  -  ENERO 1 A 31 DICIEMBRE DE 2019"]
[]
["1. Entidad:",null,null,"Alcaldía Local de Sumapaz",null,null,"2. Sector","Gobierno"]
["3. Presupuesto Disponible Inversión Directa PREDIS",null,null,34698468000,null,null,"5. Presupuesto Disponible Funcionamiento PREDIS",2730661047,null,null,null,null,null,null,null,null,null,null,null,null,"9. Nombre de quien diligencia el formato",null,"Manuel Alejandro Gómez Roa"]
["4. Presupuesto Comprometido de Inversión Directa según PREDIS ",null,null,33721525093,null,null,"6. Presupuesto Comprometido Funcionamiento según PREDIS",2523882823,null,null,null,null,null,null,null,null,null,null,null,null,"Cargo",null,"Contratista"]
[null,null,null,null,null,null,null,null,null,null,null,null,null,null,null,null,null,null,null,null,"Dependencia",null,"Planeación"]
["7. Presupuesto Disponible Operación (Regimen Privado)",null,null,null,null,null,null,null,null,null,null,null,null,null,null,null,null,null,null,null,"Teléfono",null,3105876283]
["8. Presupuesto Comprometido Operación mediante contratos",null,null,null,null,null,null,null,null,null,null,null,null,null,null,null,null,null,null,null,"Correo Electrónico",null,"manuel.gomez@gobiernobogota.gov.co"]
["1- INFORMACION GENERAL",null,null,null,null,null,null,null,null,null,null,null,null,null,"2- INFORMACION FINANCIERA",null,null,null,null,null,null,"3 - PLAZOS ",null,null,null,null,"4 - ESTADO ",null,null,null,null,"5. %  Avance y/o cumplimiento"]
[1,2,3,4,5,6,7,8,null,null,null,9,10,null,11,12,13,14,15,16,17,18,19,20,21,22,23,null,null,null,null,24]
["Número Contrato","Año","Número de proceso contractual","Tipo de contrato ","Modalidad de Selección","Procedimiento o causal","Objeto","Afectación","Número Programa","Equivalencia número de programa","Eje / Pilar","Número Proyecto","Número  de Identificación del contratista\n(NIT con digito de verificación)","Nombre del contratista","Valor Inicial del contrato","Número de reducciones","Valor total reducciones (En valor negativo)","Número de adiciones","Valor total de adiciones ","Valor Final ","Giros\n(Valor en pesos)","Fecha de suscripción (DD/MM/AAAA)","Fecha de inicio (DD/MM/AAAA)","Fecha de terminación (DD/MM/AAAA)","Plazo en días","Prorroga en días","Anulado","Celebrado o por iniciar","En Ejecución","Terminado","Liquidado","% Avance y/o Cumplimiento",null,"Total Contratos","Validación Tipo","Validación Modalidad","Validación procedimiento","Validación afectación","Validación programa"]
["CPS-001-2019",2019,"FDLS-CD-001-2019","Contratos de prestación de servicios profesionales y de apoyo a la gestión","Contratación directa","Prestación de servicios profesionales y de apoyo a la gestión, o para la ejecución de trabajos artísticos que sólo puedan encomendarse a determinadas personas naturales;","Prestar los servicios profesionales jurídicos para apoyar los asuntos legales y contractuales de la Alcaldía Local de Sumapaz de los proyectos de inversión 1331, 1340, 1349, 1353 y 1375, así como las declaratorias de incumplimiento y los demás asuntos que le sean designados.","Inversión",45,"Gobernanza e influencia local, regional e internacional","Eje Transversal 4 Gobierno Legitimo, Fortalecimiento Local y Eficiencia",1375,52900762,"JENNY CAROLINA GIRON CUERVO",59220000,null,0,null,null,{"$f":"O14+Q14+S14","v":59220000},50995000,"2019-01-15","2019-01-16","2020-01-20",360,null,null,null,"x",null,null,0.86111111111111116,null,{"$f":"IF(SUMPRODUCT((A$14:A14=A14)*(B$14:B14=B14)*(C$14:C14=C14))>1,0,1)","v":1},{"$f":"IFERROR(VLOOKUP(D14,tipo,1,FALSE),\"NO\")","v":"Contratos de prestación de servicios profesionales y de apoyo a la gestión"},{"$f":"IFERROR(VLOOKUP(E14,modal,1,FALSE),\"NO\")","v":"Contratación directa"},{"$f":"IFERROR(VLOOKUP(F14,Tipo!$C$12:$C$27,1,FALSE),\"NO\")","v":"Prestación de servicios profesionales y de apoyo a la gestión, o para la ejecución de trabajos artísticos que sólo puedan encomendarse a determinadas personas naturales;"},{"$f":"IFERROR(VLOOKUP(H14,afectacion,1,FALSE),\"NO\")","v":"Inversión"},{"$f":"IFERROR(VLOOKUP(I14,programa,1,FALSE),\"NO\")","v":45}]
["CPS-002-2019",2019,"FDLS-CD-002-2019","Contratos de prestación de servicios profesionales y de apoyo a la gestión","Contratación directa","Prestación de servicios profesionales y de apoyo a la gestión, o para la ejecución de trabajos artísticos que sólo puedan encomendarse a determinadas personas naturales;","Prestar sus servicios como técnico de apoyo administrativo a la gestión al Despacho de la Alcaldesa Local de Sumapaz.","Inversión",45,"Gobernanza e influencia local, regional e internacional","Eje Transversal 4 Gobierno Legitimo, Fortalecimiento Local y Eficiencia",1375,52603721,"SANDRA MILENA RODRIGUEZ SASTOQUE",48000000,null,0,1,8000000,{"$f":"O15+Q15+S15","v":56000000},42000000,"2019-01-15","2019-01-16","2020-03-15",360,60,null,null,"x",null,null,0.75,null,{"$f":"IF(SUMPRODUCT((A$14:A15=A15)*(B$14:B15=B15)*(C$14:C15=C15))>1,0,1)","v":1},"Contratos de prestación de servicios profesionales y de apoyo a la gestión","Contratación directa",{"$f":"IFERROR(VLOOKUP(F15,Tipo!$C$12:$C$27,1,FALSE),\"NO\")","v":"Prestación de servicios profesionales y de apoyo a la gestión, o para la ejecución de trabajos artísticos que sólo puedan encomendarse a determinadas personas naturales;"},"Inversión",45]
["CPS-003-2019",2019,"FDLS-CD-003-2018 (2019)","Contratos de prestación de servicios profesionales y de apoyo a la gestión","Contratación directa","Prestación de servicios profesionales y de apoyo a la gestión, o para la ejecución de trabajos artísticos que sólo puedan encomendarse a determinadas personas naturales;","Prestar los servicios profesionales especializados jurídicos en la revisión de todos los proyectos de inversión del Plan de Desarrollo Local 2017-2020 y elaboración de estudios previos, pliegos, evaluaciones y modificaciones proyecto 1364,1375,1334 elaboración y actualización Plan Anual de Adquisiciones vigencia 2019.","Inversión",45,"Gobernanza e influencia local, regional e internacional","Eje Transversal 4 Gobierno Legitimo, Fortalecimiento Local y Eficiencia",1375,51552857,"YASMINA GRACIELA ARAUJO RODRIGUEZ",88200000,null,0,null,null,88200000,77175000,"2019-01-16","2019-01-16","2020-01-15",360,null,null,null,"x",null,null,0.875,null,{"$f":"IF(SUMPRODUCT((A$14:A16=A16)*(B$14:B16=B16)*(C$14:C16=C16))>1,0,1)","v":1},"Contratos de prestación de servicios profesionales y de apoyo a la gestión","Contratación directa",{"$f":"IFERROR(VLOOKUP(F16,Tipo!$C$12:$C$27,1,FALSE),\"NO\")","v":"Prestación de servicios profesionales y de apoyo a la gestión, o para la ejecución de trabajos artísticos que sólo puedan encomendarse a determinadas personas naturales;"},"Inversión",45]
["CPS-004-2019",2019,"FDLS-CD-004-2019","Contratos de prestación de servicios profesionales y de apoyo a la gestión","Contratación directa","Prestación de servicios profesionales y de apoyo a la gestión, o para la ejecución de trabajos artísticos que sólo puedan encomendarse a determinadas personas naturales;","Prestar los servicios profesionales jurídicos para apoyar los asuntos legales y contractuales de la Alcaldía Local de Sumapaz de los proyectos de inversión 1379, 1356, 1382, 1377, 1375 y seguimiento Cuentas por Pagar y Actas de Liquidación.","Inversión",45,"Gobernanza e influencia local, regional e internacional","Eje Transversal 4 Gobierno Legitimo, Fortalecimiento Local y Eficiencia",1375,516577917,"MARTHA LUCIA SUAREZ MORALES",59220000,null,0,null,null,59220000,51653000,"2019-01-16","2019-01-17","2020-01-16",360,null,null,null,"x",null,null,0.87222222222222223,null,{"$f":"IF(SUMPRODUCT((A$14:A17=A17)*(B$14:B17=B17)*(C$14:C17=C17))>1,0,1)","v":1},"Contratos de prestación de servicios profesionales y de apoyo a la gestión","Contratación directa",{"$f":"IFERROR(VLOOKUP(F17,Tipo!$C$12:$C$27,1,FALSE),\"NO\")","v":"Prestación de servicios profesionales y de apoyo a la gestión, o para la ejecución de trabajos artísticos que sólo puedan encomendarse a determinadas personas naturales;"},"Inversión",45]
["CPS-005-2019",2019,"FDLS-CD-005-2019","Contratos de prestación de servicios profesionales y de apoyo a la gestión","Contratación directa","Prestación de servicios profesionales y de apoyo a la gestión, o para la ejecución de trabajos artísticos que sólo puedan encomendarse a determinadas personas naturales;","Prestar los servicios para operar el vehículo asignado, realizando de manera oportuna eficiente y segura los desplazamientos de los funcionarios del Fondo de Desarrollo Local del Sumapaz y/o demás personal que requiera ser trasladado en la zona urbana y rural de la localidad en cumplimiento de las actividades propias de la administración local.¿.","Inversión",45,"Gobernanza e influencia local, regional e internacional","Eje Transversal 4 Gobierno Legitimo, Fortalecimiento Local y Eficiencia",1375,80143954,"OSCAR FABIAN PINEDA CASTRO",28224000,null,0,1,14112000,42336000,24696000,"2019-01-16","2019-01-16","2020-07-15",360,180,null,null,"x",null,null,0.58333333333333337,null,{"$f":"IF(SUMPRODUCT((A$14:A18=A18)*(B$14:B18=B18)*(C$14:C18=C18))>1,0,1)","v":1},"Contratos de prestación de servicios profesionales y de apoyo a la gestión","Contratación directa",{"$f":"IFERROR(VLOOKUP(F18,Tipo!$C$12:$C$27,1,FALSE),\"NO\")","v":"Prestación de servicios profesionales y de apoyo a la gestión, o para la ejecución de trabajos artísticos que sólo puedan encomendarse a determinadas personas naturales;"},"Inversión",45]
["CPS-006-2019",2019,"FDLS-CD-006-2019","Contratos de prestación de servicios profesionales y de apoyo a la gestión","Contratación directa","Prestación de servicios profesionales y de apoyo a la gestión, o para la ejecución de trabajos artísticos que sólo puedan encomendarse a determinadas personas naturales;","Prestar los servicios profesionales jurídicos para apoyar los asuntos legales y contractuales de la Alcaldía Local de Sumapaz de los proyectos de inversión 1358, 1366, 1368, 1364 y 1375 y manejo y reporte de la información contractual y pagos al SIVICOF.","Inversión",45,"Gobernanza e influencia local, regional e internacional","Eje Transversal 4 Gobierno Legitimo, Fortalecimiento Local y Eficiencia",1375,1032375829,"KAREN DAYANA PATIÑO SAENZ",71820000,null,0,null,null,71820000,62443500,"2019-01-17","2019-01-18","2020-01-27",360,null,null,null,"x",null,null,0.86944444444444446,null,{"$f":"IF(SUMPRODUCT((A$14:A19=A19)*(B$14:B19=B19)*(C$14:C19=C19))>1,0,1)","v":1},{"$f":"IFERROR(VLOOKUP(D19,tipo,1,FALSE),\"NO\")","v":"Contratos de prestación de servicios profesionales y de apoyo a la gestión"},{"$f":"IFERROR(VLOOKUP(E19,modal,1,FALSE),\"NO\")","v":"Contratación directa"},{"$f":"IFERROR(VLOOKUP(F19,Tipo!$C$12:$C$27,1,FALSE),\"NO\")","v":"Prestación de servicios profesionales y de apoyo a la gestión, o para la ejecución de trabajos artísticos que sólo puedan encomendarse a determinadas personas naturales;"},{"$f":"IFERROR(VLOOKUP(H19,afectacion,1,FALSE),\"NO\")","v":"Inversión"},{"$f":"IFERROR(VLOOKUP(I19,programa,1,FALSE),\"NO\")","v":45}]
["CPS-007-2019",2019,"FDLS-CD-007-2019","Contratos de prestación de servicios profesionales y de apoyo a la gestión","Contratación directa","Prestación de servicios profesionales y de apoyo a la gestión, o para la ejecución de trabajos artísticos que sólo puedan encomendarse a determinadas personas naturales;","Prestar los servicios profesionales especializados al Despacho de la Alcaldesa Local en el seguimiento y coordinación a la formulación, evaluación y control de proyectos de inversión que componen los planes, programas y proyectos del Fondo de Desarrollo Local de Sumapaz.","Inversión",45,"Gobernanza e influencia local, regional e internacional","Eje Transversal 4 Gobierno Legitimo, Fortalecimiento Local y Eficiencia",1375,39624329,"VILMA AMPARO LOPEZ HERRERA",113280000,null,0,1,26746667,140026667,98490667,"2019-01-17","2019-01-18","2020-04-11",360,85,null,null,"x",null,null,0.70337078722297941,null,{"$f":"IF(SUMPRODUCT((A$14:A20=A20)*(B$14:B20=B20)*(C$14:C20=C20))>1,0,1)","v":1}]
["CPS-008-2019",2019,"FDLS-CD-008-2019","Contratos de prestación de servicios profesionales y de apoyo a la gestión","Contratación directa","Prestación de servicios profesionales y de apoyo a la gestión, o para la ejecución de trabajos artísticos que sólo puedan encomendarse a determinadas personas naturales;","Prestar los servicios para operar el vehículo asignado, realizando de manera oportuna eficiente y segura los desplazamientos de los funcionarios del Fondo de Desarrollo Local del Sumapaz y/o demás personal que requiera ser trasladado en la zona urbana y rural de la localidad en cumplimiento de las actividades propias de la administración local.¿.","Inversión",45,"Gobernanza e influencia local, regional e internacional","Eje Transversal 4 Gobierno Legitimo, Fortalecimiento Local y Eficiencia",1375,4090379,"CARLOS JULIO CRUZ AMAYA",28224000,null,0,null,null,28224000,24539200,"2019-01-18","2019-01-18","2020-01-17",360,null,null,null,"x",null,null,0.86944444444444446,null,{"$f":"IF(SUMPRODUCT((A$14:A21=A21)*(B$14:B21=B21)*(C$14:C21=C21))>1,0,1)","v":1}]
["CPS-009-2019",2019,"FDLS-CD-009-2019","Contratos de prestación de servicios profesionales y de apoyo a la gestión","Contratación directa","Prestación de servicios profesionales y de apoyo a la gestión, o para la ejecución de trabajos artísticos que sólo puedan encomendarse a determinadas personas naturales;","Prestar los servicios profesionales para realizar formulación, evaluación, seguimiento y control de proyectos de inversión y seguimiento de los planes, programas y proyectos del Fondo de Desarrollo Local de Sumapaz que le sean designados.","Inversión",11,"Mejores oportunidades para el desarrollo a través de la cultura, la recreación y el deporte","Pilar 1 Igualdad de Calidad de Vida",1353,53165749,"ROCIO DEL PILAR BECERRA FARIETA",66000000,null,0,1,22000000,88000000,56650000,"2019-01-17","2019-01-18","2020-05-17",360,120,null,null,"x",null,null,0.64375000000000004,null,{"$f":"IF(SUMPRODUCT((A$14:A22=A22)*(B$14:B22=B22)*(C$14:C22=C22))>1,0,1)","v":1},"Contratos de prestación de servicios profesionales y de apoyo a la gestión","Contratación directa",{"$f":"IFERROR(VLOOKUP(F22,Tipo!$C$12:$C$27,1,FALSE),\"NO\")","v":"Prestación de servicios profesionales y de apoyo a la gestión, o para la ejecución de trabajos artísticos que sólo puedan encomendarse a determinadas personas naturales;"},"Inversión",11]
["CPS-010-2019",2019,"FDLS-CD-010-2019","Contratos de prestación de servicios profesionales y de apoyo a la gestión","Contratación directa","Prestación de servicios profesionales y de apoyo a la gestión, o para la ejecución de trabajos artísticos que sólo puedan encomendarse a determinadas personas naturales;","Prestar los servicios para operar el vehículo asignado, realizando de manera oportuna eficiente y segura los desplazamientos de los funcionarios del Fondo de Desarrollo Local del Sumapaz y/o demás personal que requiera ser trasladado en la zona urbana y rural de la localidad en cumplimiento de las actividades propias de la administración local.¿.","Inversión",45,"Gobernanza e influencia local, regional e internacional","Eje Transversal 4 Gobierno Legitimo, Fortalecimiento Local y Eficiencia",1375,79763739,"WILLIAN FERNANDO PORRAS LOPEZ",28224000,null,0,null,null,28224000,24539200,"2019-01-18","2019-01-18","2020-01-17",360,null,null,null,"x",null,null,0.86944444444444446,null,{"$f":"IF(SUMPRODUCT((A$14:A23=A23)*(B$14:B23=B23)*(C$14:C23=C23))>1,0,1)","v":1},"Contratos de prestación de servicios profesionales y de apoyo a la gestión","Contratación directa",{"$f":"IFERROR(VLOOKUP(F23,Tipo!$C$12:$C$27,1,FALSE),\"NO\")","v":"Prestación de servicios profesionales y de apoyo a la gestión, o para la ejecución de trabajos artísticos que sólo puedan encomendarse a determinadas personas naturales;"},"Inversión",45]
["CPS-011-2019",2019,"FDLS-CD-011-2019","Contratos de prestación de servicios profesionales y de apoyo a la gestión","Contratación directa","Prestación de servicios profesionales y de apoyo a la gestión, o para la ejecución de trabajos artísticos que sólo puedan encomendarse a determinadas personas naturales;","Prestar los servicios para operar el vehículo asignado, realizando de manera oportuna eficiente y segura los desplazamientos delos funcionarios del Fondo de Desarrollo Local del Sumapaz y/o demás personal que requiera ser trasladado en la zona urbana y rural de lalocalidad en cumplimiento de las actividades propias de la administración local","Inversión",45,"Gobernanza e influencia local, regional e internacional","Eje Transversal 4 Gobierno Legitimo, Fortalecimiento Local y Eficiencia",1375,79816851,"WILLIAM EDUARDO MICAN VASQUEZ",28224000,null,0,null,null,28224000,24539200,"2019-01-17","2019-01-18","2020-01-17",360,null,null,null,"x",null,null,0.86944444444444446,null,{"$f":"IF(SUMPRODUCT((A$14:A24=A24)*(B$14:B24=B24)*(C$14:C24=C24))>1,0,1)","v":1},"Contratos de prestación de servicios profesionales y de apoyo a la gestión","Contratación directa",{"$f":"IFERROR(VLOOKUP(F24,Tipo!$C$12:$C$27,1,FALSE),\"NO\")","v":"Prestación de servicios profesionales y de apoyo a la gestión, o para la ejecución de trabajos artísticos que sólo puedan encomendarse a determinadas personas naturales;"},"Inversión",45]
["CPS-013-2019",2019,"FDLS-CD-013-2019","Contratos de prestación de servicios profesionales y de apoyo a la gestión","Contratación directa","Prestación de servicios profesionales y de apoyo a la gestión, o para la ejecución de trabajos artísticos que sólo puedan encomendarse a determinadas personas naturales;","Prestar los servicios profesionales para la operación, prestación, seguimiento y cumplimiento de los procedimientos administrativos, operativos y programáticos del servicio social Apoyo Económico Tipo C, que contribuyan a la garantía de los derechos de la población mayor en el marco de la Política Pública Social para el Envejecimiento y la Vejez en el Distrito Capital a cargo de la Alcaldía Local de Sumapaz.","Inversión",3,"Igualdad y autonomía para una Bogotá incluyente","Pilar 1 Igualdad de Calidad de Vida",1334,49798425,"MARIA HILDA LIÑAN OLMEDO",62988000,null,0,null,null,62988000,52839933,"2019-01-22","2019-01-23","2020-01-28",360,null,null,null,"x",null,null,0.83888888359687563,null,{"$f":"IF(SUMPRODUCT((A$14:A25=A25)*(B$14:B25=B25)*(C$14:C25=C25))>1,0,1)","v":1},"Contratos de prestación de servicios profesionales y de apoyo a la gestión","Contratación directa",{"$f":"IFERROR(VLOOKUP(F25,Tipo!$C$12:$C$27,1,FALSE),\"NO\")","v":"Prestación de servicios profesionales y de apoyo a la gestión, o para la ejecución de trabajos artísticos que sólo puedan encomendarse a determinadas personas naturales;"},"Inversión",3]
["CPS-014-2019",2019,"FDLS-CD-014-2019","Contratos de prestación de servicios profesionales y de apoyo a la gestión","Contratación directa","Prestación de servicios profesionales y de apoyo a la gestión, o para la ejecución de trabajos artísticos que sólo puedan encomendarse a determinadas personas naturales;","Prestar sus servicios técnicos de apoyo administrativo al área de Gestión de Desarrollo Local de la Alcaldía Local de Sumapaz.","Inversión",18,"Mejor movilidad para todos","Pilar 2 Democracía Urbana",1364,52558577,"GLORIA ISABEL AGUILERA ACOSTA",31500000,null,0,null,null,31500000,27037500,"2019-01-18","2019-01-22","2020-01-21",360,null,null,null,"x",null,null,0.85833333333333328,null,{"$f":"IF(SUMPRODUCT((A$14:A26=A26)*(B$14:B26=B26)*(C$14:C26=C26))>1,0,1)","v":1},"Contratos de prestación de servicios profesionales y de apoyo a la gestión","Contratación directa",{"$f":"IFERROR(VLOOKUP(F26,Tipo!$C$12:$C$27,1,FALSE),\"NO\")","v":"Prestación de servicios profesionales y de apoyo a la gestión, o para la ejecución de trabajos artísticos que sólo puedan encomendarse a determinadas personas naturales;"},"Inversión",18]
["CPS-015-2019",2019,"FDLS-CD-015-2019","Contratos de prestación de servicios profesionales y de apoyo a la gestión","Contratación directa","Prestación de servicios profesionales y de apoyo a la gestión, o para la ejecución de trabajos artísticos que sólo puedan encomendarse a determinadas personas naturales;","Prestar sus servicios técnicos de apoyo al Área Gestión de Desarrollo Local en los proyectos y procesos relacionados con el mantenimiento y operatividad del parque automotor de propiedad del FDLS y del que llegare a ser responsable.","Inversión",18,"Mejor movilidad para todos","Pilar 2 Democracía Urbana",1364,1032445235,"ANDRES FERNELLY ANGEL RINCON",31500000,null,0,null,null,31500000,27125000,"2019-01-18","2019-01-21","2020-01-20",360,null,null,null,"x",null,null,0.86111111111111116,null,{"$f":"IF(SUMPRODUCT((A$14:A27=A27)*(B$14:B27=B27)*(C$14:C27=C27))>1,0,1)","v":1},"Contratos de prestación de servicios profesionales y de apoyo a la gestión","Contratación directa",{"$f":"IFERROR(VLOOKUP(F27,Tipo!$C$12:$C$27,1,FALSE),\"NO\")","v":"Prestación de servicios profesionales y de apoyo a la gestión, o para la ejecución de trabajos artísticos que sólo puedan encomendarse a determinadas personas naturales;"},"Inversión",18]
["CPS-016-2019",2019,"FDLS-CD-016-2019","Contratos de prestación de servicios profesionales y de apoyo a la gestión","Contratación directa","Prestación de servicios profesionales y de apoyo a la gestión, o para la ejecución de trabajos artísticos que sólo puedan encomendarse a determinadas personas naturales;","Prestar los servicios profesionales para la formulación, evaluación, seguimiento y control del proyecto de inversión ¿Mejores condiciones para el acceso al agua potable¿, entre otros proyectos de inversión.","Inversión",41,"Desarrollo rural sostenible","Eje Transversal 3 Sostenibilidad Ambiental basada en la eficiencia energética",1356,1012370432,"WILDER  CENTENO BELTRAN",59220000,null,0,null,null,59220000,50830500,"2019-01-18","2019-01-22","2020-01-21",360,null,null,null,"x",null,null,0.85833333333333328,null,{"$f":"IF(SUMPRODUCT((A$14:A28=A28)*(B$14:B28=B28)*(C$14:C28=C28))>1,0,1)","v":1},"Contratos de prestación de servicios profesionales y de apoyo a la gestión","Contratación directa",{"$f":"IFERROR(VLOOKUP(F28,Tipo!$C$12:$C$27,1,FALSE),\"NO\")","v":"Prestación de servicios profesionales y de apoyo a la gestión, o para la ejecución de trabajos artísticos que sólo puedan encomendarse a determinadas personas naturales;"},"Inversión",41]
["CPS-017-2019",2019,"FDLS-CD-017-2019","Contratos de prestación de servicios profesionales y de apoyo a la gestión","Contratación directa","Prestación de servicios profesionales y de apoyo a la gestión, o para la ejecución de trabajos artísticos que sólo puedan encomendarse a determinadas personas naturales;","prestar los servicios para operar el vehículo asignado, realizando de manera oportuna eficiente y segura los desplazamientos de los funcionarios del Fondo de Desarrollo Local del Sumapaz y/o demás personal que requiera ser trasladado en la zona urbana y rural de la localidad en cumplimiento de las actividades propias de la administración local.","Inversión",45,"Gobernanza e influencia local, regional e internacional","Eje Transversal 4 Gobierno Legitimo, Fortalecimiento Local y Eficiencia",1375,1022972630,"DIYER GERARDO PRIETO HURTADO",28224000,null,0,null,null,28224000,24147200,"2019-01-22","2019-01-23","2020-01-22",360,null,null,null,"x",null,null,0.85555555555555551,null,{"$f":"IF(SUMPRODUCT((A$14:A29=A29)*(B$14:B29=B29)*(C$14:C29=C29))>1,0,1)","v":1},"Contratos de prestación de servicios profesionales y de apoyo a la gestión","Contratación directa",{"$f":"IFERROR(VLOOKUP(F29,Tipo!$C$12:$C$27,1,FALSE),\"NO\")","v":"Prestación de servicios profesionales y de apoyo a la gestión, o para la ejecución de trabajos artísticos que sólo puedan encomendarse a determinadas personas naturales;"},"Inversión",45]
["CPS-018-2019",2019,"FDLS-CD-018-2019","Contratos de prestación de servicios profesionales y de apoyo a la gestión","Contratación directa","Prestación de servicios profesionales y de apoyo a la gestión, o para la ejecución de trabajos artísticos que sólo puedan encomendarse a determinadas personas naturales;","Prestar los servicios profesionales para realizar la formulación, evaluación, seguimiento y control de proyectos de inversión y seguimiento de los planes, programas y proyectos del Fondo de Desarrollo Local de Sumapaz.","Inversión",45,"Gobernanza e influencia local, regional e internacional","Eje Transversal 4 Gobierno Legitimo, Fortalecimiento Local y Eficiencia",1375,1054800504,"JEISSON IVAN SANCHEZ CORTES",39480000,null,0,1,19740000,59220000,50008000,"2019-01-22","2019-01-23","2020-01-26",240,120,null,null,"x",null,null,0.84444444444444444,null,{"$f":"IF(SUMPRODUCT((A$14:A30=A30)*(B$14:B30=B30)*(C$14:C30=C30))>1,0,1)","v":1},"Contratos de prestación de servicios profesionales y de apoyo a la gestión","Contratación directa",{"$f":"IFERROR(VLOOKUP(F30,Tipo!$C$12:$C$27,1,FALSE),\"NO\")","v":"Prestación de servicios profesionales y de apoyo a la gestión, o para la ejecución de trabajos artísticos que sólo puedan encomendarse a determinadas personas naturales;"},"Inversión",45]
["CPS-019-2019",2019,"FDLS-CD-019-2019","Contratos de prestación de servicios profesionales y de apoyo a la gestión","Contratación directa","Prestación de servicios profesionales y de apoyo a la gestión, o para la ejecución de trabajos artísticos que sólo puedan encomendarse a determinadas personas naturales;","Prestar sus servicios como Técnico de apoyo administrativo al área de Gestión de Desarrollo Local de la Alcaldía Local de Sumapaz.","Inversión",45,"Gobernanza e influencia local, regional e internacional","Eje Transversal 4 Gobierno Legitimo, Fortalecimiento Local y Eficiencia",1375,52524470,"MARCELA  TORRES RAMIREZ",34800000,null,0,null,null,34800000,29773333,"2019-01-18","2019-01-23","2020-01-22",360,null,null,null,"x",null,null,0.85555554597701144,null,{"$f":"IF(SUMPRODUCT((A$14:A31=A31)*(B$14:B31=B31)*(C$14:C31=C31))>1,0,1)","v":1},"Contratos de prestación de servicios profesionales y de apoyo a la gestión","Contratación directa",{"$f":"IFERROR(VLOOKUP(F31,Tipo!$C$12:$C$27,1,FALSE),\"NO\")","v":"Prestación de servicios profesionales y de apoyo a la gestión, o para la ejecución de trabajos artísticos que sólo puedan encomendarse a determinadas personas naturales;"},"Inversión",45]
["CPS-020-2019",2019,"FDLS-CD-020-2019","Contratos de prestación de servicios profesionales y de apoyo a la gestión","Contratación directa","Prestación de servicios profesionales y de apoyo a la gestión, o para la ejecución de trabajos artísticos que sólo puedan encomendarse a determinadas personas naturales;","Prestar sus servicios profesionales al Área Gestión de Desarrollo Local en los proyectos y procesos relacionados con el mantenimiento y operatividad del parque automotor de propiedad del FDLS y del que llegare a ser responsable.","Inversión",18,"Mejor movilidad para todos","Pilar 2 Democracía Urbana",1364,80101544,"Joan  Londoño Guerrero",59220000,null,0,null,null,59220000,50666000,"2019-01-22","2019-01-23","2020-01-22",360,null,null,null,"x",null,null,0.85555555555555551,null,{"$f":"IF(SUMPRODUCT((A$14:A32=A32)*(B$14:B32=B32)*(C$14:C32=C32))>1,0,1)","v":1},"Contratos de prestación de servicios profesionales y de apoyo a la gestión","Contratación directa",{"$f":"IFERROR(VLOOKUP(F32,Tipo!$C$12:$C$27,1,FALSE),\"NO\")","v":"Prestación de servicios profesionales y de apoyo a la gestión, o para la ejecución de trabajos artísticos que sólo puedan encomendarse a determinadas personas naturales;"},"Inversión",18]
["CPS-021-2019",2019,"FDLS-CD-021-2019","Contratos de prestación de servicios profesionales y de apoyo a la gestión","Contratación directa","Prestación de servicios profesionales y de apoyo a la gestión, o para la ejecución de trabajos artísticos que sólo puedan encomendarse a determinadas personas naturales;","Prestar los servicios profesionales para realizar la formulación, evaluación, seguimiento y control de proyectos de inversión y seguimiento de los planes, programas y proyectos del Fondo de Desarrollo Local de Sumapaz.","Inversión",45,"Gobernanza e influencia local, regional e internacional","Eje Transversal 4 Gobierno Legitimo, Fortalecimiento Local y Eficiencia",1375,80158088,"LUIS EDUARDO PERICO ROJAS",62988000,null,0,null,null,62988000,54064700,"2019-01-18","2019-01-18","2020-01-21",360,null,null,null,"x",null,null,0.85833333333333328,null,{"$f":"IF(SUMPRODUCT((A$14:A33=A33)*(B$14:B33=B33)*(C$14:C33=C33))>1,0,1)","v":1},"Contratos de prestación de servicios profesionales y de apoyo a la gestión","Contratación directa",{"$f":"IFERROR(VLOOKUP(F33,Tipo!$C$12:$C$27,1,FALSE),\"NO\")","v":"Prestación de servicios profesionales y de apoyo a la gestión, o para la ejecución de trabajos artísticos que sólo puedan encomendarse a determinadas personas naturales;"},"Inversión",45]
["CPS-022-2019",2019,"FDLS-CD-022-2018 (2019)","Contratos de prestación de servicios profesionales y de apoyo a la gestión","Contratación directa","Prestación de servicios profesionales y de apoyo a la gestión, o para la ejecución de trabajos artísticos que sólo puedan encomendarse a determinadas personas naturales;","Prestar los servicios profesionales jurídicos para realizar el seguimiento a todos los procesos contractuales proyectos de inversión del Fondo de Desarrollo Local de Sumapaz en el marco del Plan de Desarrollo Local 2017-2020.","Inversión",45,"Gobernanza e influencia local, regional e internacional","Eje Transversal 4 Gobierno Legitimo, Fortalecimiento Local y Eficiencia",1375,1015408533,"MARCO TULIO ARIAS GOMEZ",73080000,null,0,null,null,73080000,62930000,"2019-01-18","2019-01-21","2020-01-20",360,null,null,null,"x",null,null,0.86111111111111116,null,{"$f":"IF(SUMPRODUCT((A$14:A34=A34)*(B$14:B34=B34)*(C$14:C34=C34))>1,0,1)","v":1},"Contratos de prestación de servicios profesionales y de apoyo a la gestión","Contratación directa",{"$f":"IFERROR(VLOOKUP(F34,Tipo!$C$12:$C$27,1,FALSE),\"NO\")","v":"Prestación de servicios profesionales y de apoyo a la gestión, o para la ejecución de trabajos artísticos que sólo puedan encomendarse a determinadas personas naturales;"},"Inversión",45]
["CPS-023-2019",2019,"FDLS-CD-023-2019","Contratos de prestación de servicios profesionales y de apoyo a la gestión","Contratación directa","Prestación de servicios profesionales y de apoyo a la gestión, o para la ejecución de trabajos artísticos que sólo puedan encomendarse a determinadas personas naturales;","Apoyar la formulación, ejecución, seguimiento y mejora continua de las herramientas que conforman la Gestión Ambiental Institucional de la Alcaldía Local.","Inversión",45,"Gobernanza e influencia local, regional e internacional","Eje Transversal 4 Gobierno Legitimo, Fortalecimiento Local y Eficiencia",1375,52351073,"SANDRA MILENA CORTES PINEDA",62988000,null,0,1,6123833,69111833,54764567,"2019-01-18","2019-01-18","2020-01-17",360,null,null,null,"x",null,null,0.79240507193608944,null,{"$f":"IF(SUMPRODUCT((A$14:A35=A35)*(B$14:B35=B35)*(C$14:C35=C35))>1,0,1)","v":1},"Contratos de prestación de servicios profesionales y de apoyo a la gestión","Contratación directa",{"$f":"IFERROR(VLOOKUP(F35,Tipo!$C$12:$C$27,1,FALSE),\"NO\")","v":"Prestación de servicios profesionales y de apoyo a la gestión, o para la ejecución de trabajos artísticos que sólo puedan encomendarse a determinadas personas naturales;"},"Inversión",45]
["CPS-024-2019",2019,"FDLS-CD-024-2019","Contratos de prestación de servicios profesionales y de apoyo a la gestión","Contratación directa","Prestación de servicios profesionales y de apoyo a la gestión, o para la ejecución de trabajos artísticos que sólo puedan encomendarse a determinadas personas naturales;","Prestar los servicios profesionales al Área de Gestión de Desarrollo Local para realiza la formulación, seguimiento a los diferentes procesos relacionados con la infraestructura de la localidad de Sumapaz.","Inversión",18,"Mejor movilidad para todos","Pilar 2 Democracía Urbana",1364,12194109,"Fredy  Silva Vargas",81264000,null,0,1,20316000,101580000,69751600,"2019-01-21","2019-01-22","2020-04-21",360,90,null,null,"x",null,null,0.68666666666666665,null,{"$f":"IF(SUMPRODUCT((A$14:A36=A36)*(B$14:B36=B36)*(C$14:C36=C36))>1,0,1)","v":1},{"$f":"IFERROR(VLOOKUP(D36,tipo,1,FALSE),\"NO\")","v":"Contratos de prestación de servicios profesionales y de apoyo a la gestión"},{"$f":"IFERROR(VLOOKUP(E36,modal,1,FALSE),\"NO\")","v":"Contratación directa"},{"$f":"IFERROR(VLOOKUP(F36,Tipo!$C$12:$C$27,1,FALSE),\"NO\")","v":"Prestación de servicios profesionales y de apoyo a la gestión, o para la ejecución de trabajos artísticos que sólo puedan encomendarse a determinadas personas naturales;"},{"$f":"IFERROR(VLOOKUP(H36,afectacion,1,FALSE),\"NO\")","v":"Inversión"},{"$f":"IFERROR(VLOOKUP(I36,programa,1,FALSE),\"NO\")","v":18}]
["CPS-025-2019",2019,"FDLS-CD-025-2019","Contratos de prestación de servicios profesionales y de apoyo a la gestión","Contratación directa","Prestación de servicios profesionales y de apoyo a la gestión, o para la ejecución de trabajos artísticos que sólo puedan encomendarse a determinadas personas naturales;","Prestar los servicios profesionales como abogado para apoyar el área de Gestión Policiva Jurídica de la Alcaldía Local de Sumapaz.","Inversión",45,"Gobernanza e influencia local, regional e internacional","Eje Transversal 4 Gobierno Legitimo, Fortalecimiento Local y Eficiencia",1375,39786465,"ADRIANA MARIA ARIAS BUITRAGO",60480000,null,0,null,null,60480000,51744000,"2019-01-22","2019-01-23","2020-01-22",360,null,null,null,"x",null,null,0.85555555555555551,null,{"$f":"IF(SUMPRODUCT((A$14:A37=A37)*(B$14:B37=B37)*(C$14:C37=C37))>1,0,1)","v":1},"Contratos de prestación de servicios profesionales y de apoyo a la gestión","Contratación directa",{"$f":"IFERROR(VLOOKUP(F37,Tipo!$C$12:$C$27,1,FALSE),\"NO\")","v":"Prestación de servicios profesionales y de apoyo a la gestión, o para la ejecución de trabajos artísticos que sólo puedan encomendarse a determinadas personas naturales;"},"Inversión",45]
["CPS-026-2019",2019,"FDLS-CD-026-2019","Contratos de prestación de servicios profesionales y de apoyo a la gestión","Contratación directa","Prestación de servicios profesionales y de apoyo a la gestión, o para la ejecución de trabajos artísticos que sólo puedan encomendarse a determinadas personas naturales;","Prestar sus servicios de apoyo administrativo al área de Gestión de Desarrollo  Local para el área del CDI de la  Alcaldía Local de Sumapaz.","Inversión",45,"Gobernanza e influencia local, regional e internacional","Eje Transversal 4 Gobierno Legitimo, Fortalecimiento Local y Eficiencia",1375,91071340,"NELSON  GONZALEZ CASTILLO",28476000,null,0,null,null,28476000,23888200,"2019-01-23","2019-01-25","2020-02-02",360,null,null,null,"x",null,null,0.83888888888888891,null,{"$f":"IF(SUMPRODUCT((A$14:A38=A38)*(B$14:B38=B38)*(C$14:C38=C38))>1,0,1)","v":1},{"$f":"IFERROR(VLOOKUP(D38,tipo,1,FALSE),\"NO\")","v":"Contratos de prestación de servicios profesionales y de apoyo a la gestión"},{"$f":"IFERROR(VLOOKUP(E38,modal,1,FALSE),\"NO\")","v":"Contratación directa"},{"$f":"IFERROR(VLOOKUP(F38,Tipo!$C$12:$C$27,1,FALSE),\"NO\")","v":"Prestación de servicios profesionales y de apoyo a la gestión, o para la ejecución de trabajos artísticos que sólo puedan encomendarse a determinadas personas naturales;"},{"$f":"IFERROR(VLOOKUP(H38,afectacion,1,FALSE),\"NO\")","v":"Inversión"},{"$f":"IFERROR(VLOOKUP(I38,programa,1,FALSE),\"NO\")","v":45}]
["CPS-027-2019",2019,"FDLS-CD-027-2019","Contratos de prestación de servicios profesionales y de apoyo a la gestión","Contratación directa","Prestación de servicios profesionales y de apoyo a la gestión, o para la ejecución de trabajos artísticos que sólo puedan encomendarse a determinadas personas naturales;","Prestación de servicios de apoyo para el área de Gestión de Desarrollo Local realizando actividades logisticas y operativas atendiendo los lineamientos de las diferentes áreas de la administración local en los bienes de propiedad del Fondo de Desarrollo Local  y/o de la Alcaldía Local de Sumapaz.","Inversión",45,"Gobernanza e influencia local, regional e internacional","Eje Transversal 4 Gobierno Legitimo, Fortalecimiento Local y Eficiencia",1375,79358856,"LEOPOLDO  MARTINEZ MARTINEZ",27720000,null,0,null,null,27720000,23639000,"2019-01-23","2019-01-24","2020-01-23",360,null,null,null,"x",null,null,0.85277777777777775,null,{"$f":"IF(SUMPRODUCT((A$14:A39=A39)*(B$14:B39=B39)*(C$14:C39=C39))>1,0,1)","v":1},"Contratos de prestación de servicios profesionales y de apoyo a la gestión","Contratación directa",{"$f":"IFERROR(VLOOKUP(F39,Tipo!$C$12:$C$27,1,FALSE),\"NO\")","v":"Prestación de servicios profesionales y de apoyo a la gestión, o para la ejecución de trabajos artísticos que sólo puedan encomendarse a determinadas personas naturales;"},"Inversión",45]
["CPS-028-2019",2019,"FDLS-CD-028-2019","Contratos de prestación de servicios profesionales y de apoyo a la gestión","Contratación directa","Prestación de servicios profesionales y de apoyo a la gestión, o para la ejecución de trabajos artísticos que sólo puedan encomendarse a determinadas personas naturales;","Prestar los servicios como Técnico administrativo al servicio de la Junta Administradora Local de Sumapaz.","Inversión",45,"Gobernanza e influencia local, regional e internacional","Eje Transversal 4 Gobierno Legitimo, Fortalecimiento Local y Eficiencia",1375,52231511,"CARLA NIAMED LOZANO TAUTIVA",33384000,null,0,null,null,33384000,28469133,"2019-01-24","2019-01-24","2020-01-23",360,null,null,null,"x",null,null,0.85277776779295467,null,{"$f":"IF(SUMPRODUCT((A$14:A40=A40)*(B$14:B40=B40)*(C$14:C40=C40))>1,0,1)","v":1},"Contratos de prestación de servicios profesionales y de apoyo a la gestión","Contratación directa",{"$f":"IFERROR(VLOOKUP(F40,Tipo!$C$12:$C$27,1,FALSE),\"NO\")","v":"Prestación de servicios profesionales y de apoyo a la gestión, o para la ejecución de trabajos artísticos que sólo puedan encomendarse a determinadas personas naturales;"},"Inversión",45]
["CPS -029-2019",2019,"FDLS-CD-029-2019","Contratos de prestación de servicios profesionales y de apoyo a la gestión","Contratación directa","Prestación de servicios profesionales y de apoyo a la gestión, o para la ejecución de trabajos artísticos que sólo puedan encomendarse a determinadas personas naturales;","Prestar los servicios para operar el vehículo asignado, realizando de manera oportuna eficiente y segura los desplazamientos de los funcionarios del Fondo de Desarrollo Local del Sumapaz y/o demás personal que requiera ser trasladado en la zona urbana y rural de la localidad en cumplimiento de las actividades propias de la administración local.","Inversión",45,"Gobernanza e influencia local, regional e internacional","Eje Transversal 4 Gobierno Legitimo, Fortalecimiento Local y Eficiencia",1375,19271225,"MAXIMILIANO  LOPEZ SUAREZ",28224000,null,0,null,null,28224000,24147200,"2019-01-22","2019-01-23","2020-01-22",360,null,null,null,"x",null,null,0.85555555555555551,null,{"$f":"IF(SUMPRODUCT((A$14:A41=A41)*(B$14:B41=B41)*(C$14:C41=C41))>1,0,1)","v":1},"Contratos de prestación de servicios profesionales y de apoyo a la gestión","Contratación directa",{"$f":"IFERROR(VLOOKUP(F41,Tipo!$C$12:$C$27,1,FALSE),\"NO\")","v":"Prestación de servicios profesionales y de apoyo a la gestión, o para la ejecución de trabajos artísticos que sólo puedan encomendarse a determinadas personas naturales;"},"Inversión",45]
["CPS-030-2019",2019,"FDLS-CD-030-2019","Contratos de prestación de servicios profesionales y de apoyo a la gestión","Contratación directa","Prestación de servicios profesionales y de apoyo a la gestión, o para la ejecución de trabajos artísticos que sólo puedan encomendarse a determinadas personas naturales;","Apoyar al equipo de prensa y comunicaciones de la Alcaldía Local en la realización de productos y piezas digitales, impresas y publicitarias de gran formato y de animación gráfica, así como apoyar la producción y montaje de eventos.","Inversión",45,"Gobernanza e influencia local, regional e internacional","Eje Transversal 4 Gobierno Legitimo, Fortalecimiento Local y Eficiencia",1375,53141166,"DIANA CAROLINA CALDERON ROMERO",59220000,null,0,null,null,59220000,50666000,"2019-01-22","2019-01-23","2020-01-22",360,null,null,null,"x",null,null,0.85555555555555551,null,{"$f":"IF(SUMPRODUCT((A$14:A42=A42)*(B$14:B42=B42)*(C$14:C42=C42))>1,0,1)","v":1},"Contratos de prestación de servicios profesionales y de apoyo a la gestión","Contratación directa",{"$f":"IFERROR(VLOOKUP(F42,Tipo!$C$12:$C$27,1,FALSE),\"NO\")","v":"Prestación de servicios profesionales y de apoyo a la gestión, o para la ejecución de trabajos artísticos que sólo puedan encomendarse a determinadas personas naturales;"},"Inversión",45]
["CPS-031-2019",2019,"FDLS-CD-031-2019","Contratos de prestación de servicios profesionales y de apoyo a la gestión","Contratación directa","Prestación de servicios profesionales y de apoyo a la gestión, o para la ejecución de trabajos artísticos que sólo puedan encomendarse a determinadas personas naturales;","Prestar los servicios para operar el vehículo asignado, realizando de manera oportuna eficiente y segura los desplazamientos de los funcionarios del Fondo de Desarrollo Local del Sumapaz y/o demás personal que requiera ser trasladado en la zona urbana y rural de la localidad en cumplimiento de las actividades propias de la administración local.","Inversión",45,"Gobernanza e influencia local, regional e internacional","Eje Transversal 4 Gobierno Legitimo, Fortalecimiento Local y Eficiencia",1375,1032656045,"EDUARDO  DIMATE RICO",28224000,null,0,null,null,28224000,24147200,"2019-01-22","2019-01-23","2020-01-22",360,null,null,null,"x",null,null,0.85555555555555551,null,{"$f":"IF(SUMPRODUCT((A$14:A43=A43)*(B$14:B43=B43)*(C$14:C43=C43))>1,0,1)","v":1},"Contratos de prestación de servicios profesionales y de apoyo a la gestión","Contratación directa",{"$f":"IFERROR(VLOOKUP(F43,Tipo!$C$12:$C$27,1,FALSE),\"NO\")","v":"Prestación de servicios profesionales y de apoyo a la gestión, o para la ejecución de trabajos artísticos que sólo puedan encomendarse a determinadas personas naturales;"},"Inversión",45]
["CPS-032-2019",2019,"FDLS-CD-032-2019","Contratos de prestación de servicios profesionales y de apoyo a la gestión","Contratación directa","Prestación de servicios profesionales y de apoyo a la gestión, o para la ejecución de trabajos artísticos que sólo puedan encomendarse a determinadas personas naturales;","PRESTAR SUS SERVICIOS PROFESIONALES PARA REALIZAR LA FORMULACIÓN, SEGUIMIENTO A LA EJECUCIÓN Y LIQUIDACIÓN DE LOS COMPONENTES QUE SE DERIVEN PROYECTO DE INVERSIÓN 1368 ¿SUMAPAZ DIGITAL¿. REEMPLAZA AL CDP 195 Y CRP 196 DE ACUERDO A LA RESOLUCION 16 DE 2019","Inversión",36,"Bogotá, una ciudad digital","Eje Transversal 2 Desarrollo Económico basado en el conocimiento",1368,80125822,"WOLFRANG LIZANDRO PULIDO AVENDAÑO",56339267,null,0,1,10498000,66837267,47241000,"2019-01-22","2019-01-23","2020-03-22",360,60,null,null,"x",null,null,0.70680627919750216,null,{"$f":"IF(SUMPRODUCT((A$14:A44=A44)*(B$14:B44=B44)*(C$14:C44=C44))>1,0,1)","v":1},"Contratos de prestación de servicios profesionales y de apoyo a la gestión","Contratación directa",{"$f":"IFERROR(VLOOKUP(F44,Tipo!$C$12:$C$27,1,FALSE),\"NO\")","v":"Prestación de servicios profesionales y de apoyo a la gestión, o para la ejecución de trabajos artísticos que sólo puedan encomendarse a determinadas personas naturales;"},"Inversión",36]
["CPS-032-2019",2019,"FDLS-CD-032-2019","Contratos de prestación de servicios profesionales y de apoyo a la gestión","Contratación directa","Prestación de servicios profesionales y de apoyo a la gestión, o para la ejecución de trabajos artísticos que sólo puedan encomendarse a determinadas personas naturales;","Prestar sus servicios profesionales para realizar la formulación, seguimiento a la ejecución y liquidación de los componentes que se deriven proyecto de inversión 1368 ¿Sumapaz Digital¿.","Inversión",45,"Gobernanza e influencia local, regional e internacional","Eje Transversal 4 Gobierno Legitimo, Fortalecimiento Local y Eficiencia",1375,80125822,"WOLFRANG LIZANDRO PULIDO AVENDAÑO",62988000,1,-56339267,null,null,6648733,6648733,"2019-01-22","2019-01-23","2020-03-22",360,60,null,null,"x",null,null,1,null,{"$f":"IF(SUMPRODUCT((A$14:A45=A45)*(B$14:B45=B45)*(C$14:C45=C45))>1,0,1)","v":0},"Contratos de prestación de servicios profesionales y de apoyo a la gestión","Contratación directa",{"$f":"IFERROR(VLOOKUP(F45,Tipo!$C$12:$C$27,1,FALSE),\"NO\")","v":"Prestación de servicios profesionales y de apoyo a la gestión, o para la ejecución de trabajos artísticos que sólo puedan encomendarse a determinadas personas naturales;"},"Inversión",45]
["CPS-033-2019",2019,"FDLS-CD-033-2019","Contratos de prestación de servicios profesionales y de apoyo a la gestión","Contratación directa","Prestación de servicios profesionales y de apoyo a la gestión, o para la ejecución de trabajos artísticos que sólo puedan encomendarse a determinadas personas naturales;","Apoyar técnicamente a los responsables e intengrates de los procesos de implementación de herramientas de gestión, siguiendo los lineamientos metodológicos establecidos por la Oficina Asesora de Planeación de la Secretaría Distrital de Gobierno.","Inversión",45,"Gobernanza e influencia local, regional e internacional","Eje Transversal 4 Gobierno Legitimo, Fortalecimiento Local y Eficiencia",1375,52211430,"GLORIA ESPERANZA PIRAJON TEJEDOR",59220000,1,-9870000,1,19740000,69090000,50666000,"2019-01-22","2019-01-23","2020-03-22",360,60,null,null,"x",null,null,0.73333333333333328,null,{"$f":"IF(SUMPRODUCT((A$14:A46=A46)*(B$14:B46=B46)*(C$14:C46=C46))>1,0,1)","v":1},{"$f":"IFERROR(VLOOKUP(D46,tipo,1,FALSE),\"NO\")","v":"Contratos de prestación de servicios profesionales y de apoyo a la gestión"},{"$f":"IFERROR(VLOOKUP(E46,modal,1,FALSE),\"NO\")","v":"Contratación directa"},{"$f":"IFERROR(VLOOKUP(F46,Tipo!$C$12:$C$27,1,FALSE),\"NO\")","v":"Prestación de servicios profesionales y de apoyo a la gestión, o para la ejecución de trabajos artísticos que sólo puedan encomendarse a determinadas personas naturales;"},{"$f":"IFERROR(VLOOKUP(H46,afectacion,1,FALSE),\"NO\")","v":"Inversión"},{"$f":"IFERROR(VLOOKUP(I46,programa,1,FALSE),\"NO\")","v":45}]
["CPS-034-2019",2019,"FDLS-CD-034-2019","Contratos de prestación de servicios profesionales y de apoyo a la gestión","Contratación directa","Prestación de servicios profesionales y de apoyo a la gestión, o para la ejecución de trabajos artísticos que sólo puedan encomendarse a determinadas personas naturales;","Prestar los servicios profesionales para la operación, prestación, seguimiento y cumplimiento de los procedimientos administrativos, operativos y programaticos del servicio social Apoyo Economico Tipo C, que contribuyan a la garantia de los derechos de la población mayor en le marco de la Politica Pública Social para el envejecimiento y la vejez en le Distrito Capital a cargo de la Alcaldía Local de Sumapaz.","Inversión",3,"Igualdad y autonomía para una Bogotá incluyente","Pilar 1 Igualdad de Calidad de Vida",1334,1023006378,"LEIDY PAOLA GONZALEZ PALACIOS",50400000,null,0,null,null,50400000,42840000,"2019-01-24","2019-01-25","2020-01-24",360,null,null,null,"x",null,null,0.85,null,{"$f":"IF(SUMPRODUCT((A$14:A47=A47)*(B$14:B47=B47)*(C$14:C47=C47))>1,0,1)","v":1},"Contratos de prestación de servicios profesionales y de apoyo a la gestión","Contratación directa",{"$f":"IFERROR(VLOOKUP(F47,Tipo!$C$12:$C$27,1,FALSE),\"NO\")","v":"Prestación de servicios profesionales y de apoyo a la gestión, o para la ejecución de trabajos artísticos que sólo puedan encomendarse a determinadas personas naturales;"},"Inversión",3]
["CPS-035-2019",2019,"FDLS-CD-035-2019","Contratos de prestación de servicios profesionales y de apoyo a la gestión","Contratación directa","Prestación de servicios profesionales y de apoyo a la gestión, o para la ejecución de trabajos artísticos que sólo puedan encomendarse a determinadas personas naturales;","Apoyar la formulación, gestión y seguimiento de las actividades enfocadas a promover el desarrollo rural sostenible en la localidad de Sumapaz.","Inversión",45,"Gobernanza e influencia local, regional e internacional","Eje Transversal 4 Gobierno Legitimo, Fortalecimiento Local y Eficiencia",1375,1069727546,"JULIAN NICOLAS CRUZ CLAVIJO",59220000,null,0,null,null,59220000,50501500,"2019-01-23","2019-01-24","2020-01-23",360,null,null,null,"x",null,null,0.85277777777777775,null,{"$f":"IF(SUMPRODUCT((A$14:A48=A48)*(B$14:B48=B48)*(C$14:C48=C48))>1,0,1)","v":1},"Contratos de prestación de servicios profesionales y de apoyo a la gestión","Contratación directa",{"$f":"IFERROR(VLOOKUP(F48,Tipo!$C$12:$C$27,1,FALSE),\"NO\")","v":"Prestación de servicios profesionales y de apoyo a la gestión, o para la ejecución de trabajos artísticos que sólo puedan encomendarse a determinadas personas naturales;"},"Inversión",45]
["CPS-036-2019",2019,"FDLS-CD-036-2019","Contratos de prestación de servicios profesionales y de apoyo a la gestión","Contratación directa","Prestación de servicios profesionales y de apoyo a la gestión, o para la ejecución de trabajos artísticos que sólo puedan encomendarse a determinadas personas naturales;","Prestar los servicios profesionales para realizar la formulación, evaluación, seguimiento y control de proyectos de inversión y gastos de funcionamiento del Fondo de Desarrollo Local de Sumapaz.","Inversión",45,"Gobernanza e influencia local, regional e internacional","Eje Transversal 4 Gobierno Legitimo, Fortalecimiento Local y Eficiencia",1375,80878166,"CARLOS ALBERTO VARGAS CARPINTERO",62400000,null,0,null,null,62400000,53386667,"2019-01-22","2019-01-23","2020-01-22",360,null,null,null,"x",null,null,0.8555555608974359,null,{"$f":"IF(SUMPRODUCT((A$14:A49=A49)*(B$14:B49=B49)*(C$14:C49=C49))>1,0,1)","v":1},"Contratos de prestación de servicios profesionales y de apoyo a la gestión","Contratación directa",{"$f":"IFERROR(VLOOKUP(F49,Tipo!$C$12:$C$27,1,FALSE),\"NO\")","v":"Prestación de servicios profesionales y de apoyo a la gestión, o para la ejecución de trabajos artísticos que sólo puedan encomendarse a determinadas personas naturales;"},"Inversión",45]
["CPS-037-2019",2019,"FDLS-CD-037-2019","Contratos de prestación de servicios profesionales y de apoyo a la gestión","Contratación directa","Prestación de servicios profesionales y de apoyo a la gestión, o para la ejecución de trabajos artísticos que sólo puedan encomendarse a determinadas personas naturales;","Prestar sus servicios como auxiliar administrativo para realizar la sistematización de los documentos que reposan en el archivo de gestión de la Alcaldía Local de Sumapaz.","Inversión",45,"Gobernanza e influencia local, regional e internacional","Eje Transversal 4 Gobierno Legitimo, Fortalecimiento Local y Eficiencia",1375,51876508,"DORIS CRISTINA GARCIA ADARVE",27720000,null,0,null,null,27720000,23639000,"2019-01-24","2019-01-24","2020-01-23",360,null,null,null,"x",null,null,0.85277777777777775,null,{"$f":"IF(SUMPRODUCT((A$14:A50=A50)*(B$14:B50=B50)*(C$14:C50=C50))>1,0,1)","v":1},"Contratos de prestación de servicios profesionales y de apoyo a la gestión","Contratación directa",{"$f":"IFERROR(VLOOKUP(F50,Tipo!$C$12:$C$27,1,FALSE),\"NO\")","v":"Prestación de servicios profesionales y de apoyo a la gestión, o para la ejecución de trabajos artísticos que sólo puedan encomendarse a determinadas personas naturales;"},"Inversión",45]
["CPS-038-2019",2019,"FDLS-CD-038-2019","Contratos de prestación de servicios profesionales y de apoyo a la gestión","Contratación directa","Prestación de servicios profesionales y de apoyo a la gestión, o para la ejecución de trabajos artísticos que sólo puedan encomendarse a determinadas personas naturales;","Prestar los servicios como auxiliar administrativo para la Corregiduría de Nazareth","Inversión",45,"Gobernanza e influencia local, regional e internacional","Eje Transversal 4 Gobierno Legitimo, Fortalecimiento Local y Eficiencia",1375,1022943098,"GLORIA YOLANDA DIMATE RICO",23160000,null,0,null,null,23160000,19428667,"2019-01-25","2019-01-29","2020-01-28",360,null,null,null,"x",null,null,0.83888890328151988,null,{"$f":"IF(SUMPRODUCT((A$14:A51=A51)*(B$14:B51=B51)*(C$14:C51=C51))>1,0,1)","v":1},"Contratos de prestación de servicios profesionales y de apoyo a la gestión","Contratación directa",{"$f":"IFERROR(VLOOKUP(F51,Tipo!$C$12:$C$27,1,FALSE),\"NO\")","v":"Prestación de servicios profesionales y de apoyo a la gestión, o para la ejecución de trabajos artísticos que sólo puedan encomendarse a determinadas personas naturales;"},"Inversión",45]
["CPS-039-2019",2019,"FDLS-CD-039-2019","Contratos de prestación de servicios profesionales y de apoyo a la gestión","Contratación directa","Prestación de servicios profesionales y de apoyo a la gestión, o para la ejecución de trabajos artísticos que sólo puedan encomendarse a determinadas personas naturales;","Prestar los servicios profesionales para la formulación, evaluación, seguimiento y control de proyectos de inversión y seguimiento de los planes, programas y proyectos del Fondo de Desarrollo Local de Sumapaz para el Punto Focal de Mujer y Género.","Inversión",45,"Gobernanza e influencia local, regional e internacional","Eje Transversal 4 Gobierno Legitimo, Fortalecimiento Local y Eficiencia",1375,52008301,"ANA ROSA BAUTISTA RINCON",59220000,null,0,null,null,59220000,50337000,"2019-01-24","2019-01-25","2020-01-24",360,null,null,null,"x",null,null,0.85,null,{"$f":"IF(SUMPRODUCT((A$14:A52=A52)*(B$14:B52=B52)*(C$14:C52=C52))>1,0,1)","v":1},"Contratos de prestación de servicios profesionales y de apoyo a la gestión","Contratación directa",{"$f":"IFERROR(VLOOKUP(F52,Tipo!$C$12:$C$27,1,FALSE),\"NO\")","v":"Prestación de servicios profesionales y de apoyo a la gestión, o para la ejecución de trabajos artísticos que sólo puedan encomendarse a determinadas personas naturales;"},"Inversión",45]
["CPS-040-2019",2019,"FDLS-CD-040-2019","Contratos de prestación de servicios profesionales y de apoyo a la gestión","Contratación directa","Prestación de servicios profesionales y de apoyo a la gestión, o para la ejecución de trabajos artísticos que sólo puedan encomendarse a determinadas personas naturales;","Prestar los servicios profesionales al despacho de la alcaldía local de Sumapaz para el cumplimiento del plan de desarrollo ¿Sumapaz en paz, más productiva y ambiental para todos¿ 2017-2020.","Inversión",45,"Gobernanza e influencia local, regional e internacional","Eje Transversal 4 Gobierno Legitimo, Fortalecimiento Local y Eficiencia",1375,1140819809,"RICARDO DAVID MENDEZ PALACIO",59220000,null,0,null,null,59220000,50501500,"2019-01-24","2019-01-24","2020-01-23",360,null,null,null,"x",null,null,0.85277777777777775,null,{"$f":"IF(SUMPRODUCT((A$14:A53=A53)*(B$14:B53=B53)*(C$14:C53=C53))>1,0,1)","v":1},"Contratos de prestación de servicios profesionales y de apoyo a la gestión","Contratación directa",{"$f":"IFERROR(VLOOKUP(F53,Tipo!$C$12:$C$27,1,FALSE),\"NO\")","v":"Prestación de servicios profesionales y de apoyo a la gestión, o para la ejecución de trabajos artísticos que sólo puedan encomendarse a determinadas personas naturales;"},"Inversión",45]
["CPS-041-2019",2019,"FDLS-CD-041-2019","Contratos de prestación de servicios profesionales y de apoyo a la gestión","Contratación directa","Prestación de servicios profesionales y de apoyo a la gestión, o para la ejecución de trabajos artísticos que sólo puedan encomendarse a determinadas personas naturales;","Prestar los servicios profesionales especializados para el despacho de la Alcaldía Local de Sumapaz en las diferentes etapas de los procesos administrativos y operativos para dar cumplimiento al Plan de Desarrollo Local.","Inversión",45,"Gobernanza e influencia local, regional e internacional","Eje Transversal 4 Gobierno Legitimo, Fortalecimiento Local y Eficiencia",1375,19491239,"MELCHOR ANTONIO YEPES CALANCHE",100800000,null,0,null,null,100800000,85960000,"2019-01-23","2019-01-24","2020-01-23",360,null,null,null,"x",null,null,0.85277777777777775,null,{"$f":"IF(SUMPRODUCT((A$14:A54=A54)*(B$14:B54=B54)*(C$14:C54=C54))>1,0,1)","v":1},"Contratos de prestación de servicios profesionales y de apoyo a la gestión","Contratación directa",{"$f":"IFERROR(VLOOKUP(F54,Tipo!$C$12:$C$27,1,FALSE),\"NO\")","v":"Prestación de servicios profesionales y de apoyo a la gestión, o para la ejecución de trabajos artísticos que sólo puedan encomendarse a determinadas personas naturales;"},"Inversión",45]
["CPS-042-2019",2019,"FDLS-CD-042-2019","Contratos de prestación de servicios profesionales y de apoyo a la gestión","Contratación directa","Prestación de servicios profesionales y de apoyo a la gestión, o para la ejecución de trabajos artísticos que sólo puedan encomendarse a determinadas personas naturales;","Prestar sus servicios profesionales a la Alcaldía Local de Sumapaz, como administrador de la Red de computadores de los equipos de propiedad o tenencia del Fondo de Desarrollo Local de Sumapaz y realizar la actualización de los datos en los diferentes sistemas de información.","Inversión",45,"Gobernanza e influencia local, regional e internacional","Eje Transversal 4 Gobierno Legitimo, Fortalecimiento Local y Eficiencia",1375,77183787,"YESID AFRANIO AMARIS OSPINO",62988000,null,0,null,null,62988000,53714767,"2019-01-23","2019-01-24","2020-01-23",360,null,null,null,"x",null,null,0.85277778306979102,null,{"$f":"IF(SUMPRODUCT((A$14:A55=A55)*(B$14:B55=B55)*(C$14:C55=C55))>1,0,1)","v":1},"Contratos de prestación de servicios profesionales y de apoyo a la gestión","Contratación directa",{"$f":"IFERROR(VLOOKUP(F55,Tipo!$C$12:$C$27,1,FALSE),\"NO\")","v":"Prestación de servicios profesionales y de apoyo a la gestión, o para la ejecución de trabajos artísticos que sólo puedan encomendarse a determinadas personas naturales;"},"Inversión",45]
["CPS-043-2019",2019,"FDLS-CD-043-2019","Contratos de prestación de servicios profesionales y de apoyo a la gestión","Contratación directa","Prestación de servicios profesionales y de apoyo a la gestión, o para la ejecución de trabajos artísticos que sólo puedan encomendarse a determinadas personas naturales;","Prestar los servicios profesionales al Área de Gestión de Desarrollo Local para realizar la formulación y seguimiento a los proyectos de inversión o componentes que le sean designados.","Inversión",18,"Mejor movilidad para todos","Pilar 2 Democracía Urbana",1364,79719940,"CESAR ALEXANDER URIZA ROJAS",69300000,null,0,null,null,69300000,58327500,"2019-01-25","2019-01-28","2020-01-27",360,null,null,null,"x",null,null,0.84166666666666667,null,{"$f":"IF(SUMPRODUCT((A$14:A56=A56)*(B$14:B56=B56)*(C$14:C56=C56))>1,0,1)","v":1},"Contratos de prestación de servicios profesionales y de apoyo a la gestión","Contratación directa",{"$f":"IFERROR(VLOOKUP(F56,Tipo!$C$12:$C$27,1,FALSE),\"NO\")","v":"Prestación de servicios profesionales y de apoyo a la gestión, o para la ejecución de trabajos artísticos que sólo puedan encomendarse a determinadas personas naturales;"},"Inversión",18]
["CPS-044-2019",2019,"FDLS-CD-044-2019","Contratos de prestación de servicios profesionales y de apoyo a la gestión","Contratación directa","Prestación de servicios profesionales y de apoyo a la gestión, o para la ejecución de trabajos artísticos que sólo puedan encomendarse a determinadas personas naturales;","Prestar los servicios como auxiliar administrativo para la Corregiduría de Betania.","Inversión",45,"Gobernanza e influencia local, regional e internacional","Eje Transversal 4 Gobierno Legitimo, Fortalecimiento Local y Eficiencia",1375,1032656360,"DIANA LUCIA RAMIREZ MUÑOZ",22680000,null,0,null,null,22680000,19089000,"2019-01-25","2019-01-28","2020-01-27",360,null,null,null,"x",null,null,0.84166666666666667,null,{"$f":"IF(SUMPRODUCT((A$14:A57=A57)*(B$14:B57=B57)*(C$14:C57=C57))>1,0,1)","v":1},"Contratos de prestación de servicios profesionales y de apoyo a la gestión","Contratación directa",{"$f":"IFERROR(VLOOKUP(F57,Tipo!$C$12:$C$27,1,FALSE),\"NO\")","v":"Prestación de servicios profesionales y de apoyo a la gestión, o para la ejecución de trabajos artísticos que sólo puedan encomendarse a determinadas personas naturales;"},"Inversión",45]
["CPS-045-2019",2019,"FDLS-CD-045-2019","Contratos de prestación de servicios profesionales y de apoyo a la gestión","Contratación directa","Prestación de servicios profesionales y de apoyo a la gestión, o para la ejecución de trabajos artísticos que sólo puedan encomendarse a determinadas personas naturales;","Apoyar las actividades operativas como auxiliar administrativo en la Corregiduría de San Juan.","Inversión",45,"Gobernanza e influencia local, regional e internacional","Eje Transversal 4 Gobierno Legitimo, Fortalecimiento Local y Eficiencia",1375,1016031740,"DEICY AMPARO MORALES TORRES",22680000,null,0,null,null,22680000,19026000,"2019-01-28","2019-01-29","2020-01-28",360,null,null,null,"x",null,null,0.83888888888888891,null,{"$f":"IF(SUMPRODUCT((A$14:A58=A58)*(B$14:B58=B58)*(C$14:C58=C58))>1,0,1)","v":1},"Contratos de prestación de servicios profesionales y de apoyo a la gestión","Contratación directa",{"$f":"IFERROR(VLOOKUP(F58,Tipo!$C$12:$C$27,1,FALSE),\"NO\")","v":"Prestación de servicios profesionales y de apoyo a la gestión, o para la ejecución de trabajos artísticos que sólo puedan encomendarse a determinadas personas naturales;"},"Inversión",45]
["CPS-046-2019",2019,"FDLS-CD-046-2019","Contratos de prestación de servicios profesionales y de apoyo a la gestión","Contratación directa","Prestación de servicios profesionales y de apoyo a la gestión, o para la ejecución de trabajos artísticos que sólo puedan encomendarse a determinadas personas naturales;","prestar sus servicios de apoyo para realizar actividades inherentes a la gestión documental de la alcaldía local de Sumapaz y la corregiduría de Betania.","Inversión",45,"Gobernanza e influencia local, regional e internacional","Eje Transversal 4 Gobierno Legitimo, Fortalecimiento Local y Eficiencia",1375,79826818,"GIOVANNI  SANCHEZ SABOGAL",22680000,null,0,null,null,22680000,18900000,"2019-01-25","2019-02-01","2020-01-31",360,null,null,null,"x",null,null,0.83333333333333337,null,{"$f":"IF(SUMPRODUCT((A$14:A59=A59)*(B$14:B59=B59)*(C$14:C59=C59))>1,0,1)","v":1},"Contratos de prestación de servicios profesionales y de apoyo a la gestión","Contratación directa",{"$f":"IFERROR(VLOOKUP(F59,Tipo!$C$12:$C$27,1,FALSE),\"NO\")","v":"Prestación de servicios profesionales y de apoyo a la gestión, o para la ejecución de trabajos artísticos que sólo puedan encomendarse a determinadas personas naturales;"},"Inversión",45]
["CPS-047-2019",2019,"FDLS-CD-047-2019","Contratos de prestación de servicios profesionales y de apoyo a la gestión","Contratación directa","Prestación de servicios profesionales y de apoyo a la gestión, o para la ejecución de trabajos artísticos que sólo puedan encomendarse a determinadas personas naturales;","Prestar los servicios de apoyo en las labores de oficios varios y notificación para la Cuenca del Rio Blanco y Cuenca Rio Sumapaz.","Inversión",45,"Gobernanza e influencia local, regional e internacional","Eje Transversal 4 Gobierno Legitimo, Fortalecimiento Local y Eficiencia",1375,1033767652,"IVAN DARIO CHINGATE MICAN",21420000,null,0,null,null,21420000,17850000,"2019-01-28","2019-02-01","2020-01-31",360,null,null,null,"x",null,null,0.83333333333333337,null,{"$f":"IF(SUMPRODUCT((A$14:A60=A60)*(B$14:B60=B60)*(C$14:C60=C60))>1,0,1)","v":1},"Contratos de prestación de servicios profesionales y de apoyo a la gestión","Contratación directa",{"$f":"IFERROR(VLOOKUP(F60,Tipo!$C$12:$C$27,1,FALSE),\"NO\")","v":"Prestación de servicios profesionales y de apoyo a la gestión, o para la ejecución de trabajos artísticos que sólo puedan encomendarse a determinadas personas naturales;"},"Inversión",45]
["CPS-048-2019",2019,"FDLS-CD-048-2019","Contratos de prestación de servicios profesionales y de apoyo a la gestión","Contratación directa","Prestación de servicios profesionales y de apoyo a la gestión, o para la ejecución de trabajos artísticos que sólo puedan encomendarse a determinadas personas naturales;","Prestar los servicios profesionales para realizar formulación, evaluación, seguimiento y control de proyectos de inversión y seguimiento de los planes, programas y proyectos del Fondo de Desarrollo Local de Sumapaz que le sean designados.","Inversión",45,"Gobernanza e influencia local, regional e internacional","Eje Transversal 4 Gobierno Legitimo, Fortalecimiento Local y Eficiencia",1375,52219073,"CLAUDIA  MARTIN NAIZAQUE",59220000,null,0,null,null,59220000,49843500,"2019-01-25","2019-01-28","2020-01-27",360,null,null,null,"x",null,null,0.84166666666666667,null,{"$f":"IF(SUMPRODUCT((A$14:A61=A61)*(B$14:B61=B61)*(C$14:C61=C61))>1,0,1)","v":1},"Contratos de prestación de servicios profesionales y de apoyo a la gestión","Contratación directa",{"$f":"IFERROR(VLOOKUP(F61,Tipo!$C$12:$C$27,1,FALSE),\"NO\")","v":"Prestación de servicios profesionales y de apoyo a la gestión, o para la ejecución de trabajos artísticos que sólo puedan encomendarse a determinadas personas naturales;"},"Inversión",45]
["CPS-049-2019",2019,"FDLS-CD-049-2019","Contratos de prestación de servicios profesionales y de apoyo a la gestión","Contratación directa","Prestación de servicios profesionales y de apoyo a la gestión, o para la ejecución de trabajos artísticos que sólo puedan encomendarse a determinadas personas naturales;","Prestar los servicios como auxiliar administrativo al servicio de la Junta Administradora Local de Sumapaz.","Inversión",45,"Gobernanza e influencia local, regional e internacional","Eje Transversal 4 Gobierno Legitimo, Fortalecimiento Local y Eficiencia",1375,1030521003,"FREDY HUMBERTO PEÑA FORERO",28500000,null,0,null,null,28500000,23987500,"2019-01-25","2019-01-28","2020-01-27",360,null,null,null,"x",null,null,0.84166666666666667,null,{"$f":"IF(SUMPRODUCT((A$14:A62=A62)*(B$14:B62=B62)*(C$14:C62=C62))>1,0,1)","v":1},"Contratos de prestación de servicios profesionales y de apoyo a la gestión","Contratación directa",{"$f":"IFERROR(VLOOKUP(F62,Tipo!$C$12:$C$27,1,FALSE),\"NO\")","v":"Prestación de servicios profesionales y de apoyo a la gestión, o para la ejecución de trabajos artísticos que sólo puedan encomendarse a determinadas personas naturales;"},"Inversión",45]
["CPS-050-2019",2019,"FDLS-CD-050-2019","Contratos de prestación de servicios profesionales y de apoyo a la gestión","Contratación directa","Prestación de servicios profesionales y de apoyo a la gestión, o para la ejecución de trabajos artísticos que sólo puedan encomendarse a determinadas personas naturales;","Prestar el servicio como auxiliar administrativo para el Centro de Servicios de Santa Rosa.","Inversión",45,"Gobernanza e influencia local, regional e internacional","Eje Transversal 4 Gobierno Legitimo, Fortalecimiento Local y Eficiencia",1375,1022992154,"YEIMY MAGALI ROMERO HERNANDEZ",21420000,null,0,null,null,21420000,17909500,"2019-01-28","2019-01-30","2020-01-29",360,null,null,null,"x",null,null,0.83611111111111114,null,{"$f":"IF(SUMPRODUCT((A$14:A63=A63)*(B$14:B63=B63)*(C$14:C63=C63))>1,0,1)","v":1},"Contratos de prestación de servicios profesionales y de apoyo a la gestión","Contratación directa",{"$f":"IFERROR(VLOOKUP(F63,Tipo!$C$12:$C$27,1,FALSE),\"NO\")","v":"Prestación de servicios profesionales y de apoyo a la gestión, o para la ejecución de trabajos artísticos que sólo puedan encomendarse a determinadas personas naturales;"},"Inversión",45]
["CPS-051-2019",2019,"FDLS-CD-052-2019","Contratos de prestación de servicios profesionales y de apoyo a la gestión","Contratación directa","Prestación de servicios profesionales y de apoyo a la gestión, o para la ejecución de trabajos artísticos que sólo puedan encomendarse a determinadas personas naturales;","Apoyar al equipo de prensa y comunicaciones de la Alcaldía Local mediante el registro, la edición y la presentación de fotografías de los acontecimientos, hechos y eventos de la Alcaldía Local en los medios de comunicación, especialmente escritos, digitales y audiovisuales y la creación, realización y producción de vídeos que transmitan un mensaje en la comunicación interna y externa.","Inversión",45,"Gobernanza e influencia local, regional e internacional","Eje Transversal 4 Gobierno Legitimo, Fortalecimiento Local y Eficiencia",1375,80362137,"JESUS ALFONSO PEÑA PEREZ",14805000,null,0,1,7402500,22207500,22207500,"2019-01-28","2019-01-30","2019-06-14",90,45,null,null,null,"x",null,1,null,{"$f":"IF(SUMPRODUCT((A$14:A64=A64)*(B$14:B64=B64)*(C$14:C64=C64))>1,0,1)","v":1},"Contratos de prestación de servicios profesionales y de apoyo a la gestión","Contratación directa",{"$f":"IFERROR(VLOOKUP(F64,Tipo!$C$12:$C$27,1,FALSE),\"NO\")","v":"Prestación de servicios profesionales y de apoyo a la gestión, o para la ejecución de trabajos artísticos que sólo puedan encomendarse a determinadas personas naturales;"},"Inversión",45]
["CPS-052-2019",2019,"FDLS-CD-053-2019","Contratos de prestación de servicios profesionales y de apoyo a la gestión","Contratación directa","Prestación de servicios profesionales y de apoyo a la gestión, o para la ejecución de trabajos artísticos que sólo puedan encomendarse a determinadas personas naturales;","Prestar los servicios profesionales para realizar formulación, evaluación, seguimiento y control del proyecto de inversión ¿Desarrollo Rural Sostenible y Campesino¿ y seguimiento de los planes, programas y proyectos del Fondo de Desarrollo Local de Sumapaz que le sean designados.","Inversión",41,"Desarrollo rural sostenible","Eje Transversal 3 Sostenibilidad Ambiental basada en la eficiencia energética",1382,1072638453,"IVAN CAMILO ORAMAS PRIETO",59220000,null,0,null,null,59220000,49350000,"2019-01-29","2019-02-01","2020-01-31",360,null,null,null,"x",null,null,0.83333333333333337,null,{"$f":"IF(SUMPRODUCT((A$14:A65=A65)*(B$14:B65=B65)*(C$14:C65=C65))>1,0,1)","v":1},"Contratos de prestación de servicios profesionales y de apoyo a la gestión","Contratación directa",{"$f":"IFERROR(VLOOKUP(F65,Tipo!$C$12:$C$27,1,FALSE),\"NO\")","v":"Prestación de servicios profesionales y de apoyo a la gestión, o para la ejecución de trabajos artísticos que sólo puedan encomendarse a determinadas personas naturales;"},"Inversión",41]
["CPS-053-2019",2019,"FDLS-CD-054-2019","Contratos de prestación de servicios profesionales y de apoyo a la gestión","Contratación directa","Prestación de servicios profesionales y de apoyo a la gestión, o para la ejecución de trabajos artísticos que sólo puedan encomendarse a determinadas personas naturales;","Prestar los servicios Profesionales Especializados al Área de Gestión de Desarrollo Local en los diferentes componentes de Infraestructura y Malla Vial de la Localidad de Sumapaz.","Inversión",18,"Mejor movilidad para todos","Pilar 2 Democracía Urbana",1364,79445117,"CARLOS ENRIQUE CAMPOS PINEDA",90720000,null,0,null,null,90720000,75600000,"2019-01-29","2019-02-01","2020-01-31",360,null,null,null,"x",null,null,0.83333333333333337,null,{"$f":"IF(SUMPRODUCT((A$14:A66=A66)*(B$14:B66=B66)*(C$14:C66=C66))>1,0,1)","v":1},"Contratos de prestación de servicios profesionales y de apoyo a la gestión","Contratación directa",{"$f":"IFERROR(VLOOKUP(F66,Tipo!$C$12:$C$27,1,FALSE),\"NO\")","v":"Prestación de servicios profesionales y de apoyo a la gestión, o para la ejecución de trabajos artísticos que sólo puedan encomendarse a determinadas personas naturales;"},"Inversión",18]
["CPS-055-2019",2019,"FDLS-CD-057-2019","Contratos de prestación de servicios profesionales y de apoyo a la gestión","Contratación directa","Prestación de servicios profesionales y de apoyo a la gestión, o para la ejecución de trabajos artísticos que sólo puedan encomendarse a determinadas personas naturales;","Prestar sus servicios como Profesional de apoyo a la gestión contractual de la Alcaldía Local de Sumapaz.","Inversión",45,"Gobernanza e influencia local, regional e internacional","Eje Transversal 4 Gobierno Legitimo, Fortalecimiento Local y Eficiencia",1375,1069751536,"ERIKA DAYANA FIERRO MORALES",50400000,null,0,null,null,50400000,41300000,"2019-01-29","2019-02-01","2020-01-31",360,null,null,null,"x",null,null,0.81944444444444442,null,{"$f":"IF(SUMPRODUCT((A$14:A67=A67)*(B$14:B67=B67)*(C$14:C67=C67))>1,0,1)","v":1},"Contratos de prestación de servicios profesionales y de apoyo a la gestión","Contratación directa",{"$f":"IFERROR(VLOOKUP(F67,Tipo!$C$12:$C$27,1,FALSE),\"NO\")","v":"Prestación de servicios profesionales y de apoyo a la gestión, o para la ejecución de trabajos artísticos que sólo puedan encomendarse a determinadas personas naturales;"},"Inversión",45]
["CPS-056-2019",2019,"FDLS-CD-058-2019","Contratos de prestación de servicios profesionales y de apoyo a la gestión","Contratación directa","Prestación de servicios profesionales y de apoyo a la gestión, o para la ejecución de trabajos artísticos que sólo puedan encomendarse a determinadas personas naturales;","Prestar los servicios profesionales como Abogado (a) de apoyo al Área de Gestión Policiva Jurídica Sumapaz, en el desarrollo de las funciones propias de esa dependencia.","Inversión",45,"Gobernanza e influencia local, regional e internacional","Eje Transversal 4 Gobierno Legitimo, Fortalecimiento Local y Eficiencia",1375,79042250,"PEDRO GUILLERMO CARRANZA URREA",59220000,1,-36025500,null,null,23194500,23194500,"2019-01-30","2019-02-04","2020-02-03",360,null,null,null,null,"x",null,1,null,{"$f":"IF(SUMPRODUCT((A$14:A68=A68)*(B$14:B68=B68)*(C$14:C68=C68))>1,0,1)","v":1},"Contratos de prestación de servicios profesionales y de apoyo a la gestión","Contratación directa",{"$f":"IFERROR(VLOOKUP(F68,Tipo!$C$12:$C$27,1,FALSE),\"NO\")","v":"Prestación de servicios profesionales y de apoyo a la gestión, o para la ejecución de trabajos artísticos que sólo puedan encomendarse a determinadas personas naturales;"},"Inversión",45]
["CPS-057-2019",2019,"FDLS-CD-059-2019","Contratos de prestación de servicios profesionales y de apoyo a la gestión","Contratación directa","Prestación de servicios profesionales y de apoyo a la gestión, o para la ejecución de trabajos artísticos que sólo puedan encomendarse a determinadas personas naturales;","Prestar sus servicios profesionales al Almacén del Fondo de Desarrollo Local de Sumapaz.","Inversión",45,"Gobernanza e influencia local, regional e internacional","Eje Transversal 4 Gobierno Legitimo, Fortalecimiento Local y Eficiencia",1375,1013633246,"BRYAN ALFONSO CASTAÑEDA FRANCO",59220000,null,0,null,null,59220000,49350000,"2019-01-29","2019-02-01","2020-02-05",360,null,null,null,"x",null,null,0.83333333333333337,null,{"$f":"IF(SUMPRODUCT((A$14:A69=A69)*(B$14:B69=B69)*(C$14:C69=C69))>1,0,1)","v":1},"Contratos de prestación de servicios profesionales y de apoyo a la gestión","Contratación directa",{"$f":"IFERROR(VLOOKUP(F69,Tipo!$C$12:$C$27,1,FALSE),\"NO\")","v":"Prestación de servicios profesionales y de apoyo a la gestión, o para la ejecución de trabajos artísticos que sólo puedan encomendarse a determinadas personas naturales;"},"Inversión",45]
["CPS-058-2019",2019,"FDLS-CD-060-2019","Contratos de prestación de servicios profesionales y de apoyo a la gestión","Contratación directa","Prestación de servicios profesionales y de apoyo a la gestión, o para la ejecución de trabajos artísticos que sólo puedan encomendarse a determinadas personas naturales;","Prestar sus servicios como auxiliar administrativo para que realice las actividades correspondientes al Parque Automotor propiedad del Fondo de Desarrollo Local de Sumapaz.","Inversión",18,"Mejor movilidad para todos","Pilar 2 Democracía Urbana",1364,1026578776,"MANUEL ALEJANDRO GOMEZ ROA",28500000,null,0,1,2375000,30875000,23829167,"2019-01-29","2019-01-30","2020-02-29",360,30,null,null,"x",null,null,0.77179488259109308,null,{"$f":"IF(SUMPRODUCT((A$14:A70=A70)*(B$14:B70=B70)*(C$14:C70=C70))>1,0,1)","v":1},"Contratos de prestación de servicios profesionales y de apoyo a la gestión","Contratación directa",{"$f":"IFERROR(VLOOKUP(F70,Tipo!$C$12:$C$27,1,FALSE),\"NO\")","v":"Prestación de servicios profesionales y de apoyo a la gestión, o para la ejecución de trabajos artísticos que sólo puedan encomendarse a determinadas personas naturales;"},"Inversión",18]
["CPS-059-2019",2019,"FDLS-CD-062-2019","Contratos de prestación de servicios profesionales y de apoyo a la gestión","Contratación directa","Prestación de servicios profesionales y de apoyo a la gestión, o para la ejecución de trabajos artísticos que sólo puedan encomendarse a determinadas personas naturales;","Prestar los servicios de apoyo en las labores de oficios varios y notificación para la Cuenca del Rio Blanco y Cuenca Rio Sumapaz.","Inversión",45,"Gobernanza e influencia local, regional e internacional","Eje Transversal 4 Gobierno Legitimo, Fortalecimiento Local y Eficiencia",1375,79975491,"GILBERTO  RIVEROS ROMERO",21420000,null,0,null,null,21420000,17255000,"2019-02-05","2019-02-11","2020-02-10",360,null,null,null,"x",null,null,0.80555555555555558,null,{"$f":"IF(SUMPRODUCT((A$14:A71=A71)*(B$14:B71=B71)*(C$14:C71=C71))>1,0,1)","v":1},"Contratos de prestación de servicios profesionales y de apoyo a la gestión","Contratación directa",{"$f":"IFERROR(VLOOKUP(F71,Tipo!$C$12:$C$27,1,FALSE),\"NO\")","v":"Prestación de servicios profesionales y de apoyo a la gestión, o para la ejecución de trabajos artísticos que sólo puedan encomendarse a determinadas personas naturales;"},"Inversión",45]
["CPS-060-2019",2019,"FDLS-CD-063-2019","Contratos de prestación de servicios profesionales y de apoyo a la gestión","Contratación directa","Prestación de servicios profesionales y de apoyo a la gestión, o para la ejecución de trabajos artísticos que sólo puedan encomendarse a determinadas personas naturales;","Prestar sus servicios como auxiliar administrativo para el área de Gestión de Desarrollo de la Alcaldía Local de Sumapaz.","Inversión",45,"Gobernanza e influencia local, regional e internacional","Eje Transversal 4 Gobierno Legitimo, Fortalecimiento Local y Eficiencia",1375,1013658079,"JUANITA CAROLINA GONZALEZ CHACON",28476000,null,0,null,null,28476000,23571800,"2019-01-30","2019-01-31","2020-01-30",360,null,null,null,"x",null,null,0.82777777777777772,null,{"$f":"IF(SUMPRODUCT((A$14:A72=A72)*(B$14:B72=B72)*(C$14:C72=C72))>1,0,1)","v":1},"Contratos de prestación de servicios profesionales y de apoyo a la gestión","Contratación directa",{"$f":"IFERROR(VLOOKUP(F72,Tipo!$C$12:$C$27,1,FALSE),\"NO\")","v":"Prestación de servicios profesionales y de apoyo a la gestión, o para la ejecución de trabajos artísticos que sólo puedan encomendarse a determinadas personas naturales;"},"Inversión",45]
["CPS-061-2019",2019,"FDLS-CD-064-2019","Contratos de prestación de servicios profesionales y de apoyo a la gestión","Contratación directa","Prestación de servicios profesionales y de apoyo a la gestión, o para la ejecución de trabajos artísticos que sólo puedan encomendarse a determinadas personas naturales;","Prestar sus servicios como auxiliar de apoyo administrativo al área de Gestión Policiva de la Alcaldía Local de Sumapaz.","Inversión",45,"Gobernanza e influencia local, regional e internacional","Eje Transversal 4 Gobierno Legitimo, Fortalecimiento Local y Eficiencia",1375,1136886236,"BRANDON  PARRA RICARDO",28500000,null,0,null,null,28500000,23512500,"2019-01-30","2019-02-01","2020-01-31",360,null,null,null,"x",null,null,0.82499999999999996,null,{"$f":"IF(SUMPRODUCT((A$14:A73=A73)*(B$14:B73=B73)*(C$14:C73=C73))>1,0,1)","v":1},"Contratos de prestación de servicios profesionales y de apoyo a la gestión","Contratación directa",{"$f":"IFERROR(VLOOKUP(F73,Tipo!$C$12:$C$27,1,FALSE),\"NO\")","v":"Prestación de servicios profesionales y de apoyo a la gestión, o para la ejecución de trabajos artísticos que sólo puedan encomendarse a determinadas personas naturales;"},"Inversión",45]
["CPS-062-2019",2019,"FDLS-CD-065-2019","Contratos de prestación de servicios profesionales y de apoyo a la gestión","Contratación directa","Prestación de servicios profesionales y de apoyo a la gestión, o para la ejecución de trabajos artísticos que sólo puedan encomendarse a determinadas personas naturales;","Apoyar la formulación, gestión y seguimiento de actividades enfocadas a la gestión ambiental externa, encaminadas a la mitigación de los diferentes impactos ambientales y la conservación de los recursos naturales de la Localidad de Sumapaz.","Inversión",45,"Gobernanza e influencia local, regional e internacional","Eje Transversal 4 Gobierno Legitimo, Fortalecimiento Local y Eficiencia",1375,1010206785,"ANGIE KATHERINE CURREA VARGAS",59220000,null,0,null,null,59220000,48527500,"2019-01-30","2019-02-01","2020-02-05",360,null,null,null,"x",null,null,0.81944444444444442,null,{"$f":"IF(SUMPRODUCT((A$14:A74=A74)*(B$14:B74=B74)*(C$14:C74=C74))>1,0,1)","v":1},"Contratos de prestación de servicios profesionales y de apoyo a la gestión","Contratación directa",{"$f":"IFERROR(VLOOKUP(F74,Tipo!$C$12:$C$27,1,FALSE),\"NO\")","v":"Prestación de servicios profesionales y de apoyo a la gestión, o para la ejecución de trabajos artísticos que sólo puedan encomendarse a determinadas personas naturales;"},"Inversión",45]
["CPS-063-2019",2019,"FDLS-CD-066-2019","Contratos de prestación de servicios profesionales y de apoyo a la gestión","Contratación directa","Prestación de servicios profesionales y de apoyo a la gestión, o para la ejecución de trabajos artísticos que sólo puedan encomendarse a determinadas personas naturales;","Prestar sus servicios de apoyo para realizar actividades inherentes a la gestión documental de la Alcaldía Local de Sumapaz y la Corregiduría de San Juan.","Inversión",45,"Gobernanza e influencia local, regional e internacional","Eje Transversal 4 Gobierno Legitimo, Fortalecimiento Local y Eficiencia",1375,79321996,"JOSE FRANCISCO MARIN DIAZ",22680000,null,0,null,null,22680000,18900000,"2019-01-30","2019-02-01","2020-01-31",360,null,null,null,"x",null,null,0.83333333333333337,null,{"$f":"IF(SUMPRODUCT((A$14:A75=A75)*(B$14:B75=B75)*(C$14:C75=C75))>1,0,1)","v":1},"Contratos de prestación de servicios profesionales y de apoyo a la gestión","Contratación directa",{"$f":"IFERROR(VLOOKUP(F75,Tipo!$C$12:$C$27,1,FALSE),\"NO\")","v":"Prestación de servicios profesionales y de apoyo a la gestión, o para la ejecución de trabajos artísticos que sólo puedan encomendarse a determinadas personas naturales;"},"Inversión",45]
["CPS-064-2019",2019,"FDLS-CD-067-2019","Contratos de prestación de servicios profesionales y de apoyo a la gestión","Contratación directa","Prestación de servicios profesionales y de apoyo a la gestión, o para la ejecución de trabajos artísticos que sólo puedan encomendarse a determinadas personas naturales;","Apoyar la formulación, gestión y seguimiento de actividades enfocadas a la gestión ambiental externa, encaminadas a la mitigación de los diferentes impactos ambientales y la conservación de los recursos naturales de la Localidad de Sumapaz.","Inversión",45,"Gobernanza e influencia local, regional e internacional","Eje Transversal 4 Gobierno Legitimo, Fortalecimiento Local y Eficiencia",1375,1026277892,"WILLIAM ANDRES HERRERA PABON",59220000,null,0,null,null,59220000,48856500,"2019-01-30","2019-02-04","2020-02-03",360,null,null,null,"x",null,null,0.82499999999999996,null,{"$f":"IF(SUMPRODUCT((A$14:A76=A76)*(B$14:B76=B76)*(C$14:C76=C76))>1,0,1)","v":1},"Contratos de prestación de servicios profesionales y de apoyo a la gestión","Contratación directa",{"$f":"IFERROR(VLOOKUP(F76,Tipo!$C$12:$C$27,1,FALSE),\"NO\")","v":"Prestación de servicios profesionales y de apoyo a la gestión, o para la ejecución de trabajos artísticos que sólo puedan encomendarse a determinadas personas naturales;"},"Inversión",45]
["CPS-065-2019",2019,"FDLS-CD-068-2019","Contratos de prestación de servicios profesionales y de apoyo a la gestión","Contratación directa","Prestación de servicios profesionales y de apoyo a la gestión, o para la ejecución de trabajos artísticos que sólo puedan encomendarse a determinadas personas naturales;","Prestar sus servicios de apoyo para realizar actividades inherentes a la gestión documental de la Alcaldía Local de Sumapaz y la Corregiduría de Nazareth.","Inversión",45,"Gobernanza e influencia local, regional e internacional","Eje Transversal 4 Gobierno Legitimo, Fortalecimiento Local y Eficiencia",1375,35465903,"ALICIA  CHON DIAZ",22680000,null,0,null,null,22680000,18711000,"2019-01-31","2019-02-04","2020-02-03",360,null,null,null,"x",null,null,0.82499999999999996,null,{"$f":"IF(SUMPRODUCT((A$14:A77=A77)*(B$14:B77=B77)*(C$14:C77=C77))>1,0,1)","v":1},"Contratos de prestación de servicios profesionales y de apoyo a la gestión","Contratación directa",{"$f":"IFERROR(VLOOKUP(F77,Tipo!$C$12:$C$27,1,FALSE),\"NO\")","v":"Prestación de servicios profesionales y de apoyo a la gestión, o para la ejecución de trabajos artísticos que sólo puedan encomendarse a determinadas personas naturales;"},"Inversión",45]
["CPS-066-2019",2019,"FDLS-CD-069-2019","Contratos de prestación de servicios profesionales y de apoyo a la gestión","Contratación directa","Prestación de servicios profesionales y de apoyo a la gestión, o para la ejecución de trabajos artísticos que sólo puedan encomendarse a determinadas personas naturales;","Apoyar al (la) alcalde(sa) local en la promoción, articulación, acompañamiento y seguimiento para la atención y protección de los animales domésticos y silvestres de la localidad.","Inversión",45,"Gobernanza e influencia local, regional e internacional","Eje Transversal 4 Gobierno Legitimo, Fortalecimiento Local y Eficiencia",1375,1074129230,"CARLOS EDUARDO BRAVO COTRINO",59220000,null,0,null,null,59220000,48198500,"2019-01-31","2019-02-04","2020-02-07",360,null,null,null,"x",null,null,0.81388888888888888,null,{"$f":"IF(SUMPRODUCT((A$14:A78=A78)*(B$14:B78=B78)*(C$14:C78=C78))>1,0,1)","v":1},"Contratos de prestación de servicios profesionales y de apoyo a la gestión","Contratación directa",{"$f":"IFERROR(VLOOKUP(F78,Tipo!$C$12:$C$27,1,FALSE),\"NO\")","v":"Prestación de servicios profesionales y de apoyo a la gestión, o para la ejecución de trabajos artísticos que sólo puedan encomendarse a determinadas personas naturales;"},"Inversión",45]
["CPS-067-2019",2019,"FDLS-CD-070-2019","Contratos de prestación de servicios profesionales y de apoyo a la gestión","Contratación directa","Prestación de servicios profesionales y de apoyo a la gestión, o para la ejecución de trabajos artísticos que sólo puedan encomendarse a determinadas personas naturales;","Prestar los servicios de apoyo al Grupo de Gestión de Desarrollo Local en los temas Contables del Fondo de Desarrollo Local de Sumapaz.","Inversión",45,"Gobernanza e influencia local, regional e internacional","Eje Transversal 4 Gobierno Legitimo, Fortalecimiento Local y Eficiencia",1375,1022990524,"JOHN FREIDY VASQUEZ MARTINEZ",35280000,null,0,null,null,{"$f":"O79+Q79+S79","v":35280000},29106000,"2019-01-01","2019-02-04","2020-02-03",360,null,null,null,"x",null,null,0.82499999999999996,null,{"$f":"IF(SUMPRODUCT((A$14:A79=A79)*(B$14:B79=B79)*(C$14:C79=C79))>1,0,1)","v":1},"Contratos de prestación de servicios profesionales y de apoyo a la gestión","Contratación directa",{"$f":"IFERROR(VLOOKUP(F79,Tipo!$C$12:$C$27,1,FALSE),\"NO\")","v":"Prestación de servicios profesionales y de apoyo a la gestión, o para la ejecución de trabajos artísticos que sólo puedan encomendarse a determinadas personas naturales;"},"Inversión",45]
["CPS-068-2019",2019,"FDLS-CD-071-2019","Contratos de prestación de servicios profesionales y de apoyo a la gestión","Contratación directa","Prestación de servicios profesionales y de apoyo a la gestión, o para la ejecución de trabajos artísticos que sólo puedan encomendarse a determinadas personas naturales;","Prestar sus servicios técnicos para la gestión documental de la Alcaldía Local de Sumapaz.","Inversión",45,"Gobernanza e influencia local, regional e internacional","Eje Transversal 4 Gobierno Legitimo, Fortalecimiento Local y Eficiencia",1375,1010160606,"SANDRA JOHANNA APACHE CHICA",39756000,null,0,null,null,39756000,32798700,"2019-01-31","2019-02-04","2020-02-03",360,null,null,null,"x",null,null,0.82499999999999996,null,{"$f":"IF(SUMPRODUCT((A$14:A80=A80)*(B$14:B80=B80)*(C$14:C80=C80))>1,0,1)","v":1},"Contratos de prestación de servicios profesionales y de apoyo a la gestión","Contratación directa",{"$f":"IFERROR(VLOOKUP(F80,Tipo!$C$12:$C$27,1,FALSE),\"NO\")","v":"Prestación de servicios profesionales y de apoyo a la gestión, o para la ejecución de trabajos artísticos que sólo puedan encomendarse a determinadas personas naturales;"},"Inversión",45]
["CPS-069-2019",2019,"FDLS-CD-072-2019","Contratos de prestación de servicios profesionales y de apoyo a la gestión","Contratación directa","Prestación de servicios profesionales y de apoyo a la gestión, o para la ejecución de trabajos artísticos que sólo puedan encomendarse a determinadas personas naturales;","Prestar los servicios profesionales al Área de Gestión de Desarrollo Local para realiza la formulación, seguimiento a los diferentes procesos relacionados con la infraestructura de la localidad de Sumapaz.","Inversión",18,"Mejor movilidad para todos","Pilar 2 Democracía Urbana",1364,80538280,"OSCAR LEONARDO FORERO HIGUERA",61740000,null,0,null,null,61740000,50764000,"2019-02-04","2019-02-05","2020-02-04",360,null,null,null,"x",null,null,0.82222222222222219,null,{"$f":"IF(SUMPRODUCT((A$14:A81=A81)*(B$14:B81=B81)*(C$14:C81=C81))>1,0,1)","v":1},"Contratos de prestación de servicios profesionales y de apoyo a la gestión","Contratación directa",{"$f":"IFERROR(VLOOKUP(F81,Tipo!$C$12:$C$27,1,FALSE),\"NO\")","v":"Prestación de servicios profesionales y de apoyo a la gestión, o para la ejecución de trabajos artísticos que sólo puedan encomendarse a determinadas personas naturales;"},"Inversión",18]
["CPS-070-2019",2019,"FDLS-CD-073-2019","Contratos de prestación de servicios profesionales y de apoyo a la gestión","Contratación directa","Prestación de servicios profesionales y de apoyo a la gestión, o para la ejecución de trabajos artísticos que sólo puedan encomendarse a determinadas personas naturales;","Prestar los servicios de apoyo en las labores de radicación, conservación, clasificación y notificación de la correspondencia que emite la Junta Administradora Local de Sumapaz para la Bogotá Urbana y el Fondo de Desarrollo Local de Sumapaz.","Inversión",45,"Gobernanza e influencia local, regional e internacional","Eje Transversal 4 Gobierno Legitimo, Fortalecimiento Local y Eficiencia",1375,1012446237,"DIEGO FERNANDO BENAVIDES MOGOLLON",22680000,null,0,null,null,22680000,18648000,"2019-02-01","2019-02-05","2020-02-04",360,null,null,null,"x",null,null,0.82222222222222219,null,{"$f":"IF(SUMPRODUCT((A$14:A82=A82)*(B$14:B82=B82)*(C$14:C82=C82))>1,0,1)","v":1},"Contratos de prestación de servicios profesionales y de apoyo a la gestión","Contratación directa",{"$f":"IFERROR(VLOOKUP(F82,Tipo!$C$12:$C$27,1,FALSE),\"NO\")","v":"Prestación de servicios profesionales y de apoyo a la gestión, o para la ejecución de trabajos artísticos que sólo puedan encomendarse a determinadas personas naturales;"},"Inversión",45]
["CPS-071-2019",2019,"FDLS-CD-074-2019","Contratos de prestación de servicios profesionales y de apoyo a la gestión","Contratación directa","Prestación de servicios profesionales y de apoyo a la gestión, o para la ejecución de trabajos artísticos que sólo puedan encomendarse a determinadas personas naturales;","Prestar los servicios para operar el vehículo asignado, realizando de manera oportuna eficiente y segura los desplazamientos de los funcionarios del Fondo de Desarrollo Local del Sumapaz y/o demás personal que requiera ser trasladado en la zona urbana y rural de la localidad en cumplimiento de las actividades propias de la administración local.¿.","Inversión",45,"Gobernanza e influencia local, regional e internacional","Eje Transversal 4 Gobierno Legitimo, Fortalecimiento Local y Eficiencia",1375,17639781,"WILLIAM  CIFUENTES MEDINA",28224000,null,0,null,null,28224000,23206400,"2019-02-04","2019-02-05","2020-02-04",360,null,null,null,"x",null,null,0.82222222222222219,null,{"$f":"IF(SUMPRODUCT((A$14:A83=A83)*(B$14:B83=B83)*(C$14:C83=C83))>1,0,1)","v":1},"Contratos de prestación de servicios profesionales y de apoyo a la gestión","Contratación directa",{"$f":"IFERROR(VLOOKUP(F83,Tipo!$C$12:$C$27,1,FALSE),\"NO\")","v":"Prestación de servicios profesionales y de apoyo a la gestión, o para la ejecución de trabajos artísticos que sólo puedan encomendarse a determinadas personas naturales;"},"Inversión",45]
["CPS-072-2019",2019,"FDLS-CD-076-2019","Contratos de prestación de servicios profesionales y de apoyo a la gestión","Contratación directa","Prestación de servicios profesionales y de apoyo a la gestión, o para la ejecución de trabajos artísticos que sólo puedan encomendarse a determinadas personas naturales;","Prestar servicios profesionales para coordinar, liderar y asesorar los planes y estrategias de comunicación interna y externa para la divulgación de los programas, proyectos y actividades, como la realización y publicación de contenidos de redes sociales y canales de divulgación digital (sitio web) de la Alcaldía local.","Inversión",45,"Gobernanza e influencia local, regional e internacional","Eje Transversal 4 Gobierno Legitimo, Fortalecimiento Local y Eficiencia",1375,40037804,"CLAUDIA CONSTANZA CONTRERAS CORREA",102000000,null,0,null,null,102000000,82166667,"2019-02-06","2019-02-07","2020-02-16",360,null,null,null,"x",null,null,0.80555555882352936,null,{"$f":"IF(SUMPRODUCT((A$14:A84=A84)*(B$14:B84=B84)*(C$14:C84=C84))>1,0,1)","v":1},"Contratos de prestación de servicios profesionales y de apoyo a la gestión","Contratación directa",{"$f":"IFERROR(VLOOKUP(F84,Tipo!$C$12:$C$27,1,FALSE),\"NO\")","v":"Prestación de servicios profesionales y de apoyo a la gestión, o para la ejecución de trabajos artísticos que sólo puedan encomendarse a determinadas personas naturales;"},"Inversión",45]
["CPS-073-2019",2019,"FDLS-CD-077-2019","Contratos de prestación de servicios profesionales y de apoyo a la gestión","Contratación directa","Prestación de servicios profesionales y de apoyo a la gestión, o para la ejecución de trabajos artísticos que sólo puedan encomendarse a determinadas personas naturales;","Prestación de servicios de apoyo para las Corregidurías de Nazareth y Betania realizando actividades logísticas y operativas atendiendo los lineamientos de las diferentes áreas de la administración local en los bienes de propiedad del Fondo de Desarrollo Local y/o de la Alcaldía Local de Sumapaz.","Inversión",45,"Gobernanza e influencia local, regional e internacional","Eje Transversal 4 Gobierno Legitimo, Fortalecimiento Local y Eficiencia",1375,1915189,"ENRIQUE  HUERTAS",16380000,null,0,null,null,16380000,13104000,"2019-02-06","2019-02-11","2020-02-10",360,null,null,null,"x",null,null,0.8,null,{"$f":"IF(SUMPRODUCT((A$14:A85=A85)*(B$14:B85=B85)*(C$14:C85=C85))>1,0,1)","v":1},"Contratos de prestación de servicios profesionales y de apoyo a la gestión","Contratación directa",{"$f":"IFERROR(VLOOKUP(F85,Tipo!$C$12:$C$27,1,FALSE),\"NO\")","v":"Prestación de servicios profesionales y de apoyo a la gestión, o para la ejecución de trabajos artísticos que sólo puedan encomendarse a determinadas personas naturales;"},"Inversión",45]
["CPS-074-2019",2019,"FDLS-CD-075-2019","Contratos de prestación de servicios profesionales y de apoyo a la gestión","Contratación directa","Prestación de servicios profesionales y de apoyo a la gestión, o para la ejecución de trabajos artísticos que sólo puedan encomendarse a determinadas personas naturales;","PRESTAR LOS SERVICIOS TÉCNICOS PARA LA OPERACIÓN, SEGUIMIENTO Y CUMPLIMIENTO DE LOS PROCESOS Y PROCEDIMIENTOS DEL SERVICIO SOCIAL APOYOS PARA LA SEGURIDAD ECONÓMICA TIPO C, REQUERIDOS PARA EL OPORTUNO Y ADECUADO REGISTRO, CRUCE Y REPORTE DE LOS DATOS EN EL SISTEMA DE INFORMACIÓN Y REGISTRO DE BENEFICIARIOS-SIRBE, QUE CONTRIBUYAN A LA GARANTÍA DE LOS DERECHOS DE LA POBLACIÓN MAYOR EN EL MARCO DE LA POLÍTICA PÚBLICA SOCIAL PARA EL ENVEJECIMIENTO Y LA VEJEZ EN EL DISTRITO CAPITAL A CARGO DE LA ALCALDÍA LOCAL DE SUMAPAZ.","Inversión",3,"Igualdad y autonomía para una Bogotá incluyente","Pilar 1 Igualdad de Calidad de Vida",1334,1022998108,"CRISTIAN ANDRES VASQUEZ CHINGATE",34800000,null,0,null,null,34800000,27936667,"2019-02-07","2019-02-12","2020-02-11",360,null,null,null,"x",null,null,0.80277778735632188,null,{"$f":"IF(SUMPRODUCT((A$14:A86=A86)*(B$14:B86=B86)*(C$14:C86=C86))>1,0,1)","v":1},"Contratos de prestación de servicios profesionales y de apoyo a la gestión","Contratación directa",{"$f":"IFERROR(VLOOKUP(F86,Tipo!$C$12:$C$27,1,FALSE),\"NO\")","v":"Prestación de servicios profesionales y de apoyo a la gestión, o para la ejecución de trabajos artísticos que sólo puedan encomendarse a determinadas personas naturales;"},"Inversión",3]
["CIN-075-2019",2019,"FDLS-MC-056-2019","Interventoría","Contratación mínima cuantia","No aplica","Realizar la interventoría técnica, administrativa, financiera, y ambiental al contrato CPS 169-2018 y cuyo objeto es: ¿Prestar los servicios para la organización, coordinación y ejecución de la segunda fase de las escuelas de formación artística y cultural de Sumapaz¿ (EFACS II)","Inversión",11,"Mejores oportunidades para el desarrollo a través de la cultura, la recreación y el deporte","Pilar 1 Igualdad de Calidad de Vida",1353,52557243,"NOHORA JANNETH GUTIERREZ MILLAN",16800000,1,-16800000,null,null,0,0,"2019-02-13","2019-02-15","2019-12-13",255,45,null,null,null,"x",null,"-",null,{"$f":"IF(SUMPRODUCT((A$14:A87=A87)*(B$14:B87=B87)*(C$14:C87=C87))>1,0,1)","v":1},"Interventoría","Contratación mínima cuantia",{"$f":"IFERROR(VLOOKUP(F87,Tipo!$C$12:$C$27,1,FALSE),\"NO\")","v":"NO"},"Inversión",11]
["CIN-075-2019",2019,"FDLS-MC-056-2019","Interventoría","Contratación mínima cuantia","No aplica","Realizar la interventoría técnica, administrativa, financiera, y ambiental al contrato CPS 169-2018 y cuyo objeto es: ¿Prestar los servicios para la organización, coordinación y ejecución de la segunda fase de las escuelas de formación artística y cultural de Sumapaz¿ (EFACS II)","Inversión",11,"Mejores oportunidades para el desarrollo a través de la cultura, la recreación y el deporte","Pilar 1 Igualdad de Calidad de Vida",1353,52557243,"NOHORA JANNETH GUTIERREZ MILLAN",16800000,1,-16800000,null,null,0,0,"2019-02-13","2019-02-15","2019-12-13",255,45,null,null,null,"x",null,"-",null,{"$f":"IF(SUMPRODUCT((A$14:A88=A88)*(B$14:B88=B88)*(C$14:C88=C88))>1,0,1)","v":0},"Interventoría","Contratación mínima cuantia",{"$f":"IFERROR(VLOOKUP(F88,Tipo!$C$12:$C$27,1,FALSE),\"NO\")","v":"NO"},"Inversión",11]
["CIN-075-2019",2019,"FDLS-MC-056-2019","Interventoría","Contratación mínima cuantia","No aplica","Realizar la interventoría técnica, administrativa, financiera, y ambiental al contrato CPS 169-2018 y cuyo objeto es: ¿Prestar los servicios para la organización, coordinación y ejecución de la segunda fase de las escuelas de formación artística y cultural de Sumapaz¿ (EFACS II)","Inversión",11,"Mejores oportunidades para el desarrollo a través de la cultura, la recreación y el deporte","Pilar 1 Igualdad de Calidad de Vida",1353,52557243,"NOHORA JANNETH GUTIERREZ MILLAN",16800000,null,0,null,null,16800000,12600000,"2019-02-13","2019-02-15","2019-12-13",255,45,null,null,null,"x",null,0.75,null,{"$f":"IF(SUMPRODUCT((A$14:A89=A89)*(B$14:B89=B89)*(C$14:C89=C89))>1,0,1)","v":0},"Interventoría","Contratación mínima cuantia",{"$f":"IFERROR(VLOOKUP(F89,Tipo!$C$12:$C$27,1,FALSE),\"NO\")","v":"NO"},"Inversión",11]
["CPS-076-2019",2019,"FDLS-CD-081-2019","Contratos de prestación de servicios profesionales y de apoyo a la gestión","Contratación directa","Prestación de servicios profesionales y de apoyo a la gestión, o para la ejecución de trabajos artísticos que sólo puedan encomendarse a determinadas personas naturales;","PRESTAR LOS SERVICIOS PROFESIONALES PARA REALIZAR FORMULACIÓN, EVALUACIÓN, SEGUIMIENTO Y CONTROL DE PROYECTOS DE INVERSIÓN Y SEGUIMIENTO DE LOS PLANES, PROGRAMAS Y PROYECTOS DEL FONDO DE DESARROLLO LOCAL DE SUMAPAZ QUE SE SEAN ASIGNADOS. SE REEMPLAZA EL CDP 267 Y CRP 275 DE ACUERDO A LA RESOLUCIÓN 23 DE 2019","Inversión",11,"Mejores oportunidades para el desarrollo a través de la cultura, la recreación y el deporte","Pilar 1 Igualdad de Calidad de Vida",1353,1049622527,"MIGUEL AUGUSTO RODRIGUEZ RIAÑO",57739000,1,-57739000,null,null,0,0,"2019-02-25","2019-02-27","2020-02-07",330,null,null,null,"x",null,null,"-",null,{"$f":"IF(SUMPRODUCT((A$14:A90=A90)*(B$14:B90=B90)*(C$14:C90=C90))>1,0,1)","v":1},"Contratos de prestación de servicios profesionales y de apoyo a la gestión","Contratación directa",{"$f":"IFERROR(VLOOKUP(F90,Tipo!$C$12:$C$27,1,FALSE),\"NO\")","v":"Prestación de servicios profesionales y de apoyo a la gestión, o para la ejecución de trabajos artísticos que sólo puedan encomendarse a determinadas personas naturales;"},"Inversión",11]
["CPS-076-2019",2019,"FDLS-CD-081-2019","Contratos de prestación de servicios profesionales y de apoyo a la gestión","Contratación directa","Prestación de servicios profesionales y de apoyo a la gestión, o para la ejecución de trabajos artísticos que sólo puedan encomendarse a determinadas personas naturales;","Prestar los servicios profesionales para realizar formulación, evaluación, seguimiento y control de proyectos de inversión y seguimiento de los planes, programas y proyectos del fondo de desarrollo local de Sumapaz que se sean asignados. se reemplaza el cdp 267de acuerdo a la resolución 23 de 2019","Inversión",11,"Mejores oportunidades para el desarrollo a través de la cultura, la recreación y el deporte","Pilar 1 Igualdad de Calidad de Vida",1353,1049622527,"MIGUEL AUGUSTO RODRIGUEZ RIAÑO",57739000,null,0,null,null,57739000,46891067,"2019-02-25","2019-02-27","2020-02-07",330,null,null,null,"x",null,null,0.81212121789431757,null,{"$f":"IF(SUMPRODUCT((A$14:A91=A91)*(B$14:B91=B91)*(C$14:C91=C91))>1,0,1)","v":0},"Contratos de prestación de servicios profesionales y de apoyo a la gestión","Contratación directa",{"$f":"IFERROR(VLOOKUP(F91,Tipo!$C$12:$C$27,1,FALSE),\"NO\")","v":"Prestación de servicios profesionales y de apoyo a la gestión, o para la ejecución de trabajos artísticos que sólo puedan encomendarse a determinadas personas naturales;"},"Inversión",11]
["CPS-076-2019",2019,"FDLS-CD-081-2019","Contratos de prestación de servicios profesionales y de apoyo a la gestión","Contratación directa","Prestación de servicios profesionales y de apoyo a la gestión, o para la ejecución de trabajos artísticos que sólo puedan encomendarse a determinadas personas naturales;","Prestar los servicios profesionales para realizar formulación, evaluación, seguimiento y control de proyectos de inversión y seguimiento de los planes, programas y proyectos del fondo de desarrollo local de Sumapaz que se sean asignados.","Inversión",45,"Gobernanza e influencia local, regional e internacional","Eje Transversal 4 Gobierno Legitimo, Fortalecimiento Local y Eficiencia",1375,1049622527,"MIGUEL AUGUSTO RODRIGUEZ RIAÑO",57739000,1,-57739000,null,null,0,0,"2019-02-25","2019-02-27","2020-02-07",330,null,null,null,"x",null,null,"-",null,{"$f":"IF(SUMPRODUCT((A$14:A92=A92)*(B$14:B92=B92)*(C$14:C92=C92))>1,0,1)","v":0},"Contratos de prestación de servicios profesionales y de apoyo a la gestión","Contratación directa",{"$f":"IFERROR(VLOOKUP(F92,Tipo!$C$12:$C$27,1,FALSE),\"NO\")","v":"Prestación de servicios profesionales y de apoyo a la gestión, o para la ejecución de trabajos artísticos que sólo puedan encomendarse a determinadas personas naturales;"},"Inversión",45]
["CPS-077-2019",2019,"FDLS-CD-082-2019","Contratos de prestación de servicios profesionales y de apoyo a la gestión","Contratación directa","Prestación de servicios profesionales y de apoyo a la gestión, o para la ejecución de trabajos artísticos que sólo puedan encomendarse a determinadas personas naturales;","Prestar sus servicios técnicos de apoyo administrativo al área de gestión de Desarrollo  Local de la Alcaldía Local de Sumapaz","Inversión",45,"Gobernanza e influencia local, regional e internacional","Eje Transversal 4 Gobierno Legitimo, Fortalecimiento Local y Eficiencia",1375,52662125,"ANA MILENA SILVA CORTES",28875000,null,0,null,null,28875000,23362500,"2019-02-25","2019-03-04","2020-02-08",330,null,null,null,"x",null,null,0.80909090909090908,null,{"$f":"IF(SUMPRODUCT((A$14:A93=A93)*(B$14:B93=B93)*(C$14:C93=C93))>1,0,1)","v":1},"Contratos de prestación de servicios profesionales y de apoyo a la gestión","Contratación directa",{"$f":"IFERROR(VLOOKUP(F93,Tipo!$C$12:$C$27,1,FALSE),\"NO\")","v":"Prestación de servicios profesionales y de apoyo a la gestión, o para la ejecución de trabajos artísticos que sólo puedan encomendarse a determinadas personas naturales;"},"Inversión",45]
["CIN-078-2019",2019,"FDLS-CMA-051-2019","Interventoría","Concurso de méritos","No aplica","INTERVENTORIA TECNICA, ADMINISTRATIVA, SOCIAL, FINANCIERA, AMBIENTAL Y JURIDICA DEL CONTRATO FDLS-COP-173-2018 QUE TIENE POR OBJETO ¿REALIZAR POR EL SISTEMA DE PRECIOS UNITARIOS FIJOS SIN FORMULA DE REAJUSTE: LA CONSTRUCCION DE OBRAS DE MITIGACION PARA ATENDER LA RESTAURACION Y RECUPERACION DE ZONAS CON PROCESOS DE EROSION O FENOMENOS DE REMOSION EN MASA EN LA LOCALIDAD DE SUMAPAZ¿.","Inversión",4,"Familias protegidas y adaptadas al cambio climático","Pilar 1 Igualdad de Calidad de Vida",1340,"901260489-0","CONSORCIO INTER-MUROS 2019",69982095,null,0,2,83978514,153960609,66716056,"2019-02-22","2019-03-19","2019-12-08",150,180,null,null,null,"x",null,0.43333198298793429,null,{"$f":"IF(SUMPRODUCT((A$14:A94=A94)*(B$14:B94=B94)*(C$14:C94=C94))>1,0,1)","v":1},"Interventoría","Concurso de méritos",{"$f":"IFERROR(VLOOKUP(F94,Tipo!$C$12:$C$27,1,FALSE),\"NO\")","v":"NO"},"Inversión",4]
["CPS-079-2019",2019,"FDLS-MC-079-2019","Contratos de prestación de servicios","Contratación mínima cuantia","No aplica","Prestar los servicios logísticos para la realización del evento de rendición de cuentas de la vigencia 2018 para la localidad de Sumapaz.","Inversión",45,"Gobernanza e influencia local, regional e internacional","Eje Transversal 4 Gobierno Legitimo, Fortalecimiento Local y Eficiencia",1377,"901200939-7","GRUPO EMPRESARIAL G&H ASOCIADOS SAS",13701780,null,0,null,null,13701780,13701780,"2019-03-21","2019-03-29","2019-05-28",60,null,null,null,null,"x",null,1,null,{"$f":"IF(SUMPRODUCT((A$14:A95=A95)*(B$14:B95=B95)*(C$14:C95=C95))>1,0,1)","v":1},"Contratos de prestación de servicios","Contratación mínima cuantia",{"$f":"IFERROR(VLOOKUP(F95,Tipo!$C$12:$C$27,1,FALSE),\"NO\")","v":"NO"},"Inversión",45]
["CCV-080-2019",2019,"FDLS-MC-080-2019","Compraventa de bienes muebles","Contratación mínima cuantia","No aplica","Adquirir a título de compraventa muebles de oficina y enseres para la Alcaldía Local de Sumapaz","Inversión",45,"Gobernanza e influencia local, regional e internacional","Eje Transversal 4 Gobierno Legitimo, Fortalecimiento Local y Eficiencia",1375,"900350133-7","OFIBEST SAS",10575148,null,0,null,null,10575148,10575148,"2019-03-01","2019-03-12","2019-06-11",90,null,null,null,null,"x",null,1,null,{"$f":"IF(SUMPRODUCT((A$14:A96=A96)*(B$14:B96=B96)*(C$14:C96=C96))>1,0,1)","v":1},"Compraventa de bienes muebles","Contratación mínima cuantia",{"$f":"IFERROR(VLOOKUP(F96,Tipo!$C$12:$C$27,1,FALSE),\"NO\")","v":"NO"},"Inversión",45]
["CPS-081-2019",2019,"FDLS-MC-086-2019","Compraventa de bienes muebles","Contratación mínima cuantia","No aplica","Adquisición de chaquetas y cachuchas institucionales para la Alcaldía Local de Sumapaz.","FUNCIONAMIENTO",null," "," ",null,"900697272-2","COMERCIALIZADORA BENDITO SAS",7000000,null,0,null,null,7000000,7000000,"2019-03-21","2019-03-29","2019-05-28",60,null,null,null,null,"x",null,1,null,{"$f":"IF(SUMPRODUCT((A$14:A97=A97)*(B$14:B97=B97)*(C$14:C97=C97))>1,0,1)","v":1},"Compraventa de bienes muebles","Contratación mínima cuantia",{"$f":"IFERROR(VLOOKUP(F97,Tipo!$C$12:$C$27,1,FALSE),\"NO\")","v":"NO"},"Funcionamiento","NO"]
["CPS-082-2019",2019,"FDLS-SAMC-083-2019","Contratos de prestación de servicios","Selección abreviada","Selección abreviada por menor cuantía ","CONTRATAR LA PRESTACION DEL SERVICIO DE VIGILANCIA Y SEGURIDAD PRIVADA CON ARMAS, PARA SEDES DE ALCALDIA LOCAL SUMAPAZ BOGOTA DISTRITO CAPITAL D.C.","FUNCIONAMIENTO",null," "," ",null,"860518862-7","SEGURIDAD LAS AMERICAS LTDA SEGURIAMERICAS LTDA",68354904,1,-112069,1,34177452,102420287,102420287,"2019-03-29","2019-04-03","2019-10-02",120,60,null,null,null,null,"x",1,null,{"$f":"IF(SUMPRODUCT((A$14:A98=A98)*(B$14:B98=B98)*(C$14:C98=C98))>1,0,1)","v":1},"Contratos de prestación de servicios","Selección abreviada",{"$f":"IFERROR(VLOOKUP(F98,Tipo!$C$12:$C$27,1,FALSE),\"NO\")","v":"Selección abreviada por menor cuantía "},"Funcionamiento","NO"]
["CPS-083-2019",2019,"FDLS-SAMC-085-2019","Contratos de prestación de servicios","Selección abreviada","Selección abreviada por menor cuantía ","PRESTACION DE SERVICIOS PARA LA REALIZACION DEL EVENTO CULTURAL \"POR LOS DERECHOS DE LAS MUJERES.","Inversión",11,"Mejores oportunidades para el desarrollo a través de la cultura, la recreación y el deporte","Pilar 1 Igualdad de Calidad de Vida",1353,"901276993-1","UNION TEMPORAL JK",99009193,1,-522947,null,null,98486246,98486246,"2019-04-05","2019-05-10","2019-06-09",30,null,null,null,null,"x",null,1,null,{"$f":"IF(SUMPRODUCT((A$14:A99=A99)*(B$14:B99=B99)*(C$14:C99=C99))>1,0,1)","v":1},"Contratos de prestación de servicios","Selección abreviada",{"$f":"IFERROR(VLOOKUP(F99,Tipo!$C$12:$C$27,1,FALSE),\"NO\")","v":"Selección abreviada por menor cuantía "},"Inversión",11]
["CPS-084-2019",2019,"FDLS-CD-097-2019","Contratos de prestación de servicios profesionales y de apoyo a la gestión","Contratación directa","Prestación de servicios profesionales y de apoyo a la gestión, o para la ejecución de trabajos artísticos que sólo puedan encomendarse a determinadas personas naturales;","PRESTAR SUS SERVICIOS PROFESIONALES AL ÁREA GESTIÓN DE DESARROLLO LOCAL EN LOS PROYECTOS Y PROCESOS RELACIONADOS CON EL MANTENIMIENTO Y OPERATIVIDAD DEL PARQUE AUTOMOTOR DE PROPIEDAD DEL FDLS Y DEL QUE LLEGARE A SER RESPONSABLE","Inversión",18,"Mejor movilidad para todos","Pilar 2 Democracía Urbana",1364,1033771313,"MANUEL DAVID DIAZ TANGARIFE",37800000,null,0,1,4200000,42000000,29400000,"2019-04-12","2019-04-22","2020-02-21",270,30,null,null,"x",null,null,0.7,null,{"$f":"IF(SUMPRODUCT((A$14:A100=A100)*(B$14:B100=B100)*(C$14:C100=C100))>1,0,1)","v":1},"Contratos de prestación de servicios profesionales y de apoyo a la gestión","Contratación directa",{"$f":"IFERROR(VLOOKUP(F100,Tipo!$C$12:$C$27,1,FALSE),\"NO\")","v":"Prestación de servicios profesionales y de apoyo a la gestión, o para la ejecución de trabajos artísticos que sólo puedan encomendarse a determinadas personas naturales;"},"Inversión",18]
["CSE-085-2019",2019,"FDLS-SAMC-087-2019","Seguros","Selección abreviada","Selección abreviada por menor cuantía ","CONTRATAR LOS SEGUROS QUE AMPAREN LOS INTERESES PATRIMONIALES ACTUALES Y FUTUROS, ASÍ COMO LOS BIENES DE PROPIEDAD DE LA ALCALDIA LOCAL DE SUMAPAZ, QUE ESTÉN BAJO SU RESPONSABILIDAD Y CUSTODIA Y AQUELLOS QUE SEAN ADQUIRIDOS PARA DESARROLLAR LAS FUNCIONES INHERENTES A SU ACTIVIDAD, ASI COMO CUALQUIER OTRA PÓLIZA DE SEGUROS QUE REQUIERA LA ENTIDAD EN EL DESARROLLO DE SU ACTIVIDAD","FUNCIONAMIENTO",null," "," ",null,8605246546,"ASEGURADORA SOLIDARIA DE COLOMBIA ENTIDAD COOPERATIVA",104792356,1,-104792356,null,null,0,0,"2019-04-12","2019-04-16","2020-02-24",315,null,null,null,"x",null,null,"-",null,{"$f":"IF(SUMPRODUCT((A$14:A101=A101)*(B$14:B101=B101)*(C$14:C101=C101))>1,0,1)","v":1},"Seguros","Selección abreviada",{"$f":"IFERROR(VLOOKUP(F101,Tipo!$C$12:$C$27,1,FALSE),\"NO\")","v":"Selección abreviada por menor cuantía "},"Funcionamiento","NO"]
["CSE-085-2019",2019,"FDLS-SAMC-087-2019","Seguros","Selección abreviada","Selección abreviada por menor cuantía ","CONTRATAR LOS SEGUROS QUE AMPAREN LOS INTERESES PATRIMONIALES ACTUALES Y FUTUROS, ASÍ COMO LOS BIENES DE PROPIEDAD DE LA ALCALDIA LOCAL DE SUMAPAZ, QUE ESTÉN BAJO SU RESPONSABILIDAD Y CUSTODIA Y AQUELLOS QUE SEAN ADQUIRIDOS PARA DESARROLLAR LAS FUNCIONES INHERENTES A SU ACTIVIDAD, ASI COMO CUALQUIER OTRA PÓLIZA DE SEGUROS QUE REQUIERA LA ENTIDAD EN EL DESARROLLO DE SU ACTIVIDAD","FUNCIONAMIENTO",null," "," ",null,8605246546,"ASEGURADORA SOLIDARIA DE COLOMBIA ENTIDAD COOPERATIVA",104636870,null,0,null,null,104636870,104636870,"2019-04-12","2019-04-16","2020-02-24",315,null,null,null,"x",null,null,1,null,{"$f":"IF(SUMPRODUCT((A$14:A102=A102)*(B$14:B102=B102)*(C$14:C102=C102))>1,0,1)","v":0},"Seguros","Selección abreviada",{"$f":"IFERROR(VLOOKUP(F102,Tipo!$C$12:$C$27,1,FALSE),\"NO\")","v":"Selección abreviada por menor cuantía "},"Funcionamiento","NO"]
["CSE-085-2019",2019,"FDLS-SAMC-087-2019","Seguros","Selección abreviada","Selección abreviada por menor cuantía ","CONTRATAR LOS SEGUROS QUE AMPAREN LOS INTERESES PATRIMONIALES ACTUALES Y FUTUROS, ASÍ COMO LOS BIENES DE PROPIEDAD DE LA ALCALDIA LOCAL DE SUMAPAZ, QUE ESTÉN BAJO SU RESPONSABILIDAD Y CUSTODIA Y AQUELLOS QUE SEAN ADQUIRIDOS PARA DESARROLLAR LAS FUNCIONES INHERENTES A SU ACTIVIDAD, ASI COMO CUALQUIER OTRA PÓLIZA DE SEGUROS QUE REQUIERA LA ENTIDAD EN EL DESARROLLO DE SU ACTIVIDAD","FUNCIONAMIENTO",null," "," ",null,8605246546,"ASEGURADORA SOLIDARIA DE COLOMBIA ENTIDAD COOPERATIVA",54239815,1,-54239815,null,null,0,0,"2019-04-12","2019-04-16","2020-02-24",315,null,null,null,"x",null,null,"-",null,{"$f":"IF(SUMPRODUCT((A$14:A103=A103)*(B$14:B103=B103)*(C$14:C103=C103))>1,0,1)","v":0},"Seguros","Selección abreviada",{"$f":"IFERROR(VLOOKUP(F103,Tipo!$C$12:$C$27,1,FALSE),\"NO\")","v":"Selección abreviada por menor cuantía "},"Funcionamiento","NO"]
["CSE-085-2019",2019,"FDLS-SAMC-087-2019","Seguros","Selección abreviada","Selección abreviada por menor cuantía ","CONTRATAR LOS SEGUROS QUE AMPAREN LOS INTERESES PATRIMONIALES ACTUALES Y FUTUROS, ASÍ COMO LOS BIENES DE PROPIEDAD DE LA ALCALDIA LOCAL DE SUMAPAZ, QUE ESTÉN BAJO SU RESPONSABILIDAD Y CUSTODIA Y AQUELLOS QUE SEAN ADQUIRIDOS PARA DESARROLLAR LAS FUNCIONES INHERENTES A SU ACTIVIDAD, ASI COMO CUALQUIER OTRA PÓLIZA DE SEGUROS QUE REQUIERA LA ENTIDAD EN EL DESARROLLO DE SU ACTIVIDAD","FUNCIONAMIENTO",null," "," ",null,8605246546,"ASEGURADORA SOLIDARIA DE COLOMBIA ENTIDAD COOPERATIVA",53958605,null,0,null,null,53958605,53958605,"2019-04-12","2019-04-16","2020-02-24",315,null,null,null,"x",null,null,1,null,{"$f":"IF(SUMPRODUCT((A$14:A104=A104)*(B$14:B104=B104)*(C$14:C104=C104))>1,0,1)","v":0},"Seguros","Selección abreviada",{"$f":"IFERROR(VLOOKUP(F104,Tipo!$C$12:$C$27,1,FALSE),\"NO\")","v":"Selección abreviada por menor cuantía "},"Funcionamiento","NO"]
["CSE-085-2019",2019,"FDLS-SAMC-087-2019","Seguros","Selección abreviada","Selección abreviada por menor cuantía ","CONTRATAR LOS SEGUROS QUE AMPAREN LOS INTERESES PATRIMONIALES ACTUALES Y FUTUROS, ASÍ COMO LOS BIENES DE PROPIEDAD DE LA ALCALDIA LOCAL DE SUMAPAZ, QUE ESTÉN BAJO SU RESPONSABILIDAD Y CUSTODIA Y AQUELLOS QUE SEAN ADQUIRIDOS PARA DESARROLLAR LAS FUNCIONES INHERENTES A SU ACTIVIDAD, ASI COMO CUALQUIER OTRA PÓLIZA DE SEGUROS QUE REQUIERA LA ENTIDAD EN EL DESARROLLO DE SU ACTIVIDAD","FUNCIONAMIENTO",null," "," ",null,8605246546,"ASEGURADORA SOLIDARIA DE COLOMBIA ENTIDAD COOPERATIVA",23107192,null,0,null,null,23107192,23107192,"2019-04-12","2019-04-16","2020-02-24",315,null,null,null,"x",null,null,1,null,{"$f":"IF(SUMPRODUCT((A$14:A105=A105)*(B$14:B105=B105)*(C$14:C105=C105))>1,0,1)","v":0},"Seguros","Selección abreviada",{"$f":"IFERROR(VLOOKUP(F105,Tipo!$C$12:$C$27,1,FALSE),\"NO\")","v":"Selección abreviada por menor cuantía "},"Funcionamiento","NO"]
["CSE-085-2019",2019,"FDLS-SAMC-087-2019","Seguros","Selección abreviada","Selección abreviada por menor cuantía ","CONTRATAR LOS SEGUROS QUE AMPAREN LOS INTERESES PATRIMONIALES ACTUALES Y FUTUROS, ASÍ COMO LOS BIENES DE PROPIEDAD DE LA ALCALDIA LOCAL DE SUMAPAZ, QUE ESTÉN BAJO SU RESPONSABILIDAD Y CUSTODIA Y AQUELLOS QUE SEAN ADQUIRIDOS PARA DESARROLLAR LAS FUNCIONES INHERENTES A SU ACTIVIDAD, ASI COMO CUALQUIER OTRA PÓLIZA DE SEGUROS QUE REQUIERA LA ENTIDAD EN EL DESARROLLO DE SU ACTIVIDAD","FUNCIONAMIENTO",null," "," ",null,8605246546,"ASEGURADORA SOLIDARIA DE COLOMBIA ENTIDAD COOPERATIVA",18038128,null,0,null,null,18038128,0,"2019-04-12","2019-04-16","2020-02-24",315,null,null,null,"x",null,null,0,null,{"$f":"IF(SUMPRODUCT((A$14:A106=A106)*(B$14:B106=B106)*(C$14:C106=C106))>1,0,1)","v":0},"Seguros","Selección abreviada",{"$f":"IFERROR(VLOOKUP(F106,Tipo!$C$12:$C$27,1,FALSE),\"NO\")","v":"Selección abreviada por menor cuantía "},"Funcionamiento","NO"]
["CSE-085-2019",2019,"FDLS-SAMC-087-2019","Seguros","Selección abreviada","Selección abreviada por menor cuantía ","CONTRATAR LOS SEGUROS QUE AMPAREN LOS INTERESES PATRIMONIALES ACTUALES Y FUTUROS, ASÍ COMO LOS BIENES DE PROPIEDAD DE LA ALCALDIA LOCAL DE SUMAPAZ, QUE ESTÉN BAJO SU RESPONSABILIDAD Y CUSTODIA Y AQUELLOS QUE SEAN ADQUIRIDOS PARA DESARROLLAR LAS FUNCIONES INHERENTES A SU ACTIVIDAD, ASI COMO CUALQUIER OTRA PÓLIZA DE SEGUROS QUE REQUIERA LA ENTIDAD EN EL DESARROLLO DE SU ACTIVIDAD","FUNCIONAMIENTO",null," "," ",null,8605246546,"ASEGURADORA SOLIDARIA DE COLOMBIA ENTIDAD COOPERATIVA",18643716,null,0,null,null,18643716,18074959,"2019-04-12","2019-04-16","2020-02-24",315,null,null,null,"x",null,null,0.96949336709484313,null,{"$f":"IF(SUMPRODUCT((A$14:A107=A107)*(B$14:B107=B107)*(C$14:C107=C107))>1,0,1)","v":0},"Seguros","Selección abreviada",{"$f":"IFERROR(VLOOKUP(F107,Tipo!$C$12:$C$27,1,FALSE),\"NO\")","v":"Selección abreviada por menor cuantía "},"Funcionamiento","NO"]
["CPS-086-2019",2019,"FDLS-SAMC-089-2019","Contratos de prestación de servicios","Selección abreviada","Selección abreviada por menor cuantía ","PRESTAR LOS SERVICIOS PARA LA ELABORACIÓN, DISEÑO, DIAGRAMACIÓN E IMPRESIÓN DEL PERIÓDICO LOCAL \"EL RURAL\", ASÍ COMO LA ADQUISICIÓN DE LAS DEMÁS PIEZAS PUBLICITARIAS ESTABLECIDAS POR EL FONDO DE DESARROLLO LOCAL","FUNCIONAMIENTO",null," "," ",null,"830080869-6","FUNDACION S XXI RESCATE AMBIENTAL SOCIAL CULTURAL Y TURISTICO",45590088,null,0,null,null,45590088,43884405,"2019-04-26","2019-04-30","2020-01-29",270,null,null,null,"x",null,null,0.96258653854758958,null,{"$f":"IF(SUMPRODUCT((A$14:A108=A108)*(B$14:B108=B108)*(C$14:C108=C108))>1,0,1)","v":1},"Contratos de prestación de servicios","Selección abreviada",{"$f":"IFERROR(VLOOKUP(F108,Tipo!$C$12:$C$27,1,FALSE),\"NO\")","v":"Selección abreviada por menor cuantía "},"Funcionamiento","NO"]
["CPS-086-2019",2019,"FDLS-SAMC-089-2019","Contratos de prestación de servicios","Selección abreviada","Selección abreviada por menor cuantía ","PRESTAR LOS SERVICIOS PARA LA ELABORACIÓN, DISEÑO, DIAGRAMACIÓN E IMPRESIÓN DEL PERIÓDICO LOCAL \"EL RURAL\", ASÍ COMO LA ADQUISICIÓN DE LAS DEMÁS PIEZAS PUBLICITARIAS ESTABLECIDAS POR EL FONDO DE DESARROLLO LOCAL","FUNCIONAMIENTO",null," "," ",null,"830080869-6","FUNDACION S XXI RESCATE AMBIENTAL SOCIAL CULTURAL Y TURISTICO",10000000,null,0,null,null,10000000,0,"2019-04-26","2019-04-30","2020-01-29",270,null,null,null,"x",null,null,0,null,{"$f":"IF(SUMPRODUCT((A$14:A109=A109)*(B$14:B109=B109)*(C$14:C109=C109))>1,0,1)","v":0},"Contratos de prestación de servicios","Selección abreviada",{"$f":"IFERROR(VLOOKUP(F109,Tipo!$C$12:$C$27,1,FALSE),\"NO\")","v":"Selección abreviada por menor cuantía "},"Funcionamiento","NO"]
["CPS-086-2019",2019,"FDLS-SAMC-089-2019","Contratos de prestación de servicios","Selección abreviada","Selección abreviada por menor cuantía ","PRESTAR LOS SERVICIOS PARA LA ELABORACIÓN, DISEÑO, DIAGRAMACIÓN E IMPRESIÓN DEL PERIÓDICO LOCAL \"EL RURAL\", ASÍ COMO LA ADQUISICIÓN DE LAS DEMÁS PIEZAS PUBLICITARIAS ESTABLECIDAS POR EL FONDO DE DESARROLLO LOCAL","FUNCIONAMIENTO",null," "," ",null,"830080869-6","FUNDACION S XXI RESCATE AMBIENTAL SOCIAL CULTURAL Y TURISTICO",20000000,null,0,null,null,20000000,19014000,"2019-04-26","2019-04-30","2020-01-29",270,null,null,null,"x",null,null,0.95069999999999999,null,{"$f":"IF(SUMPRODUCT((A$14:A110=A110)*(B$14:B110=B110)*(C$14:C110=C110))>1,0,1)","v":0},"Contratos de prestación de servicios","Selección abreviada",{"$f":"IFERROR(VLOOKUP(F110,Tipo!$C$12:$C$27,1,FALSE),\"NO\")","v":"Selección abreviada por menor cuantía "},"Funcionamiento","NO"]
["CPS-086-2019",2019,"FDLS-SAMC-089-2019","Contratos de prestación de servicios","Selección abreviada","Selección abreviada por menor cuantía ","PRESTAR LOS SERVICIOS PARA LA ELABORACIÓN, DISEÑO, DIAGRAMACIÓN E IMPRESIÓN DEL PERIÓDICO LOCAL \"EL RURAL\", ASÍ COMO LA ADQUISICIÓN DE LAS DEMÁS PIEZAS PUBLICITARIAS ESTABLECIDAS POR EL FONDO DE DESARROLLO LOCAL","FUNCIONAMIENTO",null," "," ",null,"830080869-6","FUNDACION S XXI RESCATE AMBIENTAL SOCIAL CULTURAL Y TURISTICO",20000000,null,0,null,null,20000000,12662970,"2019-04-26","2019-04-30","2020-01-29",270,null,null,null,"x",null,null,0.6331485,null,{"$f":"IF(SUMPRODUCT((A$14:A111=A111)*(B$14:B111=B111)*(C$14:C111=C111))>1,0,1)","v":0},"Contratos de prestación de servicios","Selección abreviada",{"$f":"IFERROR(VLOOKUP(F111,Tipo!$C$12:$C$27,1,FALSE),\"NO\")","v":"Selección abreviada por menor cuantía "},"Funcionamiento","NO"]
["CPS-087-2019",2019,"FDLS-SAMC-090-2019 ","Contratos de prestación de servicios","Selección abreviada","Selección abreviada por menor cuantía ","PRESTACIÓN DEL SERVICIO DE MANTENIMIENTO PREVENTIVO/CORRECTIVO DE LA INFRAESTRUCTURA TECNOLÓGICA, INCLUIDO EL SUMINISTRO DE REPUESTOS PARA LA ALCALDÍA LOCAL DE SUMAPAZ","FUNCIONAMIENTO",null," "," ",null,8301223705,"SYSTEM NET INGENIERIA SAS",23234800,null,0,null,null,23234800,13173439,"2019-05-03","2019-05-13","2020-05-12",360,null,null,null,"x",null,null,0.56697019126482695,null,{"$f":"IF(SUMPRODUCT((A$14:A112=A112)*(B$14:B112=B112)*(C$14:C112=C112))>1,0,1)","v":1},"Contratos de prestación de servicios","Selección abreviada",{"$f":"IFERROR(VLOOKUP(F112,Tipo!$C$12:$C$27,1,FALSE),\"NO\")","v":"Selección abreviada por menor cuantía "},"Funcionamiento","NO"]
["CPS-088-2019",2019,"FDLS-LP-078-2019 ","Contratos de prestación de servicios","Licitación pública","No aplica","PRESTAR EL SERVICIO DE ASISTENCIA TÉCNICA DIRECTA RURAL AGROPECUARIA PARA LOS PEQUEÑOS Y MEDIANOS PRODUCTORES DE LA LOCALIDAD DE SUMAPAZ","Inversión",41,"Desarrollo rural sostenible","Eje Transversal 3 Sostenibilidad Ambiental basada en la eficiencia energética",1382,9002162246,"CONSULTORES Y EJECUTORES DE TECNOLOGIA AGROEMPRESARIAL S.A.S.",982156000,null,0,null,null,982156000,589293600,"2019-05-13","2019-05-20","2020-04-19",330,null,null,null,"x",null,null,0.6,null,{"$f":"IF(SUMPRODUCT((A$14:A113=A113)*(B$14:B113=B113)*(C$14:C113=C113))>1,0,1)","v":1},{"$f":"IFERROR(VLOOKUP(D113,tipo,1,FALSE),\"NO\")","v":"Contratos de prestación de servicios"},{"$f":"IFERROR(VLOOKUP(E113,modal,1,FALSE),\"NO\")","v":"Licitación pública"},{"$f":"IFERROR(VLOOKUP(F113,Tipo!$C$12:$C$27,1,FALSE),\"NO\")","v":"NO"},{"$f":"IFERROR(VLOOKUP(H113,afectacion,1,FALSE),\"NO\")","v":"Inversión"},{"$f":"IFERROR(VLOOKUP(I113,programa,1,FALSE),\"NO\")","v":41}]
["CPS-089-2019",2019,"FDLS-SAMC-096-2019 ","Contratos de prestación de servicios","Selección abreviada","Selección abreviada por menor cuantía ","PRESTAR EL SERVICIO DE MONITOREO CON ADQUISICIÓN DE GPS, PARA LA MAQUINARIA DE PROPIEDAD Y/O TENENCIA DEL FDLS","Inversión",18,"Mejor movilidad para todos","Pilar 2 Democracía Urbana",1364,9003361195,"DAR SOLUCIONES SAS",49846720,null,0,null,null,49846720,29238729,"2019-05-09","2019-05-20","2020-04-19",360,null,null,null,"x",null,null,0.58657277750672465,null,{"$f":"IF(SUMPRODUCT((A$14:A114=A114)*(B$14:B114=B114)*(C$14:C114=C114))>1,0,1)","v":1},"Contratos de prestación de servicios","Selección abreviada",{"$f":"IFERROR(VLOOKUP(F114,Tipo!$C$12:$C$27,1,FALSE),\"NO\")","v":"Selección abreviada por menor cuantía "},"Inversión",18]
["CSU-090-2019",2019,"FDLS-MC-101-2019 ","Suministro","Contratación mínima cuantia","No aplica","Suministrar materiales de construcción, elementos de ferretería y eléctricos para mantenimiento de la sede administrativa e inmuebles propiedad del fondo de desarrollo local de Sumapaz. Se expide a solicitud de Alcaldesa","FUNCIONAMIENTO",null," "," ",null,830073899,"COMERCIALIZADORA ELECTROCON SAS",10000000,null,0,null,null,10000000,10000000,"2019-05-15","2019-05-23","2019-08-22",90,null,null,null,null,null,"x",1,null,{"$f":"IF(SUMPRODUCT((A$14:A115=A115)*(B$14:B115=B115)*(C$14:C115=C115))>1,0,1)","v":1},"Suministro","Contratación mínima cuantia",{"$f":"IFERROR(VLOOKUP(F115,Tipo!$C$12:$C$27,1,FALSE),\"NO\")","v":"NO"},"Funcionamiento","NO"]
["CAR-091-2019",2019,"FDLS-CD-106-2019","Arrendamiento de bienes inmuebles","Contratación directa","El arrendamiento o adquisición de inmuebles","Adquirir a título de arrendamiento un (1) inmueble para el funcionamiento de la sede administrativa de la Alcaldía Local de Sumapaz, incluido el servicio de parqueadero","FUNCIONAMIENTO",null," "," ",null,860041749,"INMOBILIARIA COMERCIAL CRUZ Y PINZON LTDA",179808000,null,0,null,null,179808000,179807994,"2019-05-17","2019-05-18","2020-01-17",240,null,null,null,"x",null,null,0.99999996663107316,null,{"$f":"IF(SUMPRODUCT((A$14:A116=A116)*(B$14:B116=B116)*(C$14:C116=C116))>1,0,1)","v":1},"Arrendamiento de bienes inmuebles","Contratación directa",{"$f":"IFERROR(VLOOKUP(F116,Tipo!$C$12:$C$27,1,FALSE),\"NO\")","v":"El arrendamiento o adquisición de inmuebles"},"Funcionamiento","NO"]
["CPS-092-2019",2019,"FDLS-SAMC-094-2019","Contratos de prestación de servicios","Selección abreviada","Selección abreviada por menor cuantía ","PRESTACIÓN DE SERVICIOS PARA DESARROLLAR EL PROCESO DE INSTAURACIÓN DE SISTEMAS Y NÚCLEOS DE PRODUCCIÓN AGROPECUARIA, EN LA LOCALIDAD DE SUMAPAZ","Inversión",41,"Desarrollo rural sostenible","Eje Transversal 3 Sostenibilidad Ambiental basada en la eficiencia energética",1382,"901290759-2","UNION TEMPORAL AGROSUMAPAZ 2019",148835300,null,0,null,null,148835300,104184710,"2019-05-30","2019-06-11","2019-10-21",120,null,null,null,"x",null,null,0.7,null,{"$f":"IF(SUMPRODUCT((A$14:A117=A117)*(B$14:B117=B117)*(C$14:C117=C117))>1,0,1)","v":1},"Contratos de prestación de servicios","Selección abreviada",{"$f":"IFERROR(VLOOKUP(F117,Tipo!$C$12:$C$27,1,FALSE),\"NO\")","v":"Selección abreviada por menor cuantía "},"Inversión",41]
["CPS-093-2019",2019,"FDLS-SAMC-100-2019","Contratos de prestación de servicios","Selección abreviada","Selección abreviada por menor cuantía ","REALIZAR LOS JUEGOS RURALES DE LA LOCALIDAD DE SUMAPAZ PARA LA VIGENCIA 2019. SE EXPIDE A SOLICITUD DE LA ALCALDESA","Inversión",11,"Mejores oportunidades para el desarrollo a través de la cultura, la recreación y el deporte","Pilar 1 Igualdad de Calidad de Vida",1353,"830059289-7","ASOCIACION DE DISCAPACITADOS FISICOS DEL SUR ASODISFISUR",222869272,null,0,null,null,222869272,111434636,"2019-06-05","2019-07-04","2019-10-03",90,null,null,null,"x",null,null,0.5,null,{"$f":"IF(SUMPRODUCT((A$14:A118=A118)*(B$14:B118=B118)*(C$14:C118=C118))>1,0,1)","v":1},"Contratos de prestación de servicios","Selección abreviada",{"$f":"IFERROR(VLOOKUP(F118,Tipo!$C$12:$C$27,1,FALSE),\"NO\")","v":"Selección abreviada por menor cuantía "},"Inversión",11]
["COP-094-2019",2019,"FDLS-LP-095-2019","Obra pública","Licitación pública","No aplica","CONTRATAR LAS OBRAS PARA LA CONSERVACION DE LA MALLA VIAL LOCAL DE SUMAPAZ, POR EL SISTEMA DE PRECIOS UNITARIOS FIJOS, SIN FORMULA DE REAJUUSTE Y A MONTO AGOTABLE, SE EXPIDE A SOLICITUD Y SE ACOGE AL ULTIMO PARRAFO DEL MEMORANDO 20192100173253","Inversión",18,"Mejor movilidad para todos","Pilar 2 Democracía Urbana",1364,"901298274-9","CONSORCIO SUMAPAZ 2 2019",11584886083,null,0,null,null,11584886083,3475465825,"2019-06-19","2019-08-20","2020-06-19",300,null,null,null,"x",null,null,0.30000000000863192,null,{"$f":"IF(SUMPRODUCT((A$14:A119=A119)*(B$14:B119=B119)*(C$14:C119=C119))>1,0,1)","v":1},"Obra pública","Licitación pública",{"$f":"IFERROR(VLOOKUP(F119,Tipo!$C$12:$C$27,1,FALSE),\"NO\")","v":"NO"},"Inversión",18]
["CIN-095-2019",2019,"FDLS-MC-115-2019","Interventoría","Contratación mínima cuantia","No aplica","Realizar la interventoría técnica, administrativa, financiera y ambiental al contrato cuyo objeto es: ¿Realizar los Juegos Rurales de la Localidad de Sumapaz para la vigencia 2019¿.","Inversión",11,"Mejores oportunidades para el desarrollo a través de la cultura, la recreación y el deporte","Pilar 1 Igualdad de Calidad de Vida",1353,52268409,"LORENA  MENDEZ VALLEJO",9800000,null,0,null,null,9800000,2800000,"2019-06-27","2019-07-04","2019-10-18",105,null,null,null,null,"x",null,0.2857142857142857,null,{"$f":"IF(SUMPRODUCT((A$14:A120=A120)*(B$14:B120=B120)*(C$14:C120=C120))>1,0,1)","v":1},"Interventoría","Contratación mínima cuantia",{"$f":"IFERROR(VLOOKUP(F120,Tipo!$C$12:$C$27,1,FALSE),\"NO\")","v":"NO"},"Inversión",11]
["CPS-096-2019",2019,"FDLS-CD-117-2019","Contratos de prestación de servicios profesionales y de apoyo a la gestión","Contratación directa","Prestación de servicios profesionales y de apoyo a la gestión, o para la ejecución de trabajos artísticos que sólo puedan encomendarse a determinadas personas naturales;","CONTRATAR LOS SERVICIOS DE UN BACHILLER PARA EL FORTALECIMIENTO A LA GESTIÓN LOCAL DE PROCESOS INSTITUCIONALES Y SOCIALES DE INTERÉS PÚBLICO ARTICULADA POR EL FONDO DE DESARROLLO LOCAL DE SUMAPAZ EN COMPAÑÍA DE SECTORES ADMINISTRATIVOS DEL DISTRITO, INSTANCIAS Y ORGANIZACIONES SOCIALES EN LA LOCALIDAD.","Inversión",45,"Gobernanza e influencia local, regional e internacional","Eje Transversal 4 Gobierno Legitimo, Fortalecimiento Local y Eficiencia",1375,1022954998,"NANCY CAROLINA POVEDA HUERTAS",14000000,null,0,null,null,14000000,9800000,"2019-06-26","2019-07-04","2020-02-03",210,null,null,null,"x",null,null,0.7,null,{"$f":"IF(SUMPRODUCT((A$14:A121=A121)*(B$14:B121=B121)*(C$14:C121=C121))>1,0,1)","v":1},"Contratos de prestación de servicios profesionales y de apoyo a la gestión","Contratación directa",{"$f":"IFERROR(VLOOKUP(F121,Tipo!$C$12:$C$27,1,FALSE),\"NO\")","v":"Prestación de servicios profesionales y de apoyo a la gestión, o para la ejecución de trabajos artísticos que sólo puedan encomendarse a determinadas personas naturales;"},"Inversión",45]
["CPS-097-2019",2019,"FDLS-CD-118-2019","Contratos de prestación de servicios profesionales y de apoyo a la gestión","Contratación directa","Prestación de servicios profesionales y de apoyo a la gestión, o para la ejecución de trabajos artísticos que sólo puedan encomendarse a determinadas personas naturales;","CONTRATAR LOS SERVICIOS DE UN BACHILLER PARA EL FORTALECIMIENTO A LA GESTIÓN LOCAL DE PROCESOS INSTITUCIONALES Y SOCIALES DE INTERÉS PÚBLICO ARTICULADA POR EL FONDO DE DESARROLLO LOCAL DE SUMAPAZ EN COMPAÑÍA DE SECTORES ADMINISTRATIVOS DEL DISTRITO, INSTANCIAS Y ORGANIZACIONES SOCIALES EN LA LOCALIDAD.","Inversión",45,"Gobernanza e influencia local, regional e internacional","Eje Transversal 4 Gobierno Legitimo, Fortalecimiento Local y Eficiencia",1375,79626757,"PEDRO JAVIER VELASQUEZ CASTAÑEDA",14000000,1,-9666667,null,null,4333333,4333333,"2019-06-26","2019-07-04","2020-02-03",210,null,null,null,"x",null,null,1,null,{"$f":"IF(SUMPRODUCT((A$14:A122=A122)*(B$14:B122=B122)*(C$14:C122=C122))>1,0,1)","v":1},"Contratos de prestación de servicios profesionales y de apoyo a la gestión","Contratación directa",{"$f":"IFERROR(VLOOKUP(F122,Tipo!$C$12:$C$27,1,FALSE),\"NO\")","v":"Prestación de servicios profesionales y de apoyo a la gestión, o para la ejecución de trabajos artísticos que sólo puedan encomendarse a determinadas personas naturales;"},"Inversión",45]
["CPS-098-2019",2019,"FDLS-CD-119-2019","Contratos de prestación de servicios profesionales y de apoyo a la gestión","Contratación directa","Prestación de servicios profesionales y de apoyo a la gestión, o para la ejecución de trabajos artísticos que sólo puedan encomendarse a determinadas personas naturales;","CONTRATAR LOS SERVICIOS DE UN BACHILLER PARA EL FORTALECIMIENTO A LA GESTIÓN LOCAL DE PROCESOS INSTITUCIONALES Y SOCIALES DE INTERÉS PÚBLICO ARTICULADA POR EL FONDO DE DESARROLLO LOCAL DE SUMAPAZ EN COMPAÑÍA DE SECTORES ADMINISTRATIVOS DEL DISTRITO, INSTANCIAS Y ORGANIZACIONES SOCIALES EN LA LOCALIDAD.","Inversión",45,"Gobernanza e influencia local, regional e internacional","Eje Transversal 4 Gobierno Legitimo, Fortalecimiento Local y Eficiencia",1375,1102796422,"WILLIAM ANDRES MEZA OTERO",14000000,null,0,null,null,14000000,9800000,"2019-06-26","2019-07-04","2020-02-03",210,null,null,null,"x",null,null,0.7,null,{"$f":"IF(SUMPRODUCT((A$14:A123=A123)*(B$14:B123=B123)*(C$14:C123=C123))>1,0,1)","v":1},"Contratos de prestación de servicios profesionales y de apoyo a la gestión","Contratación directa",{"$f":"IFERROR(VLOOKUP(F123,Tipo!$C$12:$C$27,1,FALSE),\"NO\")","v":"Prestación de servicios profesionales y de apoyo a la gestión, o para la ejecución de trabajos artísticos que sólo puedan encomendarse a determinadas personas naturales;"},"Inversión",45]
["CPS-099-2019",2019,"FDLS-CD-120-2019","Contratos de prestación de servicios profesionales y de apoyo a la gestión","Contratación directa","Prestación de servicios profesionales y de apoyo a la gestión, o para la ejecución de trabajos artísticos que sólo puedan encomendarse a determinadas personas naturales;","CONTRATAR LOS SERVICIOS DE UN BACHILLER PARA EL FORTALECIMIENTO A LA GESTIÓN LOCAL DE PROCESOS INSTITUCIONALES Y SOCIALES DE INTERÉS PÚBLICO ARTICULADA POR EL FONDO DE DESARROLLO LOCAL DE SUMAPAZ EN COMPAÑÍA DE SECTORES ADMINISTRATIVOS DEL DISTRITO, INSTANCIAS Y ORGANIZACIONES SOCIALES EN LA LOCALIDAD.","Inversión",45,"Gobernanza e influencia local, regional e internacional","Eje Transversal 4 Gobierno Legitimo, Fortalecimiento Local y Eficiencia",1375,53072839,"LUZ ADRIANA SOLANO SUAREZ",14000000,null,0,null,null,14000000,9800000,"2019-06-26","2019-07-04","2020-02-03",210,null,null,null,"x",null,null,0.7,null,{"$f":"IF(SUMPRODUCT((A$14:A124=A124)*(B$14:B124=B124)*(C$14:C124=C124))>1,0,1)","v":1},"Contratos de prestación de servicios profesionales y de apoyo a la gestión","Contratación directa",{"$f":"IFERROR(VLOOKUP(F124,Tipo!$C$12:$C$27,1,FALSE),\"NO\")","v":"Prestación de servicios profesionales y de apoyo a la gestión, o para la ejecución de trabajos artísticos que sólo puedan encomendarse a determinadas personas naturales;"},"Inversión",45]
["CPS-100-2019",2019,"FDLS-CD-127-2019","Contratos de prestación de servicios profesionales y de apoyo a la gestión","Contratación directa","Prestación de servicios profesionales y de apoyo a la gestión, o para la ejecución de trabajos artísticos que sólo puedan encomendarse a determinadas personas naturales;","REEMPLAZA AL CRP 402, POR ERROR INVOLUNTARIO CON OBJETO CONTRATAR LOS SERVICIOS DE UN BACHILLER PARA EL FORTALECIMIENTO A LA GESTIÓN LOCAL DE PROCESOS INSTITUCIONALES Y SOCIALES DE INTERÉS PÚBLICO ARTICULADA POR EL FONDO DE DESARROLLO LOCAL DE SUMAPAZ EN COMPAÑÍA DE SECTORES ADMINISTRATIVOS DEL DISTRITO, INSTANCIAS Y ORGANIZACIONES SOCIALES EN LA LOCALIDAD.","Inversión",45,"Gobernanza e influencia local, regional e internacional","Eje Transversal 4 Gobierno Legitimo, Fortalecimiento Local y Eficiencia",1375,53102434,"JENNIFER YURANI CORONADO DUQUE",10200000,null,0,null,null,10200000,6000000,"2019-06-26","2019-07-04","2020-02-03",210,null,null,null,"x",null,null,0.58823529411764708,null,{"$f":"IF(SUMPRODUCT((A$14:A125=A125)*(B$14:B125=B125)*(C$14:C125=C125))>1,0,1)","v":1},"Contratos de prestación de servicios profesionales y de apoyo a la gestión","Contratación directa",{"$f":"IFERROR(VLOOKUP(F125,Tipo!$C$12:$C$27,1,FALSE),\"NO\")","v":"Prestación de servicios profesionales y de apoyo a la gestión, o para la ejecución de trabajos artísticos que sólo puedan encomendarse a determinadas personas naturales;"},"Inversión",45]
["CPS-101-2019",2019,"FDLS-CD-121-2019","Contratos de prestación de servicios profesionales y de apoyo a la gestión","Contratación directa","Prestación de servicios profesionales y de apoyo a la gestión, o para la ejecución de trabajos artísticos que sólo puedan encomendarse a determinadas personas naturales;","CONTRATAR LOS SERVICIOS DE UN BACHILLER PARA EL FORTALECIMIENTO A LA GESTIÓN LOCAL DE PROCESOS INSTITUCIONALES Y SOCIALES DE INTERÉS PÚBLICO ARTICULADA POR EL FONDO DE DESARROLLO LOCAL DE SUMAPAZ EN COMPAÑÍA DE SECTORES ADMINISTRATIVOS DEL DISTRITO, INSTANCIAS Y ORGANIZACIONES SOCIALES EN LA LOCALIDAD.","Inversión",45,"Gobernanza e influencia local, regional e internacional","Eje Transversal 4 Gobierno Legitimo, Fortalecimiento Local y Eficiencia",1375,80733543,"ALDO MILLAR GARZON ANGEL",14000000,null,0,null,null,14000000,9800000,"2019-06-26","2019-07-04","2020-02-03",210,null,null,null,"x",null,null,0.7,null,{"$f":"IF(SUMPRODUCT((A$14:A126=A126)*(B$14:B126=B126)*(C$14:C126=C126))>1,0,1)","v":1},"Contratos de prestación de servicios profesionales y de apoyo a la gestión","Contratación directa",{"$f":"IFERROR(VLOOKUP(F126,Tipo!$C$12:$C$27,1,FALSE),\"NO\")","v":"Prestación de servicios profesionales y de apoyo a la gestión, o para la ejecución de trabajos artísticos que sólo puedan encomendarse a determinadas personas naturales;"},"Inversión",45]
["CPS-102-2019",2019,"FDLS-CD-123-2019","Contratos de prestación de servicios profesionales y de apoyo a la gestión","Contratación directa","Prestación de servicios profesionales y de apoyo a la gestión, o para la ejecución de trabajos artísticos que sólo puedan encomendarse a determinadas personas naturales;","CONTRATAR LOS SERVICIOS DE UN BACHILLER PARA EL FORTALECIMIENTO A LA GESTIÓN LOCAL DE PROCESOS INSTITUCIONALES Y SOCIALES DE INTERÉS PÚBLICO ARTICULADA POR EL FONDO DE DESARROLLO LOCAL DE SUMAPAZ EN COMPAÑÍA DE SECTORES ADMINISTRATIVOS DEL DISTRITO, INSTANCIAS Y ORGANIZACIONES SOCIALES EN LA LOCALIDAD.","Inversión",45,"Gobernanza e influencia local, regional e internacional","Eje Transversal 4 Gobierno Legitimo, Fortalecimiento Local y Eficiencia",1375,80830022,"ANDRES DAVID CAICEDO TELLO",14000000,null,0,null,null,14000000,9800000,"2019-06-26","2019-07-04","2020-02-03",210,null,null,null,"x",null,null,0.7,null,{"$f":"IF(SUMPRODUCT((A$14:A127=A127)*(B$14:B127=B127)*(C$14:C127=C127))>1,0,1)","v":1},"Contratos de prestación de servicios profesionales y de apoyo a la gestión","Contratación directa",{"$f":"IFERROR(VLOOKUP(F127,Tipo!$C$12:$C$27,1,FALSE),\"NO\")","v":"Prestación de servicios profesionales y de apoyo a la gestión, o para la ejecución de trabajos artísticos que sólo puedan encomendarse a determinadas personas naturales;"},"Inversión",45]
["CIA-103-2019",2019,"FDLS-CD-122-2019","Contratos interadministrativos","Contratación directa","Prestación de servicios profesionales y de apoyo a la gestión, o para la ejecución de trabajos artísticos que sólo puedan encomendarse a determinadas personas naturales;","Aunar esfuerzos entre la Subred Integra de Servicios de Salud Sur y el FDL Sumapaz para el otorgamiento de dispositivos de asistencia personal, no incluidas o no cubiertas en el plan obligatorio de salud -POS","Inversión",3,"Igualdad y autonomía para una Bogotá incluyente","Pilar 1 Igualdad de Calidad de Vida",1334,900958564,"SUBRED INTEGRADA DE SERVICIOS DE SALUD SUR E.S.E",81354722,null,0,null,null,81354722,0,"2019-06-26","2019-09-18","2020-05-17",240,null,null,null,"x",null,null,0,null,{"$f":"IF(SUMPRODUCT((A$14:A128=A128)*(B$14:B128=B128)*(C$14:C128=C128))>1,0,1)","v":1},"Contratos interadministrativos","Contratación directa",{"$f":"IFERROR(VLOOKUP(F128,Tipo!$C$12:$C$27,1,FALSE),\"NO\")","v":"Prestación de servicios profesionales y de apoyo a la gestión, o para la ejecución de trabajos artísticos que sólo puedan encomendarse a determinadas personas naturales;"},"Inversión",3]
["CPS-104-2019",2019,"FDLS-CD-124-2019","Contratos de prestación de servicios profesionales y de apoyo a la gestión","Contratación directa","Prestación de servicios profesionales y de apoyo a la gestión, o para la ejecución de trabajos artísticos que sólo puedan encomendarse a determinadas personas naturales;","CONTRATAR LOS SERVICIOS DE UN BACHILLER PARA EL FORTALECIMIENTO A LA GESTIÓN LOCAL DE PROCESOS INSTITUCIONALES Y SOCIALES DE INTERÉS PÚBLICO ARTICULADA POR EL FONDO DE DESARROLLO LOCAL DE SUMAPAZ EN COMPAÑÍA DE SECTORES ADMINISTRATIVOS DEL DISTRITO, INSTANCIAS Y ORGANIZACIONES SOCIALES EN LA LOCALIDAD.","Inversión",45,"Gobernanza e influencia local, regional e internacional","Eje Transversal 4 Gobierno Legitimo, Fortalecimiento Local y Eficiencia",1375,1030643941,"MIGUEL ANGEL SANCHEZ MARTINEZ",14000000,null,0,null,null,14000000,9800000,"2019-06-26","2019-07-04","2020-02-03",210,null,null,null,"x",null,null,0.7,null,{"$f":"IF(SUMPRODUCT((A$14:A129=A129)*(B$14:B129=B129)*(C$14:C129=C129))>1,0,1)","v":1},"Contratos de prestación de servicios profesionales y de apoyo a la gestión","Contratación directa",{"$f":"IFERROR(VLOOKUP(F129,Tipo!$C$12:$C$27,1,FALSE),\"NO\")","v":"Prestación de servicios profesionales y de apoyo a la gestión, o para la ejecución de trabajos artísticos que sólo puedan encomendarse a determinadas personas naturales;"},"Inversión",45]
["CPS-105-2019",2019,"FDLS-CD-125-2019","Contratos de prestación de servicios profesionales y de apoyo a la gestión","Contratación directa","Prestación de servicios profesionales y de apoyo a la gestión, o para la ejecución de trabajos artísticos que sólo puedan encomendarse a determinadas personas naturales;","CONTRATAR LOS SERVICIOS DE UN BACHILLER PARA EL FORTALECIMIENTO A LA GESTIÓN LOCAL DE PROCESOS INSTITUCIONALES Y SOCIALES DE INTERÉS PÚBLICO ARTICULADA POR EL FONDO DE DESARROLLO LOCAL DE SUMAPAZ EN COMPAÑÍA DE SECTORES ADMINISTRATIVOS DEL DISTRITO, INSTANCIAS Y ORGANIZACIONES SOCIALES EN LA LOCALIDAD.","Inversión",45,"Gobernanza e influencia local, regional e internacional","Eje Transversal 4 Gobierno Legitimo, Fortalecimiento Local y Eficiencia",1375,1030622765,"LUIS FELIPE ALONSO MONTES",14000000,null,0,null,null,14000000,9800000,"2019-06-26","2019-07-04","2020-02-03",210,null,null,null,"x",null,null,0.7,null,{"$f":"IF(SUMPRODUCT((A$14:A130=A130)*(B$14:B130=B130)*(C$14:C130=C130))>1,0,1)","v":1},"Contratos de prestación de servicios profesionales y de apoyo a la gestión","Contratación directa",{"$f":"IFERROR(VLOOKUP(F130,Tipo!$C$12:$C$27,1,FALSE),\"NO\")","v":"Prestación de servicios profesionales y de apoyo a la gestión, o para la ejecución de trabajos artísticos que sólo puedan encomendarse a determinadas personas naturales;"},"Inversión",45]
["CPS-106-2019",2019,"FDLS-CD-126-2019","Contratos de prestación de servicios profesionales y de apoyo a la gestión","Contratación directa","Prestación de servicios profesionales y de apoyo a la gestión, o para la ejecución de trabajos artísticos que sólo puedan encomendarse a determinadas personas naturales;","CONTRATAR LOS SERVICIOS DE UN BACHILLER PARA EL FORTALECIMIENTO A LA GESTIÓN LOCAL DE PROCESOS INSTITUCIONALES Y SOCIALES DE INTERÉS PÚBLICO ARTICULADA POR EL FONDO DE DESARROLLO LOCAL DE SUMAPAZ EN COMPAÑÍA DE SECTORES ADMINISTRATIVOS DEL DISTRITO, INSTANCIAS Y ORGANIZACIONES SOCIALES EN LA LOCALIDAD.","Inversión",45,"Gobernanza e influencia local, regional e internacional","Eje Transversal 4 Gobierno Legitimo, Fortalecimiento Local y Eficiencia",1375,79967743,"ROBINSON LEANDRO GIRALDO CARDONA",14000000,null,0,null,null,14000000,9800000,"2019-06-26","2019-07-04","2020-02-03",210,null,null,null,"x",null,null,0.7,null,{"$f":"IF(SUMPRODUCT((A$14:A131=A131)*(B$14:B131=B131)*(C$14:C131=C131))>1,0,1)","v":1},"Contratos de prestación de servicios profesionales y de apoyo a la gestión","Contratación directa",{"$f":"IFERROR(VLOOKUP(F131,Tipo!$C$12:$C$27,1,FALSE),\"NO\")","v":"Prestación de servicios profesionales y de apoyo a la gestión, o para la ejecución de trabajos artísticos que sólo puedan encomendarse a determinadas personas naturales;"},"Inversión",45]
["CPS-107-2019",2019,"FDLS-CD-128-2019","Contratos de prestación de servicios profesionales y de apoyo a la gestión","Contratación directa","Prestación de servicios profesionales y de apoyo a la gestión, o para la ejecución de trabajos artísticos que sólo puedan encomendarse a determinadas personas naturales;","APOYAR AL EQUIPO DE PRENSA Y COMUNICACIONES DE LA ALCALDÍA LOCAL MEDIANTE EL REGISTRO, LA EDICIÓN Y LA PRESENTACIÓN DE FOTOGRAFÍAS DE LOS ACONTECIMIENTOS, HECHOS Y EVENTOS DE LA ALCALDÍA LOCAL EN LOS MEDIOS DE COMUNICACIÓN, ESPECIALMENTE ESCRITOS, DIGITALES Y AUDIOVISUALES Y LA CREACIÓN, REALIZACIÓN Y PRODUCCIÓN DE VÍDEOS QUE TRANSMITAN UN MENSAJE EN LA COMUNICACIÓN INTERNA Y EXTERNA.","Inversión",45,"Gobernanza e influencia local, regional e internacional","Eje Transversal 4 Gobierno Legitimo, Fortalecimiento Local y Eficiencia",1375,1114398753,"JESUS ALFONSO PEÑA PEREZ",34545000,null,0,null,null,34545000,25333000,"2019-06-27","2019-06-27","2020-01-26",210,null,null,null,null,"x",null,0.73333333333333328,null,{"$f":"IF(SUMPRODUCT((A$14:A132=A132)*(B$14:B132=B132)*(C$14:C132=C132))>1,0,1)","v":1},"Contratos de prestación de servicios profesionales y de apoyo a la gestión","Contratación directa",{"$f":"IFERROR(VLOOKUP(F132,Tipo!$C$12:$C$27,1,FALSE),\"NO\")","v":"Prestación de servicios profesionales y de apoyo a la gestión, o para la ejecución de trabajos artísticos que sólo puedan encomendarse a determinadas personas naturales;"},"Inversión",45]
["CCV-108-2019",2019,"FDLS-MC-114-2019","Compraventa de bienes muebles","Contratación mínima cuantia","No aplica","ADQUISICION, INSTALACION Y PUESTA EN FUNCIONAMIENTO DE UN SISTEMA DE AIRE ACONDICIONADO DE 18000 BTU PARA EL CENTRO DE DATOS Y EL CUARTO DE UPS DE LA ALCALDÍA LOCAL DE SUMAPAZ","Inversión",45,"Gobernanza e influencia local, regional e internacional","Eje Transversal 4 Gobierno Legitimo, Fortalecimiento Local y Eficiencia",1375,80362137,"PROYECTOS INSTITUCIONALES DE COLOMBIA SAS",7104300,null,0,null,null,7104300,7104300,"2019-07-08","2019-07-09","2019-09-09",60,null,null,null,null,"x",null,1,null,{"$f":"IF(SUMPRODUCT((A$14:A133=A133)*(B$14:B133=B133)*(C$14:C133=C133))>1,0,1)","v":1},"Compraventa de bienes muebles","Contratación mínima cuantia",{"$f":"IFERROR(VLOOKUP(F133,Tipo!$C$12:$C$27,1,FALSE),\"NO\")","v":"NO"},"Inversión",45]
[108,2017,"17-11-7209828","Seguros","Selección abreviada","Selección abreviada por menor cuantía ","Adición No. 2 y Prorroga No. 1 al contrato de seguros No. 108-2017 cuyo objeto es: Contratar los seguros que amparen los intereses patrimoniales actuales y futuros de propiedad y/o tenencia del Fondo de Desarrollo Local de Sumapaz.","FUNCIONAMIENTO",null," "," ",null,"860002184-6","AXA COLPATRIA SEGUROS SA",null,null,0,2,30746083,30746083,24710784,"2017-11-21","2017-11-21","2019-02-21",256,55,null,null,null,"X",null,0.80370510936303663,null,{"$f":"IF(SUMPRODUCT((A$14:A134=A134)*(B$14:B134=B134)*(C$14:C134=C134))>1,0,1)","v":1},"Seguros","Selección abreviada",{"$f":"IFERROR(VLOOKUP(F134,Tipo!$C$12:$C$27,1,FALSE),\"NO\")","v":"Selección abreviada por menor cuantía "},"Funcionamiento","NO"]
["CCV-109-2019",2019,"FDLS-SASI-108-2019","Compraventa de bienes muebles","Selección abreviada","Subasta inversa ","ADQUIRIR A TÍTULO DE COMPRAVENTA UNA MOTONIVELADORA PARA EL FONDO DE DESARROLLO LOCAL DE SUMAPAZ","Inversión",18,"Mejor movilidad para todos","Pilar 2 Democracía Urbana",1364,"860.001.307-7","DISTRIBUIDORA NISSAN S.A.",638850000,null,0,null,null,638850000,638850000,"2019-07-10","2019-07-25","2019-11-19",90,25,null,null,null,"x",null,1,null,{"$f":"IF(SUMPRODUCT((A$14:A135=A135)*(B$14:B135=B135)*(C$14:C135=C135))>1,0,1)","v":1},"Compraventa de bienes muebles","Selección abreviada",{"$f":"IFERROR(VLOOKUP(F135,Tipo!$C$12:$C$27,1,FALSE),\"NO\")","v":"Subasta inversa "},"Inversión",18]
["CPS-110-2019",2019,"FDLS-SAMC-107-2019","Contratos de prestación de servicios","Selección abreviada","Selección abreviada por menor cuantía ","Prestar el servicio de mantenimiento pre-ventivo, y correctivo de los vehículos livia-nos de propiedad, guarda o tenencia del fondo de desarrollo local de Sumapaz con suministro de repuestos originales y llan-tas, insumos y mano de obra","FUNCIONAMIENTO",null," "," ",null,"860515236-2","PRECAR LIMITADA",42931400,null,0,null,null,42931400,15625040,"2019-07-15","2019-07-15","2020-04-14",270,null,null,null,null,"x",null,0.36395365629818732,null,{"$f":"IF(SUMPRODUCT((A$14:A136=A136)*(B$14:B136=B136)*(C$14:C136=C136))>1,0,1)","v":1},"Contratos de prestación de servicios","Selección abreviada",{"$f":"IFERROR(VLOOKUP(F136,Tipo!$C$12:$C$27,1,FALSE),\"NO\")","v":"Selección abreviada por menor cuantía "},"Funcionamiento","NO"]
["CPS-110-2019",2019,"FDLS-SAMC-107-2019","Contratos de prestación de servicios","Selección abreviada","Selección abreviada por menor cuantía ","Prestar el servicio de mantenimiento pre-ventivo, y correctivo de los vehículos livia-nos de propiedad, guarda o tenencia del fondo de desarrollo local de Sumapaz con suministro de repuestos originales y llan-tas, insumos y mano de obra","FUNCIONAMIENTO",null," "," ",null,"860515236-2","PRECAR LIMITADA",100863790,null,0,null,null,100863790,50566955,"2019-07-15","2019-07-15","2020-04-14",270,null,null,null,null,"x",null,0.50133903356199483,null,{"$f":"IF(SUMPRODUCT((A$14:A137=A137)*(B$14:B137=B137)*(C$14:C137=C137))>1,0,1)","v":0},"Contratos de prestación de servicios","Selección abreviada",{"$f":"IFERROR(VLOOKUP(F137,Tipo!$C$12:$C$27,1,FALSE),\"NO\")","v":"Selección abreviada por menor cuantía "},"Funcionamiento","NO"]
["CPS-111-2019",2019,"FDLS-SAMC-109-2019","Contratos de prestación de servicios","Selección abreviada","Selección abreviada por menor cuantía ","Prestar los servicios logísticos y profesionales en la conmemoración del día del campesino y campesina  de la localidad  de Sumapaz","Inversión",11,"Mejores oportunidades para el desarrollo a través de la cultura, la recreación y el deporte","Pilar 1 Igualdad de Calidad de Vida",1353,"830059289-7","ASOCIACION DE DISCAPACITADOS FISICOS DEL SUR ASODISFISUR",224734100,null,0,null,null,224734100,67420230,"2019-07-15","2019-07-15","2019-09-14",60,null,null,null,null,null,"x",0.3,null,{"$f":"IF(SUMPRODUCT((A$14:A138=A138)*(B$14:B138=B138)*(C$14:C138=C138))>1,0,1)","v":1},"Contratos de prestación de servicios","Selección abreviada",{"$f":"IFERROR(VLOOKUP(F138,Tipo!$C$12:$C$27,1,FALSE),\"NO\")","v":"Selección abreviada por menor cuantía "},"Inversión",11]
["COP-112-2019",2019,"FDLS-LP-098-2019","Obra pública","Licitación pública","No aplica","REALIZAR POR EL SISTEMA DE PRECIOS UNITARIOS FIJOS SIN FORMULA DE REAJUSTE: LA CONSERVACIÓN DE PUENTES SOBRE CORRIENTES DE AGUA EN LA LOCALIDAD DE SUMAPAZ.","Inversión",18,"Mejor movilidad para todos","Pilar 2 Democracía Urbana",1364,"901303616-6","CONSORCIO TRIDELSA",589061494,null,0,null,null,589061494,0,"2019-07-19","2019-09-19","2020-02-18",150,null,null,null,null,"x",null,0,null,{"$f":"IF(SUMPRODUCT((A$14:A139=A139)*(B$14:B139=B139)*(C$14:C139=C139))>1,0,1)","v":1},"Obra pública","Licitación pública",{"$f":"IFERROR(VLOOKUP(F139,Tipo!$C$12:$C$27,1,FALSE),\"NO\")","v":"NO"},"Inversión",18]
["CPS-113-2019",2019,"FDLS-LP-102-2019","Contratos de prestación de servicios","Licitación pública","No aplica","DESARROLLAR EL EVENTO DE IDENTIDAD CULTURAL SUMAPACEÑA- FERIA AGROAMBIENTAL EN SU DECIMO NOVENA VERSIÓN XIX","Inversión",11,"Mejores oportunidades para el desarrollo a través de la cultura, la recreación y el deporte","Pilar 1 Igualdad de Calidad de Vida",1353,"800184306-1","ROYAL PARK LTDA",399037145,null,0,null,null,399037145,279326002,"2019-07-19","2019-09-16","2019-12-15",90,null,null,null,null,"x",null,0.7000000012530162,null,{"$f":"IF(SUMPRODUCT((A$14:A140=A140)*(B$14:B140=B140)*(C$14:C140=C140))>1,0,1)","v":1},"Contratos de prestación de servicios","Licitación pública",{"$f":"IFERROR(VLOOKUP(F140,Tipo!$C$12:$C$27,1,FALSE),\"NO\")","v":"NO"},"Inversión",11]
["CCV-114-2019",2019,"FDLS-SASI-113-2019","Compraventa de bienes muebles","Selección abreviada","Subasta inversa ","ADQUISICIÓN DE EQUIPOS TECNOLÓGICOS PARA LA ALCALDÍA LOCAL DE SUMAPAZ.","Inversión",45,"Gobernanza e influencia local, regional e internacional","Eje Transversal 4 Gobierno Legitimo, Fortalecimiento Local y Eficiencia",1375,"830016004-0","REDCOMPUTO LIMITADA",199882500,null,0,null,null,199882500,199882500,"2019-07-18","2019-07-22",43729,60,null,null,null,null,"x",null,1,null,{"$f":"IF(SUMPRODUCT((A$14:A141=A141)*(B$14:B141=B141)*(C$14:C141=C141))>1,0,1)","v":1},"Compraventa de bienes muebles","Selección abreviada",{"$f":"IFERROR(VLOOKUP(F141,Tipo!$C$12:$C$27,1,FALSE),\"NO\")","v":"Subasta inversa "},"Inversión",45]
["CIN-115-2019",2019,"FDLS-MC-116-2019","Interventoría","Contratación mínima cuantia","No aplica","REALIZAR LA INTERVENTORÍA TÉCNICA, ADMINISTRATIVA, FINANCIERA, AMBIENTAL Y JURÍDICA AL CONTRATO QUE SE DERIVE DEL PROCESO LICITATORIO No. FDLS-LP-103-2019, CUYO OBJETO ES: ¿REALIZAR LA TERCERA ETAPA DE LA ESCUELA DE FORMACIÓN DEPORTIVA DE LA LOCALIDAD DE SUMAPAZ","Inversión",11,"Mejores oportunidades para el desarrollo a través de la cultura, la recreación y el deporte","Pilar 1 Igualdad de Calidad de Vida",1353,80220338,"FRANCISCO ALBERTO ROZO TORRES",17400000,null,0,null,null,17400000,8700000,"2019-07-24","2019-08-21","2020-03-20",180,null,null,null,null,null,null,0.5,null,{"$f":"IF(SUMPRODUCT((A$14:A142=A142)*(B$14:B142=B142)*(C$14:C142=C142))>1,0,1)","v":1},"Interventoría","Contratación mínima cuantia",{"$f":"IFERROR(VLOOKUP(F142,Tipo!$C$12:$C$27,1,FALSE),\"NO\")","v":"NO"},"Inversión",11]
["CPS-116-2019",2019,"FDLS-LP-103-2019","Contratos de prestación de servicios","Licitación pública","No aplica","REALIZAR LA TERCERA ETAPA DE LA ESCUELA DE FORMACIÓN DEPORTIVA DE LA LOCALIDAD DE SUMAPAZ","Inversión",11,"Mejores oportunidades para el desarrollo a través de la cultura, la recreación y el deporte","Pilar 1 Igualdad de Calidad de Vida",1353,"900216251-5","ASOCIACION PARA EL DESARROLLO INTEGRAL DE LA FAMILIA COLOMBIANA",303740201,null,0,1,38283887,{"$f":"O143+Q143+S143","v":342024088},151870100,"2019-07-31","2019-08-21","2020-03-20",180,null,null,null,"x",null,null,0.44403334539408229,null,{"$f":"IF(SUMPRODUCT((A$14:A143=A143)*(B$14:B143=B143)*(C$14:C143=C143))>1,0,1)","v":1},"Contratos de prestación de servicios","Licitación pública",{"$f":"IFERROR(VLOOKUP(F143,Tipo!$C$12:$C$27,1,FALSE),\"NO\")","v":"NO"},"Inversión",11]
["CPS-117-2019",2019,"FDLS-CD-134-2019","Contratos de prestación de servicios profesionales y de apoyo a la gestión","Contratación directa","Prestación de servicios profesionales y de apoyo a la gestión, o para la ejecución de trabajos artísticos que sólo puedan encomendarse a determinadas personas naturales;","Apoyar la formulación, gestión y seguimiento de las actividades, acciones y estrategias  que se adelanten enfocadas a promover el desarrollo rural sostenible en la localidad de Sumapaz. Se expidio certificación de noexistencia  de personal 16988 del 19 de julio de 2019, autoriza la jefe la solicitud de cdp mediante memorando 20197000001643","Inversión",45,"Gobernanza e influencia local, regional e internacional","Eje Transversal 4 Gobierno Legitimo, Fortalecimiento Local y Eficiencia",1375,79381209,"WILSON  REY MORENO",33000000,null,0,null,null,33000000,22000000,"2019-08-01","2019-08-01","2020-01-31",180,null,null,null,"x",null,null,0.66666666666666663,null,{"$f":"IF(SUMPRODUCT((A$14:A144=A144)*(B$14:B144=B144)*(C$14:C144=C144))>1,0,1)","v":1},"Contratos de prestación de servicios profesionales y de apoyo a la gestión","Contratación directa",{"$f":"IFERROR(VLOOKUP(F144,Tipo!$C$12:$C$27,1,FALSE),\"NO\")","v":"Prestación de servicios profesionales y de apoyo a la gestión, o para la ejecución de trabajos artísticos que sólo puedan encomendarse a determinadas personas naturales;"},"Inversión",45]
["CIN-118-2019",2019,"FDLS-CMA-105-2019","Interventoría","Concurso de méritos","No aplica","3REALIZAR LA INTERVENTORÍA TÉCNICA, ADMINISTRATIVA, FINANCIERA, AMBIENTAL, SOCIAL Y JURÍDICA AL CONTRATO CUYO OBJETO ES ¿REALIZAR POR EL SISTEMA DE PRECIOS UNITARIOS FIJOS SIN FORMULA DE REAJUSTE: LA CONSERVACIÓN DE PUENTES SOBRE CORRIENTES DE AGUA EN LA LOCALIDAD DE SUMAPAZ¿, SE ACOGE LA ALCALDESA AL MEMORANDO 20182100388883 EN SU ULTIMO PARRAFO","Inversión",18,"Mejor movilidad para todos","Pilar 2 Democracía Urbana",1364,"901309308-1","CONSORCIO INTERPUENTES 2019",99971900,null,0,null,null,99971900,0,"2019-07-29","2019-09-19","2020-02-18",150,null,null,null,"x",null,null,0,null,{"$f":"IF(SUMPRODUCT((A$14:A145=A145)*(B$14:B145=B145)*(C$14:C145=C145))>1,0,1)","v":1},"Interventoría","Concurso de méritos",{"$f":"IFERROR(VLOOKUP(F145,Tipo!$C$12:$C$27,1,FALSE),\"NO\")","v":"NO"},"Inversión",18]
["CIN-119-2019",2019,"FDLS-CMA-111-2019","Interventoría","Concurso de méritos","No aplica","REALIZAR LA INTERVENTORÍA TÉCNICA, ADMINISTRATIVA, FINANCIERA, AMBIENTAL, SOCIAL, SISO Y JURÍDICA AL CONTRATO QUE RESULTE DEL PROCESO LICITATORIO FDLS-LP-095-2019, CUYO OBJETO ES: CONTRATAR LAS OBRAS PARA LA CONSERVACIÓN DE LA MALLA VIAL LOCAL DE SUMAPAZ, POR EL SISTEMA DE PRECIOS UNITARIOS FIJOS, SIN FORMULA DE REAJUSTE Y A MONTO AGOTABLE. SE ACOGE AL ULTIMO PARRAFO DEL MEMORANDO","Inversión",18,"Mejor movilidad para todos","Pilar 2 Democracía Urbana",1364,"901310016-6","CONSORCIO INTERVIAL SUMAPAZ",1299974838,null,0,null,null,1299974838,0,"2019-08-02","2019-08-20","2020-06-19",300,null,null,null,"x",null,null,0,null,{"$f":"IF(SUMPRODUCT((A$14:A146=A146)*(B$14:B146=B146)*(C$14:C146=C146))>1,0,1)","v":1},"Interventoría","Concurso de méritos",{"$f":"IFERROR(VLOOKUP(F146,Tipo!$C$12:$C$27,1,FALSE),\"NO\")","v":"NO"},"Inversión",18]
["CPS-120-2019",2019,"FDLS-LP-112-2019","Contratos de prestación de servicios","Licitación pública","No aplica","Realizar actividades recreativas, lúdicas y deportivas dirigidas a Persona mayor y Persona con Discapacidad y los cuidadores de la localidad de Sumapaz¿","Inversión",11,"Mejores oportunidades para el desarrollo a través de la cultura, la recreación y el deporte","Pilar 1 Igualdad de Calidad de Vida",1353,"800184306-1","ROYAL PARK LTDA",602969826,null,0,null,null,602969826,0,"2019-08-13","2019-09-30","2019-12-29",90,null,null,null,null,"x",null,0,null,{"$f":"IF(SUMPRODUCT((A$14:A147=A147)*(B$14:B147=B147)*(C$14:C147=C147))>1,0,1)","v":1},"Contratos de prestación de servicios","Licitación pública",{"$f":"IFERROR(VLOOKUP(F147,Tipo!$C$12:$C$27,1,FALSE),\"NO\")","v":"NO"},"Inversión",11]
["CPS-121-2019",2019,"FDLS-CD-141-2019","Contratos de prestación de servicios profesionales y de apoyo a la gestión","Contratación directa","Prestación de servicios profesionales y de apoyo a la gestión, o para la ejecución de trabajos artísticos que sólo puedan encomendarse a determinadas personas naturales;","PRESTAR LOS SERVICIOS DE APOYO A LOS ARCHIVOS DE GESTIÓN DE LA ENTIDAD EN LA IMPLEMENTACIÓN DE LOS PROCESOS DE CLASIFICACIÓN, ORDENACIÓN, SELECCIÓN NATURAL, FOLIACIÓN, IDENTIFICACIÓN, LEVANTAMIENTO DE INVENTARIOS, ALMACENAMIENTO Y APLICACIÓN DE PROTOCOLOS DE ELIMINACIÓN Y TRANSFERENCIAS DOCUMENTALES DE LA ALCALDÍA LOCAL DE SUMAPAZ. SEGUN CERTIFICACION DE NO EXISTENCIA 16993 DEL 22 DE JULIO 2019,AUTORIZADO MEDIANTE MEMORANDO  LA SOLICITUD DE CDP 20197020008193","Inversión",45,"Gobernanza e influencia local, regional e internacional","Eje Transversal 4 Gobierno Legitimo, Fortalecimiento Local y Eficiencia",1375,1114398753,"MONICA JULIETH GONZALEZ MEJIA",14250000,null,0,null,null,14250000,7916666,"2019-08-21","2019-08-21","2020-02-20",180,null,null,null,"x",null,null,0.55555550877192983,null,{"$f":"IF(SUMPRODUCT((A$14:A148=A148)*(B$14:B148=B148)*(C$14:C148=C148))>1,0,1)","v":1},"Contratos de prestación de servicios profesionales y de apoyo a la gestión","Contratación directa",{"$f":"IFERROR(VLOOKUP(F148,Tipo!$C$12:$C$27,1,FALSE),\"NO\")","v":"Prestación de servicios profesionales y de apoyo a la gestión, o para la ejecución de trabajos artísticos que sólo puedan encomendarse a determinadas personas naturales;"},"Inversión",45]
["CPS-122-2019",2019,"FDLS-MC-132-2019","Contratos de prestación de servicios","Contratación mínima cuantia","No aplica","El alquiler de impresoras e incluido tóner, soporte técnico y mantenimientos requeridos por el Fondo de Desarrollo Local de Sumapaz","FUNCIONAMIENTO",null," "," ",null,"830053669-5","SOLUTION COPY LTDA",14280000,null,0,null,null,14280000,3570000,"2019-08-22","2019-08-26","2020-08-25",360,null,null,null,"x",null,null,0.25,null,{"$f":"IF(SUMPRODUCT((A$14:A149=A149)*(B$14:B149=B149)*(C$14:C149=C149))>1,0,1)","v":1},"Contratos de prestación de servicios","Contratación mínima cuantia",{"$f":"IFERROR(VLOOKUP(F149,Tipo!$C$12:$C$27,1,FALSE),\"NO\")","v":"NO"},"Funcionamiento","NO"]
["CPS-123-2019",2019,"FDLS-SAMC-129-2019","Contratos de prestación de servicios","Selección abreviada","Selección abreviada por menor cuantía ","REALIZAR LA SEGUNDA VERSIÓN DEL FESTIVAL MUSICAL CAMPESINO ¿SUMAPAZ-SUENA MÁS 2019.","Inversión",11,"Mejores oportunidades para el desarrollo a través de la cultura, la recreación y el deporte","Pilar 1 Igualdad de Calidad de Vida",1353,"900270576-2","FUNDACION CONSTRUCCION LOCAL",132820273,null,0,null,null,132820273,0,"2019-08-23","2019-09-18","2019-11-17",60,null,null,null,null,"x",null,0,null,{"$f":"IF(SUMPRODUCT((A$14:A150=A150)*(B$14:B150=B150)*(C$14:C150=C150))>1,0,1)","v":1},"Contratos de prestación de servicios","Selección abreviada",{"$f":"IFERROR(VLOOKUP(F150,Tipo!$C$12:$C$27,1,FALSE),\"NO\")","v":"Selección abreviada por menor cuantía "},"Inversión",11]
["CCV-124-2019",2019,"FDLS-MC-135-2019","Compraventa de bienes muebles","Contratación mínima cuantia","No aplica","ADQUISICIÓN E INSTALACIÓN DE LICENCIA DE ADOBE CREATIVE CLOUD Y AUTOCAD PARA LA ALCALDÍA LOCAL DE SUMAPAZ¿","FUNCIONAMIENTO",null," "," ",null,"800058607-2","CONTROLES EMPRESARIALES S A S",12281698,null,0,null,null,12281698,12281698,"2019-08-27","2019-09-09","2019-10-08",30,null,null,null,null,"x",null,1,null,{"$f":"IF(SUMPRODUCT((A$14:A151=A151)*(B$14:B151=B151)*(C$14:C151=C151))>1,0,1)","v":1},"Compraventa de bienes muebles","Contratación mínima cuantia",{"$f":"IFERROR(VLOOKUP(F151,Tipo!$C$12:$C$27,1,FALSE),\"NO\")","v":"NO"},"Funcionamiento","NO"]
["CSU-125-2019",2019,"FDLS-MC-139-2019","Suministro","Contratación mínima cuantia","No aplica","Prestar el servicio de avituallamiento (alimentación) para la realización de eventos y/o actividades de gestión, promoción y participación","FUNCIONAMIENTO",null," "," ",null,"900893468-9","LOGISTIC & SERVICE SAS",17185000,null,0,null,null,17185000,0,"2019-09-04","2019-09-06","2020-03-05",180,null,null,null,"x",null,null,0,null,{"$f":"IF(SUMPRODUCT((A$14:A152=A152)*(B$14:B152=B152)*(C$14:C152=C152))>1,0,1)","v":1},"Suministro","Contratación mínima cuantia",{"$f":"IFERROR(VLOOKUP(F152,Tipo!$C$12:$C$27,1,FALSE),\"NO\")","v":"NO"},"Funcionamiento","NO"]
["CIN-126-2019",2019,"FDLS-MC-144-2019","Interventoría","Contratación mínima cuantia","No aplica","Realizar la interventoría técnica, administrativa, financiera, jurídica y ambiental al contrato que deriva del proceso FDLS-SAMC-129-2019, y que tiene como objeto: ¿Realizar La Segunda Versión Del Festival Musical Campesino Sumapaz-Suena Más 2019\"","Inversión",11,"Mejores oportunidades para el desarrollo a través de la cultura, la recreación y el deporte","Pilar 1 Igualdad de Calidad de Vida",1353,1014180831,"ADRIANA KATHERINE GUTIERREZ TORRES",5410693,null,0,null,null,5410693,2164277,"2019-09-12","2019-09-18","2019-12-02",75,null,null,null,null,"x",null,0.3999999630361582,null,{"$f":"IF(SUMPRODUCT((A$14:A153=A153)*(B$14:B153=B153)*(C$14:C153=C153))>1,0,1)","v":1},"Interventoría","Contratación mínima cuantia",{"$f":"IFERROR(VLOOKUP(F153,Tipo!$C$12:$C$27,1,FALSE),\"NO\")","v":"NO"},"Inversión",11]
["CPS-127-2019",2019,"FDLS-MC-148-2019","Contratos de prestación de servicios","Contratación mínima cuantia","No aplica","PRESTAR SUS SERVICIOS COMO INGENIERO DIRECTOR DEL PARQUE AUTOMOTOR DE MAQUINARIA PESADA DE PROPIEDAD DEL FONDO DE DESARROLLO LOCAL DE SUMAPAZ, PARA LA REALIZACIÓN DE LABORES DE MANTENIMIENTO DE LA MALLA VIAL Y SUS ZONAS PÚBLICAS, ASÍ COMO ATENDER LAS EMERGENCIAS VIALES QUE SURJAN EN LA LOCALIDAD DE SUMAPAZ. LA ALCALDESA LOCAL SE ACOGE AL PENÚLTIMO PÁRRAFO DE LA EXPEDICIÓN DE LA CERTIFICACIÓN DE NO EXISTENCIA NÚMERO 17027 DEL 10 DE SEPTIEMBRE DE 2019, QUE BAJO SU RESPONSABILIDAD CONTRATA EL PERSONAL. ELLA AUTORIZA LA EXPEDICIÓN DEL CDP  Y CRP PARA LA CONTRATACIÓN.","Inversión",18,"Mejor movilidad para todos","Pilar 2 Democracía Urbana",1364,80166444,"YERNEY ROLANDO RODRIGUEZ AVILA",23100000,null,0,null,null,23100000,11550000,"2019-09-23","2019-10-01","2020-02-29",120,null,null,null,"x",null,null,0.5,null,{"$f":"IF(SUMPRODUCT((A$14:A154=A154)*(B$14:B154=B154)*(C$14:C154=C154))>1,0,1)","v":1},"Contratos de prestación de servicios","Contratación mínima cuantia",{"$f":"IFERROR(VLOOKUP(F154,Tipo!$C$12:$C$27,1,FALSE),\"NO\")","v":"NO"},"Inversión",18]
["CPS-128-2019",2019,"FDLS-CD-152-2019","Contratos de prestación de servicios profesionales y de apoyo a la gestión","Contratación directa","Prestación de servicios profesionales y de apoyo a la gestión, o para la ejecución de trabajos artísticos que sólo puedan encomendarse a determinadas personas naturales;","Prestar sus servicios como inspector del parque  automotor de maquinaria pesada de propiedad del Fondo de Desarrollo Local de Sumapaz, en la realización de labores de mantenimiento y mejoramiento de la malla vial y sus zonas públicas, así como en la atención de las emergencias viales que surjan en la Localidad de Sumapaz. La alcaldesa local se acoge al penúltimo párrafo de la expedición de la certificación de no existencia número 17028 del 10 de septiembre de 2019, que bajo su responsabilidad contrata el personal. Ella autoriza la expedición del CDP para la contratación.","Inversión",18,"Mejor movilidad para todos","Pilar 2 Democracía Urbana",1364,79727160,"VICTOR MANUEL RAMIREZ TORRES",9408000,null,0,null,null,9408000,3920000,"2019-09-30","2019-10-11","2020-02-10",120," ",null,null,"x",null,null,0.41666666666666669,null,{"$f":"IF(SUMPRODUCT((A$14:A155=A155)*(B$14:B155=B155)*(C$14:C155=C155))>1,0,1)","v":1},"Contratos de prestación de servicios profesionales y de apoyo a la gestión","Contratación directa",{"$f":"IFERROR(VLOOKUP(F155,Tipo!$C$12:$C$27,1,FALSE),\"NO\")","v":"Prestación de servicios profesionales y de apoyo a la gestión, o para la ejecución de trabajos artísticos que sólo puedan encomendarse a determinadas personas naturales;"},"Inversión",18]
["CPS-129-2019",2019,"FDLS-CD-153-2019","Contratos de prestación de servicios profesionales y de apoyo a la gestión","Contratación directa","Prestación de servicios profesionales y de apoyo a la gestión, o para la ejecución de trabajos artísticos que sólo puedan encomendarse a determinadas personas naturales;","PRESTAR SUS SERVICIOS COMO INSPECTOR DEL PARQUE  AUTOMOTOR DE MAQUINARIA PESADA DE PROPIEDAD DEL FONDO DE DESARROLLO LOCAL DE SUMAPAZ, EN LA REALIZACIÓN DE LABORES DE MANTENIMIENTO Y MEJORAMIENTO DE LA MALLA VIAL Y SUS ZONAS PÚBLICAS, ASÍ COMO EN LA ATENCIÓN DE LAS EMERGENCIAS VIALES QUE SURJAN EN LA LOCALIDAD DE SUMAPAZ. LA ALCALDESA LOCAL SE ACOGE AL PENÚLTIMO PÁRRAFO DE LA EXPEDICIÓN DE LA CERTIFICACIÓN DE NO EXISTENCIA NÚMERO 17028 DEL 10 DE SEPTIEMBRE DE 2019, QUE BAJO SU RESPONSABILIDAD CONTRATA EL PERSONAL. ELLA AUTORIZA LA EXPEDICIÓN DEL CRP PARA LA CONTRATACIÓN.","Inversión",18,"Mejor movilidad para todos","Pilar 2 Democracía Urbana",1364,7310938,"JORGE ALONSO JIMENEZ RAMOS",9408000,null,0,null,null,9408000,3920000,"2019-09-30","2019-10-11","2020-02-10",120," ",null,null,"x",null,null,0.41666666666666669,null,{"$f":"IF(SUMPRODUCT((A$14:A156=A156)*(B$14:B156=B156)*(C$14:C156=C156))>1,0,1)","v":1},"Contratos de prestación de servicios profesionales y de apoyo a la gestión","Contratación directa",{"$f":"IFERROR(VLOOKUP(F156,Tipo!$C$12:$C$27,1,FALSE),\"NO\")","v":"Prestación de servicios profesionales y de apoyo a la gestión, o para la ejecución de trabajos artísticos que sólo puedan encomendarse a determinadas personas naturales;"},"Inversión",18]
["CPS-130-2019",2019,"FDLS-CD-154-2019","Contratos de prestación de servicios profesionales y de apoyo a la gestión","Contratación directa","Prestación de servicios profesionales y de apoyo a la gestión, o para la ejecución de trabajos artísticos que sólo puedan encomendarse a determinadas personas naturales;","PRESTAR SUS SERVICIOS COMO CONDUCTOR DE VEHÍCULOS PESADOS DE PROPIEDAD DEL FONDO DE DESARROLLO LOCAL DE SUMAPAZ QUE LE SEA ASIGNADA PARA LA REALIZACIÓN DE LABORES DE MANTENIMIENTO DE LA MALLA VIAL Y LAS ZONAS PÚBLICAS DE LA LOCALIDAD, ASÍ COMO ATENDER LAS EMERGENCIAS VIALES QUE SURJAN EN LA LOCALIDAD DE SUMAPAZ.LA ALCALDESA LOCAL SE ACOGE AL PENÚLTIMO PÁRRAFO DE LA EXPEDICIÓN DEL CERTIFICACIÓN DE NO EXISTENCIA NÚMERO 17029 DEL 10 DE SEPTIEMBRE DE 2019, QUE BAJO SU RESPONSABILIDAD CONTRATA EL PERSONAL. EL AUTORIZA LA EXPEDICIÓN DEL CRP PARA LA CONTRATACIÓN.","Inversión",18,"Mejor movilidad para todos","Pilar 2 Democracía Urbana",1364,79632499,"WILLAM EXNEIDER PULIDO MARTINEZ",9408000,null,0,null,null,9408000,3920000,"2019-10-04","2019-10-11","2020-02-10",120,null,null,null,"x",null,null,0.41666666666666669,null,{"$f":"IF(SUMPRODUCT((A$14:A157=A157)*(B$14:B157=B157)*(C$14:C157=C157))>1,0,1)","v":1},"Contratos de prestación de servicios profesionales y de apoyo a la gestión","Contratación directa",{"$f":"IFERROR(VLOOKUP(F157,Tipo!$C$12:$C$27,1,FALSE),\"NO\")","v":"Prestación de servicios profesionales y de apoyo a la gestión, o para la ejecución de trabajos artísticos que sólo puedan encomendarse a determinadas personas naturales;"},"Inversión",18]
["CPS-131-2019",2019,"FDLS-CD-156-2019","Contratos de prestación de servicios profesionales y de apoyo a la gestión","Contratación directa","Prestación de servicios profesionales y de apoyo a la gestión, o para la ejecución de trabajos artísticos que sólo puedan encomendarse a determinadas personas naturales;","PRESTAR SUS SERVICIOS COMO CONDUCTOR DE VEHÍCULOS PESADOS DE PROPIEDAD DEL FONDO DE DESARROLLO LOCAL DE SUMAPAZ QUE LE SEA ASIGNADA PARA LA REALIZACIÓN DE LABORES DE MANTENIMIENTO DE LA MALLA VIAL Y LAS ZONAS PÚBLICAS DE LA LOCALIDAD, ASÍ COMO ATENDER LAS EMERGENCIAS VIALES QUE SURJAN EN LA LOCALIDAD DE SUMAPAZ.LA ALCALDESA LOCAL SE ACOGE AL PENÚLTIMO PÁRRAFO DE LA EXPEDICIÓN DEL CERTIFICACIÓN DE NO EXISTENCIA NÚMERO 17030 DEL 10 DE SEPTIEMBRE DE 2019, QUE BAJO SU RESPONSABILIDAD CONTRATA EL PERSONAL. ELLA AUTORIZA LA EXPEDICIÓN DEL CRP PARA LA CONTRATACIÓN.","Inversión",18,"Mejor movilidad para todos","Pilar 2 Democracía Urbana",1364,79632409,"GERMAN  ROMERO ROMAN",9408000,null,0,null,null,9408000,4076800,"2019-09-26","2019-10-09","2020-02-08",120,null,null,null,"x",null,null,0.43333333333333335,null,{"$f":"IF(SUMPRODUCT((A$14:A158=A158)*(B$14:B158=B158)*(C$14:C158=C158))>1,0,1)","v":1},"Contratos de prestación de servicios profesionales y de apoyo a la gestión","Contratación directa",{"$f":"IFERROR(VLOOKUP(F158,Tipo!$C$12:$C$27,1,FALSE),\"NO\")","v":"Prestación de servicios profesionales y de apoyo a la gestión, o para la ejecución de trabajos artísticos que sólo puedan encomendarse a determinadas personas naturales;"},"Inversión",18]
["CPS-132-2019",2019,"FDLS-CD-157-2019","Contratos de prestación de servicios profesionales y de apoyo a la gestión","Contratación directa","Prestación de servicios profesionales y de apoyo a la gestión, o para la ejecución de trabajos artísticos que sólo puedan encomendarse a determinadas personas naturales;","PRESTAR SUS SERVICIOS COMO CONDUCTOR DE VEHÍCULOS PESADOS DE PROPIEDAD DEL FONDO DE DESARROLLO LOCAL DE SUMAPAZ QUE LE SEA ASIGNADA PARA LA REALIZACIÓN DE LABORES DE MANTENIMIENTO DE LA MALLA VIAL Y LAS ZONAS PÚBLICAS DE LA LOCALIDAD, ASÍ COMO ATENDER LAS EMERGENCIAS VIALES QUE SURJAN EN LA LOCALIDAD DE SUMAPAZ.LA ALCALDESA LOCAL SE ACOGE AL PENÚLTIMO PÁRRAFO DE LA EXPEDICIÓN DEL CERTIFICACIÓN DE NO EXISTENCIA NÚMERO 17030 DEL 10 DE SEPTIEMBRE DE 2019, QUE BAJO SU RESPONSABILIDAD CONTRATA EL PERSONAL. ELLA AUTORIZA LA EXPEDICIÓN DEL CRP PARA LA CONTRATACIÓN.","Inversión",18,"Mejor movilidad para todos","Pilar 2 Democracía Urbana",1364,80877733,"HILBER  VERGARA ROBAYO",9408000,null,0,null,null,9408000,4076800,"2019-09-26","2019-10-09","2020-02-08",120," ",null,null,"x",null,null,0.43333333333333335,null,{"$f":"IF(SUMPRODUCT((A$14:A159=A159)*(B$14:B159=B159)*(C$14:C159=C159))>1,0,1)","v":1},"Contratos de prestación de servicios profesionales y de apoyo a la gestión","Contratación directa",{"$f":"IFERROR(VLOOKUP(F159,Tipo!$C$12:$C$27,1,FALSE),\"NO\")","v":"Prestación de servicios profesionales y de apoyo a la gestión, o para la ejecución de trabajos artísticos que sólo puedan encomendarse a determinadas personas naturales;"},"Inversión",18]
["CPS-133-2019",2019,"FDLS-CD-158-2019","Contratos de prestación de servicios profesionales y de apoyo a la gestión","Contratación directa","Prestación de servicios profesionales y de apoyo a la gestión, o para la ejecución de trabajos artísticos que sólo puedan encomendarse a determinadas personas naturales;","PRESTAR SUS SERVICIOS COMO CONDUCTOR DE VEHÍCULOS PESADOS DE PROPIEDAD DEL FONDO DE DESARROLLO LOCAL DE SUMAPAZ QUE LE SEA ASIGNADA PARA LA REALIZACIÓN DE LABORES DE MANTENIMIENTO DE LA MALLA VIAL Y LAS ZONAS PÚBLICAS DE LA LOCALIDAD, ASÍ COMO ATENDER LAS EMERGENCIAS VIALES QUE SURJAN EN LA LOCALIDAD DE SUMAPAZ.LA ALCALDESA LOCAL SE ACOGE AL PENÚLTIMO PÁRRAFO DE LA EXPEDICIÓN DEL CERTIFICACIÓN DE NO EXISTENCIA NÚMERO 17030 DEL 10 DE SEPTIEMBRE DE 2019, QUE BAJO SU RESPONSABILIDAD CONTRATA EL PERSONAL. ELLA AUTORIZA LA EXPEDICIÓN DEL CRP PARA LA CONTRATACIÓN.","Inversión",18,"Mejor movilidad para todos","Pilar 2 Democracía Urbana",1364,1032656348,"JHON EDUARD ROMERO MICAN",9408000,null,0,null,null,9408000,4076800,"2019-09-26","2019-10-09","2020-02-08",120,null,null,null,"x",null,null,0.43333333333333335,null,{"$f":"IF(SUMPRODUCT((A$14:A160=A160)*(B$14:B160=B160)*(C$14:C160=C160))>1,0,1)","v":1},"Contratos de prestación de servicios profesionales y de apoyo a la gestión","Contratación directa",{"$f":"IFERROR(VLOOKUP(F160,Tipo!$C$12:$C$27,1,FALSE),\"NO\")","v":"Prestación de servicios profesionales y de apoyo a la gestión, o para la ejecución de trabajos artísticos que sólo puedan encomendarse a determinadas personas naturales;"},"Inversión",18]
["CPS-134-2019",2019,"FDLS-CD-159-2019","Contratos de prestación de servicios profesionales y de apoyo a la gestión","Contratación directa","Prestación de servicios profesionales y de apoyo a la gestión, o para la ejecución de trabajos artísticos que sólo puedan encomendarse a determinadas personas naturales;","PRESTAR SUS SERVICIOS COMO CONDUCTOR DE VEHÍCULOS PESADOS DE PROPIEDAD DEL FONDO DE DESARROLLO LOCAL DE SUMAPAZ QUE LE SEA ASIGNADA PARA LA REALIZACIÓN DE LABORES DE MANTENIMIENTO DE LA MALLA VIAL Y LAS ZONAS PÚBLICAS DE LA LOCALIDAD, ASÍ COMO ATENDER LAS EMERGENCIAS VIALES QUE SURJAN EN LA LOCALIDAD DE SUMAPAZ.LA ALCALDESA LOCAL SE ACOGE AL PENÚLTIMO PÁRRAFO DE LA EXPEDICIÓN DEL CERTIFICACIÓN DE NO EXISTENCIA NÚMERO 17030 DEL 10 DE SEPTIEMBRE DE 2019, QUE BAJO SU RESPONSABILIDAD CONTRATA EL PERSONAL. ELLA AUTORIZA LA EXPEDICIÓN DEL CRP PARA LA CONTRATACIÓN.MEDIANTE MEMORANDO 20197020009413","Inversión",18,"Mejor movilidad para todos","Pilar 2 Democracía Urbana",1364,79632428,"ORLANDO  HERNANDEZ MARTINEZ",9408000,null,0,null,null,9408000,4076800,"2019-09-26","2019-10-09","2020-02-09",120,null,null,null,"x",null,null,0.43333333333333335,null,{"$f":"IF(SUMPRODUCT((A$14:A161=A161)*(B$14:B161=B161)*(C$14:C161=C161))>1,0,1)","v":1},"Contratos de prestación de servicios profesionales y de apoyo a la gestión","Contratación directa",{"$f":"IFERROR(VLOOKUP(F161,Tipo!$C$12:$C$27,1,FALSE),\"NO\")","v":"Prestación de servicios profesionales y de apoyo a la gestión, o para la ejecución de trabajos artísticos que sólo puedan encomendarse a determinadas personas naturales;"},"Inversión",18]
["CPS-135-2019",2019,"FDLS-CD-160-2019","Contratos de prestación de servicios profesionales y de apoyo a la gestión","Contratación directa","Prestación de servicios profesionales y de apoyo a la gestión, o para la ejecución de trabajos artísticos que sólo puedan encomendarse a determinadas personas naturales;","Prestar sus servicios como conductor de vehículos pesados de propiedad del Fondo de Desarrollo Local de Sumapaz que le sea asignada para la realización de labores de mantenimiento de la malla vial y las zonas públicas de la localidad, así como atender las emergencias viales que surjan en la Localidad de Sumapaz.La alcaldesa local se acoge al penúltimo párrafo de la expedición del certificación de no existencia número 17030 del 10 de septiembre de 2019, que bajo su responsabilidad contrata el personal. Ella autoriza la expedición del CDP para la contratación.","Inversión",18,"Mejor movilidad para todos","Pilar 2 Democracía Urbana",1364,80452901,"NILSON  LOPEZ RAMIREZ",9408000,null,0,null,null,9408000,4076800,"2019-09-26","09//10/2019","2020-02-08",120,null,null,null,"x",null,null,0.43333333333333335,null,{"$f":"IF(SUMPRODUCT((A$14:A162=A162)*(B$14:B162=B162)*(C$14:C162=C162))>1,0,1)","v":1},"Contratos de prestación de servicios profesionales y de apoyo a la gestión","Contratación directa",{"$f":"IFERROR(VLOOKUP(F162,Tipo!$C$12:$C$27,1,FALSE),\"NO\")","v":"Prestación de servicios profesionales y de apoyo a la gestión, o para la ejecución de trabajos artísticos que sólo puedan encomendarse a determinadas personas naturales;"},"Inversión",18]
["CPS-136-2019",2019,"FDLS-CD-161-2019","Contratos de prestación de servicios profesionales y de apoyo a la gestión","Contratación directa","Prestación de servicios profesionales y de apoyo a la gestión, o para la ejecución de trabajos artísticos que sólo puedan encomendarse a determinadas personas naturales;","PRESTAR SUS SERVICIOS COMO CONDUCTOR DE VEHÍCULOS PESADOS DE PROPIEDAD DEL FONDO DE DESARROLLO LOCAL DE SUMAPAZ QUE LE SEA ASIGNADA PARA LA REALIZACIÓN DE LABORES DE MANTENIMIENTO DE LA MALLA VIAL Y LAS ZONAS PÚBLICAS DE LA LOCALIDAD, ASÍ COMO ATENDER LAS EMERGENCIAS VIALES QUE SURJAN EN LA LOCALIDAD DE SUMAPAZ.LA ALCALDESA LOCAL SE ACOGE AL PENÚLTIMO PÁRRAFO DE LA EXPEDICIÓN DEL CERTIFICACIÓN DE NO EXISTENCIA NÚMERO 17030 DEL 10 DE SEPTIEMBRE DE 2019, QUE BAJO SU RESPONSABILIDAD CONTRATA EL PERSONAL. ELLA AUTORIZA LA EXPEDICIÓN DEL CRP PARA LA CONTRATACIÓN.","Inversión",18,"Mejor movilidad para todos","Pilar 2 Democracía Urbana",1364,80747512,"HERNAN DARIO HERRERA MORALES",9408000,null,0,null,null,9408000,4076800,"2019-09-27","2019-10-09","2020-02-08",120,null,null,null,"x",null,null,0.43333333333333335,null,{"$f":"IF(SUMPRODUCT((A$14:A163=A163)*(B$14:B163=B163)*(C$14:C163=C163))>1,0,1)","v":1},"Contratos de prestación de servicios profesionales y de apoyo a la gestión","Contratación directa",{"$f":"IFERROR(VLOOKUP(F163,Tipo!$C$12:$C$27,1,FALSE),\"NO\")","v":"Prestación de servicios profesionales y de apoyo a la gestión, o para la ejecución de trabajos artísticos que sólo puedan encomendarse a determinadas personas naturales;"},"Inversión",18]
["CPS-137-2019",2019,"FDLS-CD-162-2019","Contratos de prestación de servicios profesionales y de apoyo a la gestión","Contratación directa","Prestación de servicios profesionales y de apoyo a la gestión, o para la ejecución de trabajos artísticos que sólo puedan encomendarse a determinadas personas naturales;","PRESTAR SUS SERVICIOS COMO CONDUCTOR DE VEHÍCULOS PESADOS DE PROPIEDAD DEL FONDO DE DESARROLLO LOCAL DE SUMAPAZ QUE LE SEA ASIGNADA PARA LA REALIZACIÓN DE LABORES DE MANTENIMIENTO DE LA MALLA VIAL Y LAS ZONAS PÚBLICAS DE LA LOCALIDAD, ASÍ COMO ATENDER LAS EMERGENCIAS VIALES QUE SURJAN EN LA LOCALIDAD DE SUMAPAZ.LA ALCALDESA LOCAL SE ACOGE AL PENÚLTIMO PÁRRAFO DE LA EXPEDICIÓN DEL CERTIFICACIÓN DE NO EXISTENCIA NÚMERO 17030 DEL 10 DE SEPTIEMBRE DE 2019, QUE BAJO SU RESPONSABILIDAD CONTRATA EL PERSONAL. ELLA AUTORIZA LA EXPEDICIÓN DEL CRP PARA LA CONTRATACIÓN.","Inversión",18,"Mejor movilidad para todos","Pilar 2 Democracía Urbana",1364,1022992747,"YOVANI  CASTIBLANCO HUERTAS",9408000,null,0,null,null,9408000,3920000,"2019-10-03","2019-10-11","2020-02-10",120,null,null,null,"x",null,null,0.41666666666666669,null,{"$f":"IF(SUMPRODUCT((A$14:A164=A164)*(B$14:B164=B164)*(C$14:C164=C164))>1,0,1)","v":1},"Contratos de prestación de servicios profesionales y de apoyo a la gestión","Contratación directa",{"$f":"IFERROR(VLOOKUP(F164,Tipo!$C$12:$C$27,1,FALSE),\"NO\")","v":"Prestación de servicios profesionales y de apoyo a la gestión, o para la ejecución de trabajos artísticos que sólo puedan encomendarse a determinadas personas naturales;"},"Inversión",18]
["CPS-138-2019",2019,"FDLS-CD-163-2019","Contratos de prestación de servicios profesionales y de apoyo a la gestión","Contratación directa","Prestación de servicios profesionales y de apoyo a la gestión, o para la ejecución de trabajos artísticos que sólo puedan encomendarse a determinadas personas naturales;","Prestar sus servicios como conductor de vehículos pesados de propiedad del Fondo de Desarrollo Local de Sumapaz que le sea asignada para la realización de labores de mantenimiento de la malla vial y las zonas públicas de la localidad, así como atender las emergencias viales que surjan en la Localidad de Sumapaz.La alcaldesa local se acoge al penúltimo párrafo de la expedición del certificación de no existencia número 17029 del 10 de septiembre de 2019, que bajo su responsabilidad contrata el personal. El autoriza la expedición del CDP para la contratación.","Inversión",18,"Mejor movilidad para todos","Pilar 2 Democracía Urbana",1364,1007829181,"ELKIN ANDRES GARCIA CIFUENTES",9408000,null,0,null,null,9408000,1960000,"2019-10-04","2019-10-11","2020-03-06",120,null,null,null,"x",null,null,0.20833333333333334,null,{"$f":"IF(SUMPRODUCT((A$14:A165=A165)*(B$14:B165=B165)*(C$14:C165=C165))>1,0,1)","v":1},"Contratos de prestación de servicios profesionales y de apoyo a la gestión","Contratación directa",{"$f":"IFERROR(VLOOKUP(F165,Tipo!$C$12:$C$27,1,FALSE),\"NO\")","v":"Prestación de servicios profesionales y de apoyo a la gestión, o para la ejecución de trabajos artísticos que sólo puedan encomendarse a determinadas personas naturales;"},"Inversión",18]
["CPS-139-2019",2019,"FDLS-CD-164-2019","Contratos de prestación de servicios profesionales y de apoyo a la gestión","Contratación directa","Prestación de servicios profesionales y de apoyo a la gestión, o para la ejecución de trabajos artísticos que sólo puedan encomendarse a determinadas personas naturales;","Prestar sus servicios como conductor de vehículos pesados de propiedad del Fondo de Desarrollo Local de Sumapaz que le sea asignada para la realización de labores de mantenimiento de la malla vial y las zonas públicas de la localidad, así como atender las emergencias viales que surjan en la Localidad de Sumapaz.La alcaldesa local se acoge al penúltimo párrafo de la expedición del certificación de no existencia número 17029 del 10 de septiembre de 2019, que bajo su responsabilidad contrata el personal. El autoriza la expedición del CDP para la contratación.","Inversión",18,"Mejor movilidad para todos","Pilar 2 Democracía Urbana",1364,79819241,"CARLOS JULIO PALACIOS RAMIREZ",9408000,null,0,null,null,9408000,3920000,"2019-10-04","2019-10-11","2020-02-10",120,null,null,null,"x",null,null,0.41666666666666669,null,{"$f":"IF(SUMPRODUCT((A$14:A166=A166)*(B$14:B166=B166)*(C$14:C166=C166))>1,0,1)","v":1},"Contratos de prestación de servicios profesionales y de apoyo a la gestión","Contratación directa",{"$f":"IFERROR(VLOOKUP(F166,Tipo!$C$12:$C$27,1,FALSE),\"NO\")","v":"Prestación de servicios profesionales y de apoyo a la gestión, o para la ejecución de trabajos artísticos que sólo puedan encomendarse a determinadas personas naturales;"},"Inversión",18]
["CPS-140-2019",2019,"FDLS-CD-165-2019","Contratos de prestación de servicios profesionales y de apoyo a la gestión","Contratación directa","Prestación de servicios profesionales y de apoyo a la gestión, o para la ejecución de trabajos artísticos que sólo puedan encomendarse a determinadas personas naturales;","PRESTAR SUS SERVICIOS COMO OPERARIO DE MAQUINARIA PESADA DE PROPIEDAD DEL FONDO DE DESARROLLO LOCAL DE SUMAPAZ QUE LE SEA ASIGNADA PARA LA REALIZACIÓN DE LABORES DE MANTENIMIENTO DE LA MALLA VIAL Y LAS ZONAS PÚBLICAS DE LA LOCALIDAD, ASÍ COMO ATENDER LAS EMERGENCIAS VIALES QUE SURJAN EN LA LOCALIDAD DE SUMAPAZ. LA ALCALDESA LOCAL SE ACOGE AL PENÚLTIMO PÁRRAFO DE LA EXPEDICIÓN DE LA CERTIFICACIÓN DE NO EXISTENCIA NÚMERO 17032 DEL 10 DE SEPTIEMBRE DE 2019, QUE BAJO SU RESPONSABILIDAD CONTRATA EL PERSONAL. ELLA AUTORIZA LA EXPEDICIÓN DEL CRP PARA LA CONTRATACIÓN.","Inversión",18,"Mejor movilidad para todos","Pilar 2 Democracía Urbana",1364,1032656287,"ALBEIRO  BARBOSA CIFUENTES",9408000,null,0,null,null,9408000,3920000,"2019-09-26","2019-10-11","2019-02-10",120,null,null,null,null,"x",null,0.41666666666666669,null,{"$f":"IF(SUMPRODUCT((A$14:A167=A167)*(B$14:B167=B167)*(C$14:C167=C167))>1,0,1)","v":1},"Contratos de prestación de servicios profesionales y de apoyo a la gestión","Contratación directa",{"$f":"IFERROR(VLOOKUP(F167,Tipo!$C$12:$C$27,1,FALSE),\"NO\")","v":"Prestación de servicios profesionales y de apoyo a la gestión, o para la ejecución de trabajos artísticos que sólo puedan encomendarse a determinadas personas naturales;"},"Inversión",18]
["CPS-141-2019",2019,"FDLS-CD-166-2019","Contratos de prestación de servicios profesionales y de apoyo a la gestión","Contratación directa","Prestación de servicios profesionales y de apoyo a la gestión, o para la ejecución de trabajos artísticos que sólo puedan encomendarse a determinadas personas naturales;","PRESTAR SUS SERVICIOS COMO OPERARIO DE MAQUINARIA PESADA DE PROPIEDAD DEL FONDO DE DESARROLLO LOCAL DE SUMAPAZ QUE LE SEA ASIGNADA PARA LA REALIZACIÓN DE LABORES DE MANTENIMIENTO DE LA MALLA VIAL Y LAS ZONAS PÚBLICAS DE LA LOCALIDAD, ASÍ COMO ATENDER LAS EMERGENCIAS VIALES QUE SURJAN EN LA LOCALIDAD DE SUMAPAZ. LA ALCALDESA LOCAL SE ACOGE AL PENÚLTIMO PÁRRAFO DE LA EXPEDICIÓN DE LA CERTIFICACIÓN DE NO EXISTENCIA NÚMERO 17034 DEL 10 DE SEPTIEMBRE DE 2019, QUE BAJO SU RESPONSABILIDAD CONTRATA EL PERSONAL. ELLA AUTORIZA LA EXPEDICIÓN DEL CRP PARA LA CONTRATACIÓN.","Inversión",18,"Mejor movilidad para todos","Pilar 2 Democracía Urbana",1364,80452262,"GUSTAVO  MARTINEZ HERNANDEZ",9408000,null,0,null,null,9408000,3920000,"2019-10-04","2019-10-11","2020-02-10",120,null,null,null,"x",null,null,0.41666666666666669,null,{"$f":"IF(SUMPRODUCT((A$14:A168=A168)*(B$14:B168=B168)*(C$14:C168=C168))>1,0,1)","v":1},"Contratos de prestación de servicios profesionales y de apoyo a la gestión","Contratación directa",{"$f":"IFERROR(VLOOKUP(F168,Tipo!$C$12:$C$27,1,FALSE),\"NO\")","v":"Prestación de servicios profesionales y de apoyo a la gestión, o para la ejecución de trabajos artísticos que sólo puedan encomendarse a determinadas personas naturales;"},"Inversión",18]
["CPS -142-2019",2019,"FDLS-CD-167-2019","Contratos de prestación de servicios profesionales y de apoyo a la gestión","Contratación directa","Prestación de servicios profesionales y de apoyo a la gestión, o para la ejecución de trabajos artísticos que sólo puedan encomendarse a determinadas personas naturales;","PRESTAR SUS SERVICIOS COMO CONDUCTOR DE VEHÍCULOS PESADOS DE PROPIEDAD DEL FONDO DE DESARROLLO LOCAL DE SUMAPAZ QUE LE SEA ASIGNADA PARA LA REALIZACIÓN DE LABORES DE MANTENIMIENTO DE LA MALLA VIAL Y LAS ZONAS PÚBLICAS DE LA LOCALIDAD, ASÍ COMO ATENDER LAS EMERGENCIAS VIALES QUE SURJAN EN LA LOCALIDAD DE SUMAPAZ.LA ALCALDESA LOCAL SE ACOGE AL PENÚLTIMO PÁRRAFO DE LA EXPEDICIÓN DEL CERTIFICACIÓN DE NO EXISTENCIA NÚMERO 17029 DEL 10 DE SEPTIEMBRE DE 2019, QUE BAJO SU RESPONSABILIDAD CONTRATA EL PERSONAL. ELLA AUTORIZA LA EXPEDICIÓN DEL CRP PARA LA CONTRATACIÓN.","Inversión",18,"Mejor movilidad para todos","Pilar 2 Democracía Urbana",1364,1022924525,"MOISES  DELGADO VERGARA",9408000,null,0,null,null,9408000,3920000,"2019-09-30","2019-10-11","2020-02-10",120,null,null,null,"x",null,null,0.41666666666666669,null,{"$f":"IF(SUMPRODUCT((A$14:A169=A169)*(B$14:B169=B169)*(C$14:C169=C169))>1,0,1)","v":1},"Contratos de prestación de servicios profesionales y de apoyo a la gestión","Contratación directa",{"$f":"IFERROR(VLOOKUP(F169,Tipo!$C$12:$C$27,1,FALSE),\"NO\")","v":"Prestación de servicios profesionales y de apoyo a la gestión, o para la ejecución de trabajos artísticos que sólo puedan encomendarse a determinadas personas naturales;"},"Inversión",18]
["CPS-143-2019",2019,"FDLS-CD-169-2019","Contratos de prestación de servicios profesionales y de apoyo a la gestión","Contratación directa","Prestación de servicios profesionales y de apoyo a la gestión, o para la ejecución de trabajos artísticos que sólo puedan encomendarse a determinadas personas naturales;","PRESTAR SUS SERVICIOS COMO OPERARIO DE MAQUINARIA PESADA DE PROPIEDAD DEL FONDO DE DESARROLLO LOCAL DE SUMAPAZ QUE LE SEA ASIGNADA PARA LA REALIZACIÓN DE LABORES DE MANTENIMIENTO DE LA MALLA VIAL Y LAS ZONAS PÚBLICAS DE LA LOCALIDAD, ASÍ COMO ATENDER LAS EMERGENCIAS VIALES QUE SURJAN EN LA LOCALIDAD DE SUMAPAZ. LA ALCALDESA LOCAL SE ACOGE AL PENÚLTIMO PÁRRAFO DE LA EXPEDICIÓN DE LA CERTIFICACIÓN DE NO EXISTENCIA NÚMERO 17035 DEL 10 DE SEPTIEMBRE DE 2019, QUE BAJO SU RESPONSABILIDAD CONTRATA EL PERSONAL. ELLA AUTORIZA LA EXPEDICIÓN DEL CRP PARA LA CONTRATACIÓN.","Inversión",18,"Mejor movilidad para todos","Pilar 2 Democracía Urbana",1364,80779602,"DEIVER ORLANDO ROMERO ROJAS",9408000,null,0,null,null,9408000,3920000,"2019-10-04","2019-10-11","2020-02-10",120,null,null,null,"x",null,null,0.41666666666666669,null,{"$f":"IF(SUMPRODUCT((A$14:A170=A170)*(B$14:B170=B170)*(C$14:C170=C170))>1,0,1)","v":1},"Contratos de prestación de servicios profesionales y de apoyo a la gestión","Contratación directa",{"$f":"IFERROR(VLOOKUP(F170,Tipo!$C$12:$C$27,1,FALSE),\"NO\")","v":"Prestación de servicios profesionales y de apoyo a la gestión, o para la ejecución de trabajos artísticos que sólo puedan encomendarse a determinadas personas naturales;"},"Inversión",18]
["CPS-144-2019",2019,"FDLS-CD-170-2019","Contratos de prestación de servicios profesionales y de apoyo a la gestión","Contratación directa","Prestación de servicios profesionales y de apoyo a la gestión, o para la ejecución de trabajos artísticos que sólo puedan encomendarse a determinadas personas naturales;","PRESTAR SUS SERVICIOS COMO OPERARIO DE MAQUINARIA PESADA DE PROPIEDAD DEL FONDO DE DESARROLLO LOCAL DE SUMAPAZ QUE LE SEA ASIGNADA PARA LA REALIZACIÓN DE LABORES DE MANTENIMIENTO DE LA MALLA VIAL Y LAS ZONAS PÚBLICAS DE LA LOCALIDAD, ASÍ COMO ATENDER LAS EMERGENCIAS VIALES QUE SURJAN EN LA LOCALIDAD DE SUMAPAZ. LA ALCALDESA LOCAL SE ACOGE AL PENÚLTIMO PÁRRAFO DE LA EXPEDICIÓN DE LA CERTIFICACIÓN DE NO EXISTENCIA NÚMERO 17032 DEL 10 DE SEPTIEMBRE DE 2019, QUE BAJO SU RESPONSABILIDAD CONTRATA EL PERSONAL. ELLA AUTORIZA LA EXPEDICIÓN DEL CRP PARA LA CONTRATACIÓN.","Inversión",18,"Mejor movilidad para todos","Pilar 2 Democracía Urbana",1364,1033676728,"HECTOR ERNESTO GARCIA GARIBELLO",9408000,null,0,null,null,9408000,3920000,"2019-10-04","2019-10-11","2020-02-10",120,null,null,null,"x",null,null,0.41666666666666669,null,{"$f":"IF(SUMPRODUCT((A$14:A171=A171)*(B$14:B171=B171)*(C$14:C171=C171))>1,0,1)","v":1},"Contratos de prestación de servicios profesionales y de apoyo a la gestión","Contratación directa",{"$f":"IFERROR(VLOOKUP(F171,Tipo!$C$12:$C$27,1,FALSE),\"NO\")","v":"Prestación de servicios profesionales y de apoyo a la gestión, o para la ejecución de trabajos artísticos que sólo puedan encomendarse a determinadas personas naturales;"},"Inversión",18]
["CPS-145-2019",2019,"FDLS-CD-171-2019","Contratos de prestación de servicios profesionales y de apoyo a la gestión","Contratación directa","Prestación de servicios profesionales y de apoyo a la gestión, o para la ejecución de trabajos artísticos que sólo puedan encomendarse a determinadas personas naturales;","PRESTAR SUS SERVICIOS COMO OPERARIO DE MAQUINARIA PESADA DE PROPIEDAD DEL FONDO DE DESARROLLO LOCAL DE SUMAPAZ QUE LE SEA ASIGNADA PARA LA REALIZACIÓN DE LABORES DE MANTENIMIENTO DE LA MALLA VIAL Y LAS ZONAS PÚBLICAS DE LA LOCALIDAD, ASÍ COMO ATENDER LAS EMERGENCIAS VIALES QUE SURJAN EN LA LOCALIDAD DE SUMAPAZ. LA ALCALDESA LOCAL SE ACOGE AL PENÚLTIMO PÁRRAFO DE LA EXPEDICIÓN DE LA CERTIFICACIÓN DE NO EXISTENCIA NÚMERO 17034 DEL 10 DE SEPTIEMBRE DE 2019, QUE BAJO SU RESPONSABILIDAD CONTRATA EL PERSONAL. ELLA AUTORIZA LA EXPEDICIÓN DEL CRP PARA LA CONTRATACIÓN.","Inversión",18,"Mejor movilidad para todos","Pilar 2 Democracía Urbana",1364,79519512,"RAMIRO  MARTINEZ HILARION",9408000,null,0,null,null,9408000,3920000,"2019-10-04","2019-10-11","2020-02-10",120,null,null,null,"x",null,null,0.41666666666666669,null,{"$f":"IF(SUMPRODUCT((A$14:A172=A172)*(B$14:B172=B172)*(C$14:C172=C172))>1,0,1)","v":1},"Contratos de prestación de servicios profesionales y de apoyo a la gestión","Contratación directa",{"$f":"IFERROR(VLOOKUP(F172,Tipo!$C$12:$C$27,1,FALSE),\"NO\")","v":"Prestación de servicios profesionales y de apoyo a la gestión, o para la ejecución de trabajos artísticos que sólo puedan encomendarse a determinadas personas naturales;"},"Inversión",18]
["CPS-146-2019",2019,"FDLS-CD-172-2019","Contratos de prestación de servicios profesionales y de apoyo a la gestión","Contratación directa","Prestación de servicios profesionales y de apoyo a la gestión, o para la ejecución de trabajos artísticos que sólo puedan encomendarse a determinadas personas naturales;","PRESTAR SUS SERVICIOS COMO OPERARIO DE MAQUINARIA PESADA DE PROPIEDAD DEL FONDO DE DESARROLLO LOCAL DE SUMAPAZ QUE LE SEA ASIGNADA PARA LA REALIZACIÓN DE LABORES DE MANTENIMIENTO DE LA MALLA VIAL Y LAS ZONAS PÚBLICAS DE LA LOCALIDAD, ASÍ COMO ATENDER LAS EMERGENCIAS VIALES QUE SURJAN EN LA LOCALIDAD DE SUMAPAZ. LA ALCALDESA LOCAL SE ACOGE AL PENÚLTIMO PÁRRAFO DE LA EXPEDICIÓN DE LA CERTIFICACIÓN DE NO EXISTENCIA NÚMERO 17033 DEL 10 DE SEPTIEMBRE DE 2019, QUE BAJO SU RESPONSABILIDAD CONTRATA EL PERSONAL. ELLA AUTORIZA LA EXPEDICIÓN DEL CRP PARA LA CONTRATACIÓN.","Inversión",18,"Mejor movilidad para todos","Pilar 2 Democracía Urbana",1364,1024559011,"HECTOR ORLANDO PENAGOS PABON",9408000,null,0,null,null,9408000,3528000,"2019-10-09","2019-10-16","2020-02-15",120,null,null,null,"x",null,null,0.375,null,{"$f":"IF(SUMPRODUCT((A$14:A173=A173)*(B$14:B173=B173)*(C$14:C173=C173))>1,0,1)","v":1},"Contratos de prestación de servicios profesionales y de apoyo a la gestión","Contratación directa",{"$f":"IFERROR(VLOOKUP(F173,Tipo!$C$12:$C$27,1,FALSE),\"NO\")","v":"Prestación de servicios profesionales y de apoyo a la gestión, o para la ejecución de trabajos artísticos que sólo puedan encomendarse a determinadas personas naturales;"},"Inversión",18]
[146,2018,"FDLS-CD-086-2018","Contratos interadministrativos","Contratación directa","Contratos interadministrativos","Adición No. 1 al Contrato Interadministrativo No. 146 de 2018 cuyo Objeto es: ¿DESARROLLAR UN PROCESO DE INTERVENCIÓN QUE GARANTICE EL DERECHO A LAS COMUNICACIONES, MEDIANTE LA OPERACIÓN, ADMINISTRACIÓN Y MANTENIMIENTO DE LOS PORTALES INTERACTIVOS Y LAS LÍNEAS TELEFÓNICAS INSTALADAS EN LA LOCALIDAD DE SUMAPAZ¿. SE EXPIDE TENIENDO EN CUENTA LA DIRECTIVA 002 DEL 21 DE JUNIO DE 2019, EN EL NUMERAL 1 DE LA ACTIVIDAD CONTRACTUAL LITERAL B, POR  EL CUAL LA ALCALDESA ORDENA SOLICITAR EL CDP A TRAVES DEL MEMORANDO 20197020008493","Inversión",36,"Bogotá, una ciudad digital","Eje Transversal 2 Desarrollo Económico basado en el conocimiento",1368,79887251,"EMPRESA DE TELECOMUNICACIONES DE BOGOTA SA ESP",null,1,-96959887,2,{"$f":"96959887*2","v":193919774},96959887,47520162,"2018-10-29","2018-11-15","2019-10-30",300,76,null,null,null,"x",null,0.49010125187130221,null,{"$f":"IF(SUMPRODUCT((A$14:A174=A174)*(B$14:B174=B174)*(C$14:C174=C174))>1,0,1)","v":1},"Contratos interadministrativos","Contratación directa",{"$f":"IFERROR(VLOOKUP(F174,Tipo!$C$12:$C$27,1,FALSE),\"NO\")","v":"Contratos interadministrativos"},"Inversión",36]
["CPS-147-2019",2019,"FDLS-CD-173-2019","Contratos de prestación de servicios profesionales y de apoyo a la gestión","Contratación directa","Prestación de servicios profesionales y de apoyo a la gestión, o para la ejecución de trabajos artísticos que sólo puedan encomendarse a determinadas personas naturales;","PRESTAR SUS SERVICIOS COMO OPERARIO DE MAQUINARIA PESADA DE PROPIEDAD DEL FONDO DE DESARROLLO LOCAL DE SUMAPAZ QUE LE SEA ASIGNADA PARA LA REALIZACIÓN DE LABORES DE MANTENIMIENTO DE LA MALLA VIAL Y LAS ZONAS PÚBLICAS DE LA LOCALIDAD, ASÍ COMO ATENDER LAS EMERGENCIAS VIALES QUE SURJAN EN LA LOCALIDAD DE SUMAPAZ. LA ALCALDESA LOCAL SE ACOGE AL PENÚLTIMO PÁRRAFO DE LA EXPEDICIÓN DE LA CERTIFICACIÓN DE NO EXISTENCIA NÚMERO 17035 DEL 10 DE SEPTIEMBRE DE 2019, QUE BAJO SU RESPONSABILIDAD CONTRATA EL PERSONAL. ELLA AUTORIZA LA EXPEDICIÓN DEL CRP PARA LA CONTRATACIÓN.","Inversión",18,"Mejor movilidad para todos","Pilar 2 Democracía Urbana",1364,1022950747,"AUDER ORLANDO DIAZ RUBIANO",9408000,null,0,null,null,9408000,3920000,"2019-10-04","2019-10-11","2020-02-10",120,null,null,null,"x",null,null,0.41666666666666669,null,{"$f":"IF(SUMPRODUCT((A$14:A175=A175)*(B$14:B175=B175)*(C$14:C175=C175))>1,0,1)","v":1},"Contratos de prestación de servicios profesionales y de apoyo a la gestión","Contratación directa",{"$f":"IFERROR(VLOOKUP(F175,Tipo!$C$12:$C$27,1,FALSE),\"NO\")","v":"Prestación de servicios profesionales y de apoyo a la gestión, o para la ejecución de trabajos artísticos que sólo puedan encomendarse a determinadas personas naturales;"},"Inversión",18]
["CPS-148-2019",2019,"FDLS-CD-174-2019","Contratos de prestación de servicios profesionales y de apoyo a la gestión","Contratación directa","Prestación de servicios profesionales y de apoyo a la gestión, o para la ejecución de trabajos artísticos que sólo puedan encomendarse a determinadas personas naturales;","PRESTAR SUS SERVICIOS COMO AYUDANTE DE LA MAQUINARIA PESADA DE PROPIEDAD DEL FONDO DE DESARROLLO LOCAL DE SUMAPAZ QUE LE SEA ASIGNADA PARA LA REALIZACIÓN DE LABORES DE MANTENIMIENTO Y MEJORAMIENTO DE LA MALLA VIAL, ZONAS PÚBLICAS, ASÍ COMO LA ATENCIÓN DE EMERGENCIAS VIALES QUE SURJAN EN LA LOCALIDAD DE SUMAPAZ. LA ALCALDESA LOCAL SE ACOGE AL PENÚLTIMO PÁRRAFO DE LA EXPEDICIÓN DE LA CERTIFICACIÓN DE NO EXISTENCIA NÚMERO 17031 DEL 10 DE SEPTIEMBRE DE 2019, QUE BAJO SU RESPONSABILIDAD CONTRATA EL PERSONAL. ELLA AUTORIZA LA EXPEDICIÓN DEL CRP PARA LA CONTRATACIÓN.","Inversión",18,"Mejor movilidad para todos","Pilar 2 Democracía Urbana",1364,1013598298,"CARLOS JAIR PEÑA PEÑA",9408000,null,0,null,null,9408000,3920000,"2019-10-02","2019-10-11","2020-02-10",120,null,null,null,"x",null,null,0.41666666666666669,null,{"$f":"IF(SUMPRODUCT((A$14:A176=A176)*(B$14:B176=B176)*(C$14:C176=C176))>1,0,1)","v":1},"Contratos de prestación de servicios profesionales y de apoyo a la gestión","Contratación directa",{"$f":"IFERROR(VLOOKUP(F176,Tipo!$C$12:$C$27,1,FALSE),\"NO\")","v":"Prestación de servicios profesionales y de apoyo a la gestión, o para la ejecución de trabajos artísticos que sólo puedan encomendarse a determinadas personas naturales;"},"Inversión",18]
["CPS-149-2019",2019,"FDLS-CD-175-2019","Contratos de prestación de servicios profesionales y de apoyo a la gestión","Contratación directa","Prestación de servicios profesionales y de apoyo a la gestión, o para la ejecución de trabajos artísticos que sólo puedan encomendarse a determinadas personas naturales;","PRESTAR SUS SERVICIOS COMO AYUDANTE DE LA MAQUINARIA PESADA DE PROPIEDAD DEL FONDO DE DESARROLLO LOCAL DE SUMAPAZ QUE LE SEA ASIGNADA PARA LA REALIZACIÓN DE LABORES DE MANTENIMIENTO Y MEJORAMIENTO DE LA MALLA VIAL, ZONAS PÚBLICAS, ASÍ COMO LA ATENCIÓN DE EMERGENCIAS VIALES QUE SURJAN EN LA LOCALIDAD DE SUMAPAZ. LA ALCALDESA LOCAL SE ACOGE AL PENÚLTIMO PÁRRAFO DE LA EXPEDICIÓN DE LA CERTIFICACIÓN DE NO EXISTENCIA NÚMERO 17031 DEL 10 DE SEPTIEMBRE DE 2019, QUE BAJO SU RESPONSABILIDAD CONTRATA EL PERSONAL. ELLA AUTORIZA LA EXPEDICIÓN DEL CRP PARA LA CONTRATACIÓN.","Inversión",18,"Mejor movilidad para todos","Pilar 2 Democracía Urbana",1364,1069230738,"CAMILO ANDREA SUSA CIFUENTES",9408000,null,0,null,null,9408000,3920000,"2019-10-02","2019-10-11","2020-02-10",120,null,null,null,"x",null,null,0.41666666666666669,null,{"$f":"IF(SUMPRODUCT((A$14:A177=A177)*(B$14:B177=B177)*(C$14:C177=C177))>1,0,1)","v":1},{"$f":"IFERROR(VLOOKUP(D177,tipo,1,FALSE),\"NO\")","v":"Contratos de prestación de servicios profesionales y de apoyo a la gestión"},{"$f":"IFERROR(VLOOKUP(E177,modal,1,FALSE),\"NO\")","v":"Contratación directa"},{"$f":"IFERROR(VLOOKUP(F177,Tipo!$C$12:$C$27,1,FALSE),\"NO\")","v":"Prestación de servicios profesionales y de apoyo a la gestión, o para la ejecución de trabajos artísticos que sólo puedan encomendarse a determinadas personas naturales;"},{"$f":"IFERROR(VLOOKUP(H177,afectacion,1,FALSE),\"NO\")","v":"Inversión"},{"$f":"IFERROR(VLOOKUP(I177,programa,1,FALSE),\"NO\")","v":18}]
["CPS-150-2019",2019,"FDLS-CD-176-2019","Contratos de prestación de servicios profesionales y de apoyo a la gestión","Contratación directa","Prestación de servicios profesionales y de apoyo a la gestión, o para la ejecución de trabajos artísticos que sólo puedan encomendarse a determinadas personas naturales;","PRESTAR SUS SERVICIOS COMO AYUDANTE DE LA MAQUINARIA PESADA DE PROPIEDAD DEL FONDO DE DESARROLLO LOCAL DE SUMAPAZ QUE LE SEA ASIGNADA PARA LA REALIZACIÓN DE LABORES DE MANTENIMIENTO Y MEJORAMIENTO DE LA MALLA VIAL, ZONAS PÚBLICAS, ASÍ COMO LA ATENCIÓN DE EMERGENCIAS VIALES QUE SURJAN EN LA LOCALIDAD DE SUMAPAZ. LA ALCALDESA LOCAL SE ACOGE AL PENÚLTIMO PÁRRAFO DE LA EXPEDICIÓN DE LA CERTIFICACIÓN DE NO EXISTENCIA NÚMERO 17031 DEL 10 DE SEPTIEMBRE DE 2019, QUE BAJO SU RESPONSABILIDAD CONTRATA EL PERSONAL. ELLA AUTORIZA LA EXPEDICIÓN DEL CRP PARA LA CONTRATACIÓN.","Inversión",18,"Mejor movilidad para todos","Pilar 2 Democracía Urbana",1364,79216776,"ERISMENDIZ  CASTELLANOS DIAZ",9408000,null,0,null,null,9408000,3998400,"2019-10-02","2019-10-10","2020-02-09",120,null,null,null,"x",null,null,0.42499999999999999,null,{"$f":"IF(SUMPRODUCT((A$14:A178=A178)*(B$14:B178=B178)*(C$14:C178=C178))>1,0,1)","v":1},"Contratos de prestación de servicios profesionales y de apoyo a la gestión","Contratación directa",{"$f":"IFERROR(VLOOKUP(F178,Tipo!$C$12:$C$27,1,FALSE),\"NO\")","v":"Prestación de servicios profesionales y de apoyo a la gestión, o para la ejecución de trabajos artísticos que sólo puedan encomendarse a determinadas personas naturales;"},"Inversión",18]
[150,2018,"FDLS-LP-012-2018","Obra pública","Licitación pública","No aplica","ADICION NO. 1 AL CONTRATO DE OBRA NO. FDLS COP 150-2019, CUYO OBJETO ES ¿REALIZAR POR EL SISTEMA DE PRECIOS UNITARIOS FIJOS SIN FORMULA DE REAJUSTE: LAS OBRAS Y ACTIVIDADES PARA LA CONSERVACIÓN DE LA MALLA VIAL DE LA LOCALIDAD DE SUMAPAZ A MONTO AGOTABLE.","Inversión",18,"Mejor movilidad para todos","Pilar 2 Democracía Urbana",1364,79462118,"CONSORCIO PARAMO SUMAPAZ 2018",null,null,0,1,1110000000,1110000000,0,"2018-10-08","2018-12-20","2020-03-19",360,null,null,null,"x",null,null,0,null,{"$f":"IF(SUMPRODUCT((A$14:A179=A179)*(B$14:B179=B179)*(C$14:C179=C179))>1,0,1)","v":1},"Obra pública","Licitación pública",{"$f":"IFERROR(VLOOKUP(F179,Tipo!$C$12:$C$27,1,FALSE),\"NO\")","v":"NO"},"Inversión",18]
["CPS-151-2019",2019,"FDLS-CD-177-2019","Contratos de prestación de servicios profesionales y de apoyo a la gestión","Contratación directa","Prestación de servicios profesionales y de apoyo a la gestión, o para la ejecución de trabajos artísticos que sólo puedan encomendarse a determinadas personas naturales;","PRESTAR SUS SERVICIOS COMO OPERARIO DE MAQUINARIA PESADA DE PROPIEDAD DEL FONDO DE DESARROLLO LOCAL DE SUMAPAZ QUE LE SEA ASIGNADA PARA LA REALIZACIÓN DE LABORES DE MANTENIMIENTO DE LA MALLA VIAL Y LAS ZONAS PÚBLICAS DE LA LOCALIDAD, ASÍ COMO ATENDER LAS EMERGENCIAS VIALES QUE SURJAN EN LA LOCALIDAD DE SUMAPAZ. LA ALCALDESA LOCAL SE ACOGE AL PENÚLTIMO PÁRRAFO DE LA EXPEDICIÓN DE LA CERTIFICACIÓN DE NO EXISTENCIA NÚMERO 17033 DEL 10 DE SEPTIEMBRE DE 2019, QUE BAJO SU RESPONSABILIDAD CONTRATA EL PERSONAL. ELLA AUTORIZA LA EXPEDICIÓN DEL CRP PARA LA CONTRATACIÓN.","Inversión",18,"Mejor movilidad para todos","Pilar 2 Democracía Urbana",1364,79462118,"ERNESTO  GUEVARA GONZALEZ",9408000,null,0,null,null,9408000,3528000,"2019-10-09","2019-10-16","2020-02-15",120,null,null,null,"x",null,null,0.375,null,{"$f":"IF(SUMPRODUCT((A$14:A180=A180)*(B$14:B180=B180)*(C$14:C180=C180))>1,0,1)","v":1},"Contratos de prestación de servicios profesionales y de apoyo a la gestión","Contratación directa",{"$f":"IFERROR(VLOOKUP(F180,Tipo!$C$12:$C$27,1,FALSE),\"NO\")","v":"Prestación de servicios profesionales y de apoyo a la gestión, o para la ejecución de trabajos artísticos que sólo puedan encomendarse a determinadas personas naturales;"},"Inversión",18]
["CPS-152-2019",2019,"FDLS-SAMC-140-2019","Contratos de prestación de servicios","Selección abreviada","Selección abreviada por menor cuantía ","REALIZAR LA INSTALACIÓN DE SISTEMAS DE GENERACIÓN DE ENERGÍA ELÉCTRICA RENOVABLE MEDIANTE CELDAS FOTOVOLTAICAS EN LA LOCALIDAD DE SUMAPAZ.  A SOLICITUD DE LA ALCALDESA","Inversión",41,"Desarrollo rural sostenible","Eje Transversal 3 Sostenibilidad Ambiental basada en la eficiencia energética",1382,"900557982-3","PLANOS Y PLANAS CORPORACION",217427102,null,0,null,null,217427102,65228130,"2019-09-30","2019-10-09","2020-02-08",120,null,null,null,"x",null,null,0.2999999972404544,null,{"$f":"IF(SUMPRODUCT((A$14:A181=A181)*(B$14:B181=B181)*(C$14:C181=C181))>1,0,1)","v":1},"Contratos de prestación de servicios","Selección abreviada",{"$f":"IFERROR(VLOOKUP(F181,Tipo!$C$12:$C$27,1,FALSE),\"NO\")","v":"Selección abreviada por menor cuantía "},"Inversión",41]
["CPS-153-2019",2019,"FDLS-CD-178-2019","Contratos de prestación de servicios profesionales y de apoyo a la gestión","Contratación directa","Prestación de servicios profesionales y de apoyo a la gestión, o para la ejecución de trabajos artísticos que sólo puedan encomendarse a determinadas personas naturales;","Prestar sus servicios como operario de maquinaria pesada de propiedad del Fondo de Desarrollo Local de Sumapaz que le sea asignada para la realización de labores de mantenimiento de la malla vial y las zonas públicas de la localidad, así como atender las emergencias viales que surjan en la Localidad de Sumapaz. La alcaldesa local se acoge al penúltimo párrafo de la expedición de la certificación de no existencia número 17035 del 10 de septiembre de 2019, que bajo su responsabilidad contrata el personal. Ella autoriza la expedición del CDP para la contratación.","Inversión",18,"Mejor movilidad para todos","Pilar 2 Democracía Urbana",1364,174188,"RUPERTO  VILLALBA ROMAN",9408000,null,0,null,null,9408000,3920000,"2019-10-04","2019-10-11","2020-02-10",120,null,null,null,"x",null,null,0.41666666666666669,null,{"$f":"IF(SUMPRODUCT((A$14:A182=A182)*(B$14:B182=B182)*(C$14:C182=C182))>1,0,1)","v":1},"Contratos de prestación de servicios profesionales y de apoyo a la gestión","Contratación directa",{"$f":"IFERROR(VLOOKUP(F182,Tipo!$C$12:$C$27,1,FALSE),\"NO\")","v":"Prestación de servicios profesionales y de apoyo a la gestión, o para la ejecución de trabajos artísticos que sólo puedan encomendarse a determinadas personas naturales;"},"Inversión",18]
["CPS-154-2019",2019,"FDLS-CD-180-2019","Contratos de prestación de servicios profesionales y de apoyo a la gestión","Contratación directa","Prestación de servicios profesionales y de apoyo a la gestión, o para la ejecución de trabajos artísticos que sólo puedan encomendarse a determinadas personas naturales;","PRESTAR SUS SERVICIOS COMO CONDUCTOR DE VEHÍCULOS PESADOS DE PROPIEDAD DEL FONDO DE DESARROLLO LOCAL DE SUMAPAZ QUE LE SEA ASIGNADA PARA LA REALIZACIÓN DE LABORES DE MANTENIMIENTO DE LA MALLA VIAL Y LAS ZONAS PÚBLICAS DE LA LOCALIDAD, ASÍ COMO ATENDER LAS EMERGENCIAS VIALES QUE SURJAN EN LA LOCALIDAD DE SUMAPAZ.LA ALCALDESA LOCAL SE ACOGE AL PENÚLTIMO PÁRRAFO DE LA EXPEDICIÓN DEL CERTIFICACIÓN DE NO EXISTENCIA NÚMERO 17029 DEL 10 DE SEPTIEMBRE DE 2019, QUE BAJO SU RESPONSABILIDAD CONTRATA EL PERSONAL. EL AUTORIZA LA EXPEDICIÓN DEL CRP PARA LA CONTRATACIÓN.","Inversión",18,"Mejor movilidad para todos","Pilar 2 Democracía Urbana",1364,1022938049,"ALEXANDER  BUSTOS CHAVARRO",9408000,null,0,null,null,9408000,3920000,"2019-10-04","2019-10-11","2020-02-10",120,null,null,null,"x",null,null,0.41666666666666669,null,{"$f":"IF(SUMPRODUCT((A$14:A183=A183)*(B$14:B183=B183)*(C$14:C183=C183))>1,0,1)","v":1},"Contratos de prestación de servicios profesionales y de apoyo a la gestión","Contratación directa",{"$f":"IFERROR(VLOOKUP(F183,Tipo!$C$12:$C$27,1,FALSE),\"NO\")","v":"Prestación de servicios profesionales y de apoyo a la gestión, o para la ejecución de trabajos artísticos que sólo puedan encomendarse a determinadas personas naturales;"},"Inversión",18]
["CPS-155-2019",2019,"FDLS-CD-181-2019","Contratos de prestación de servicios profesionales y de apoyo a la gestión","Contratación directa","Prestación de servicios profesionales y de apoyo a la gestión, o para la ejecución de trabajos artísticos que sólo puedan encomendarse a determinadas personas naturales;","PRESTAR SUS SERVICIOS COMO AYUDANTE DE LA MAQUINARIA PESADA DE PROPIEDAD DEL FONDO DE DESARROLLO LOCAL DE SUMAPAZ QUE LE SEA ASIGNADA PARA LA REALIZACIÓN DE LABORES DE MANTENIMIENTO Y MEJORAMIENTO DE LA MALLA VIAL, ZONAS PÚBLICAS, ASÍ COMO LA ATENCIÓN DE EMERGENCIAS VIALES QUE SURJAN EN LA LOCALIDAD DE SUMAPAZ. LA ALCALDESA LOCAL SE ACOGE AL PENÚLTIMO PÁRRAFO DE LA EXPEDICIÓN DE LA CERTIFICACIÓN DE NO EXISTENCIA NÚMERO 17031 DEL 10 DE SEPTIEMBRE DE 2019, QUE BAJO SU RESPONSABILIDAD CONTRATA EL PERSONAL. ELLA AUTORIZA LA EXPEDICIÓN DEL CRP PARA LA CONTRATACIÓN.","Inversión",18,"Mejor movilidad para todos","Pilar 2 Democracía Urbana",1364,1070750533,"RAFAEL ANTONIO LARA SANABRIA",9408000,null,0,null,null,9408000,3920000,"2019-10-03","2019-10-11","2020-02-10",120,null,null,null,"x",null,null,0.41666666666666669,null,{"$f":"IF(SUMPRODUCT((A$14:A184=A184)*(B$14:B184=B184)*(C$14:C184=C184))>1,0,1)","v":1},"Contratos de prestación de servicios profesionales y de apoyo a la gestión","Contratación directa",{"$f":"IFERROR(VLOOKUP(F184,Tipo!$C$12:$C$27,1,FALSE),\"NO\")","v":"Prestación de servicios profesionales y de apoyo a la gestión, o para la ejecución de trabajos artísticos que sólo puedan encomendarse a determinadas personas naturales;"},"Inversión",18]
["CPS-156-2019",2019,"FDLS-CD-182-2019","Contratos de prestación de servicios profesionales y de apoyo a la gestión","Contratación directa","Prestación de servicios profesionales y de apoyo a la gestión, o para la ejecución de trabajos artísticos que sólo puedan encomendarse a determinadas personas naturales;","Prestar sus servicios como ayudante de la maquinaria pesada de propiedad del Fondo de Desarrollo Local de Sumapaz que le sea asignada para la realización de labores de mantenimiento y mejoramiento de la malla vial, zonas públicas, así como la atención de emergencias viales que surjan en la Localidad de Sumapaz. La alcaldesa local se acoge al penúltimo párrafo de la expedición de la certificación de no existencia número 17031 del 10 de septiembre de 2019, que bajo su responsabilidad contrata el personal. Ella autoriza la expedición del CDP para la contratación.","Inversión",18,"Mejor movilidad para todos","Pilar 2 Democracía Urbana",1364,1023025796,"PABLO YESID RIOS HILARION",9408000,null,0,null,null,9408000,3528000,"2019-10-09","2019-10-16","2020-02-15",120,null,null,null,"x",null,null,0.375,null,{"$f":"IF(SUMPRODUCT((A$14:A185=A185)*(B$14:B185=B185)*(C$14:C185=C185))>1,0,1)","v":1},"Contratos de prestación de servicios profesionales y de apoyo a la gestión","Contratación directa",{"$f":"IFERROR(VLOOKUP(F185,Tipo!$C$12:$C$27,1,FALSE),\"NO\")","v":"Prestación de servicios profesionales y de apoyo a la gestión, o para la ejecución de trabajos artísticos que sólo puedan encomendarse a determinadas personas naturales;"},"Inversión",18]
["CIN-157-2019",2019,"FDLS-MC-147-2019","Interventoría","Contratación mínima cuantia","No aplica","Realizar la interventoría técnica, administrativa, financiera, y ambiental al contrato que deriva del proceso licitatorio FDLS-LP-112-2019, y que tiene como objeto: \"Realizar actividades lúdicas y deportivas dirigidas a Persona mayor y Persona con Discapacidad de la localidad de Sumapaz","Inversión",11,"Mejores oportunidades para el desarrollo a través de la cultura, la recreación y el deporte","Pilar 1 Igualdad de Calidad de Vida",1353,1030535004,"ANGIE CAROLINA RIVEROS ARAUJO",11999998,null,0,null,null,11999998,0,"2019-10-07","2019-10-09","2020-02-08",120,null,null,null,"x",null,null,0,null,{"$f":"IF(SUMPRODUCT((A$14:A186=A186)*(B$14:B186=B186)*(C$14:C186=C186))>1,0,1)","v":1},"Interventoría","Contratación mínima cuantia",{"$f":"IFERROR(VLOOKUP(F186,Tipo!$C$12:$C$27,1,FALSE),\"NO\")","v":"NO"},"Inversión",11]
["CCS-158-2019",2019,"FDLS-MC-150-2019","Consultoría","Contratación mínima cuantia","No aplica","REALIZAR LOS DIAGNÓSTICOS DETALLADOS PARA LA IMPLEMENTACIÓN DE MODELOS DE BIOINGENIERÍA, TENDIENTES A LA RESTAURACIÓN Y RECUPERACIÓN DE ZONAS CON PROCESOS DE EROSIÓN O FENOMENOS DE REMOCIÓN EN MASA EN LA LOCALIDAD DE SUMAPAZ. LA ALCALDESA SE ACOGE  AL MEMORANDO 20192100476953 EN SU ÚLTIMO PARRAFO PARA REALIZAR LA CONTRATACIÓN Y AUTORIZA LA EXPEDICIÓN DEL CRP MEDIANTE MEMORANDO 20197020009923, COMO ORDENADORA DEL GASTO.","Inversión",4,"Familias protegidas y adaptadas al cambio climático","Pilar 1 Igualdad de Calidad de Vida",1340,"900217608-5","GEOTECHNICAL S A S",21741300,null,0,null,null,21741300,0,"2019-04-10","2019-10-11","2019-11-10",30,null,null,null,null,"x",null,0,null,{"$f":"IF(SUMPRODUCT((A$14:A187=A187)*(B$14:B187=B187)*(C$14:C187=C187))>1,0,1)","v":1},"Consultoría","Contratación mínima cuantia",{"$f":"IFERROR(VLOOKUP(F187,Tipo!$C$12:$C$27,1,FALSE),\"NO\")","v":"NO"},"Inversión",4]
["CPS-159-2019",2019,"FDLS-CD-184-2019","Contratos de prestación de servicios profesionales y de apoyo a la gestión","Contratación directa","Prestación de servicios profesionales y de apoyo a la gestión, o para la ejecución de trabajos artísticos que sólo puedan encomendarse a determinadas personas naturales;","PRESTAR SUS SERVICIOS COMO OPERARIO DE MAQUINARIA PESADA DE PROPIEDAD DEL FONDO DE DESARROLLO LOCAL DE SUMAPAZ QUE LE SEA ASIGNADA PARA LA REALIZACIÓN DE LABORES DE MANTENIMIENTO DE LA MALLA VIAL Y LAS ZONAS PÚBLICAS DE LA LOCALIDAD, ASÍ COMO ATENDER LAS EMERGENCIAS VIALES QUE SURJAN EN LA LOCALIDAD DE SUMAPAZ. LA ALCALDESA LOCAL SE ACOGE AL PENÚLTIMO PÁRRAFO DE LA EXPEDICIÓN DE LA CERTIFICACIÓN DE NO EXISTENCIA NÚMERO 17033 DEL 10 DE SEPTIEMBRE DE 2019, QUE BAJO SU RESPONSABILIDAD CONTRATA EL PERSONAL. ELLA AUTORIZA LA EXPEDICIÓN DEL CRP PARA LA CONTRATACIÓN.","Inversión",18,"Mejor movilidad para todos","Pilar 2 Democracía Urbana",1364,79565214,"NEIDER  MOLINA REY",9408000,null,0,null,null,9408000,3528000,"2019-10-09","2019-10-16","2020-02-15",120,null,null,null,"x",null,null,0.375,null,{"$f":"IF(SUMPRODUCT((A$14:A188=A188)*(B$14:B188=B188)*(C$14:C188=C188))>1,0,1)","v":1},"Contratos de prestación de servicios profesionales y de apoyo a la gestión","Contratación directa",{"$f":"IFERROR(VLOOKUP(F188,Tipo!$C$12:$C$27,1,FALSE),\"NO\")","v":"Prestación de servicios profesionales y de apoyo a la gestión, o para la ejecución de trabajos artísticos que sólo puedan encomendarse a determinadas personas naturales;"},"Inversión",18]
[159,2018,"FDLS-SAMC-090-2018","Contratos de prestación de servicios","Selección abreviada","Selección abreviada por menor cuantía ","REALIZAR ADICIÓN 1 AL CONTRATO CPS 159-2018 DE OBJETO ¿PRESTACIÓN DE SERVICIOS PARA LA REALIZACIÓN DE ACCIONES QUE MUEVAN LA VINCULACIÓN DE LA POBLACIÓN A PROCESOS DE PARTICIPACIÓN Y CONTROL SOCIAL. SE EXPIDE POR ORDEN DE LA ALCALDESA DONDE NO HAY AVANCE DE EJECUCION. BAJO SU RESPONSABILIDAD.","Inversión",45,"Gobernanza e influencia local, regional e internacional","Eje Transversal 4 Gobierno Legitimo, Fortalecimiento Local y Eficiencia",1377,80451743,"ASOCIACION RED ANDINA DE VEEDURIAS Y M.A.",null,null,0,1,22900000,22900000,8716580,"2018-11-21","2018-11-26","2019-04-21",90,null,null,null,null,"x",null,0.38063668122270744,null,{"$f":"IF(SUMPRODUCT((A$14:A189=A189)*(B$14:B189=B189)*(C$14:C189=C189))>1,0,1)","v":1},"Contratos de prestación de servicios","Selección abreviada",{"$f":"IFERROR(VLOOKUP(F189,Tipo!$C$12:$C$27,1,FALSE),\"NO\")","v":"Selección abreviada por menor cuantía "},"Inversión",45]
["CPS-160-2019",2019,"FDLS-CD-183-2019","Contratos de prestación de servicios profesionales y de apoyo a la gestión","Contratación directa","Prestación de servicios profesionales y de apoyo a la gestión, o para la ejecución de trabajos artísticos que sólo puedan encomendarse a determinadas personas naturales;","PRESTAR SUS SERVICIOS COMO OPERARIO DE MAQUINARIA PESADA DE PROPIEDAD DEL FONDO DE DESARROLLO LOCAL DE SUMAPAZ QUE LE SEA ASIGNADA PARA LA REALIZACIÓN DE LABORES DE MANTENIMIENTO DE LA MALLA VIAL Y LAS ZONAS PÚBLICAS DE LA LOCALIDAD, ASÍ COMO ATENDER LAS EMERGENCIAS VIALES QUE SURJAN EN LA LOCALIDAD DE SUMAPAZ. LA ALCALDESA LOCAL SE ACOGE AL PENÚLTIMO PÁRRAFO DE LA EXPEDICIÓN DE LA CERTIFICACIÓN DE NO EXISTENCIA NÚMERO 17033 DEL 10 DE SEPTIEMBRE DE 2019, QUE BAJO SU RESPONSABILIDAD CONTRATA EL PERSONAL. ELLA AUTORIZA LA EXPEDICIÓN DEL CRP PARA LA CONTRATACIÓN.","Inversión",18,"Mejor movilidad para todos","Pilar 2 Democracía Urbana",1364,80451743,"SALOMON  ROMERO PALACIOS",9408000,null,0,null,null,9408000,3528000,"2019-10-09","2019-10-16","2020-02-15",120,null,null,null,"x",null,null,0.375,null,{"$f":"IF(SUMPRODUCT((A$14:A190=A190)*(B$14:B190=B190)*(C$14:C190=C190))>1,0,1)","v":1},"Contratos de prestación de servicios profesionales y de apoyo a la gestión","Contratación directa",{"$f":"IFERROR(VLOOKUP(F190,Tipo!$C$12:$C$27,1,FALSE),\"NO\")","v":"Prestación de servicios profesionales y de apoyo a la gestión, o para la ejecución de trabajos artísticos que sólo puedan encomendarse a determinadas personas naturales;"},"Inversión",18]
[160,2018,"FDLS-SAMC-093-2018","Obra pública","Selección abreviada","Selección abreviada por menor cuantía ","ADICION AL CONTRATO 160-2018 QUE TIENE COMO OBJETO ¿REALIZAR EL MANTENIMIENTO DEL PARQUE DE LA VEREDA RIOS EN EL CORREGIMIENTO DE NAZARETH DE LA LOCALIDAD DE SUMAPAZ EN LA CIUDAD DE BOGOTA D.C¿. DE CONFORMIDAD CON LOS ESTUDIOS PREVIOS, ANEXO TECNICO Y APENDICES. LA ALCALDESA SE ACOGEN AL ULTIMO PARRAFO DEL MEMORANDO 20192100216753","Inversión",17,"Espacio público, derecho de todos","Pilar 2 Democracía Urbana",1358,"860518862-1","CONSORCIO PRIMAVERA ",null,1,-250,1,9330465,9330215,9330215,"2018-11-22","2019-01-08","2019-06-01",120,25,null,null,null,null,"x",1,null,{"$f":"IF(SUMPRODUCT((A$14:A191=A191)*(B$14:B191=B191)*(C$14:C191=C191))>1,0,1)","v":1},"Obra pública","Selección abreviada",{"$f":"IFERROR(VLOOKUP(F191,Tipo!$C$12:$C$27,1,FALSE),\"NO\")","v":"Selección abreviada por menor cuantía "},"Inversión",17]
["CPS-161-2019",2019,"FDLS-SAMC-143-2019","Contratos de prestación de servicios","Selección abreviada","Selección abreviada por menor cuantía ","PROMOCIÓN DE ESTRATÉGIAS DE CONVIVENCIA CIUDADANA Y ACOMPAÑAMIENTO PSICOSOCIAL A GRUPOS AFECTADOS POR LA VIOLENCIA, CON ENFOQUE DE GÉNERO.LA ALCALDESA AUTORIZA LA EXPEDICION DEL CRP MEDIANTE MEMORANDO 20197020010463","Inversión",19,"Seguridad y convivencia para todos","Pilar 3 Construcción de Comunidad y Cultura Ciudadana",1366,"900018217-5","FUNDACION OTRO ROLLO SOCIAL",197651500,null,0,null,null,197651500,0,"2018-10-11","2019-10-25","2020-05-24",210,null,null,null,"x",null,null,0,null,{"$f":"IF(SUMPRODUCT((A$14:A192=A192)*(B$14:B192=B192)*(C$14:C192=C192))>1,0,1)","v":1},"Contratos de prestación de servicios","Selección abreviada",{"$f":"IFERROR(VLOOKUP(F192,Tipo!$C$12:$C$27,1,FALSE),\"NO\")","v":"Selección abreviada por menor cuantía "},"Inversión",19]
["CPS-162-2019",2019,"FDLS-SAMC-145-2019","Contratos de prestación de servicios","Selección abreviada","Selección abreviada por menor cuantía ","CONTRATAR  LA PRESTACION DEL SERVICIO DE VIGILANCIA Y SEGURIDAD PRIVADA CON ARMAS, PARA SEDES DE LA ALCALDIA LOCAL DE SUMAPAZ BOGOTA DISTRITO CAPITAL D.C.","FUNCIONAMIENTO",null," "," ",null,"860518862-1","SEGURIDAD LAS AMERICAS LTDA SEGURIAMERICAS LTDA",133833553,null,0,null,null,133833553,34500740,"2019-10-07","2019-10-14","2020-05-28",225,null,null,null,"x",null,null,0.25778841872336755,null,{"$f":"IF(SUMPRODUCT((A$14:A193=A193)*(B$14:B193=B193)*(C$14:C193=C193))>1,0,1)","v":1},"Contratos de prestación de servicios","Selección abreviada",{"$f":"IFERROR(VLOOKUP(F193,Tipo!$C$12:$C$27,1,FALSE),\"NO\")","v":"Selección abreviada por menor cuantía "},"Funcionamiento","NO"]
["CPS-163-2019",2019,"FDLS-CD-185-2019","Contratos de prestación de servicios profesionales y de apoyo a la gestión","Contratación directa","Prestación de servicios profesionales y de apoyo a la gestión, o para la ejecución de trabajos artísticos que sólo puedan encomendarse a determinadas personas naturales;","Prestar sus servicios como ayudante de la maquinaria pesada de propiedad del Fondo de Desarrollo Local de Sumapaz que le sea asignada para la realización de labores de mantenimiento y mejoramiento de la malla vial, zonas públicas, así como la atención de emergencias viales que surjan en la Localidad de Sumapaz. La alcaldesa local se acoge al penúltimo párrafo de la expedición de la certificación de no existencia número 17031 del 10 de septiembre de 2019, que bajo su responsabilidad contrata el personal. Ella autoriza la expedición del CDP para la contratación.","Inversión",18,"Mejor movilidad para todos","Pilar 2 Democracía Urbana",1364,79887251,"FABIO  MORENO TORRES",9408000,null,0,null,null,9408000,3920000,"2019-10-07","2019-10-11","2020-02-10",120,null,null,null,"x",null,null,0.41666666666666669,null,{"$f":"IF(SUMPRODUCT((A$14:A194=A194)*(B$14:B194=B194)*(C$14:C194=C194))>1,0,1)","v":1},"Contratos de prestación de servicios profesionales y de apoyo a la gestión","Contratación directa",{"$f":"IFERROR(VLOOKUP(F194,Tipo!$C$12:$C$27,1,FALSE),\"NO\")","v":"Prestación de servicios profesionales y de apoyo a la gestión, o para la ejecución de trabajos artísticos que sólo puedan encomendarse a determinadas personas naturales;"},"Inversión",18]
["CPS-164-2019",2019,"FDLS-CD-186-2019","Contratos de prestación de servicios profesionales y de apoyo a la gestión","Contratación directa","Prestación de servicios profesionales y de apoyo a la gestión, o para la ejecución de trabajos artísticos que sólo puedan encomendarse a determinadas personas naturales;","PRESTAR SUS SERVICIOS COMO AYUDANTE DE LA MAQUINARIA PESADA DE PROPIEDAD DEL FONDO DE DESARROLLO LOCAL DE SUMAPAZ QUE LE SEA ASIGNADA PARA LA REALIZACIÓN DE LABORES DE MANTENIMIENTO Y MEJORAMIENTO DE LA MALLA VIAL, ZONAS PÚBLICAS, ASÍ COMO LA ATENCIÓN DE EMERGENCIAS VIALES QUE SURJAN EN LA LOCALIDAD DE SUMAPAZ. LA ALCALDESA LOCAL SE ACOGE AL PENÚLTIMO PÁRRAFO DE LA EXPEDICIÓN DE LA CERTIFICACIÓN DE NO EXISTENCIA NÚMERO 17031 DEL 10 DE SEPTIEMBRE DE 2019, QUE BAJO SU RESPONSABILIDAD CONTRATA EL PERSONAL. ELLA AUTORIZA LA EXPEDICIÓN DEL CRP PARA LA CONTRATACIÓN.","Inversión",18,"Mejor movilidad para todos","Pilar 2 Democracía Urbana",1364,1032656406,"FABIAN LEONARDO PULIDO MORENO",9408000,null,0,null,null,9408000,3528000,"2019-10-07","2019-10-16","2020-02-15",120,null,null,null,"x",null,null,0.375,null,{"$f":"IF(SUMPRODUCT((A$14:A195=A195)*(B$14:B195=B195)*(C$14:C195=C195))>1,0,1)","v":1},"Contratos de prestación de servicios profesionales y de apoyo a la gestión","Contratación directa",{"$f":"IFERROR(VLOOKUP(F195,Tipo!$C$12:$C$27,1,FALSE),\"NO\")","v":"Prestación de servicios profesionales y de apoyo a la gestión, o para la ejecución de trabajos artísticos que sólo puedan encomendarse a determinadas personas naturales;"},"Inversión",18]
[164,2018,"FDLS-CD-109-2018","Contratos interadministrativos","Contratación directa","Contratos interadministrativos","ADICION CONVENIO INTERADMINISTRATIVO  CIA - 164 -2018 CUYO OBJETO ES: AUNAR ESFUERZOS TÉCNICOS, ADMINISTRATIVOS Y FINANCIEROS PARA REALIZAR ACCIONES DE RECONOCIMIENTO Y FUNCIONAMIENTO DE LOS SISTEMAS DE ACUEDUCTO VEREDAL LEGALIZADOS O EN PROCESO DE LEGALIZACIÓN Y SISTEMAS DE SANEAMIENTO BÁSICO DE LA LOCALIDAD DE SUMAPAZ. LA ALCALDESA LOCAL  SE ACOGE AL ÚLTIMO PARRAFO DEL MEMORANDO 20192100533383 DEL 02 DE OCTUBRE DE 2019, POR LO CUAL HACE LA SOLICITUD PARA LA EXPEDICION DEL CRP","Inversión",41,"Desarrollo rural sostenible","Eje Transversal 3 Sostenibilidad Ambiental basada en la eficiencia energética",1356,"830070987-4","AGUAS DE BOGOTA S A ESP",null,null,0,1,89845980,89845980,null,"2018-12-27","2019-02-05","2020-01-19",240,105,null,null,null,"x",null,0,null,{"$f":"IF(SUMPRODUCT((A$14:A196=A196)*(B$14:B196=B196)*(C$14:C196=C196))>1,0,1)","v":1},"Contratos interadministrativos","Contratación directa",{"$f":"IFERROR(VLOOKUP(F196,Tipo!$C$12:$C$27,1,FALSE),\"NO\")","v":"Contratos interadministrativos"},"Inversión",41]
["CPS-165-2019",2019,"FDLS-LP-142-2019","Contratos de prestación de servicios","Licitación pública","No aplica","PRESTACIÓN DEL SERVICIO DE MANTENIMIENTO DE LA MAQUINARIA Y VEHICULOS PESADOS DE PROPIEDAD, GUARDA Y/O TENENCIA DEL FONDO DE DESARROLLO LOCAL DE SUMAPAZ CON SUMINISTRO DE REPUESTOS, LLANTAS, INSUMOS, ACCESORIOS Y MANO DE OBRA","Inversión",18,"Mejor movilidad para todos","Pilar 2 Democracía Urbana",1364,"830070987-4","HYUNDAUTOS SAS",600000000,null,0,null,null,600000000,0,"2019-10-26","2019-11-07","2020-07-06",240,null,null,null,"x",null,null,0,null,{"$f":"IF(SUMPRODUCT((A$14:A197=A197)*(B$14:B197=B197)*(C$14:C197=C197))>1,0,1)","v":1},"Contratos de prestación de servicios","Licitación pública",{"$f":"IFERROR(VLOOKUP(F197,Tipo!$C$12:$C$27,1,FALSE),\"NO\")","v":"NO"},"Inversión",18]
[165,2018,"FDLS-CMA-067-2018","Interventoría","Concurso de méritos","No aplica","ADICION NO. 1 AL CONTRATO DE INTERVENTORIA NO. FDLS CIN 165-2019, CUYO OBJETO ES ¿REALIZAR LA INTERVENTORÍA TÉCNICA, ADMINISTRATIVA, FINANCIERA, AMBIENTAL, SOCIAL Y JURÍDICA AL CONTRATO QUE RESULTE DEL PROCESO LICITATORIO FDLS-LP-012-2018, CUYO OBJETO ES CONTRATAR LAS OBRAS PARA LA CONSERVACION DE LA MALLA VIAL LOCAL DE SUMAPAZ, POR EL SISTEMA DE PRECIOS UNITARIOS FIJOS, SIN FORMULA DE REAJUSTE Y A MONTO AGOTABLE","Inversión",18,"Mejor movilidad para todos","Pilar 2 Democracía Urbana",1364,9012349671,"CONSORCIO INTERVIAL SUMAPAZ",null,null,0,1,300000000,300000000,0,"2018-11-29","2018-12-20","2020-03-19",360,90,null,null,"x",null,null,0,null,{"$f":"IF(SUMPRODUCT((A$14:A198=A198)*(B$14:B198=B198)*(C$14:C198=C198))>1,0,1)","v":1},"Interventoría","Concurso de méritos",{"$f":"IFERROR(VLOOKUP(F198,Tipo!$C$12:$C$27,1,FALSE),\"NO\")","v":"NO"},"Inversión",18]
["CPS-166-2019",2019,"FDLS-SAMC-151-2019","Contratos de prestación de servicios","Selección abreviada","Selección abreviada por menor cuantía ","REALIZACIÓN DE ACCIONES QUE PROMUEVAN LA VINCULACIÓN A PROCESOS DE PARTICIPACIÓN COMUNITARIA EN LA LOCALIDAD DE SUMAPAZ EN LA VIGENCIA 2019. SE AUTORIZA POR LA ALCALDESA A EXPEDIR EL CRP MEDIANTE MEMORANDO 20197020010723","Inversión",45,"Gobernanza e influencia local, regional e internacional","Eje Transversal 4 Gobierno Legitimo, Fortalecimiento Local y Eficiencia",1377,8300890580,"FUNDACION DE CIENCIA Y TECNOLOGIA GLOBAL",141009592,null,0,null,null,141009592,0,"2019-11-06","2019-11-12","2020-05-11",180,null,null,null,"x",null,null,0,null,{"$f":"IF(SUMPRODUCT((A$14:A199=A199)*(B$14:B199=B199)*(C$14:C199=C199))>1,0,1)","v":1},"Contratos de prestación de servicios","Selección abreviada",{"$f":"IFERROR(VLOOKUP(F199,Tipo!$C$12:$C$27,1,FALSE),\"NO\")","v":"Selección abreviada por menor cuantía "},"Inversión",45]
["CIN-167-2019",2019,"FDLS-CMA-168-2019","Interventoría","Concurso de méritos","No aplica","REALIZAR LA INTERVENTORIA TECNICA, ADMINISTRATIVA, FINANCIERA Y AMBIENTAL AL CONTRATO DERIVADO DE LA LICITACION PÚBLICA N° FDLS-LP-142-2019, QUE TENDRÁ POR OBJETO ¿PRESTACIÓN DEL SERVICIO DE MANTENIMIENTO DE LA MAQUINARIA Y VEHICULOS PESADOS DE PROPIEDAD, GUARDA Y/O TENENCIA DEL FONDO DE DESARROLLO LOCAL DE SUMAPAZ CON SUMINISTRO DE REPUESTOS, LLANTAS, INSUMOS, ACCESORIOS Y MANO DE OBRA. LA ALCALDESA LOCAL AUTORIZA LA EXPEDICION DE CDP MEDIANTE MEMORANDOnO. 20197020009283","Inversión",18,"Mejor movilidad para todos","Pilar 2 Democracía Urbana",1364,"3096924-3","JAVIER ENRIQUE BUITRAGO GOMEZ",43684000,null,0,null,null,43684000,0,"2019-11-05","2019-11-07","2020-07-06",240,null,null,null,"x",null,null,0,null,{"$f":"IF(SUMPRODUCT((A$14:A200=A200)*(B$14:B200=B200)*(C$14:C200=C200))>1,0,1)","v":1},"Interventoría","Concurso de méritos",{"$f":"IFERROR(VLOOKUP(F200,Tipo!$C$12:$C$27,1,FALSE),\"NO\")","v":"NO"},"Inversión",18]
["CPS-167-2019",2019,"FDLS-CD-192-2019","Contratos de prestación de servicios profesionales y de apoyo a la gestión","Contratación directa","Prestación de servicios profesionales y de apoyo a la gestión, o para la ejecución de trabajos artísticos que sólo puedan encomendarse a determinadas personas naturales;","PRESTAR SUS SERVICIOS COMO AYUDANTE DE LA MAQUINARIA PESADA DE PROPIEDAD DEL FONDO DE DESARROLLO LOCAL DE SUMAPAZ QUE LE SEA ASIGNADA PARA LA REALIZACIÓN DE LABORES DE MANTENIMIENTO DE LA MALLA VIAL Y LAS ZONAS PÚBLICAS DE LA LOCALIDAD, ASÍ COMO LA ATENCIÓN DE EMERGENCIAS VIALES QUE SURJAN EN LA LOCALIDAD DE SUMAPAZ.LA ALCALDESA SE ACOGE A LA CERTIFICACIÓN DE NO EXISTENCIA DE PERSONAL N. 17172 DEL 07 DE NOVIEMBRE DE 2019. SE EXPIDE CRP  A SOLICITUD DE LA ALCALDESA","Inversión",18,"Mejor movilidad para todos","Pilar 2 Democracía Urbana",1364,80746510,"FREDDY ERNESTO PORRAS PALACIOS",4704000,null,0,null,null,4704000,313600,"2019-11-19","2019-11-27","2020-01-26",60,null,null,null,"x",null,null,6.6666666666666666E-2,null,{"$f":"IF(SUMPRODUCT((A$14:A201=A201)*(B$14:B201=B201)*(C$14:C201=C201))>1,0,1)","v":1},"Contratos de prestación de servicios profesionales y de apoyo a la gestión","Contratación directa",{"$f":"IFERROR(VLOOKUP(F201,Tipo!$C$12:$C$27,1,FALSE),\"NO\")","v":"Prestación de servicios profesionales y de apoyo a la gestión, o para la ejecución de trabajos artísticos que sólo puedan encomendarse a determinadas personas naturales;"},"Inversión",18]
["CPS-168-2019",2019,"FDLS-CD-193-2019","Contratos de prestación de servicios profesionales y de apoyo a la gestión","Contratación directa","Prestación de servicios profesionales y de apoyo a la gestión, o para la ejecución de trabajos artísticos que sólo puedan encomendarse a determinadas personas naturales;","Prestar sus servicios como operario de maquinaria pesada de propiedad del Fondo de Desarrollo Local de Sumapaz que le sea asignada para la realización de labores de mantenimiento de la malla vial y las zonas públicas de la localidad, así como atender las emergencias viales que surjan en la Localidad de Sumapaz. La alcaldesa se acoge a lo estipulado en la certificación de no existencia de personal No. 17166 del 6 de noviembre de 2019","Inversión",18,"Mejor movilidad para todos","Pilar 2 Democracía Urbana",1364,1023017436,"LEONEL JESID MARTINEZ MARTINEZ",4704000,null,0,null,null,4704000,862400,"2019-11-13","2019-11-20","2020-01-19",60,null,null,null,"x",null,null,0.18333333333333332,null,{"$f":"IF(SUMPRODUCT((A$14:A202=A202)*(B$14:B202=B202)*(C$14:C202=C202))>1,0,1)","v":1},"Contratos de prestación de servicios profesionales y de apoyo a la gestión","Contratación directa",{"$f":"IFERROR(VLOOKUP(F202,Tipo!$C$12:$C$27,1,FALSE),\"NO\")","v":"Prestación de servicios profesionales y de apoyo a la gestión, o para la ejecución de trabajos artísticos que sólo puedan encomendarse a determinadas personas naturales;"},"Inversión",18]
["CPS-169-2019",2019,"FDLS-CD-194-2019","Contratos de prestación de servicios profesionales y de apoyo a la gestión","Contratación directa","Prestación de servicios profesionales y de apoyo a la gestión, o para la ejecución de trabajos artísticos que sólo puedan encomendarse a determinadas personas naturales;","Prestar sus servicios como operario de maquinaria pesada de propiedad del Fondo de Desarrollo Local de Sumapaz que le sea asignada para la realización de labores de mantenimiento de la malla vial y las zonas públicas de la localidad, así como atender las emergencias viales que surjan en la Localidad de Sumapaz. La alcaldesa se acoge a lo estipulado en la certificación de no existencia de personal No. 17166 del 6 de noviembre de 2019","Inversión",18,"Mejor movilidad para todos","Pilar 2 Democracía Urbana",1364,79519630,"JOSE JAVIER PORRAS",4704000,null,0,null,null,4704000,862400,"2019-11-15","2019-11-20","2020-01-19",60,null,null,null,"x",null,null,0.18333333333333332,null,{"$f":"IF(SUMPRODUCT((A$14:A203=A203)*(B$14:B203=B203)*(C$14:C203=C203))>1,0,1)","v":1},"Contratos de prestación de servicios profesionales y de apoyo a la gestión","Contratación directa",{"$f":"IFERROR(VLOOKUP(F203,Tipo!$C$12:$C$27,1,FALSE),\"NO\")","v":"Prestación de servicios profesionales y de apoyo a la gestión, o para la ejecución de trabajos artísticos que sólo puedan encomendarse a determinadas personas naturales;"},"Inversión",18]
["CPS-170-2019",2019,"FDLS-CD-195-2019","Contratos de prestación de servicios profesionales y de apoyo a la gestión","Contratación directa","Prestación de servicios profesionales y de apoyo a la gestión, o para la ejecución de trabajos artísticos que sólo puedan encomendarse a determinadas personas naturales;","PRESTAR LOS SERVICIOS PROFESIONALES COMO ABOGADO (A) DE APOYO AL ÁREA DE GESTIÓN POLICIVA Y JURÍDICA DEL FONDO DE DESARROLLO LOCAL DE SUMAPAZ, EN EL DESARROLLO DE LAS FUNCIONES PROPIAS DE ESA DEPENDENCIA. LA ALCALDESA LOCAL SE ACOGE A LO QUE DICE EL CERTIFICACION DE NO EXISTE  DE PERSONAL  N. 17058 DEL 22 DE OCTUBRE DE 2019.","Inversión",45,"Gobernanza e influencia local, regional e internacional","Eje Transversal 4 Gobierno Legitimo, Fortalecimiento Local y Eficiencia",1375,78114406,"FRANK JAVIER MARQUEZ ARRIETA",9870000,null,0,null,null,9870000,2138500,"2019-11-13","2019-11-18","2020-01-17",60,null,null,null,"x",null,null,0.21666666666666667,null,{"$f":"IF(SUMPRODUCT((A$14:A204=A204)*(B$14:B204=B204)*(C$14:C204=C204))>1,0,1)","v":1},"Contratos de prestación de servicios profesionales y de apoyo a la gestión","Contratación directa",{"$f":"IFERROR(VLOOKUP(F204,Tipo!$C$12:$C$27,1,FALSE),\"NO\")","v":"Prestación de servicios profesionales y de apoyo a la gestión, o para la ejecución de trabajos artísticos que sólo puedan encomendarse a determinadas personas naturales;"},"Inversión",45]
["COP-171-2019",2019,"FDLS-SAMC-155-2019","Obra pública","Selección abreviada","Selección abreviada por menor cuantía ","POR EL SISTEMA DE PRECIOS FIJOS SIN FORMULA DE REAJUSTE EL MANTENIMIENTO DE PARQUES Y/O ESCENARIOS DEPORTIVOS UBICADOS EN LAS (UPR) UNIDAD DE PLANEAMIENTO RURAL DEL RIO BLANCO Y DEL RIO SUMAPAZ, PARA LA COMUNIDAD DE LA LOCALIDAD DE SUMAPAZ EN LA CIUDAD DE BOGOTAD.C. SE EXPIDE CRP A SOLICITUD DE LA ALCALDESA MEDIANTE MEMORANDO 20197020011203 DEL 26 DE NOVIEMBRE DE 2019","Inversión",17,"Espacio público, derecho de todos","Pilar 2 Democracía Urbana",1358,9013419804,"CONSORCIO PARQUES SUMAPAZ 2019",188214682,null,0,null,null,188214682,0,"2019-11-18","2019-11-28","2020-04-27",150,null,null,null,"x",null,null,0,null,{"$f":"IF(SUMPRODUCT((A$14:A205=A205)*(B$14:B205=B205)*(C$14:C205=C205))>1,0,1)","v":1},"Obra pública","Selección abreviada",{"$f":"IFERROR(VLOOKUP(F205,Tipo!$C$12:$C$27,1,FALSE),\"NO\")","v":"Selección abreviada por menor cuantía "},"Inversión",17]
["CPS-173-2019",2019,"FDLS-SAMC-179-2019","Contratos de prestación de servicios","Selección abreviada","Selección abreviada por menor cuantía ","PRESTAR LOS SERVICIOS PARA LA CELEBRACIÓN DE LAS TRADICIONALES NOVENAS NAVIDEÑAS EN LA LOCALIDAD 20 DE SUMAPAZ DE LA VIGENCIA 2019. SE EXPIDE A SOLICITUD DE LA ALCALDESA LOCAL, QUE AUTORIZA  ESTANDO PENDIENTE DE PUBLICAR EN SIPSE PARA CORREGIR VALOR","Inversión",11,"Mejores oportunidades para el desarrollo a través de la cultura, la recreación y el deporte","Pilar 1 Igualdad de Calidad de Vida",1353,"830140609-6","INVERSIONES AGROCOLOMBIA S A S",218858450,null,0,null,null,218858450,0,"2019-11-22","2019-11-26","2019-12-25",30,null,null,null,null,"x",null,0,null,{"$f":"IF(SUMPRODUCT((A$14:A206=A206)*(B$14:B206=B206)*(C$14:C206=C206))>1,0,1)","v":1},"Contratos de prestación de servicios","Selección abreviada",{"$f":"IFERROR(VLOOKUP(F206,Tipo!$C$12:$C$27,1,FALSE),\"NO\")","v":"Selección abreviada por menor cuantía "},"Inversión",11]
[173,2018,"FDLS-LP-094-2018","Obra pública","Licitación pública","No aplica","ADICIÓN # 1 AL CONTRATO DE OBRA PÚBLICA # 173 DE 2018 CUYO OBJETO ES: ¿REALIZAR POR EL SISTEMA DE PRECIOS UNITARIOS FIJOS SIN FORMULA DE REAJUSTE: LA CONSTRUCCIÓN DE OBRAS DE MITIGACIÓN PARA ATENDER LA RESTAURACIÓN Y RECUPERACIÓN DE ZONAS CON PROCESOS DE EROSIÓN O FENOMENOS DE REMOCIÓN EN MASA EN LA LOCALIDAD DE SUMAPAZ¿, ES RESPONSABILIDAD DEL ALCALDESA LOCAL DE SUMAPAZ COMO REPRESENTANTE LEGAL DEL FONDO DE DESARROLLO LOCAL, ACORDE A LA FACULTAD DELEGADA POR EL ARTÍCULO 8° DEL DECRETO 101 DE 2010, ADELANTAR LOS TRÁMITES DE PRÓRROGAS PREVISTOS, ACOGIENDO O NO, TOTAL O PARCIALMENTE, LAS OBSERVACIONES CONSIGNADAS EN EL MEMORANDO N. 20192100527103, POR LO CUAL REALIZA LA SOLICITUD DE CRP A TRAVÉS DE  MEMORANDO 20197020010023.","Inversión",3,"Igualdad y autonomía para una Bogotá incluyente","Pilar 1 Igualdad de Calidad de Vida",1340,"900298623-2","CEDRO ANDINO SOCIEDAD POR ACCIONES SIMPLIFICADA",null,null,0,1,453116954,{"$f":"O207+Q207+S207","v":453116954},0,"2018-12-18","2019-03-19","2019-12-08",210,180,null,null,null,"x",null,0,null,{"$f":"IF(SUMPRODUCT((A$14:A207=A207)*(B$14:B207=B207)*(C$14:C207=C207))>1,0,1)","v":1},"Obra pública","Licitación pública",{"$f":"IFERROR(VLOOKUP(F207,Tipo!$C$12:$C$27,1,FALSE),\"NO\")","v":"NO"},"Inversión",3]
["CIA-175-2019",2019,"FDLS-CD-199-2019","Contratos interadministrativos","Contratación directa","Contratos interadministrativos","DESARROLLAR UN PROCESO DE INTERVENCIÓN QUE GARANTICE EL DERECHO A LAS COMUNICACIONES, MEDIANTE LA OPERACIÓN, ADMINISTRACIÓN Y MANTENIMIENTO DE LOS PORTALES INTERACTIVOS Y LAS LÍNEAS TELEFÓNICAS INSTALADAS EN LA LOCALIDAD DE SUMAPAZ","Inversión",36,"Bogotá, una ciudad digital","Eje Transversal 2 Desarrollo Económico basado en el conocimiento",1368,"899999115-8","EMPRESA DE TELECOMUNICACIONES DE BOGOTA SA ESP",829327612,null,0,null,null,829327612,0,"2019-12-05","2019-12-11","2020-12-10",360,null,null,null,"x",null,null,0,null,{"$f":"IF(SUMPRODUCT((A$14:A208=A208)*(B$14:B208=B208)*(C$14:C208=C208))>1,0,1)","v":1},"Contratos interadministrativos","Contratación directa",{"$f":"IFERROR(VLOOKUP(F208,Tipo!$C$12:$C$27,1,FALSE),\"NO\")","v":"Contratos interadministrativos"},"Inversión",36]
["CPS-176-2019",2019,"FDLS-SAMC-190-2019","Contratos de prestación de servicios","Selección abreviada","Selección abreviada por menor cuantía ","PRESTAR LOS SERVICIOS PARA LA ORGANIZACIÓN, COORDINACIÓN Y EJECUCIÓN DE LA TERCERA FASE DE LA ESCUELA DE FORMACIÓN ARTÍSTICA Y CULTURAL DE SUMAPAZ¿L (EFACS III).LA ALCALDESA AUTORIZA LA EXPEDICIÓN DEL CRP MEDIANTE MEMORANDO 20197020013183","Inversión",11,"Mejores oportunidades para el desarrollo a través de la cultura, la recreación y el deporte","Pilar 1 Igualdad de Calidad de Vida",1353,"900270576-2","FUNDACION CONSTRUCCION LOCAL",212718500,null,0,null,null,212718500,0,"2019-12-18",null,null,240,null,null,"x",null,null,null,0,null,{"$f":"IF(SUMPRODUCT((A$14:A209=A209)*(B$14:B209=B209)*(C$14:C209=C209))>1,0,1)","v":1},"Contratos de prestación de servicios","Selección abreviada",{"$f":"IFERROR(VLOOKUP(F209,Tipo!$C$12:$C$27,1,FALSE),\"NO\")","v":"Selección abreviada por menor cuantía "},"Inversión",11]
[176,2018,"FDLS-MC-114-2018","Contratos de prestación de servicios","Contratación mínima cuantia","No aplica","Adición y prorroga No 1al contrato CPS-176-2018, cuyo objeto es: ¿PRESTAR LOS SERVICIOS DE MONITOREO VEHICULAR INTEGRAL POR GPS PARA LOS VEHÍCULOS DE PROPIEDAD O TENENCIA DEL FONDO DE DESARROLLO LOCAL DE SUMAPAZ¿. DE ACUERDO A LA SOLICITUD A LA ALCALDESA COMO ORDENADORA DEL GASTO.","Inversión",45,"Gobernanza e influencia local, regional e internacional","Eje Transversal 4 Gobierno Legitimo, Fortalecimiento Local y Eficiencia",1375,"901351185-8","DAR SOLUCIONES SAS",null,null,0,1,2601150,2601150,0,"2018-12-26","2019-01-15","2020-03-14",360,60,null,null,"x",null,null,0,null,{"$f":"IF(SUMPRODUCT((A$14:A210=A210)*(B$14:B210=B210)*(C$14:C210=C210))>1,0,1)","v":1},"Contratos de prestación de servicios","Contratación mínima cuantia",{"$f":"IFERROR(VLOOKUP(F210,Tipo!$C$12:$C$27,1,FALSE),\"NO\")","v":"NO"},"Inversión",45]
["COP-177-2019",2019,"FDLS-LP-188-2019","Obra pública","Licitación pública","No aplica","REALIZAR EL DIAGNOSTICO, DEMOLICION, CONSTRUCCION, MANTENIMIENTO Y REPARACIONES LOCATIVAS DE LOS SALONES COMUNALES Y/O EQUIPAMIENTOS COMUNITARIOS POR EL SISTEMA DE PRECIOS FIJOS SIN FORMULA DE REAJUSTE, EN LA LOCALIDAD DE SUMAPAZ, D.C,. LA ALCALDESA LOCAL SE ACOGE AL ÚLTIMO PARRAFO DEL MEMORANDO 20192100558223. POR LO CUAL AUTORIZA LA EXPEDICIÓN DEL CDP COMO ORDENADORA DEL GASTO.","Inversión",45,"Gobernanza e influencia local, regional e internacional","Eje Transversal 4 Gobierno Legitimo, Fortalecimiento Local y Eficiencia",1377,"901351185-8","CONSORCIO SALONES 2019",1599967634,null,0,null,null,1599967634,0,"2019-12-24",null,null,210,null,null,"x",null,null,null,0,null,{"$f":"IF(SUMPRODUCT((A$14:A211=A211)*(B$14:B211=B211)*(C$14:C211=C211))>1,0,1)","v":1},"Obra pública","Licitación pública",{"$f":"IFERROR(VLOOKUP(F211,Tipo!$C$12:$C$27,1,FALSE),\"NO\")","v":"NO"},"Inversión",45]
["COP-178-2019",2019,"FDLS-LP-189-2019","Obra pública","Licitación pública","No aplica","REALIZAR POR EL SISTEMA DE PRECIOS UNITARIOS FIJOS SIN FORMULA DE REAJUSTE Y A MONTO AGOTABLE, EL RECONOCIMIENTO, VERIFICACIÓN Y DIAGNÓSTICOS ASI COMO LAS OBRAS DE MANTENIMIENTO REQUERIDAS PARA LA ADECUACIÓN, REHABILITACIÓN Y FUNCIONAMIENTO DE LOS SISTEMAS DE ACUEDUCTOS VEREDALES EN LA LOCALIDAD DE SUMAPAZ. LA ALCALDESA SE ACOGE AL ÚLTIMO PARRAFO DEL MEMORANDO 20192100555503 DEL 17 DE OCTUBRE DE 2019, POR LO CUAL SOLICITA LA SOLICITUD DEL CRP. MEDIANTE MEMORANDO SIN RADICAR","Inversión",41,"Desarrollo rural sostenible","Eje Transversal 3 Sostenibilidad Ambiental basada en la eficiencia energética",1356,"901350917-8","CONSORCIO ACUEDUCTOS PARA EL SUMAPAZ",1636000000,null,0,null,null,1636000000,0,"2019-12-24",null,null,300,null,null,"x",null,null,null,0,null,{"$f":"IF(SUMPRODUCT((A$14:A212=A212)*(B$14:B212=B212)*(C$14:C212=C212))>1,0,1)","v":1},"Obra pública","Licitación pública",{"$f":"IFERROR(VLOOKUP(F212,Tipo!$C$12:$C$27,1,FALSE),\"NO\")","v":"NO"},"Inversión",41]
["CCO-179-2019",2019,"FDLS-CMA-191-2019","Consultoría","Concurso de méritos","No aplica","REALIZAR LOS ESTUDIOS Y DISEÑOS PARA LA CONSTRUCCIÓN DE LA SEDE ADMINISTRATIVA EN EL CORREGIMIENTO DE SAN JUAN O CORREGIMIENTO DE BETANIA ¿ LOCALIDAD DE SUMAPAZ ¿ DISTRITO CAPITAL. LA ALCALDESA SE ACOGE AL ULTIMO PARRAFO DEL MEMORANDO 20192100533373, POR LO CUAL AUTORIZA EXPEDIR EL CORRESPONDIENTE CDP COMO ORDENADORA DEL GASTO","Inversión",45,"Gobernanza e influencia local, regional e internacional","Eje Transversal 4 Gobierno Legitimo, Fortalecimiento Local y Eficiencia",1375,"901351529-8","CONSORCIO DISEÑOS 2019",1170719994,null,0,null,null,1170719994,0,"2019-12-26",null,null,240,null,null,"x",null,null,null,0,null,{"$f":"IF(SUMPRODUCT((A$14:A213=A213)*(B$14:B213=B213)*(C$14:C213=C213))>1,0,1)","v":1},"Consultoría","Concurso de méritos",{"$f":"IFERROR(VLOOKUP(F213,Tipo!$C$12:$C$27,1,FALSE),\"NO\")","v":"NO"},"Inversión",45]
["CIN-180-2019",2019,"FDLS-CMA-197-2019","Interventoría","Concurso de méritos","No aplica","REALIZAR LA INTERVENTORÍA TÉCNICA, ADMINISTRATIVA, FINANCIERA, LEGAL AL CONTRATO QUE RESULTE DEL PROCESO LICITATORIO, CUYO OBJETO ES: ¿REALIZAR EL DIAGNOSTICO, DEMOLICION, CONSTRUCCION, MANTENIMIENTO Y REPARACIONES LOCATIVAS DE LOS SALONES COMUNALES Y/O EQUIPAMIENTOS COMUNITARIOS POR EL SISTEMA DE PRECIOS FIJOS SIN FORMULA DE REAJUSTE, EN LA LOCALIDAD DE SUMAPAZ, D.C. LA ALCALDESA SE ACOGE AL ULTIMO PARRAFO DEL MEMORANDO 20192100557843, POR LO CUAL AUTORIZA A EXPEDIR A SOLICITUD DE CDP MEDIANTE MEMORANDO 20197020010063","Inversión",45,"Gobernanza e influencia local, regional e internacional","Eje Transversal 4 Gobierno Legitimo, Fortalecimiento Local y Eficiencia",1377,"901351433-1","CONSORCIO MAJOPE",159999103,null,0,null,null,159999103,0,"2019-12-26",null,null,240,null,null,"x",null,null,null,0,null,{"$f":"IF(SUMPRODUCT((A$14:A214=A214)*(B$14:B214=B214)*(C$14:C214=C214))>1,0,1)","v":1},"Interventoría","Concurso de méritos",{"$f":"IFERROR(VLOOKUP(F214,Tipo!$C$12:$C$27,1,FALSE),\"NO\")","v":"NO"},"Inversión",45]
["CIN-181-2019",2019,"FDLS-CMA-196-2019","Interventoría","Concurso de méritos","No aplica","REALIZAR LA INTERVENTORÍA TÉCNICA, ADMINISTRATIVA, FINANCIERA, AMBIENTAL, SOCIAL, SISO Y JURÍDICA AL CONTRATO QUE RESULTE DEL PROCESO LICITATORIO, CUYO OBJETO ES: REALIZAR POR EL SISTEMA DE PRECIOS UNITARIOS FIJOS SIN FORMULA DE REAJUSTE Y A MONTO AGOTABLE, EL RECONOCIMIENTO, VERIFICACIÓN Y DIAGNÓSTICOS ASI COMO LAS OBRAS DE MANTENIMIENTO REQUERIDAS PARA LA ADECUACIÓN, REHABILITACIÓN Y FUNCIONAMIENTO DE LOS SISTEMAS DE ACUEDUCTOS VEREDALES EN LA LOCALIDAD DE SUMAPAZ. LA ALCALDESA SE ACOGE A LO ESTIPULADO EN EL MEMORANDO 20192100568373 EN SU ULTIMO PARRAFO POR LO CUAL SOLICITA EL CRP A TRAVÉS DE MEMORANDO SIN RADICADO AUTORIZA LA ALCALDESA","Inversión",41,"Desarrollo rural sostenible","Eje Transversal 3 Sostenibilidad Ambiental basada en la eficiencia energética",1356,"901350924-1","CONSORCIO ORION 126",186934008,null,0,null,null,186934008,0,"2019-12-24",null,null,330,null,null,"x",null,null,null,0,null,{"$f":"IF(SUMPRODUCT((A$14:A215=A215)*(B$14:B215=B215)*(C$14:C215=C215))>1,0,1)","v":1},"Interventoría","Concurso de méritos",{"$f":"IFERROR(VLOOKUP(F215,Tipo!$C$12:$C$27,1,FALSE),\"NO\")","v":"NO"},"Inversión",41]
["CIN-182-2019",2019,"FDLS-CMA-198-2019","Interventoría","Concurso de méritos","No aplica","REALIZAR LA INTERVENTORIA TECNICA, ADMINISTRATIVA, FINANCIERA, AMBIENTAL, SOCIAL Y JURIDICA AL CONTRATO DE ESTUDIOS Y DISEÑOS PARA LA CONSTRUCCIÓN DE LA SEDE ADMINISTRATIVA EN EL CORREGIMIENTO DE SAN JUAN O CORREGIMIENTO DE BETANIA ¿ LOCALIDAD DE SUMAPAZ  DISTRITO CAPITAL.LA ALCALDESA SE ACOGE AL ULTIMO PARRAFO DEL MEMORANDO 20192100566873, POR LO CUAL SOLICITA EL CRP MEDIANTE MEMORANDO SIN RADICAR AUTORIZADO POR LA ALCALDESA","Inversión",45,"Gobernanza e influencia local, regional e internacional","Eje Transversal 4 Gobierno Legitimo, Fortalecimiento Local y Eficiencia",1375,"900283049-9","IA INGENIERIA Y ARQUITECTURA DE COLOMBIA S.A.S.",118825070,null,0,null,null,118825070,0,"2019-12-26",null,null,270,null,null,"x",null,null,null,0,null,{"$f":"IF(SUMPRODUCT((A$14:A216=A216)*(B$14:B216=B216)*(C$14:C216=C216))>1,0,1)","v":1},"Interventoría","Concurso de méritos",{"$f":"IFERROR(VLOOKUP(F216,Tipo!$C$12:$C$27,1,FALSE),\"NO\")","v":"NO"},"Inversión",45]
["CIN-183-2019",2019,"FDLS-SAMC-066-2018","Interventoría","Selección abreviada","Selección abreviada por menor cuantía ","Realizar la interventoría técnica, administrativa, financiera, jurídica y ambiental al contrato que deriva el proceso FDLS-SAMC-190-2019, cuyo objeto es: \"Prestar los servicios para la organización, coordinación y ejecución de la tercera fase de la Escuelas de Formación Artística y Cultural de Sumapaz¿ (EFACS III).Se expide a solicitud de la alcaldesa Local mediante memorando 20197020013243","Inversión",11,"Mejores oportunidades para el desarrollo a través de la cultura, la recreación y el deporte","Pilar 1 Igualdad de Calidad de Vida",1353,52268409,"LORENA  MENDEZ VALLEJO",14025000,null,0,null,null,14025000,0,"2019-12-30",null,null,255,null,null,"X",null,null,null,0,null,{"$f":"IF(SUMPRODUCT((A$14:A217=A217)*(B$14:B217=B217)*(C$14:C217=C217))>1,0,1)","v":1},"Interventoría","Selección abreviada",{"$f":"IFERROR(VLOOKUP(F217,Tipo!$C$12:$C$27,1,FALSE),\"NO\")","v":"Selección abreviada por menor cuantía "},"Inversión",11]
["CPS-100-2019",2019,"FDLS-CD-127-2019","Contratos de prestación de servicios profesionales y de apoyo a la gestión","Contratación directa","Prestación de servicios profesionales y de apoyo a la gestión, o para la ejecución de trabajos artísticos que sólo puedan encomendarse a determinadas personas naturales;","CONTRATAR LOS SERVICIOS DE UN BACHILLER PARA EL FORTALECIMIENTO A LA GESTIÓN LOCAL DE PROCESOS INSTITUCIONALES Y SOCIALES DE INTERÉS PÚBLICO ARTICULADA POR EL FONDO DE DESARROLLO LOCAL DE SUMAPAZ EN COMPAÑÍA DE SECTORES ADMINISTRATIVOS DEL DISTRITO, INSTANCIAS Y ORGANIZACIONES SOCIALES EN LA LOCALIDAD.","Inversión",45,"Gobernanza e influencia local, regional e internacional","Eje Transversal 4 Gobierno Legitimo, Fortalecimiento Local y Eficiencia",1375,53102434,"JENNIFER YURANI CORONADO DUQUE",14000000,1,-10200000,null,null,3800000,3800000,"2019-06-26","2019-07-04","2020-02-03",210,null,null,null,null,"X",null,1,null,{"$f":"IF(SUMPRODUCT((A$14:A218=A218)*(B$14:B218=B218)*(C$14:C218=C218))>1,0,1)","v":0},"Contratos de prestación de servicios profesionales y de apoyo a la gestión","Contratación directa",{"$f":"IFERROR(VLOOKUP(F218,Tipo!$C$12:$C$27,1,FALSE),\"NO\")","v":"Prestación de servicios profesionales y de apoyo a la gestión, o para la ejecución de trabajos artísticos que sólo puedan encomendarse a determinadas personas naturales;"},"Inversión",45]
[39015,2019,null,"Suministro","Selección abreviada","Acuerdo marco de precios ","Contratar la prestación del servicio integral de aseo y cafetería que incluya personal, maquinaria, elementos e insumos para la sede administrativa de la Alcaldía Local de Sumapaz y las corregidurías de Nazareth, Betania y San Juan. Adición Orden de Compra N. 34075 de 2018.","FUNCIONAMIENTO","No aplica"," "," ",5,"860067479-2","SERVIASEO S.A.",1904522,1,-75005,null,null,1829517,1829517,"05/08/019","2019-08-11","2020-02-10",150,30,null,null,null,null,null,1,null,{"$f":"IF(SUMPRODUCT((A$14:A219=A219)*(B$14:B219=B219)*(C$14:C219=C219))>1,0,1)","v":1},"Suministro","Selección abreviada",{"$f":"IFERROR(VLOOKUP(F219,Tipo!$C$12:$C$27,1,FALSE),\"NO\")","v":"Acuerdo marco de precios "},"Funcionamiento","NO"]
[36587,2019,null,"Suministro","Selección abreviada","Acuerdo marco de precios ","SUMINISTRO DE COMBUSTIBLE PARA LOS VEHÍCULOS LIVIANOS DE PROPIEDAD Y/O TENENCIA DEL FONDO DE DESARROLLO LOCAL DE SUMAPAZ","FUNCIONAMIENTO","No aplica"," "," ",3,"830095213-0","ORGANIZACION TERPEL S A",75000000,null,0,null,null,75000000,49625156,"2019-03-20","2019-04-25","2020-03-24",330,null,null,null,"X",null,null,0.66166874666666664,null,{"$f":"IF(SUMPRODUCT((A$14:A220=A220)*(B$14:B220=B220)*(C$14:C220=C220))>1,0,1)","v":1},"Suministro","Selección abreviada",{"$f":"IFERROR(VLOOKUP(F220,Tipo!$C$12:$C$27,1,FALSE),\"NO\")","v":"Acuerdo marco de precios "},"Funcionamiento","NO"]
[37194,2019,null,"Suministro","Selección abreviada","Acuerdo marco de precios ","ADQUISICION DE LICENCIAS DE MICROSOFT OFFICE 365 E3 POR SUSCRIPCION ANUAL PARA LOS EQUIPOS DEL FDLS","Funcionamiento","No aplica"," "," ","0002-",8000155831,"UT SOLUCIONES MICROSOFT 2017",20139001,null,0,null,null,20139001,20139001,"2019-04-12","2019-04-12","2019-05-26",45,null,null,null,null,null,"X",1,null,{"$f":"IF(SUMPRODUCT((A$14:A221=A221)*(B$14:B221=B221)*(C$14:C221=C221))>1,0,1)","v":1},"Suministro","Selección abreviada",{"$f":"IFERROR(VLOOKUP(F221,Tipo!$C$12:$C$27,1,FALSE),\"NO\")","v":"Acuerdo marco de precios "},"Funcionamiento","NO"]
[39240,2019,null,"Compraventa de bienes muebles","Selección abreviada","Acuerdo marco de precios ","Contratar la compra de papelería, útiles de oficina con destino a las diferentes dependencias del Fondo de Desarrollo Local de Sumapaz a través de Contratación con Gran Almacén en la TVEC.","FUNCIONAMIENTO","No aplica"," "," ",2,"830037946-3","PANAMERICANA LIBRERIA Y PAPELERIA S A",14999950,null,0,null,null,14999950,14999950,"10/07/219","2019-07-10","2019-07-24",10,null,null,null,null,"X",null,1,null,{"$f":"IF(SUMPRODUCT((A$14:A222=A222)*(B$14:B222=B222)*(C$14:C222=C222))>1,0,1)","v":1},"Compraventa de bienes muebles","Selección abreviada",{"$f":"IFERROR(VLOOKUP(F222,Tipo!$C$12:$C$27,1,FALSE),\"NO\")","v":"Acuerdo marco de precios "},"Funcionamiento","NO"]
[39815,2019,null,"Suministro","Selección abreviada","Acuerdo marco de precios ","Contratar la prestación del servicio integral de aseo y cafetería que incluya personal, maquinaria, elementos e insumos para la sede administrativa de la Alcaldía Local de Sumapaz y las Corregidurías de Nazareth, Betania y San Juan. Se expide a solicitud de la Alcaldesa","FUNCIONAMIENTO","No aplica"," "," ",5,"860067479-2","SERVIASEO S.A.",58271624,null,0,1,12624724,70896348,30384867,"05/08/019","2019-08-11","2020-02-10",150,30,null,null,"X",null,null,0.42858155401742271,null,{"$f":"IF(SUMPRODUCT((A$14:A223=A223)*(B$14:B223=B223)*(C$14:C223=C223))>1,0,1)","v":1},"Suministro","Selección abreviada",{"$f":"IFERROR(VLOOKUP(F223,Tipo!$C$12:$C$27,1,FALSE),\"NO\")","v":"Acuerdo marco de precios "},"Funcionamiento","NO"]
[40267,2019,null,"Suministro","Selección abreviada","Acuerdo marco de precios ","SUMINISTRO y TRANSPORTE DE COMBUSTIBLE PARA LA MAQUINARIA PESADA Y VOLQUETAS DE PROPIEDAD Y/O TENENCIA DEL FONDO DE DESARROLLO LOCAL DE SUMAPAZ","Inversión",18,"Mejor movilidad para todos","Pilar 2 Democracía Urbana",1364,"900459737-5","GRUPO EDS AUTOGAS S.A.S.",600000000,null,0,null,null,600000000,53061141,"2019-08-26","2019-09-19","2020-09-18",360,null,null,null,"X",null,null,8.8435235000000001E-2,null,{"$f":"IF(SUMPRODUCT((A$14:A224=A224)*(B$14:B224=B224)*(C$14:C224=C224))>1,0,1)","v":1},"Suministro","Selección abreviada",{"$f":"IFERROR(VLOOKUP(F224,Tipo!$C$12:$C$27,1,FALSE),\"NO\")","v":"Acuerdo marco de precios "},"Inversión",18]
[40302,2019,null,"Compraventa de bienes muebles","Selección abreviada","Acuerdo marco de precios ","ADQUIRIR TRES (3) IMPRESORAS MULTIFUNCIONALES PARA LOS PORTALES INTERACTIVOS DE LA LOCALIDAD DE SUMAPAZ","Inversión",36,"Bogotá, una ciudad digital","Eje Transversal 2 Desarrollo Económico basado en el conocimiento",1368,"900,276,997-7","CYSNUS SAS",6772290,null,0,null,null,6772290,6772290,"2019-08-18","2019-08-28","2019-10-12",45,null,null,null,null,"X",null,1,null,{"$f":"IF(SUMPRODUCT((A$14:A225=A225)*(B$14:B225=B225)*(C$14:C225=C225))>1,0,1)","v":1},"Compraventa de bienes muebles","Selección abreviada",{"$f":"IFERROR(VLOOKUP(F225,Tipo!$C$12:$C$27,1,FALSE),\"NO\")","v":"Acuerdo marco de precios "},"Inversión",36]
[40357,2019,null,"Compraventa de bienes muebles","Selección abreviada","Acuerdo marco de precios ","ADQUISICION DE PLOTTER PARA LA OFICINA DE PRENSA DE LA ALCALDIA LOCAL DE SUMAPAZ ","Funcionamiento","No aplica"," "," ","0006-",9002769977,"CYSNUS S.A.S",33587393,null,0,null,null,33587393,33587393,"2019-08-29","2019-08-29","2019-10-30",15,null,null,null,null,null,"X",1,null,{"$f":"IF(SUMPRODUCT((A$14:A226=A226)*(B$14:B226=B226)*(C$14:C226=C226))>1,0,1)","v":1},"Compraventa de bienes muebles","Selección abreviada",{"$f":"IFERROR(VLOOKUP(F226,Tipo!$C$12:$C$27,1,FALSE),\"NO\")","v":"Acuerdo marco de precios "},"Funcionamiento","NO"]
[43603,2019,null,"Compraventa de bienes inmuebles","Selección abreviada","Acuerdo marco de precios ","ADQUIRIR A TITULO DE COMPRA VENTA DOS (2) VOLQUETAS DOBLE TROQUE PARA EL FONDO DE DESARROLLO LOCAL DE SUMAPAZ. TIENE AVAL DE LA UNIDAD DE MANTENIMIENTO VIAL MEDIANTE RADICADO 20191300042951, POR LO CUAL LA ALCALDESA AUTORIZA MEDIANTE RADICADO 20197020012993 PARA EXPEDIR EL CRP","Inversión",18,"Mejor movilidad para todos","Pilar 2 Democracía Urbana",1364,"890903024-1","COMERCIAL INTERNACIONAL DE EQUIPOS Y MAQUINARIA S.A.S.",910949702,null,0,null,null,910949702,0,"2019-12-11","2019-12-17","2020-03-16",90,null,null,null,null,null,"X",0,null,{"$f":"IF(SUMPRODUCT((A$14:A227=A227)*(B$14:B227=B227)*(C$14:C227=C227))>1,0,1)","v":1},"Compraventa de bienes inmuebles","Selección abreviada",{"$f":"IFERROR(VLOOKUP(F227,Tipo!$C$12:$C$27,1,FALSE),\"NO\")","v":"Acuerdo marco de precios "},"Inversión",18]
[1072712,2019,null,"Compraventa de bienes muebles","Selección abreviada","Acuerdo marco de precios ","ADQUISICIÓN DE COMPUTADORES CON DESTINO A LOS COLEGIOS DEL DISTRITO CAPITAL, NIVEL CENTRAL Y LOCAL CONFORME A LAS NECESIDADES EVIDENCIADAS POR LA SECRETARÍA DE EDUCACIÓN DEL DISTRITO LAS CUALES FUERON CONCERTADAS Y ACEPTADAS POR LOS FONDOS DE DESARROLLO LOCAL PARTICIPANTES EN EL CONVENIO INTERADMINISTRATIVO DE COFINANCIACIÓN NO. 1999 DE 2019","Inversión",6,"Calidad educativa para todos","Pilar 1 Igualdad de Calidad de Vida",1349,"830110570-1","NEX COMPUTER SAS",50000000,null,0,null,null,50000000,0,"2019-08-15","2019-08-15","2020-02-14",180,null,null,null,null,null,"X",0,null,{"$f":"IF(SUMPRODUCT((A$14:A228=A228)*(B$14:B228=B228)*(C$14:C228=C228))>1,0,1)","v":1},"Compraventa de bienes muebles","Selección abreviada",{"$f":"IFERROR(VLOOKUP(F228,Tipo!$C$12:$C$27,1,FALSE),\"NO\")","v":"Acuerdo marco de precios "},"Inversión",6]
[77,2018,"FDLS-MC-002-2018","Contratos de prestación de servicios","Contratación mínima cuantia","No aplica","REEMPLAZA EL CDP 469 y CRP 596 DE 2018 CON OBJETO:\"ADICIÓN AL CONTRATO 77 DE 2018 CON OBJETO,\"PRESTAR EL SERVICIO DE AVITUALLAMIENTO (ALIMENTACIÓN) PARA LA REALIZACIÓN DE EVENTOS Y/O ACTIVIDADES DE GESTIÓN, PROMOCIÓN Y PARTICIPACIÓN\"","Funcionamiento","No aplica"," "," ",0,"51.864.107-2","LIDIA  SANABRIA LOPEZ",null,1,-2700,1,4815000,4812300,4812300,"2018-03-13","2018-03-13","2019-06-26",330,135,null,null,null,"x",null,1,null,{"$f":"IF(SUMPRODUCT((A$14:A229=A229)*(B$14:B229=B229)*(C$14:C229=C229))>1,0,1)","v":1},{"$f":"IFERROR(VLOOKUP(D229,tipo,1,FALSE),\"NO\")","v":"Contratos de prestación de servicios"},{"$f":"IFERROR(VLOOKUP(E229,modal,1,FALSE),\"NO\")","v":"Contratación mínima cuantia"},{"$f":"IFERROR(VLOOKUP(F229,Tipo!$C$12:$C$27,1,FALSE),\"NO\")","v":"NO"},{"$f":"IFERROR(VLOOKUP(H229,afectacion,1,FALSE),\"NO\")","v":"Funcionamiento"},{"$f":"IFERROR(VLOOKUP(I229,programa,1,FALSE),\"NO\")","v":"NO"}]
[151,2018,"FDLS-SAMC-066-2018","Contratos de prestación de servicios","Selección abreviada","Selección abreviada por menor cuantía ","REEMPLAZA EL CDP 445  Y CRP 588 DE 2018 POR CONSTITUCION DE OBLIGACION POR PAGAR CON OBJETO: \"PRESTAR EL SERVICIO DE MANTENIMIENTO PREVENTIVO, Y CORRECTIVO DE LOS VEHÍCULOS LIVIANOS DE PROPIEDAD, GUARDA O TENENCIA DEL FONDO DE DESARROLLO LOCAL DE SUMAPAZ CON SUMINISTRO DE REPUESTOS ORIGINALES, INSUMOS Y MANO DE OBRA\"","Funcionamiento","No aplica"," "," ",0,860515236,"PRECAR LIMITADA",null,null,0,1,32204810,32204810,32204810,"2018-10-29","2018-10-29","2019-04-28",180,null,null,null,null,null,"X",1,null,{"$f":"IF(SUMPRODUCT((A$14:A230=A230)*(B$14:B230=B230)*(C$14:C230=C230))>1,0,1)","v":1},{"$f":"IFERROR(VLOOKUP(D230,tipo,1,FALSE),\"NO\")","v":"Contratos de prestación de servicios"},{"$f":"IFERROR(VLOOKUP(E230,modal,1,FALSE),\"NO\")","v":"Selección abreviada"},{"$f":"IFERROR(VLOOKUP(F230,Tipo!$C$12:$C$27,1,FALSE),\"NO\")","v":"Selección abreviada por menor cuantía "},{"$f":"IFERROR(VLOOKUP(H230,afectacion,1,FALSE),\"NO\")","v":"Funcionamiento"},{"$f":"IFERROR(VLOOKUP(I230,programa,1,FALSE),\"NO\")","v":"NO"}]
[170,2018,"FDLS-SAMC-100-2018","Contratos de prestación de servicios","Selección abreviada","Selección abreviada por menor cuantía ","REEMPLAZA EL CDP 481 y CRP 661 DE 2018 CON OBJETO:\" PRESTAR EL SERVICIO DE TRANSPORTE TERRESTRE CON EL FIN DE ATENDER LOS DIFERENTES EVENTOS INSTITUCIONALES PROGRAMADOS POR LA ADMINISTRACIÓN LOCAL, EVENTOS Y ACTIVIDADES DE PROMOCIÓN Y PARTICIPACIÓN\"","Funcionamiento","No aplica"," "," ",0,"830092628-1","CARS TURISMO LTDA.",null,null,0,1,44000000,44000000,0,"2018-12-13","2018-12-24","2019-12-23",240,120,null,null,"X",null,null,0,null,{"$f":"IF(SUMPRODUCT((A$14:A231=A231)*(B$14:B231=B231)*(C$14:C231=C231))>1,0,1)","v":1},{"$f":"IFERROR(VLOOKUP(D231,tipo,1,FALSE),\"NO\")","v":"Contratos de prestación de servicios"},{"$f":"IFERROR(VLOOKUP(E231,modal,1,FALSE),\"NO\")","v":"Selección abreviada"},{"$f":"IFERROR(VLOOKUP(F231,Tipo!$C$12:$C$27,1,FALSE),\"NO\")","v":"Selección abreviada por menor cuantía "},{"$f":"IFERROR(VLOOKUP(H231,afectacion,1,FALSE),\"NO\")","v":"Funcionamiento"},{"$f":"IFERROR(VLOOKUP(I231,programa,1,FALSE),\"NO\")","v":"NO"}]
[null,null,null,null,null,null,null,null,null,null,null,null,null,null,null,null,null,null,null,0,null,null,null,null,null,null,null,null,null,null,null,null,null,{"$f":"IF(SUMPRODUCT((A$14:A232=A232)*(B$14:B232=B232)*(C$14:C232=C232))>1,0,1)","v":1},{"$f":"IFERROR(VLOOKUP(D232,tipo,1,FALSE),\"NO\")","v":"NO"},{"$f":"IFERROR(VLOOKUP(E232,modal,1,FALSE),\"NO\")","v":"NO"},{"$f":"IFERROR(VLOOKUP(F232,Tipo!$C$12:$C$27,1,FALSE),\"NO\")","v":"NO"},{"$f":"IFERROR(VLOOKUP(H232,afectacion,1,FALSE),\"NO\")","v":"NO"},{"$f":"IFERROR(VLOOKUP(I232,programa,1,FALSE),\"NO\")","v":"NO"}]
[null,null,null,null,null,null,null,null,null,null,null,null,null,null,null,null,null,null,null,0,null,null,null,null,null,null,null,null,null,null,null,null,null,{"$f":"IF(SUMPRODUCT((A$14:A233=A233)*(B$14:B233=B233)*(C$14:C233=C233))>1,0,1)","v":0},{"$f":"IFERROR(VLOOKUP(D233,tipo,1,FALSE),\"NO\")","v":"NO"},{"$f":"IFERROR(VLOOKUP(E233,modal,1,FALSE),\"NO\")","v":"NO"},{"$f":"IFERROR(VLOOKUP(F233,Tipo!$C$12:$C$27,1,FALSE),\"NO\")","v":"NO"},{"$f":"IFERROR(VLOOKUP(H233,afectacion,1,FALSE),\"NO\")","v":"NO"},{"$f":"IFERROR(VLOOKUP(I233,programa,1,FALSE),\"NO\")","v":"NO"}]
[null,null,null,null,null,null,null,null,null,null,null,null,null,null,null,null,null,null,null,0,null,null,null,null,null,null,null,null,null,null,null,null,null,{"$f":"IF(SUMPRODUCT((A$14:A234=A234)*(B$14:B234=B234)*(C$14:C234=C234))>1,0,1)","v":0},{"$f":"IFERROR(VLOOKUP(D234,tipo,1,FALSE),\"NO\")","v":"NO"},{"$f":"IFERROR(VLOOKUP(E234,modal,1,FALSE),\"NO\")","v":"NO"},{"$f":"IFERROR(VLOOKUP(F234,Tipo!$C$12:$C$27,1,FALSE),\"NO\")","v":"NO"},{"$f":"IFERROR(VLOOKUP(H234,afectacion,1,FALSE),\"NO\")","v":"NO"},{"$f":"IFERROR(VLOOKUP(I234,programa,1,FALSE),\"NO\")","v":"NO"}]
[null,null,null,null,null,null,null,null,null,null,null,null,null,null,null,null,null,null,null,0,null,null,null,null,null,null,null,null,null,null,null,null,null,{"$f":"IF(SUMPRODUCT((A$14:A235=A235)*(B$14:B235=B235)*(C$14:C235=C235))>1,0,1)","v":0},{"$f":"IFERROR(VLOOKUP(D235,tipo,1,FALSE),\"NO\")","v":"NO"},{"$f":"IFERROR(VLOOKUP(E235,modal,1,FALSE),\"NO\")","v":"NO"},{"$f":"IFERROR(VLOOKUP(F235,Tipo!$C$12:$C$27,1,FALSE),\"NO\")","v":"NO"},{"$f":"IFERROR(VLOOKUP(H235,afectacion,1,FALSE),\"NO\")","v":"NO"},{"$f":"IFERROR(VLOOKUP(I235,programa,1,FALSE),\"NO\")","v":"NO"}]
["4002-2011",2011,null,"Convenios de apoyo y/o convenios de asociación ",null,null,"GASTO APOYO ECONOMICO SUBSIDIO TIPO C PARA LA VIGENCIA FEBRERO 2019 A ENERO 2020 RESOLUCION No. 001 DE 2019 POR DOCE MESES","Inversión",3,"Igualdad y autonomía para una Bogotá incluyente","Pilar 1 Igualdad de Calidad de Vida",1334,null,"CAJA DE COMPENSACION FAMILIAR - COMPENSAR",344160000,null,null,null,null,344160000,313150000,"2019-01-01","2019-02-01","2020-01-31",365,null,null,null,null,null,null,0.909896559739656,null,{"$f":"IF(SUMPRODUCT((A$14:A236=A236)*(B$14:B236=B236)*(C$14:C236=C236))>1,0,1)","v":1},{"$f":"IFERROR(VLOOKUP(D236,tipo,1,FALSE),\"NO\")","v":"Convenios de apoyo y/o convenios de asociación "},{"$f":"IFERROR(VLOOKUP(E236,modal,1,FALSE),\"NO\")","v":"NO"},{"$f":"IFERROR(VLOOKUP(F236,Tipo!$C$12:$C$27,1,FALSE),\"NO\")","v":"NO"},{"$f":"IFERROR(VLOOKUP(H236,afectacion,1,FALSE),\"NO\")","v":"Inversión"},{"$f":"IFERROR(VLOOKUP(I236,programa,1,FALSE),\"NO\")","v":3}]
["4002-2011",2011,null,"Convenios de apoyo y/o convenios de asociación ",null,null,"COSTOS OPERATIVOS APOYO ECONOMICO SUBSIDICO TIPO C PARA LA VIGENCIA FEBRERO 2019 A ENERO 2020 RESOLUCION 002 DE 2019 GASTO OPERATIVO.","Inversión",3,"Igualdad y autonomía para una Bogotá incluyente","Pilar 1 Igualdad de Calidad de Vida",1334,null,"CAJA DE COMPENSACION FAMILIAR - COMPENSAR",5000000,null,null,null,null,5000000,3304574,"2019-01-01","2019-02-01","2019-12-31",365,null,null,null,null,null,null,0.66091480000000002,null,{"$f":"IF(SUMPRODUCT((A$14:A237=A237)*(B$14:B237=B237)*(C$14:C237=C237))>1,0,1)","v":0},{"$f":"IFERROR(VLOOKUP(D237,tipo,1,FALSE),\"NO\")","v":"Convenios de apoyo y/o convenios de asociación "},{"$f":"IFERROR(VLOOKUP(E237,modal,1,FALSE),\"NO\")","v":"NO"},{"$f":"IFERROR(VLOOKUP(F237,Tipo!$C$12:$C$27,1,FALSE),\"NO\")","v":"NO"},{"$f":"IFERROR(VLOOKUP(H237,afectacion,1,FALSE),\"NO\")","v":"Inversión"},{"$f":"IFERROR(VLOOKUP(I237,programa,1,FALSE),\"NO\")","v":3}]
[null,2019,null,"Otros gastos",null,null,"PAGO DE HONORARIOS EDILES DE LA LOCALIDAD DE SUMAPAZ CORRESPONDIENTE A 2019.","Funcionamiento","No aplica"," "," ",null,null,"JUNTAADMINISTRADORA LOCAL",573436014,null,null,null,null,573436014,573436014,"2018-12-01","2018-12-01","2019-11-30",365,null,null,null,null,null,null,1,null,{"$f":"IF(SUMPRODUCT((A$14:A238=A238)*(B$14:B238=B238)*(C$14:C238=C238))>1,0,1)","v":1},{"$f":"IFERROR(VLOOKUP(D238,tipo,1,FALSE),\"NO\")","v":"Otros gastos"},{"$f":"IFERROR(VLOOKUP(E238,modal,1,FALSE),\"NO\")","v":"NO"},{"$f":"IFERROR(VLOOKUP(F238,Tipo!$C$12:$C$27,1,FALSE),\"NO\")","v":"NO"},{"$f":"IFERROR(VLOOKUP(H238,afectacion,1,FALSE),\"NO\")","v":"Funcionamiento"},{"$f":"IFERROR(VLOOKUP(I238,programa,1,FALSE),\"NO\")","v":"NO"}]
[null,2019,null,"Otros gastos",null,null,"PAGO SEGURIDAD SOCIAL DE LOS CONDUCTORES DE LA LOCALIDAD DE SUMAPAZ CORRESPONDIENTE A 2019.","Inversión",18,"Mejor movilidad para todos","Pilar 2 Democracía Urbana",1364,null,"POSITIVA COMPAÑIA DE SEGUROS SA",2825000,null,null,null,null,2825000,2825000,"2018-12-01","2018-12-01","2019-11-30",365,null,null,null,null,null,null,1,null,{"$f":"IF(SUMPRODUCT((A$14:A239=A239)*(B$14:B239=B239)*(C$14:C239=C239))>1,0,1)","v":0},{"$f":"IFERROR(VLOOKUP(D239,tipo,1,FALSE),\"NO\")","v":"Otros gastos"},{"$f":"IFERROR(VLOOKUP(E239,modal,1,FALSE),\"NO\")","v":"NO"},{"$f":"IFERROR(VLOOKUP(F239,Tipo!$C$12:$C$27,1,FALSE),\"NO\")","v":"NO"},{"$f":"IFERROR(VLOOKUP(H239,afectacion,1,FALSE),\"NO\")","v":"Inversión"},{"$f":"IFERROR(VLOOKUP(I239,programa,1,FALSE),\"NO\")","v":18}]
[null,2019,null,"Otros gastos",null,null,"PAGO SEGURIDAD SOCIAL DE LOS CONDUCTORES DE LA LOCALIDAD DE SUMAPAZ CORRESPONDIENTE A 2019.","Inversión",45,"Gobernanza e influencia local, regional e internacional","Eje Transversal 4 Gobierno Legitimo, Fortalecimiento Local y Eficiencia",1375,null,"POSITIVA COMPAÑIA DE SEGUROS SA",4195500,null,null,null,null,4195500,4195500,"2018-12-01","2018-12-01","2019-11-30",365,null,null,null,null,null,null,1,null,{"$f":"IF(SUMPRODUCT((A$14:A240=A240)*(B$14:B240=B240)*(C$14:C240=C240))>1,0,1)","v":0},{"$f":"IFERROR(VLOOKUP(D240,tipo,1,FALSE),\"NO\")","v":"Otros gastos"},{"$f":"IFERROR(VLOOKUP(E240,modal,1,FALSE),\"NO\")","v":"NO"},{"$f":"IFERROR(VLOOKUP(F240,Tipo!$C$12:$C$27,1,FALSE),\"NO\")","v":"NO"},{"$f":"IFERROR(VLOOKUP(H240,afectacion,1,FALSE),\"NO\")","v":"Inversión"},{"$f":"IFERROR(VLOOKUP(I240,programa,1,FALSE),\"NO\")","v":45}]
[null,2019,null,"Otros gastos",null,null,"PAGO SEGURIDAD SOCIAL DE LOS EDILES DE LA LOCALIDAD DE SUMAPAZ CORRESPONDIENTE A 2019.","Funcionamiento","No aplica"," "," ",null,null,"POSITIVA COMPAÑIA DE SEGUROS SA",72109800,null,null,null,null,72109800,72109800,"2018-12-01","2018-12-01","2019-11-30",365,null,null,null,null,null,null,1,null,{"$f":"IF(SUMPRODUCT((A$14:A241=A241)*(B$14:B241=B241)*(C$14:C241=C241))>1,0,1)","v":0},{"$f":"IFERROR(VLOOKUP(D241,tipo,1,FALSE),\"NO\")","v":"Otros gastos"},{"$f":"IFERROR(VLOOKUP(E241,modal,1,FALSE),\"NO\")","v":"NO"},{"$f":"IFERROR(VLOOKUP(F241,Tipo!$C$12:$C$27,1,FALSE),\"NO\")","v":"NO"},{"$f":"IFERROR(VLOOKUP(H241,afectacion,1,FALSE),\"NO\")","v":"Funcionamiento"},{"$f":"IFERROR(VLOOKUP(I241,programa,1,FALSE),\"NO\")","v":"NO"}]
[null,2019,null,"Otros gastos",null,null,"PAGOS SERVICIOS PÚBLICOS","Funcionamiento","No aplica"," "," ",null,null,null,43377096,1,-995148,null,null,42381948,42381948,"2018-12-01","2018-12-01","2019-11-30",365,null,null,null,null,null,null,1,null,{"$f":"IF(SUMPRODUCT((A$14:A242=A242)*(B$14:B242=B242)*(C$14:C242=C242))>1,0,1)","v":0},{"$f":"IFERROR(VLOOKUP(D242,tipo,1,FALSE),\"NO\")","v":"Otros gastos"},{"$f":"IFERROR(VLOOKUP(E242,modal,1,FALSE),\"NO\")","v":"NO"},{"$f":"IFERROR(VLOOKUP(F242,Tipo!$C$12:$C$27,1,FALSE),\"NO\")","v":"NO"},{"$f":"IFERROR(VLOOKUP(H242,afectacion,1,FALSE),\"NO\")","v":"Funcionamiento"},{"$f":"IFERROR(VLOOKUP(I242,programa,1,FALSE),\"NO\")","v":"NO"}]
[null,null,null,null,null,null,null,null,null,{"$f":"IF(ISERROR(VLOOKUP(I243,Eje_Pilar!$C$2:$E$47,2,FALSE)),\" \",VLOOKUP(I243,Eje_Pilar!$C$2:$E$47,2,FALSE))","v":" "},{"$f":"IF(ISERROR(VLOOKUP(I243,Eje_Pilar!$C$2:$E$47,3,FALSE)),\" \",VLOOKUP(I243,Eje_Pilar!$C$2:$E$47,3,FALSE))","v":" "},null,null,null,null,null,null,null,null,0,null,null,null,null,null,null,null,null,null,null,null,{"$f":"IF(ISERROR(U243/T243),\"-\",(U243/T243))","v":"-"},null,{"$f":"IF(SUMPRODUCT((A$14:A243=A243)*(B$14:B243=B243)*(C$14:C243=C243))>1,0,1)","v":0},{"$f":"IFERROR(VLOOKUP(D243,tipo,1,FALSE),\"NO\")","v":"NO"},{"$f":"IFERROR(VLOOKUP(E243,modal,1,FALSE),\"NO\")","v":"NO"},{"$f":"IFERROR(VLOOKUP(F243,Tipo!$C$12:$C$27,1,FALSE),\"NO\")","v":"NO"},{"$f":"IFERROR(VLOOKUP(H243,afectacion,1,FALSE),\"NO\")","v":"NO"},{"$f":"IFERROR(VLOOKUP(I243,programa,1,FALSE),\"NO\")","v":"NO"}]
[null,null,null,null,null,null,null,null,null,{"$f":"IF(ISERROR(VLOOKUP(I244,Eje_Pilar!$C$2:$E$47,2,FALSE)),\" \",VLOOKUP(I244,Eje_Pilar!$C$2:$E$47,2,FALSE))","v":" "},{"$f":"IF(ISERROR(VLOOKUP(I244,Eje_Pilar!$C$2:$E$47,3,FALSE)),\" \",VLOOKUP(I244,Eje_Pilar!$C$2:$E$47,3,FALSE))","v":" "},null,null,null,null,null,null,null,null,0,null,null,null,null,null,null,null,null,null,null,null,"-",null,{"$f":"IF(SUMPRODUCT((A$14:A244=A244)*(B$14:B244=B244)*(C$14:C244=C244))>1,0,1)","v":0},{"$f":"IFERROR(VLOOKUP(D244,tipo,1,FALSE),\"NO\")","v":"NO"},{"$f":"IFERROR(VLOOKUP(E244,modal,1,FALSE),\"NO\")","v":"NO"},{"$f":"IFERROR(VLOOKUP(F244,Tipo!$C$12:$C$27,1,FALSE),\"NO\")","v":"NO"},{"$f":"IFERROR(VLOOKUP(H244,afectacion,1,FALSE),\"NO\")","v":"NO"},{"$f":"IFERROR(VLOOKUP(I244,programa,1,FALSE),\"NO\")","v":"NO"}]
[null,null,null,null,null,null,null,null,null,{"$f":"IF(ISERROR(VLOOKUP(I245,Eje_Pilar!$C$2:$E$47,2,FALSE)),\" \",VLOOKUP(I245,Eje_Pilar!$C$2:$E$47,2,FALSE))","v":" "},{"$f":"IF(ISERROR(VLOOKUP(I245,Eje_Pilar!$C$2:$E$47,3,FALSE)),\" \",VLOOKUP(I245,Eje_Pilar!$C$2:$E$47,3,FALSE))","v":" "},null,null,null,null,null,null,null,null,0,null,null,null,null,null,null,null,null,null,null,null,"-",null,{"$f":"IF(SUMPRODUCT((A$14:A245=A245)*(B$14:B245=B245)*(C$14:C245=C245))>1,0,1)","v":0},{"$f":"IFERROR(VLOOKUP(D245,tipo,1,FALSE),\"NO\")","v":"NO"},{"$f":"IFERROR(VLOOKUP(E245,modal,1,FALSE),\"NO\")","v":"NO"},{"$f":"IFERROR(VLOOKUP(F245,Tipo!$C$12:$C$27,1,FALSE),\"NO\")","v":"NO"},{"$f":"IFERROR(VLOOKUP(H245,afectacion,1,FALSE),\"NO\")","v":"NO"},{"$f":"IFERROR(VLOOKUP(I245,programa,1,FALSE),\"NO\")","v":"NO"}]
[null,null,null,null,null,null,null,null,null,{"$f":"IF(ISERROR(VLOOKUP(I246,Eje_Pilar!$C$2:$E$47,2,FALSE)),\" \",VLOOKUP(I246,Eje_Pilar!$C$2:$E$47,2,FALSE))","v":" "},{"$f":"IF(ISERROR(VLOOKUP(I246,Eje_Pilar!$C$2:$E$47,3,FALSE)),\" \",VLOOKUP(I246,Eje_Pilar!$C$2:$E$47,3,FALSE))","v":" "},null,null,null,null,null,null,null,null,0,null,null,null,null,null,null,null,null,null,null,null,"-",null,{"$f":"IF(SUMPRODUCT((A$14:A246=A246)*(B$14:B246=B246)*(C$14:C246=C246))>1,0,1)","v":0},{"$f":"IFERROR(VLOOKUP(D246,tipo,1,FALSE),\"NO\")","v":"NO"},{"$f":"IFERROR(VLOOKUP(E246,modal,1,FALSE),\"NO\")","v":"NO"},{"$f":"IFERROR(VLOOKUP(F246,Tipo!$C$12:$C$27,1,FALSE),\"NO\")","v":"NO"},{"$f":"IFERROR(VLOOKUP(H246,afectacion,1,FALSE),\"NO\")","v":"NO"},{"$f":"IFERROR(VLOOKUP(I246,programa,1,FALSE),\"NO\")","v":"NO"}]
[null,null,null,null,null,null,null,null,null,{"$f":"IF(ISERROR(VLOOKUP(I247,Eje_Pilar!$C$2:$E$47,2,FALSE)),\" \",VLOOKUP(I247,Eje_Pilar!$C$2:$E$47,2,FALSE))","v":" "},{"$f":"IF(ISERROR(VLOOKUP(I247,Eje_Pilar!$C$2:$E$47,3,FALSE)),\" \",VLOOKUP(I247,Eje_Pilar!$C$2:$E$47,3,FALSE))","v":" "},null,null,null,null,null,null,null,null,0,null,null,null,null,null,null,null,null,null,null,null,"-",null,{"$f":"IF(SUMPRODUCT((A$14:A247=A247)*(B$14:B247=B247)*(C$14:C247=C247))>1,0,1)","v":0},{"$f":"IFERROR(VLOOKUP(D247,tipo,1,FALSE),\"NO\")","v":"NO"},{"$f":"IFERROR(VLOOKUP(E247,modal,1,FALSE),\"NO\")","v":"NO"},{"$f":"IFERROR(VLOOKUP(F247,Tipo!$C$12:$C$27,1,FALSE),\"NO\")","v":"NO"},{"$f":"IFERROR(VLOOKUP(H247,afectacion,1,FALSE),\"NO\")","v":"NO"},{"$f":"IFERROR(VLOOKUP(I247,programa,1,FALSE),\"NO\")","v":"NO"}]
[null,null,null,null,null,null,null,null,null,{"$f":"IF(ISERROR(VLOOKUP(I248,Eje_Pilar!$C$2:$E$47,2,FALSE)),\" \",VLOOKUP(I248,Eje_Pilar!$C$2:$E$47,2,FALSE))","v":" "},{"$f":"IF(ISERROR(VLOOKUP(I248,Eje_Pilar!$C$2:$E$47,3,FALSE)),\" \",VLOOKUP(I248,Eje_Pilar!$C$2:$E$47,3,FALSE))","v":" "},null,null,null,null,null,null,null,null,0,null,null,null,null,null,null,null,null,null,null,null,"-",null,{"$f":"IF(SUMPRODUCT((A$14:A248=A248)*(B$14:B248=B248)*(C$14:C248=C248))>1,0,1)","v":0},{"$f":"IFERROR(VLOOKUP(D248,tipo,1,FALSE),\"NO\")","v":"NO"},{"$f":"IFERROR(VLOOKUP(E248,modal,1,FALSE),\"NO\")","v":"NO"},{"$f":"IFERROR(VLOOKUP(F248,Tipo!$C$12:$C$27,1,FALSE),\"NO\")","v":"NO"},{"$f":"IFERROR(VLOOKUP(H248,afectacion,1,FALSE),\"NO\")","v":"NO"},{"$f":"IFERROR(VLOOKUP(I248,programa,1,FALSE),\"NO\")","v":"NO"}]
[null,null,null,null,null,null,null,null,null,{"$f":"IF(ISERROR(VLOOKUP(I249,Eje_Pilar!$C$2:$E$47,2,FALSE)),\" \",VLOOKUP(I249,Eje_Pilar!$C$2:$E$47,2,FALSE))","v":" "},{"$f":"IF(ISERROR(VLOOKUP(I249,Eje_Pilar!$C$2:$E$47,3,FALSE)),\" \",VLOOKUP(I249,Eje_Pilar!$C$2:$E$47,3,FALSE))","v":" "},null,null,null,null,null,null,null,null,0,null,null,null,null,null,null,null,null,null,null,null,"-",null,{"$f":"IF(SUMPRODUCT((A$14:A249=A249)*(B$14:B249=B249)*(C$14:C249=C249))>1,0,1)","v":0},{"$f":"IFERROR(VLOOKUP(D249,tipo,1,FALSE),\"NO\")","v":"NO"},{"$f":"IFERROR(VLOOKUP(E249,modal,1,FALSE),\"NO\")","v":"NO"},{"$f":"IFERROR(VLOOKUP(F249,Tipo!$C$12:$C$27,1,FALSE),\"NO\")","v":"NO"},{"$f":"IFERROR(VLOOKUP(H249,afectacion,1,FALSE),\"NO\")","v":"NO"},{"$f":"IFERROR(VLOOKUP(I249,programa,1,FALSE),\"NO\")","v":"NO"}]
[null,null,null,null,null,null,null,null,null,{"$f":"IF(ISERROR(VLOOKUP(I250,Eje_Pilar!$C$2:$E$47,2,FALSE)),\" \",VLOOKUP(I250,Eje_Pilar!$C$2:$E$47,2,FALSE))","v":" "},{"$f":"IF(ISERROR(VLOOKUP(I250,Eje_Pilar!$C$2:$E$47,3,FALSE)),\" \",VLOOKUP(I250,Eje_Pilar!$C$2:$E$47,3,FALSE))","v":" "},null,null,null,null,null,null,null,null,0,null,null,null,null,null,null,null,null,null,null,null,"-",null,{"$f":"IF(SUMPRODUCT((A$14:A250=A250)*(B$14:B250=B250)*(C$14:C250=C250))>1,0,1)","v":0},{"$f":"IFERROR(VLOOKUP(D250,tipo,1,FALSE),\"NO\")","v":"NO"},{"$f":"IFERROR(VLOOKUP(E250,modal,1,FALSE),\"NO\")","v":"NO"},{"$f":"IFERROR(VLOOKUP(F250,Tipo!$C$12:$C$27,1,FALSE),\"NO\")","v":"NO"},{"$f":"IFERROR(VLOOKUP(H250,afectacion,1,FALSE),\"NO\")","v":"NO"},{"$f":"IFERROR(VLOOKUP(I250,programa,1,FALSE),\"NO\")","v":"NO"}]
[null,null,null,null,null,null,null,null,null,{"$f":"IF(ISERROR(VLOOKUP(I251,Eje_Pilar!$C$2:$E$47,2,FALSE)),\" \",VLOOKUP(I251,Eje_Pilar!$C$2:$E$47,2,FALSE))","v":" "},{"$f":"IF(ISERROR(VLOOKUP(I251,Eje_Pilar!$C$2:$E$47,3,FALSE)),\" \",VLOOKUP(I251,Eje_Pilar!$C$2:$E$47,3,FALSE))","v":" "},null,null,null,null,null,null,null,null,0,null,null,null,null,null,null,null,null,null,null,null,"-",null,{"$f":"IF(SUMPRODUCT((A$14:A251=A251)*(B$14:B251=B251)*(C$14:C251=C251))>1,0,1)","v":0},{"$f":"IFERROR(VLOOKUP(D251,tipo,1,FALSE),\"NO\")","v":"NO"},{"$f":"IFERROR(VLOOKUP(E251,modal,1,FALSE),\"NO\")","v":"NO"},{"$f":"IFERROR(VLOOKUP(F251,Tipo!$C$12:$C$27,1,FALSE),\"NO\")","v":"NO"},{"$f":"IFERROR(VLOOKUP(H251,afectacion,1,FALSE),\"NO\")","v":"NO"},{"$f":"IFERROR(VLOOKUP(I251,programa,1,FALSE),\"NO\")","v":"NO"}]
[null,null,null,null,null,null,null,null,null,{"$f":"IF(ISERROR(VLOOKUP(I252,Eje_Pilar!$C$2:$E$47,2,FALSE)),\" \",VLOOKUP(I252,Eje_Pilar!$C$2:$E$47,2,FALSE))","v":" "},{"$f":"IF(ISERROR(VLOOKUP(I252,Eje_Pilar!$C$2:$E$47,3,FALSE)),\" \",VLOOKUP(I252,Eje_Pilar!$C$2:$E$47,3,FALSE))","v":" "},null,null,null,null,null,null,null,null,0,null,null,null,null,null,null,null,null,null,null,null,"-",null,{"$f":"IF(SUMPRODUCT((A$14:A252=A252)*(B$14:B252=B252)*(C$14:C252=C252))>1,0,1)","v":0},{"$f":"IFERROR(VLOOKUP(D252,tipo,1,FALSE),\"NO\")","v":"NO"},{"$f":"IFERROR(VLOOKUP(E252,modal,1,FALSE),\"NO\")","v":"NO"},{"$f":"IFERROR(VLOOKUP(F252,Tipo!$C$12:$C$27,1,FALSE),\"NO\")","v":"NO"},{"$f":"IFERROR(VLOOKUP(H252,afectacion,1,FALSE),\"NO\")","v":"NO"},{"$f":"IFERROR(VLOOKUP(I252,programa,1,FALSE),\"NO\")","v":"NO"}]
[null,null,null,null,null,null,null,null,null,{"$f":"IF(ISERROR(VLOOKUP(I253,Eje_Pilar!$C$2:$E$47,2,FALSE)),\" \",VLOOKUP(I253,Eje_Pilar!$C$2:$E$47,2,FALSE))","v":" "},{"$f":"IF(ISERROR(VLOOKUP(I253,Eje_Pilar!$C$2:$E$47,3,FALSE)),\" \",VLOOKUP(I253,Eje_Pilar!$C$2:$E$47,3,FALSE))","v":" "},null,null,null,null,null,null,null,null,0,null,null,null,null,null,null,null,null,null,null,null,"-",null,{"$f":"IF(SUMPRODUCT((A$14:A253=A253)*(B$14:B253=B253)*(C$14:C253=C253))>1,0,1)","v":0},{"$f":"IFERROR(VLOOKUP(D253,tipo,1,FALSE),\"NO\")","v":"NO"},{"$f":"IFERROR(VLOOKUP(E253,modal,1,FALSE),\"NO\")","v":"NO"},{"$f":"IFERROR(VLOOKUP(F253,Tipo!$C$12:$C$27,1,FALSE),\"NO\")","v":"NO"},{"$f":"IFERROR(VLOOKUP(H253,afectacion,1,FALSE),\"NO\")","v":"NO"},{"$f":"IFERROR(VLOOKUP(I253,programa,1,FALSE),\"NO\")","v":"NO"}]
[null,null,null,null,null,null,null,null,null,{"$f":"IF(ISERROR(VLOOKUP(I254,Eje_Pilar!$C$2:$E$47,2,FALSE)),\" \",VLOOKUP(I254,Eje_Pilar!$C$2:$E$47,2,FALSE))","v":" "},{"$f":"IF(ISERROR(VLOOKUP(I254,Eje_Pilar!$C$2:$E$47,3,FALSE)),\" \",VLOOKUP(I254,Eje_Pilar!$C$2:$E$47,3,FALSE))","v":" "},null,null,null,null,null,null,null,null,0,null,null,null,null,null,null,null,null,null,null,null,{"$f":"IF(ISERROR(U254/T254),\"-\",(U254/T254))","v":"-"},null,{"$f":"IF(SUMPRODUCT((A$14:A254=A254)*(B$14:B254=B254)*(C$14:C254=C254))>1,0,1)","v":0},{"$f":"IFERROR(VLOOKUP(D254,tipo,1,FALSE),\"NO\")","v":"NO"},{"$f":"IFERROR(VLOOKUP(E254,modal,1,FALSE),\"NO\")","v":"NO"},{"$f":"IFERROR(VLOOKUP(F254,Tipo!$C$12:$C$27,1,FALSE),\"NO\")","v":"NO"},{"$f":"IFERROR(VLOOKUP(H254,afectacion,1,FALSE),\"NO\")","v":"NO"},{"$f":"IFERROR(VLOOKUP(I254,programa,1,FALSE),\"NO\")","v":"NO"}]
[null,null,null,null,null,null,null,null,null,{"$f":"IF(ISERROR(VLOOKUP(I255,Eje_Pilar!$C$2:$E$47,2,FALSE)),\" \",VLOOKUP(I255,Eje_Pilar!$C$2:$E$47,2,FALSE))","v":" "},{"$f":"IF(ISERROR(VLOOKUP(I255,Eje_Pilar!$C$2:$E$47,3,FALSE)),\" \",VLOOKUP(I255,Eje_Pilar!$C$2:$E$47,3,FALSE))","v":" "},null,null,null,null,null,null,null,null,0,null,null,null,null,null,null,null,null,null,null,null,"-",null,{"$f":"IF(SUMPRODUCT((A$14:A255=A255)*(B$14:B255=B255)*(C$14:C255=C255))>1,0,1)","v":0},{"$f":"IFERROR(VLOOKUP(D255,tipo,1,FALSE),\"NO\")","v":"NO"},{"$f":"IFERROR(VLOOKUP(E255,modal,1,FALSE),\"NO\")","v":"NO"},{"$f":"IFERROR(VLOOKUP(F255,Tipo!$C$12:$C$27,1,FALSE),\"NO\")","v":"NO"},{"$f":"IFERROR(VLOOKUP(H255,afectacion,1,FALSE),\"NO\")","v":"NO"},{"$f":"IFERROR(VLOOKUP(I255,programa,1,FALSE),\"NO\")","v":"NO"}]
[null,null,null,null,null,null,null,null,null,{"$f":"IF(ISERROR(VLOOKUP(I256,Eje_Pilar!$C$2:$E$47,2,FALSE)),\" \",VLOOKUP(I256,Eje_Pilar!$C$2:$E$47,2,FALSE))","v":" "},{"$f":"IF(ISERROR(VLOOKUP(I256,Eje_Pilar!$C$2:$E$47,3,FALSE)),\" \",VLOOKUP(I256,Eje_Pilar!$C$2:$E$47,3,FALSE))","v":" "},null,null,null,null,null,null,null,null,0,null,null,null,null,null,null,null,null,null,null,null,"-",null,{"$f":"IF(SUMPRODUCT((A$14:A256=A256)*(B$14:B256=B256)*(C$14:C256=C256))>1,0,1)","v":0},{"$f":"IFERROR(VLOOKUP(D256,tipo,1,FALSE),\"NO\")","v":"NO"},{"$f":"IFERROR(VLOOKUP(E256,modal,1,FALSE),\"NO\")","v":"NO"},{"$f":"IFERROR(VLOOKUP(F256,Tipo!$C$12:$C$27,1,FALSE),\"NO\")","v":"NO"},{"$f":"IFERROR(VLOOKUP(H256,afectacion,1,FALSE),\"NO\")","v":"NO"},{"$f":"IFERROR(VLOOKUP(I256,programa,1,FALSE),\"NO\")","v":"NO"}]
[null,null,null,null,null,null,null,null,null,{"$f":"IF(ISERROR(VLOOKUP(I257,Eje_Pilar!$C$2:$E$47,2,FALSE)),\" \",VLOOKUP(I257,Eje_Pilar!$C$2:$E$47,2,FALSE))","v":" "},{"$f":"IF(ISERROR(VLOOKUP(I257,Eje_Pilar!$C$2:$E$47,3,FALSE)),\" \",VLOOKUP(I257,Eje_Pilar!$C$2:$E$47,3,FALSE))","v":" "},null,null,null,null,null,null,null,null,0,null,null,null,null,null,null,null,null,null,null,null,"-",null,{"$f":"IF(SUMPRODUCT((A$14:A257=A257)*(B$14:B257=B257)*(C$14:C257=C257))>1,0,1)","v":0},{"$f":"IFERROR(VLOOKUP(D257,tipo,1,FALSE),\"NO\")","v":"NO"},{"$f":"IFERROR(VLOOKUP(E257,modal,1,FALSE),\"NO\")","v":"NO"},{"$f":"IFERROR(VLOOKUP(F257,Tipo!$C$12:$C$27,1,FALSE),\"NO\")","v":"NO"},{"$f":"IFERROR(VLOOKUP(H257,afectacion,1,FALSE),\"NO\")","v":"NO"},{"$f":"IFERROR(VLOOKUP(I257,programa,1,FALSE),\"NO\")","v":"NO"}]
[null,null,null,null,null,null,null,null,null,{"$f":"IF(ISERROR(VLOOKUP(I258,Eje_Pilar!$C$2:$E$47,2,FALSE)),\" \",VLOOKUP(I258,Eje_Pilar!$C$2:$E$47,2,FALSE))","v":" "},{"$f":"IF(ISERROR(VLOOKUP(I258,Eje_Pilar!$C$2:$E$47,3,FALSE)),\" \",VLOOKUP(I258,Eje_Pilar!$C$2:$E$47,3,FALSE))","v":" "},null,null,null,null,null,null,null,null,0,null,null,null,null,null,null,null,null,null,null,null,"-",null,{"$f":"IF(SUMPRODUCT((A$14:A258=A258)*(B$14:B258=B258)*(C$14:C258=C258))>1,0,1)","v":0},{"$f":"IFERROR(VLOOKUP(D258,tipo,1,FALSE),\"NO\")","v":"NO"},{"$f":"IFERROR(VLOOKUP(E258,modal,1,FALSE),\"NO\")","v":"NO"},{"$f":"IFERROR(VLOOKUP(F258,Tipo!$C$12:$C$27,1,FALSE),\"NO\")","v":"NO"},{"$f":"IFERROR(VLOOKUP(H258,afectacion,1,FALSE),\"NO\")","v":"NO"},{"$f":"IFERROR(VLOOKUP(I258,programa,1,FALSE),\"NO\")","v":"NO"}]
[null,null,null,null,null,null,null,null,null,{"$f":"IF(ISERROR(VLOOKUP(I259,Eje_Pilar!$C$2:$E$47,2,FALSE)),\" \",VLOOKUP(I259,Eje_Pilar!$C$2:$E$47,2,FALSE))","v":" "},{"$f":"IF(ISERROR(VLOOKUP(I259,Eje_Pilar!$C$2:$E$47,3,FALSE)),\" \",VLOOKUP(I259,Eje_Pilar!$C$2:$E$47,3,FALSE))","v":" "},null,null,null,null,null,null,null,null,0,null,null,null,null,null,null,null,null,null,null,null,"-",null,{"$f":"IF(SUMPRODUCT((A$14:A259=A259)*(B$14:B259=B259)*(C$14:C259=C259))>1,0,1)","v":0},{"$f":"IFERROR(VLOOKUP(D259,tipo,1,FALSE),\"NO\")","v":"NO"},{"$f":"IFERROR(VLOOKUP(E259,modal,1,FALSE),\"NO\")","v":"NO"},{"$f":"IFERROR(VLOOKUP(F259,Tipo!$C$12:$C$27,1,FALSE),\"NO\")","v":"NO"},{"$f":"IFERROR(VLOOKUP(H259,afectacion,1,FALSE),\"NO\")","v":"NO"},{"$f":"IFERROR(VLOOKUP(I259,programa,1,FALSE),\"NO\")","v":"NO"}]
[null,null,null,null,null,null,null,null,null,{"$f":"IF(ISERROR(VLOOKUP(I260,Eje_Pilar!$C$2:$E$47,2,FALSE)),\" \",VLOOKUP(I260,Eje_Pilar!$C$2:$E$47,2,FALSE))","v":" "},{"$f":"IF(ISERROR(VLOOKUP(I260,Eje_Pilar!$C$2:$E$47,3,FALSE)),\" \",VLOOKUP(I260,Eje_Pilar!$C$2:$E$47,3,FALSE))","v":" "},null,null,null,null,null,null,null,null,0,null,null,null,null,null,null,null,null,null,null,null,"-",null,{"$f":"IF(SUMPRODUCT((A$14:A260=A260)*(B$14:B260=B260)*(C$14:C260=C260))>1,0,1)","v":0},{"$f":"IFERROR(VLOOKUP(D260,tipo,1,FALSE),\"NO\")","v":"NO"},{"$f":"IFERROR(VLOOKUP(E260,modal,1,FALSE),\"NO\")","v":"NO"},{"$f":"IFERROR(VLOOKUP(F260,Tipo!$C$12:$C$27,1,FALSE),\"NO\")","v":"NO"},{"$f":"IFERROR(VLOOKUP(H260,afectacion,1,FALSE),\"NO\")","v":"NO"},{"$f":"IFERROR(VLOOKUP(I260,programa,1,FALSE),\"NO\")","v":"NO"}]
[null,null,null,null,null,null,null,null,null,{"$f":"IF(ISERROR(VLOOKUP(I261,Eje_Pilar!$C$2:$E$47,2,FALSE)),\" \",VLOOKUP(I261,Eje_Pilar!$C$2:$E$47,2,FALSE))","v":" "},{"$f":"IF(ISERROR(VLOOKUP(I261,Eje_Pilar!$C$2:$E$47,3,FALSE)),\" \",VLOOKUP(I261,Eje_Pilar!$C$2:$E$47,3,FALSE))","v":" "},null,null,null,null,null,null,null,null,0,null,null,null,null,null,null,null,null,null,null,null,"-",null,{"$f":"IF(SUMPRODUCT((A$14:A261=A261)*(B$14:B261=B261)*(C$14:C261=C261))>1,0,1)","v":0},{"$f":"IFERROR(VLOOKUP(D261,tipo,1,FALSE),\"NO\")","v":"NO"},{"$f":"IFERROR(VLOOKUP(E261,modal,1,FALSE),\"NO\")","v":"NO"},{"$f":"IFERROR(VLOOKUP(F261,Tipo!$C$12:$C$27,1,FALSE),\"NO\")","v":"NO"},{"$f":"IFERROR(VLOOKUP(H261,afectacion,1,FALSE),\"NO\")","v":"NO"},{"$f":"IFERROR(VLOOKUP(I261,programa,1,FALSE),\"NO\")","v":"NO"}]
[null,null,null,null,null,null,null,null,null,{"$f":"IF(ISERROR(VLOOKUP(I262,Eje_Pilar!$C$2:$E$47,2,FALSE)),\" \",VLOOKUP(I262,Eje_Pilar!$C$2:$E$47,2,FALSE))","v":" "},{"$f":"IF(ISERROR(VLOOKUP(I262,Eje_Pilar!$C$2:$E$47,3,FALSE)),\" \",VLOOKUP(I262,Eje_Pilar!$C$2:$E$47,3,FALSE))","v":" "},null,null,null,null,null,null,null,null,0,null,null,null,null,null,null,null,null,null,null,null,"-",null,{"$f":"IF(SUMPRODUCT((A$14:A262=A262)*(B$14:B262=B262)*(C$14:C262=C262))>1,0,1)","v":0},{"$f":"IFERROR(VLOOKUP(D262,tipo,1,FALSE),\"NO\")","v":"NO"},{"$f":"IFERROR(VLOOKUP(E262,modal,1,FALSE),\"NO\")","v":"NO"},{"$f":"IFERROR(VLOOKUP(F262,Tipo!$C$12:$C$27,1,FALSE),\"NO\")","v":"NO"},{"$f":"IFERROR(VLOOKUP(H262,afectacion,1,FALSE),\"NO\")","v":"NO"},{"$f":"IFERROR(VLOOKUP(I262,programa,1,FALSE),\"NO\")","v":"NO"}]
[null,null,null,null,null,null,null,null,null,{"$f":"IF(ISERROR(VLOOKUP(I263,Eje_Pilar!$C$2:$E$47,2,FALSE)),\" \",VLOOKUP(I263,Eje_Pilar!$C$2:$E$47,2,FALSE))","v":" "},{"$f":"IF(ISERROR(VLOOKUP(I263,Eje_Pilar!$C$2:$E$47,3,FALSE)),\" \",VLOOKUP(I263,Eje_Pilar!$C$2:$E$47,3,FALSE))","v":" "},null,null,null,null,null,null,null,null,0,null,null,null,null,null,null,null,null,null,null,null,"-",null,{"$f":"IF(SUMPRODUCT((A$14:A263=A263)*(B$14:B263=B263)*(C$14:C263=C263))>1,0,1)","v":0},{"$f":"IFERROR(VLOOKUP(D263,tipo,1,FALSE),\"NO\")","v":"NO"},{"$f":"IFERROR(VLOOKUP(E263,modal,1,FALSE),\"NO\")","v":"NO"},{"$f":"IFERROR(VLOOKUP(F263,Tipo!$C$12:$C$27,1,FALSE),\"NO\")","v":"NO"},{"$f":"IFERROR(VLOOKUP(H263,afectacion,1,FALSE),\"NO\")","v":"NO"},{"$f":"IFERROR(VLOOKUP(I263,programa,1,FALSE),\"NO\")","v":"NO"}]
[null,null,null,null,null,null,null,null,null,{"$f":"IF(ISERROR(VLOOKUP(I264,Eje_Pilar!$C$2:$E$47,2,FALSE)),\" \",VLOOKUP(I264,Eje_Pilar!$C$2:$E$47,2,FALSE))","v":" "},{"$f":"IF(ISERROR(VLOOKUP(I264,Eje_Pilar!$C$2:$E$47,3,FALSE)),\" \",VLOOKUP(I264,Eje_Pilar!$C$2:$E$47,3,FALSE))","v":" "},null,null,null,null,null,null,null,null,0,null,null,null,null,null,null,null,null,null,null,null,"-",null,{"$f":"IF(SUMPRODUCT((A$14:A264=A264)*(B$14:B264=B264)*(C$14:C264=C264))>1,0,1)","v":0},{"$f":"IFERROR(VLOOKUP(D264,tipo,1,FALSE),\"NO\")","v":"NO"},{"$f":"IFERROR(VLOOKUP(E264,modal,1,FALSE),\"NO\")","v":"NO"},{"$f":"IFERROR(VLOOKUP(F264,Tipo!$C$12:$C$27,1,FALSE),\"NO\")","v":"NO"},{"$f":"IFERROR(VLOOKUP(H264,afectacion,1,FALSE),\"NO\")","v":"NO"},{"$f":"IFERROR(VLOOKUP(I264,programa,1,FALSE),\"NO\")","v":"NO"}]
[null,null,null,null,null,null,null,null,null,{"$f":"IF(ISERROR(VLOOKUP(I265,Eje_Pilar!$C$2:$E$47,2,FALSE)),\" \",VLOOKUP(I265,Eje_Pilar!$C$2:$E$47,2,FALSE))","v":" "},{"$f":"IF(ISERROR(VLOOKUP(I265,Eje_Pilar!$C$2:$E$47,3,FALSE)),\" \",VLOOKUP(I265,Eje_Pilar!$C$2:$E$47,3,FALSE))","v":" "},null,null,null,null,null,null,null,null,0,null,null,null,null,null,null,null,null,null,null,null,"-",null,{"$f":"IF(SUMPRODUCT((A$14:A265=A265)*(B$14:B265=B265)*(C$14:C265=C265))>1,0,1)","v":0},{"$f":"IFERROR(VLOOKUP(D265,tipo,1,FALSE),\"NO\")","v":"NO"},{"$f":"IFERROR(VLOOKUP(E265,modal,1,FALSE),\"NO\")","v":"NO"},{"$f":"IFERROR(VLOOKUP(F265,Tipo!$C$12:$C$27,1,FALSE),\"NO\")","v":"NO"},{"$f":"IFERROR(VLOOKUP(H265,afectacion,1,FALSE),\"NO\")","v":"NO"},{"$f":"IFERROR(VLOOKUP(I265,programa,1,FALSE),\"NO\")","v":"NO"}]
[null,null,null,null,null,null,null,null,null,{"$f":"IF(ISERROR(VLOOKUP(I266,Eje_Pilar!$C$2:$E$47,2,FALSE)),\" \",VLOOKUP(I266,Eje_Pilar!$C$2:$E$47,2,FALSE))","v":" "},{"$f":"IF(ISERROR(VLOOKUP(I266,Eje_Pilar!$C$2:$E$47,3,FALSE)),\" \",VLOOKUP(I266,Eje_Pilar!$C$2:$E$47,3,FALSE))","v":" "},null,null,null,null,null,null,null,null,0,null,null,null,null,null,null,null,null,null,null,null,"-",null,{"$f":"IF(SUMPRODUCT((A$14:A266=A266)*(B$14:B266=B266)*(C$14:C266=C266))>1,0,1)","v":0},{"$f":"IFERROR(VLOOKUP(D266,tipo,1,FALSE),\"NO\")","v":"NO"},{"$f":"IFERROR(VLOOKUP(E266,modal,1,FALSE),\"NO\")","v":"NO"},{"$f":"IFERROR(VLOOKUP(F266,Tipo!$C$12:$C$27,1,FALSE),\"NO\")","v":"NO"},{"$f":"IFERROR(VLOOKUP(H266,afectacion,1,FALSE),\"NO\")","v":"NO"},{"$f":"IFERROR(VLOOKUP(I266,programa,1,FALSE),\"NO\")","v":"NO"}]
[null,null,null,null,null,null,null,null,null,{"$f":"IF(ISERROR(VLOOKUP(I267,Eje_Pilar!$C$2:$E$47,2,FALSE)),\" \",VLOOKUP(I267,Eje_Pilar!$C$2:$E$47,2,FALSE))","v":" "},{"$f":"IF(ISERROR(VLOOKUP(I267,Eje_Pilar!$C$2:$E$47,3,FALSE)),\" \",VLOOKUP(I267,Eje_Pilar!$C$2:$E$47,3,FALSE))","v":" "},null,null,null,null,null,null,null,null,0,null,null,null,null,null,null,null,null,null,null,null,"-",null,{"$f":"IF(SUMPRODUCT((A$14:A267=A267)*(B$14:B267=B267)*(C$14:C267=C267))>1,0,1)","v":0},{"$f":"IFERROR(VLOOKUP(D267,tipo,1,FALSE),\"NO\")","v":"NO"},{"$f":"IFERROR(VLOOKUP(E267,modal,1,FALSE),\"NO\")","v":"NO"},{"$f":"IFERROR(VLOOKUP(F267,Tipo!$C$12:$C$27,1,FALSE),\"NO\")","v":"NO"},{"$f":"IFERROR(VLOOKUP(H267,afectacion,1,FALSE),\"NO\")","v":"NO"},{"$f":"IFERROR(VLOOKUP(I267,programa,1,FALSE),\"NO\")","v":"NO"}]
[null,null,null,null,null,null,null,null,null,{"$f":"IF(ISERROR(VLOOKUP(I268,Eje_Pilar!$C$2:$E$47,2,FALSE)),\" \",VLOOKUP(I268,Eje_Pilar!$C$2:$E$47,2,FALSE))","v":" "},{"$f":"IF(ISERROR(VLOOKUP(I268,Eje_Pilar!$C$2:$E$47,3,FALSE)),\" \",VLOOKUP(I268,Eje_Pilar!$C$2:$E$47,3,FALSE))","v":" "},null,null,null,null,null,null,null,null,0,null,null,null,null,null,null,null,null,null,null,null,"-",null,{"$f":"IF(SUMPRODUCT((A$14:A268=A268)*(B$14:B268=B268)*(C$14:C268=C268))>1,0,1)","v":0},{"$f":"IFERROR(VLOOKUP(D268,tipo,1,FALSE),\"NO\")","v":"NO"},{"$f":"IFERROR(VLOOKUP(E268,modal,1,FALSE),\"NO\")","v":"NO"},{"$f":"IFERROR(VLOOKUP(F268,Tipo!$C$12:$C$27,1,FALSE),\"NO\")","v":"NO"},{"$f":"IFERROR(VLOOKUP(H268,afectacion,1,FALSE),\"NO\")","v":"NO"},{"$f":"IFERROR(VLOOKUP(I268,programa,1,FALSE),\"NO\")","v":"NO"}]
[null,null,null,null,null,null,null,null,null,{"$f":"IF(ISERROR(VLOOKUP(I269,Eje_Pilar!$C$2:$E$47,2,FALSE)),\" \",VLOOKUP(I269,Eje_Pilar!$C$2:$E$47,2,FALSE))","v":" "},{"$f":"IF(ISERROR(VLOOKUP(I269,Eje_Pilar!$C$2:$E$47,3,FALSE)),\" \",VLOOKUP(I269,Eje_Pilar!$C$2:$E$47,3,FALSE))","v":" "},null,null,null,null,null,null,null,null,0,null,null,null,null,null,null,null,null,null,null,null,"-",null,{"$f":"IF(SUMPRODUCT((A$14:A269=A269)*(B$14:B269=B269)*(C$14:C269=C269))>1,0,1)","v":0},{"$f":"IFERROR(VLOOKUP(D269,tipo,1,FALSE),\"NO\")","v":"NO"},{"$f":"IFERROR(VLOOKUP(E269,modal,1,FALSE),\"NO\")","v":"NO"},{"$f":"IFERROR(VLOOKUP(F269,Tipo!$C$12:$C$27,1,FALSE),\"NO\")","v":"NO"},{"$f":"IFERROR(VLOOKUP(H269,afectacion,1,FALSE),\"NO\")","v":"NO"},{"$f":"IFERROR(VLOOKUP(I269,programa,1,FALSE),\"NO\")","v":"NO"}]
[null,null,null,null,null,null,null,null,null,{"$f":"IF(ISERROR(VLOOKUP(I270,Eje_Pilar!$C$2:$E$47,2,FALSE)),\" \",VLOOKUP(I270,Eje_Pilar!$C$2:$E$47,2,FALSE))","v":" "},{"$f":"IF(ISERROR(VLOOKUP(I270,Eje_Pilar!$C$2:$E$47,3,FALSE)),\" \",VLOOKUP(I270,Eje_Pilar!$C$2:$E$47,3,FALSE))","v":" "},null,null,null,null,null,null,null,null,0,null,null,null,null,null,null,null,null,null,null,null,"-",null,{"$f":"IF(SUMPRODUCT((A$14:A270=A270)*(B$14:B270=B270)*(C$14:C270=C270))>1,0,1)","v":0},{"$f":"IFERROR(VLOOKUP(D270,tipo,1,FALSE),\"NO\")","v":"NO"},{"$f":"IFERROR(VLOOKUP(E270,modal,1,FALSE),\"NO\")","v":"NO"},{"$f":"IFERROR(VLOOKUP(F270,Tipo!$C$12:$C$27,1,FALSE),\"NO\")","v":"NO"},{"$f":"IFERROR(VLOOKUP(H270,afectacion,1,FALSE),\"NO\")","v":"NO"},{"$f":"IFERROR(VLOOKUP(I270,programa,1,FALSE),\"NO\")","v":"NO"}]
[null,null,null,null,null,null,null,null,null,{"$f":"IF(ISERROR(VLOOKUP(I271,Eje_Pilar!$C$2:$E$47,2,FALSE)),\" \",VLOOKUP(I271,Eje_Pilar!$C$2:$E$47,2,FALSE))","v":" "},{"$f":"IF(ISERROR(VLOOKUP(I271,Eje_Pilar!$C$2:$E$47,3,FALSE)),\" \",VLOOKUP(I271,Eje_Pilar!$C$2:$E$47,3,FALSE))","v":" "},null,null,null,null,null,null,null,null,{"$f":"O271+Q271+S271","v":0},null,null,null,null,null,null,null,null,null,null,null,"-",null,{"$f":"IF(SUMPRODUCT((A$14:A271=A271)*(B$14:B271=B271)*(C$14:C271=C271))>1,0,1)","v":0},{"$f":"IFERROR(VLOOKUP(D271,tipo,1,FALSE),\"NO\")","v":"NO"},{"$f":"IFERROR(VLOOKUP(E271,modal,1,FALSE),\"NO\")","v":"NO"},{"$f":"IFERROR(VLOOKUP(F271,Tipo!$C$12:$C$27,1,FALSE),\"NO\")","v":"NO"},{"$f":"IFERROR(VLOOKUP(H271,afectacion,1,FALSE),\"NO\")","v":"NO"},{"$f":"IFERROR(VLOOKUP(I271,programa,1,FALSE),\"NO\")","v":"NO"}]
[null,null,null,null,null,null,null,null,null,{"$f":"IF(ISERROR(VLOOKUP(I272,Eje_Pilar!$C$2:$E$47,2,FALSE)),\" \",VLOOKUP(I272,Eje_Pilar!$C$2:$E$47,2,FALSE))","v":" "},{"$f":"IF(ISERROR(VLOOKUP(I272,Eje_Pilar!$C$2:$E$47,3,FALSE)),\" \",VLOOKUP(I272,Eje_Pilar!$C$2:$E$47,3,FALSE))","v":" "},null,null,null,null,null,null,null,null,0,null,null,null,null,null,null,null,null,null,null,null,"-",null,{"$f":"IF(SUMPRODUCT((A$14:A272=A272)*(B$14:B272=B272)*(C$14:C272=C272))>1,0,1)","v":0},{"$f":"IFERROR(VLOOKUP(D272,tipo,1,FALSE),\"NO\")","v":"NO"},{"$f":"IFERROR(VLOOKUP(E272,modal,1,FALSE),\"NO\")","v":"NO"},{"$f":"IFERROR(VLOOKUP(F272,Tipo!$C$12:$C$27,1,FALSE),\"NO\")","v":"NO"},{"$f":"IFERROR(VLOOKUP(H272,afectacion,1,FALSE),\"NO\")","v":"NO"},{"$f":"IFERROR(VLOOKUP(I272,programa,1,FALSE),\"NO\")","v":"NO"}]
[null,null,null,null,null,null,null,null,null,{"$f":"IF(ISERROR(VLOOKUP(I273,Eje_Pilar!$C$2:$E$47,2,FALSE)),\" \",VLOOKUP(I273,Eje_Pilar!$C$2:$E$47,2,FALSE))","v":" "},{"$f":"IF(ISERROR(VLOOKUP(I273,Eje_Pilar!$C$2:$E$47,3,FALSE)),\" \",VLOOKUP(I273,Eje_Pilar!$C$2:$E$47,3,FALSE))","v":" "},null,null,null,null,null,null,null,null,0,null,null,null,null,null,null,null,null,null,null,null,"-",null,{"$f":"IF(SUMPRODUCT((A$14:A273=A273)*(B$14:B273=B273)*(C$14:C273=C273))>1,0,1)","v":0},{"$f":"IFERROR(VLOOKUP(D273,tipo,1,FALSE),\"NO\")","v":"NO"},{"$f":"IFERROR(VLOOKUP(E273,modal,1,FALSE),\"NO\")","v":"NO"},{"$f":"IFERROR(VLOOKUP(F273,Tipo!$C$12:$C$27,1,FALSE),\"NO\")","v":"NO"},{"$f":"IFERROR(VLOOKUP(H273,afectacion,1,FALSE),\"NO\")","v":"NO"},{"$f":"IFERROR(VLOOKUP(I273,programa,1,FALSE),\"NO\")","v":"NO"}]
[null,null,null,null,null,null,null,null,null,{"$f":"IF(ISERROR(VLOOKUP(I274,Eje_Pilar!$C$2:$E$47,2,FALSE)),\" \",VLOOKUP(I274,Eje_Pilar!$C$2:$E$47,2,FALSE))","v":" "},{"$f":"IF(ISERROR(VLOOKUP(I274,Eje_Pilar!$C$2:$E$47,3,FALSE)),\" \",VLOOKUP(I274,Eje_Pilar!$C$2:$E$47,3,FALSE))","v":" "},null,null,null,null,null,null,null,null,0,null,null,null,null,null,null,null,null,null,null,null,"-",null,{"$f":"IF(SUMPRODUCT((A$14:A274=A274)*(B$14:B274=B274)*(C$14:C274=C274))>1,0,1)","v":0},{"$f":"IFERROR(VLOOKUP(D274,tipo,1,FALSE),\"NO\")","v":"NO"},{"$f":"IFERROR(VLOOKUP(E274,modal,1,FALSE),\"NO\")","v":"NO"},{"$f":"IFERROR(VLOOKUP(F274,Tipo!$C$12:$C$27,1,FALSE),\"NO\")","v":"NO"},{"$f":"IFERROR(VLOOKUP(H274,afectacion,1,FALSE),\"NO\")","v":"NO"},{"$f":"IFERROR(VLOOKUP(I274,programa,1,FALSE),\"NO\")","v":"NO"}]
[null,null,null,null,null,null,null,null,null,{"$f":"IF(ISERROR(VLOOKUP(I275,Eje_Pilar!$C$2:$E$47,2,FALSE)),\" \",VLOOKUP(I275,Eje_Pilar!$C$2:$E$47,2,FALSE))","v":" "},{"$f":"IF(ISERROR(VLOOKUP(I275,Eje_Pilar!$C$2:$E$47,3,FALSE)),\" \",VLOOKUP(I275,Eje_Pilar!$C$2:$E$47,3,FALSE))","v":" "},null,null,null,null,null,null,null,null,0,null,null,null,null,null,null,null,null,null,null,null,"-",null,{"$f":"IF(SUMPRODUCT((A$14:A275=A275)*(B$14:B275=B275)*(C$14:C275=C275))>1,0,1)","v":0},{"$f":"IFERROR(VLOOKUP(D275,tipo,1,FALSE),\"NO\")","v":"NO"},{"$f":"IFERROR(VLOOKUP(E275,modal,1,FALSE),\"NO\")","v":"NO"},{"$f":"IFERROR(VLOOKUP(F275,Tipo!$C$12:$C$27,1,FALSE),\"NO\")","v":"NO"},{"$f":"IFERROR(VLOOKUP(H275,afectacion,1,FALSE),\"NO\")","v":"NO"},{"$f":"IFERROR(VLOOKUP(I275,programa,1,FALSE),\"NO\")","v":"NO"}]
[null,null,null,null,null,null,null,null,null,{"$f":"IF(ISERROR(VLOOKUP(I276,Eje_Pilar!$C$2:$E$47,2,FALSE)),\" \",VLOOKUP(I276,Eje_Pilar!$C$2:$E$47,2,FALSE))","v":" "},{"$f":"IF(ISERROR(VLOOKUP(I276,Eje_Pilar!$C$2:$E$47,3,FALSE)),\" \",VLOOKUP(I276,Eje_Pilar!$C$2:$E$47,3,FALSE))","v":" "},null,null,null,null,null,null,null,null,0,null,null,null,null,null,null,null,null,null,null,null,"-",null,{"$f":"IF(SUMPRODUCT((A$14:A276=A276)*(B$14:B276=B276)*(C$14:C276=C276))>1,0,1)","v":0},{"$f":"IFERROR(VLOOKUP(D276,tipo,1,FALSE),\"NO\")","v":"NO"},{"$f":"IFERROR(VLOOKUP(E276,modal,1,FALSE),\"NO\")","v":"NO"},{"$f":"IFERROR(VLOOKUP(F276,Tipo!$C$12:$C$27,1,FALSE),\"NO\")","v":"NO"},{"$f":"IFERROR(VLOOKUP(H276,afectacion,1,FALSE),\"NO\")","v":"NO"},{"$f":"IFERROR(VLOOKUP(I276,programa,1,FALSE),\"NO\")","v":"NO"}]
[null,null,null,null,null,null,null,null,null,{"$f":"IF(ISERROR(VLOOKUP(I277,Eje_Pilar!$C$2:$E$47,2,FALSE)),\" \",VLOOKUP(I277,Eje_Pilar!$C$2:$E$47,2,FALSE))","v":" "},{"$f":"IF(ISERROR(VLOOKUP(I277,Eje_Pilar!$C$2:$E$47,3,FALSE)),\" \",VLOOKUP(I277,Eje_Pilar!$C$2:$E$47,3,FALSE))","v":" "},null,null,null,null,null,null,null,null,0,null,null,null,null,null,null,null,null,null,null,null,"-",null,{"$f":"IF(SUMPRODUCT((A$14:A277=A277)*(B$14:B277=B277)*(C$14:C277=C277))>1,0,1)","v":0},{"$f":"IFERROR(VLOOKUP(D277,tipo,1,FALSE),\"NO\")","v":"NO"},{"$f":"IFERROR(VLOOKUP(E277,modal,1,FALSE),\"NO\")","v":"NO"},{"$f":"IFERROR(VLOOKUP(F277,Tipo!$C$12:$C$27,1,FALSE),\"NO\")","v":"NO"},{"$f":"IFERROR(VLOOKUP(H277,afectacion,1,FALSE),\"NO\")","v":"NO"},{"$f":"IFERROR(VLOOKUP(I277,programa,1,FALSE),\"NO\")","v":"NO"}]
[null,null,null,null,null,null,null,null,null,{"$f":"IF(ISERROR(VLOOKUP(I278,Eje_Pilar!$C$2:$E$47,2,FALSE)),\" \",VLOOKUP(I278,Eje_Pilar!$C$2:$E$47,2,FALSE))","v":" "},{"$f":"IF(ISERROR(VLOOKUP(I278,Eje_Pilar!$C$2:$E$47,3,FALSE)),\" \",VLOOKUP(I278,Eje_Pilar!$C$2:$E$47,3,FALSE))","v":" "},null,null,null,null,null,null,null,null,0,null,null,null,null,null,null,null,null,null,null,null,"-",null,{"$f":"IF(SUMPRODUCT((A$14:A278=A278)*(B$14:B278=B278)*(C$14:C278=C278))>1,0,1)","v":0},{"$f":"IFERROR(VLOOKUP(D278,tipo,1,FALSE),\"NO\")","v":"NO"},{"$f":"IFERROR(VLOOKUP(E278,modal,1,FALSE),\"NO\")","v":"NO"},{"$f":"IFERROR(VLOOKUP(F278,Tipo!$C$12:$C$27,1,FALSE),\"NO\")","v":"NO"},{"$f":"IFERROR(VLOOKUP(H278,afectacion,1,FALSE),\"NO\")","v":"NO"},{"$f":"IFERROR(VLOOKUP(I278,programa,1,FALSE),\"NO\")","v":"NO"}]
[null,null,null,null,null,null,null,null,null,{"$f":"IF(ISERROR(VLOOKUP(I279,Eje_Pilar!$C$2:$E$47,2,FALSE)),\" \",VLOOKUP(I279,Eje_Pilar!$C$2:$E$47,2,FALSE))","v":" "},{"$f":"IF(ISERROR(VLOOKUP(I279,Eje_Pilar!$C$2:$E$47,3,FALSE)),\" \",VLOOKUP(I279,Eje_Pilar!$C$2:$E$47,3,FALSE))","v":" "},null,null,null,null,null,null,null,null,0,null,null,null,null,null,null,null,null,null,null,null,"-",null,{"$f":"IF(SUMPRODUCT((A$14:A279=A279)*(B$14:B279=B279)*(C$14:C279=C279))>1,0,1)","v":0},{"$f":"IFERROR(VLOOKUP(D279,tipo,1,FALSE),\"NO\")","v":"NO"},{"$f":"IFERROR(VLOOKUP(E279,modal,1,FALSE),\"NO\")","v":"NO"},{"$f":"IFERROR(VLOOKUP(F279,Tipo!$C$12:$C$27,1,FALSE),\"NO\")","v":"NO"},{"$f":"IFERROR(VLOOKUP(H279,afectacion,1,FALSE),\"NO\")","v":"NO"},{"$f":"IFERROR(VLOOKUP(I279,programa,1,FALSE),\"NO\")","v":"NO"}]
[null,null,null,null,null,null,null,null,null,{"$f":"IF(ISERROR(VLOOKUP(I280,Eje_Pilar!$C$2:$E$47,2,FALSE)),\" \",VLOOKUP(I280,Eje_Pilar!$C$2:$E$47,2,FALSE))","v":" "},{"$f":"IF(ISERROR(VLOOKUP(I280,Eje_Pilar!$C$2:$E$47,3,FALSE)),\" \",VLOOKUP(I280,Eje_Pilar!$C$2:$E$47,3,FALSE))","v":" "},null,null,null,null,null,null,null,null,0,null,null,null,null,null,null,null,null,null,null,null,"-",null,{"$f":"IF(SUMPRODUCT((A$14:A280=A280)*(B$14:B280=B280)*(C$14:C280=C280))>1,0,1)","v":0},{"$f":"IFERROR(VLOOKUP(D280,tipo,1,FALSE),\"NO\")","v":"NO"},{"$f":"IFERROR(VLOOKUP(E280,modal,1,FALSE),\"NO\")","v":"NO"},{"$f":"IFERROR(VLOOKUP(F280,Tipo!$C$12:$C$27,1,FALSE),\"NO\")","v":"NO"},{"$f":"IFERROR(VLOOKUP(H280,afectacion,1,FALSE),\"NO\")","v":"NO"},{"$f":"IFERROR(VLOOKUP(I280,programa,1,FALSE),\"NO\")","v":"NO"}]
[null,null,null,null,null,null,null,null,null,{"$f":"IF(ISERROR(VLOOKUP(I281,Eje_Pilar!$C$2:$E$47,2,FALSE)),\" \",VLOOKUP(I281,Eje_Pilar!$C$2:$E$47,2,FALSE))","v":" "},{"$f":"IF(ISERROR(VLOOKUP(I281,Eje_Pilar!$C$2:$E$47,3,FALSE)),\" \",VLOOKUP(I281,Eje_Pilar!$C$2:$E$47,3,FALSE))","v":" "},null,null,null,null,null,null,null,null,0,null,null,null,null,null,null,null,null,null,null,null,"-",null,{"$f":"IF(SUMPRODUCT((A$14:A281=A281)*(B$14:B281=B281)*(C$14:C281=C281))>1,0,1)","v":0},{"$f":"IFERROR(VLOOKUP(D281,tipo,1,FALSE),\"NO\")","v":"NO"},{"$f":"IFERROR(VLOOKUP(E281,modal,1,FALSE),\"NO\")","v":"NO"},{"$f":"IFERROR(VLOOKUP(F281,Tipo!$C$12:$C$27,1,FALSE),\"NO\")","v":"NO"},{"$f":"IFERROR(VLOOKUP(H281,afectacion,1,FALSE),\"NO\")","v":"NO"},{"$f":"IFERROR(VLOOKUP(I281,programa,1,FALSE),\"NO\")","v":"NO"}]
[null,null,null,null,null,null,null,null,null,{"$f":"IF(ISERROR(VLOOKUP(I282,Eje_Pilar!$C$2:$E$47,2,FALSE)),\" \",VLOOKUP(I282,Eje_Pilar!$C$2:$E$47,2,FALSE))","v":" "},{"$f":"IF(ISERROR(VLOOKUP(I282,Eje_Pilar!$C$2:$E$47,3,FALSE)),\" \",VLOOKUP(I282,Eje_Pilar!$C$2:$E$47,3,FALSE))","v":" "},null,null,null,null,null,null,null,null,0,null,null,null,null,null,null,null,null,null,null,null,"-",null,{"$f":"IF(SUMPRODUCT((A$14:A282=A282)*(B$14:B282=B282)*(C$14:C282=C282))>1,0,1)","v":0},{"$f":"IFERROR(VLOOKUP(D282,tipo,1,FALSE),\"NO\")","v":"NO"},{"$f":"IFERROR(VLOOKUP(E282,modal,1,FALSE),\"NO\")","v":"NO"},{"$f":"IFERROR(VLOOKUP(F282,Tipo!$C$12:$C$27,1,FALSE),\"NO\")","v":"NO"},{"$f":"IFERROR(VLOOKUP(H282,afectacion,1,FALSE),\"NO\")","v":"NO"},{"$f":"IFERROR(VLOOKUP(I282,programa,1,FALSE),\"NO\")","v":"NO"}]
[null,null,null,null,null,null,null,null,null,{"$f":"IF(ISERROR(VLOOKUP(I283,Eje_Pilar!$C$2:$E$47,2,FALSE)),\" \",VLOOKUP(I283,Eje_Pilar!$C$2:$E$47,2,FALSE))","v":" "},{"$f":"IF(ISERROR(VLOOKUP(I283,Eje_Pilar!$C$2:$E$47,3,FALSE)),\" \",VLOOKUP(I283,Eje_Pilar!$C$2:$E$47,3,FALSE))","v":" "},null,null,null,null,null,null,null,null,0,null,null,null,null,null,null,null,null,null,null,null,"-",null,{"$f":"IF(SUMPRODUCT((A$14:A283=A283)*(B$14:B283=B283)*(C$14:C283=C283))>1,0,1)","v":0},{"$f":"IFERROR(VLOOKUP(D283,tipo,1,FALSE),\"NO\")","v":"NO"},{"$f":"IFERROR(VLOOKUP(E283,modal,1,FALSE),\"NO\")","v":"NO"},{"$f":"IFERROR(VLOOKUP(F283,Tipo!$C$12:$C$27,1,FALSE),\"NO\")","v":"NO"},{"$f":"IFERROR(VLOOKUP(H283,afectacion,1,FALSE),\"NO\")","v":"NO"},{"$f":"IFERROR(VLOOKUP(I283,programa,1,FALSE),\"NO\")","v":"NO"}]
[null,null,null,null,null,null,null,null,null,{"$f":"IF(ISERROR(VLOOKUP(I284,Eje_Pilar!$C$2:$E$47,2,FALSE)),\" \",VLOOKUP(I284,Eje_Pilar!$C$2:$E$47,2,FALSE))","v":" "},{"$f":"IF(ISERROR(VLOOKUP(I284,Eje_Pilar!$C$2:$E$47,3,FALSE)),\" \",VLOOKUP(I284,Eje_Pilar!$C$2:$E$47,3,FALSE))","v":" "},null,null,null,null,null,null,null,null,0,null,null,null,null,null,null,null,null,null,null,null,"-",null,{"$f":"IF(SUMPRODUCT((A$14:A284=A284)*(B$14:B284=B284)*(C$14:C284=C284))>1,0,1)","v":0},{"$f":"IFERROR(VLOOKUP(D284,tipo,1,FALSE),\"NO\")","v":"NO"},{"$f":"IFERROR(VLOOKUP(E284,modal,1,FALSE),\"NO\")","v":"NO"},{"$f":"IFERROR(VLOOKUP(F284,Tipo!$C$12:$C$27,1,FALSE),\"NO\")","v":"NO"},{"$f":"IFERROR(VLOOKUP(H284,afectacion,1,FALSE),\"NO\")","v":"NO"},{"$f":"IFERROR(VLOOKUP(I284,programa,1,FALSE),\"NO\")","v":"NO"}]
[null,null,null,null,null,null,null,null,null,{"$f":"IF(ISERROR(VLOOKUP(I285,Eje_Pilar!$C$2:$E$47,2,FALSE)),\" \",VLOOKUP(I285,Eje_Pilar!$C$2:$E$47,2,FALSE))","v":" "},{"$f":"IF(ISERROR(VLOOKUP(I285,Eje_Pilar!$C$2:$E$47,3,FALSE)),\" \",VLOOKUP(I285,Eje_Pilar!$C$2:$E$47,3,FALSE))","v":" "},null,null,null,null,null,null,null,null,{"$f":"+O285+Q285+S285","v":0},null,null,null,null,null,null,null,null,null,null,null,"-",null,{"$f":"IF(SUMPRODUCT((A$14:A285=A285)*(B$14:B285=B285)*(C$14:C285=C285))>1,0,1)","v":0},{"$f":"IFERROR(VLOOKUP(D285,tipo,1,FALSE),\"NO\")","v":"NO"},{"$f":"IFERROR(VLOOKUP(E285,modal,1,FALSE),\"NO\")","v":"NO"},{"$f":"IFERROR(VLOOKUP(F285,Tipo!$C$12:$C$27,1,FALSE),\"NO\")","v":"NO"},{"$f":"IFERROR(VLOOKUP(H285,afectacion,1,FALSE),\"NO\")","v":"NO"},{"$f":"IFERROR(VLOOKUP(I285,programa,1,FALSE),\"NO\")","v":"NO"}]
[null,null,null,null,null,null,null,null,null,{"$f":"IF(ISERROR(VLOOKUP(I286,Eje_Pilar!$C$2:$E$47,2,FALSE)),\" \",VLOOKUP(I286,Eje_Pilar!$C$2:$E$47,2,FALSE))","v":" "},{"$f":"IF(ISERROR(VLOOKUP(I286,Eje_Pilar!$C$2:$E$47,3,FALSE)),\" \",VLOOKUP(I286,Eje_Pilar!$C$2:$E$47,3,FALSE))","v":" "},null,null,null,null,null,null,null,null,{"$f":"+O286+Q286+S286","v":0},null,null,null,null,null,null,null,null,null,null,null,"-",null,{"$f":"IF(SUMPRODUCT((A$14:A286=A286)*(B$14:B286=B286)*(C$14:C286=C286))>1,0,1)","v":0},{"$f":"IFERROR(VLOOKUP(D286,tipo,1,FALSE),\"NO\")","v":"NO"},{"$f":"IFERROR(VLOOKUP(E286,modal,1,FALSE),\"NO\")","v":"NO"},{"$f":"IFERROR(VLOOKUP(F286,Tipo!$C$12:$C$27,1,FALSE),\"NO\")","v":"NO"},{"$f":"IFERROR(VLOOKUP(H286,afectacion,1,FALSE),\"NO\")","v":"NO"},{"$f":"IFERROR(VLOOKUP(I286,programa,1,FALSE),\"NO\")","v":"NO"}]
[null,null,null,null,null,null,null,null,null,{"$f":"IF(ISERROR(VLOOKUP(I287,Eje_Pilar!$C$2:$E$47,2,FALSE)),\" \",VLOOKUP(I287,Eje_Pilar!$C$2:$E$47,2,FALSE))","v":" "},{"$f":"IF(ISERROR(VLOOKUP(I287,Eje_Pilar!$C$2:$E$47,3,FALSE)),\" \",VLOOKUP(I287,Eje_Pilar!$C$2:$E$47,3,FALSE))","v":" "},null,null,null,null,null,null,null,null,{"$f":"+O287+Q287+S287","v":0},null,null,null,null,null,null,null,null,null,null,null,"-",null,{"$f":"IF(SUMPRODUCT((A$14:A287=A287)*(B$14:B287=B287)*(C$14:C287=C287))>1,0,1)","v":0},{"$f":"IFERROR(VLOOKUP(D287,tipo,1,FALSE),\"NO\")","v":"NO"},{"$f":"IFERROR(VLOOKUP(E287,modal,1,FALSE),\"NO\")","v":"NO"},{"$f":"IFERROR(VLOOKUP(F287,Tipo!$C$12:$C$27,1,FALSE),\"NO\")","v":"NO"},{"$f":"IFERROR(VLOOKUP(H287,afectacion,1,FALSE),\"NO\")","v":"NO"},{"$f":"IFERROR(VLOOKUP(I287,programa,1,FALSE),\"NO\")","v":"NO"}]
[null,null,null,null,null,null,null,null,null,{"$f":"IF(ISERROR(VLOOKUP(I288,Eje_Pilar!$C$2:$E$47,2,FALSE)),\" \",VLOOKUP(I288,Eje_Pilar!$C$2:$E$47,2,FALSE))","v":" "},{"$f":"IF(ISERROR(VLOOKUP(I288,Eje_Pilar!$C$2:$E$47,3,FALSE)),\" \",VLOOKUP(I288,Eje_Pilar!$C$2:$E$47,3,FALSE))","v":" "},null,null,null,null,null,null,null,null,{"$f":"+O288+Q288+S288","v":0},null,null,null,null,null,null,null,null,null,null,null,"-",null,{"$f":"IF(SUMPRODUCT((A$14:A288=A288)*(B$14:B288=B288)*(C$14:C288=C288))>1,0,1)","v":0},{"$f":"IFERROR(VLOOKUP(D288,tipo,1,FALSE),\"NO\")","v":"NO"},{"$f":"IFERROR(VLOOKUP(E288,modal,1,FALSE),\"NO\")","v":"NO"},{"$f":"IFERROR(VLOOKUP(F288,Tipo!$C$12:$C$27,1,FALSE),\"NO\")","v":"NO"},{"$f":"IFERROR(VLOOKUP(H288,afectacion,1,FALSE),\"NO\")","v":"NO"},{"$f":"IFERROR(VLOOKUP(I288,programa,1,FALSE),\"NO\")","v":"NO"}]
[null,null,null,null,null,null,null,null,null,{"$f":"IF(ISERROR(VLOOKUP(I289,Eje_Pilar!$C$2:$E$47,2,FALSE)),\" \",VLOOKUP(I289,Eje_Pilar!$C$2:$E$47,2,FALSE))","v":" "},{"$f":"IF(ISERROR(VLOOKUP(I289,Eje_Pilar!$C$2:$E$47,3,FALSE)),\" \",VLOOKUP(I289,Eje_Pilar!$C$2:$E$47,3,FALSE))","v":" "},null,null,null,null,null,null,null,null,{"$f":"+O289+Q289+S289","v":0},null,null,null,null,null,null,null,null,null,null,null,"-",null,{"$f":"IF(SUMPRODUCT((A$14:A289=A289)*(B$14:B289=B289)*(C$14:C289=C289))>1,0,1)","v":0},{"$f":"IFERROR(VLOOKUP(D289,tipo,1,FALSE),\"NO\")","v":"NO"},{"$f":"IFERROR(VLOOKUP(E289,modal,1,FALSE),\"NO\")","v":"NO"},{"$f":"IFERROR(VLOOKUP(F289,Tipo!$C$12:$C$27,1,FALSE),\"NO\")","v":"NO"},{"$f":"IFERROR(VLOOKUP(H289,afectacion,1,FALSE),\"NO\")","v":"NO"},{"$f":"IFERROR(VLOOKUP(I289,programa,1,FALSE),\"NO\")","v":"NO"}]
[null,null,null,null,null,null,null,null,null,{"$f":"IF(ISERROR(VLOOKUP(I290,Eje_Pilar!$C$2:$E$47,2,FALSE)),\" \",VLOOKUP(I290,Eje_Pilar!$C$2:$E$47,2,FALSE))","v":" "},{"$f":"IF(ISERROR(VLOOKUP(I290,Eje_Pilar!$C$2:$E$47,3,FALSE)),\" \",VLOOKUP(I290,Eje_Pilar!$C$2:$E$47,3,FALSE))","v":" "},null,null,null,null,null,null,null,null,{"$f":"+O290+Q290+S290","v":0},null,null,null,null,null,null,null,null,null,null,null,"-",null,{"$f":"IF(SUMPRODUCT((A$14:A290=A290)*(B$14:B290=B290)*(C$14:C290=C290))>1,0,1)","v":0},{"$f":"IFERROR(VLOOKUP(D290,tipo,1,FALSE),\"NO\")","v":"NO"},{"$f":"IFERROR(VLOOKUP(E290,modal,1,FALSE),\"NO\")","v":"NO"},{"$f":"IFERROR(VLOOKUP(F290,Tipo!$C$12:$C$27,1,FALSE),\"NO\")","v":"NO"},{"$f":"IFERROR(VLOOKUP(H290,afectacion,1,FALSE),\"NO\")","v":"NO"},{"$f":"IFERROR(VLOOKUP(I290,programa,1,FALSE),\"NO\")","v":"NO"}]
[null,null,null,null,null,null,null,null,null,{"$f":"IF(ISERROR(VLOOKUP(I291,Eje_Pilar!$C$2:$E$47,2,FALSE)),\" \",VLOOKUP(I291,Eje_Pilar!$C$2:$E$47,2,FALSE))","v":" "},{"$f":"IF(ISERROR(VLOOKUP(I291,Eje_Pilar!$C$2:$E$47,3,FALSE)),\" \",VLOOKUP(I291,Eje_Pilar!$C$2:$E$47,3,FALSE))","v":" "},null,null,null,null,null,null,null,null,{"$f":"+O291+Q291+S291","v":0},null,null,null,null,null,null,null,null,null,null,null,"-",null,{"$f":"IF(SUMPRODUCT((A$14:A291=A291)*(B$14:B291=B291)*(C$14:C291=C291))>1,0,1)","v":0},{"$f":"IFERROR(VLOOKUP(D291,tipo,1,FALSE),\"NO\")","v":"NO"},{"$f":"IFERROR(VLOOKUP(E291,modal,1,FALSE),\"NO\")","v":"NO"},{"$f":"IFERROR(VLOOKUP(F291,Tipo!$C$12:$C$27,1,FALSE),\"NO\")","v":"NO"},{"$f":"IFERROR(VLOOKUP(H291,afectacion,1,FALSE),\"NO\")","v":"NO"},{"$f":"IFERROR(VLOOKUP(I291,programa,1,FALSE),\"NO\")","v":"NO"}]
[null,null,null,null,null,null,null,null,null,{"$f":"IF(ISERROR(VLOOKUP(I292,Eje_Pilar!$C$2:$E$47,2,FALSE)),\" \",VLOOKUP(I292,Eje_Pilar!$C$2:$E$47,2,FALSE))","v":" "},{"$f":"IF(ISERROR(VLOOKUP(I292,Eje_Pilar!$C$2:$E$47,3,FALSE)),\" \",VLOOKUP(I292,Eje_Pilar!$C$2:$E$47,3,FALSE))","v":" "},null,null,null,null,null,null,null,null,{"$f":"+O292+Q292+S292","v":0},null,null,null,null,null,null,null,null,null,null,null,"-",null,{"$f":"IF(SUMPRODUCT((A$14:A292=A292)*(B$14:B292=B292)*(C$14:C292=C292))>1,0,1)","v":0},{"$f":"IFERROR(VLOOKUP(D292,tipo,1,FALSE),\"NO\")","v":"NO"},{"$f":"IFERROR(VLOOKUP(E292,modal,1,FALSE),\"NO\")","v":"NO"},{"$f":"IFERROR(VLOOKUP(F292,Tipo!$C$12:$C$27,1,FALSE),\"NO\")","v":"NO"},{"$f":"IFERROR(VLOOKUP(H292,afectacion,1,FALSE),\"NO\")","v":"NO"},{"$f":"IFERROR(VLOOKUP(I292,programa,1,FALSE),\"NO\")","v":"NO"}]
[null,null,null,null,null,null,null,null,null,{"$f":"IF(ISERROR(VLOOKUP(I293,Eje_Pilar!$C$2:$E$47,2,FALSE)),\" \",VLOOKUP(I293,Eje_Pilar!$C$2:$E$47,2,FALSE))","v":" "},{"$f":"IF(ISERROR(VLOOKUP(I293,Eje_Pilar!$C$2:$E$47,3,FALSE)),\" \",VLOOKUP(I293,Eje_Pilar!$C$2:$E$47,3,FALSE))","v":" "},null,null,null,null,null,null,null,null,{"$f":"+O293+Q293+S293","v":0},null,null,null,null,null,null,null,null,null,null,null,"-",null,{"$f":"IF(SUMPRODUCT((A$14:A293=A293)*(B$14:B293=B293)*(C$14:C293=C293))>1,0,1)","v":0},{"$f":"IFERROR(VLOOKUP(D293,tipo,1,FALSE),\"NO\")","v":"NO"},{"$f":"IFERROR(VLOOKUP(E293,modal,1,FALSE),\"NO\")","v":"NO"},{"$f":"IFERROR(VLOOKUP(F293,Tipo!$C$12:$C$27,1,FALSE),\"NO\")","v":"NO"},{"$f":"IFERROR(VLOOKUP(H293,afectacion,1,FALSE),\"NO\")","v":"NO"},{"$f":"IFERROR(VLOOKUP(I293,programa,1,FALSE),\"NO\")","v":"NO"}]
[null,null,null,null,null,null,null,null,null,{"$f":"IF(ISERROR(VLOOKUP(I294,Eje_Pilar!$C$2:$E$47,2,FALSE)),\" \",VLOOKUP(I294,Eje_Pilar!$C$2:$E$47,2,FALSE))","v":" "},{"$f":"IF(ISERROR(VLOOKUP(I294,Eje_Pilar!$C$2:$E$47,3,FALSE)),\" \",VLOOKUP(I294,Eje_Pilar!$C$2:$E$47,3,FALSE))","v":" "},null,null,null,null,null,null,null,null,{"$f":"+O294+Q294+S294","v":0},null,null,null,null,null,null,null,null,null,null,null,"-",null,{"$f":"IF(SUMPRODUCT((A$14:A294=A294)*(B$14:B294=B294)*(C$14:C294=C294))>1,0,1)","v":0},{"$f":"IFERROR(VLOOKUP(D294,tipo,1,FALSE),\"NO\")","v":"NO"},{"$f":"IFERROR(VLOOKUP(E294,modal,1,FALSE),\"NO\")","v":"NO"},{"$f":"IFERROR(VLOOKUP(F294,Tipo!$C$12:$C$27,1,FALSE),\"NO\")","v":"NO"},{"$f":"IFERROR(VLOOKUP(H294,afectacion,1,FALSE),\"NO\")","v":"NO"},{"$f":"IFERROR(VLOOKUP(I294,programa,1,FALSE),\"NO\")","v":"NO"}]
[null,null,null,null,null,null,null,null,null,{"$f":"IF(ISERROR(VLOOKUP(I295,Eje_Pilar!$C$2:$E$47,2,FALSE)),\" \",VLOOKUP(I295,Eje_Pilar!$C$2:$E$47,2,FALSE))","v":" "},{"$f":"IF(ISERROR(VLOOKUP(I295,Eje_Pilar!$C$2:$E$47,3,FALSE)),\" \",VLOOKUP(I295,Eje_Pilar!$C$2:$E$47,3,FALSE))","v":" "},null,null,null,null,null,null,null,null,{"$f":"+O295+Q295+S295","v":0},null,null,null,null,null,null,null,null,null,null,null,"-",null,{"$f":"IF(SUMPRODUCT((A$14:A295=A295)*(B$14:B295=B295)*(C$14:C295=C295))>1,0,1)","v":0},{"$f":"IFERROR(VLOOKUP(D295,tipo,1,FALSE),\"NO\")","v":"NO"},{"$f":"IFERROR(VLOOKUP(E295,modal,1,FALSE),\"NO\")","v":"NO"},{"$f":"IFERROR(VLOOKUP(F295,Tipo!$C$12:$C$27,1,FALSE),\"NO\")","v":"NO"},{"$f":"IFERROR(VLOOKUP(H295,afectacion,1,FALSE),\"NO\")","v":"NO"},{"$f":"IFERROR(VLOOKUP(I295,programa,1,FALSE),\"NO\")","v":"NO"}]
[null,null,null,null,null,null,null,null,null,{"$f":"IF(ISERROR(VLOOKUP(I296,Eje_Pilar!$C$2:$E$47,2,FALSE)),\" \",VLOOKUP(I296,Eje_Pilar!$C$2:$E$47,2,FALSE))","v":" "},{"$f":"IF(ISERROR(VLOOKUP(I296,Eje_Pilar!$C$2:$E$47,3,FALSE)),\" \",VLOOKUP(I296,Eje_Pilar!$C$2:$E$47,3,FALSE))","v":" "},null,null,null,null,null,null,null,null,{"$f":"+O296+Q296+S296","v":0},null,null,null,null,null,null,null,null,null,null,null,"-",null,{"$f":"IF(SUMPRODUCT((A$14:A296=A296)*(B$14:B296=B296)*(C$14:C296=C296))>1,0,1)","v":0},{"$f":"IFERROR(VLOOKUP(D296,tipo,1,FALSE),\"NO\")","v":"NO"},{"$f":"IFERROR(VLOOKUP(E296,modal,1,FALSE),\"NO\")","v":"NO"},{"$f":"IFERROR(VLOOKUP(F296,Tipo!$C$12:$C$27,1,FALSE),\"NO\")","v":"NO"},{"$f":"IFERROR(VLOOKUP(H296,afectacion,1,FALSE),\"NO\")","v":"NO"},{"$f":"IFERROR(VLOOKUP(I296,programa,1,FALSE),\"NO\")","v":"NO"}]
[null,null,null,null,null,null,null,null,null,{"$f":"IF(ISERROR(VLOOKUP(I297,Eje_Pilar!$C$2:$E$47,2,FALSE)),\" \",VLOOKUP(I297,Eje_Pilar!$C$2:$E$47,2,FALSE))","v":" "},{"$f":"IF(ISERROR(VLOOKUP(I297,Eje_Pilar!$C$2:$E$47,3,FALSE)),\" \",VLOOKUP(I297,Eje_Pilar!$C$2:$E$47,3,FALSE))","v":" "},null,null,null,null,null,null,null,null,{"$f":"+O297+Q297+S297","v":0},null,null,null,null,null,null,null,null,null,null,null,"-",null,{"$f":"IF(SUMPRODUCT((A$14:A297=A297)*(B$14:B297=B297)*(C$14:C297=C297))>1,0,1)","v":0},{"$f":"IFERROR(VLOOKUP(D297,tipo,1,FALSE),\"NO\")","v":"NO"},{"$f":"IFERROR(VLOOKUP(E297,modal,1,FALSE),\"NO\")","v":"NO"},{"$f":"IFERROR(VLOOKUP(F297,Tipo!$C$12:$C$27,1,FALSE),\"NO\")","v":"NO"},{"$f":"IFERROR(VLOOKUP(H297,afectacion,1,FALSE),\"NO\")","v":"NO"},{"$f":"IFERROR(VLOOKUP(I297,programa,1,FALSE),\"NO\")","v":"NO"}]
[null,null,null,null,null,null,null,null,null,{"$f":"IF(ISERROR(VLOOKUP(I298,Eje_Pilar!$C$2:$E$47,2,FALSE)),\" \",VLOOKUP(I298,Eje_Pilar!$C$2:$E$47,2,FALSE))","v":" "},{"$f":"IF(ISERROR(VLOOKUP(I298,Eje_Pilar!$C$2:$E$47,3,FALSE)),\" \",VLOOKUP(I298,Eje_Pilar!$C$2:$E$47,3,FALSE))","v":" "},null,null,null,null,null,null,null,null,{"$f":"+O298+Q298+S298","v":0},null,null,null,null,null,null,null,null,null,null,null,"-",null,{"$f":"IF(SUMPRODUCT((A$14:A298=A298)*(B$14:B298=B298)*(C$14:C298=C298))>1,0,1)","v":0},{"$f":"IFERROR(VLOOKUP(D298,tipo,1,FALSE),\"NO\")","v":"NO"},{"$f":"IFERROR(VLOOKUP(E298,modal,1,FALSE),\"NO\")","v":"NO"},{"$f":"IFERROR(VLOOKUP(F298,Tipo!$C$12:$C$27,1,FALSE),\"NO\")","v":"NO"},{"$f":"IFERROR(VLOOKUP(H298,afectacion,1,FALSE),\"NO\")","v":"NO"},{"$f":"IFERROR(VLOOKUP(I298,programa,1,FALSE),\"NO\")","v":"NO"}]
[null,null,null,null,null,null,null,null,null,{"$f":"IF(ISERROR(VLOOKUP(I299,Eje_Pilar!$C$2:$E$47,2,FALSE)),\" \",VLOOKUP(I299,Eje_Pilar!$C$2:$E$47,2,FALSE))","v":" "},{"$f":"IF(ISERROR(VLOOKUP(I299,Eje_Pilar!$C$2:$E$47,3,FALSE)),\" \",VLOOKUP(I299,Eje_Pilar!$C$2:$E$47,3,FALSE))","v":" "},null,null,null,null,null,null,null,null,{"$f":"+O299+Q299+S299","v":0},null,null,null,null,null,null,null,null,null,null,null,"-",null,{"$f":"IF(SUMPRODUCT((A$14:A299=A299)*(B$14:B299=B299)*(C$14:C299=C299))>1,0,1)","v":0},{"$f":"IFERROR(VLOOKUP(D299,tipo,1,FALSE),\"NO\")","v":"NO"},{"$f":"IFERROR(VLOOKUP(E299,modal,1,FALSE),\"NO\")","v":"NO"},{"$f":"IFERROR(VLOOKUP(F299,Tipo!$C$12:$C$27,1,FALSE),\"NO\")","v":"NO"},{"$f":"IFERROR(VLOOKUP(H299,afectacion,1,FALSE),\"NO\")","v":"NO"},{"$f":"IFERROR(VLOOKUP(I299,programa,1,FALSE),\"NO\")","v":"NO"}]
[null,null,null,null,null,null,null,null,null,{"$f":"IF(ISERROR(VLOOKUP(I300,Eje_Pilar!$C$2:$E$47,2,FALSE)),\" \",VLOOKUP(I300,Eje_Pilar!$C$2:$E$47,2,FALSE))","v":" "},{"$f":"IF(ISERROR(VLOOKUP(I300,Eje_Pilar!$C$2:$E$47,3,FALSE)),\" \",VLOOKUP(I300,Eje_Pilar!$C$2:$E$47,3,FALSE))","v":" "},null,null,null,null,null,null,null,null,{"$f":"+O300+Q300+S300","v":0},null,null,null,null,null,null,null,null,null,null,null,"-",null,{"$f":"IF(SUMPRODUCT((A$14:A300=A300)*(B$14:B300=B300)*(C$14:C300=C300))>1,0,1)","v":0},{"$f":"IFERROR(VLOOKUP(D300,tipo,1,FALSE),\"NO\")","v":"NO"},{"$f":"IFERROR(VLOOKUP(E300,modal,1,FALSE),\"NO\")","v":"NO"},{"$f":"IFERROR(VLOOKUP(F300,Tipo!$C$12:$C$27,1,FALSE),\"NO\")","v":"NO"},{"$f":"IFERROR(VLOOKUP(H300,afectacion,1,FALSE),\"NO\")","v":"NO"},{"$f":"IFERROR(VLOOKUP(I300,programa,1,FALSE),\"NO\")","v":"NO"}]
[null,null,null,null,null,null,null,null,null,{"$f":"IF(ISERROR(VLOOKUP(I301,Eje_Pilar!$C$2:$E$47,2,FALSE)),\" \",VLOOKUP(I301,Eje_Pilar!$C$2:$E$47,2,FALSE))","v":" "},{"$f":"IF(ISERROR(VLOOKUP(I301,Eje_Pilar!$C$2:$E$47,3,FALSE)),\" \",VLOOKUP(I301,Eje_Pilar!$C$2:$E$47,3,FALSE))","v":" "},null,null,null,null,null,null,null,null,{"$f":"+O301+Q301+S301","v":0},null,null,null,null,null,null,null,null,null,null,null,"-",null,{"$f":"IF(SUMPRODUCT((A$14:A301=A301)*(B$14:B301=B301)*(C$14:C301=C301))>1,0,1)","v":0},{"$f":"IFERROR(VLOOKUP(D301,tipo,1,FALSE),\"NO\")","v":"NO"},{"$f":"IFERROR(VLOOKUP(E301,modal,1,FALSE),\"NO\")","v":"NO"},{"$f":"IFERROR(VLOOKUP(F301,Tipo!$C$12:$C$27,1,FALSE),\"NO\")","v":"NO"},{"$f":"IFERROR(VLOOKUP(H301,afectacion,1,FALSE),\"NO\")","v":"NO"},{"$f":"IFERROR(VLOOKUP(I301,programa,1,FALSE),\"NO\")","v":"NO"}]
[null,null,null,null,null,null,null,null,null,{"$f":"IF(ISERROR(VLOOKUP(I302,Eje_Pilar!$C$2:$E$47,2,FALSE)),\" \",VLOOKUP(I302,Eje_Pilar!$C$2:$E$47,2,FALSE))","v":" "},{"$f":"IF(ISERROR(VLOOKUP(I302,Eje_Pilar!$C$2:$E$47,3,FALSE)),\" \",VLOOKUP(I302,Eje_Pilar!$C$2:$E$47,3,FALSE))","v":" "},null,null,null,null,null,null,null,null,{"$f":"+O302+Q302+S302","v":0},null,null,null,null,null,null,null,null,null,null,null,"-",null,{"$f":"IF(SUMPRODUCT((A$14:A302=A302)*(B$14:B302=B302)*(C$14:C302=C302))>1,0,1)","v":0},{"$f":"IFERROR(VLOOKUP(D302,tipo,1,FALSE),\"NO\")","v":"NO"},{"$f":"IFERROR(VLOOKUP(E302,modal,1,FALSE),\"NO\")","v":"NO"},{"$f":"IFERROR(VLOOKUP(F302,Tipo!$C$12:$C$27,1,FALSE),\"NO\")","v":"NO"},{"$f":"IFERROR(VLOOKUP(H302,afectacion,1,FALSE),\"NO\")","v":"NO"},{"$f":"IFERROR(VLOOKUP(I302,programa,1,FALSE),\"NO\")","v":"NO"}]
[null,null,null,null,null,null,null,null,null,{"$f":"IF(ISERROR(VLOOKUP(I303,Eje_Pilar!$C$2:$E$47,2,FALSE)),\" \",VLOOKUP(I303,Eje_Pilar!$C$2:$E$47,2,FALSE))","v":" "},{"$f":"IF(ISERROR(VLOOKUP(I303,Eje_Pilar!$C$2:$E$47,3,FALSE)),\" \",VLOOKUP(I303,Eje_Pilar!$C$2:$E$47,3,FALSE))","v":" "},null,null,null,null,null,null,null,null,{"$f":"+O303+Q303+S303","v":0},null,null,null,null,null,null,null,null,null,null,null,"-",null,{"$f":"IF(SUMPRODUCT((A$14:A303=A303)*(B$14:B303=B303)*(C$14:C303=C303))>1,0,1)","v":0},{"$f":"IFERROR(VLOOKUP(D303,tipo,1,FALSE),\"NO\")","v":"NO"},{"$f":"IFERROR(VLOOKUP(E303,modal,1,FALSE),\"NO\")","v":"NO"},{"$f":"IFERROR(VLOOKUP(F303,Tipo!$C$12:$C$27,1,FALSE),\"NO\")","v":"NO"},{"$f":"IFERROR(VLOOKUP(H303,afectacion,1,FALSE),\"NO\")","v":"NO"},{"$f":"IFERROR(VLOOKUP(I303,programa,1,FALSE),\"NO\")","v":"NO"}]
[null,null,null,null,null,null,null,null,null,{"$f":"IF(ISERROR(VLOOKUP(I304,Eje_Pilar!$C$2:$E$47,2,FALSE)),\" \",VLOOKUP(I304,Eje_Pilar!$C$2:$E$47,2,FALSE))","v":" "},{"$f":"IF(ISERROR(VLOOKUP(I304,Eje_Pilar!$C$2:$E$47,3,FALSE)),\" \",VLOOKUP(I304,Eje_Pilar!$C$2:$E$47,3,FALSE))","v":" "},null,null,null,null,null,null,null,null,{"$f":"+O304+Q304+S304","v":0},null,null,null,null,null,null,null,null,null,null,null,"-",null,{"$f":"IF(SUMPRODUCT((A$14:A304=A304)*(B$14:B304=B304)*(C$14:C304=C304))>1,0,1)","v":0},{"$f":"IFERROR(VLOOKUP(D304,tipo,1,FALSE),\"NO\")","v":"NO"},{"$f":"IFERROR(VLOOKUP(E304,modal,1,FALSE),\"NO\")","v":"NO"},{"$f":"IFERROR(VLOOKUP(F304,Tipo!$C$12:$C$27,1,FALSE),\"NO\")","v":"NO"},{"$f":"IFERROR(VLOOKUP(H304,afectacion,1,FALSE),\"NO\")","v":"NO"},{"$f":"IFERROR(VLOOKUP(I304,programa,1,FALSE),\"NO\")","v":"NO"}]
[null,null,null,null,null,null,null,null,null,{"$f":"IF(ISERROR(VLOOKUP(I305,Eje_Pilar!$C$2:$E$47,2,FALSE)),\" \",VLOOKUP(I305,Eje_Pilar!$C$2:$E$47,2,FALSE))","v":" "},{"$f":"IF(ISERROR(VLOOKUP(I305,Eje_Pilar!$C$2:$E$47,3,FALSE)),\" \",VLOOKUP(I305,Eje_Pilar!$C$2:$E$47,3,FALSE))","v":" "},null,null,null,null,null,null,null,null,{"$f":"+O305+Q305+S305","v":0},null,null,null,null,null,null,null,null,null,null,null,"-",null,{"$f":"IF(SUMPRODUCT((A$14:A305=A305)*(B$14:B305=B305)*(C$14:C305=C305))>1,0,1)","v":0},{"$f":"IFERROR(VLOOKUP(D305,tipo,1,FALSE),\"NO\")","v":"NO"},{"$f":"IFERROR(VLOOKUP(E305,modal,1,FALSE),\"NO\")","v":"NO"},{"$f":"IFERROR(VLOOKUP(F305,Tipo!$C$12:$C$27,1,FALSE),\"NO\")","v":"NO"},{"$f":"IFERROR(VLOOKUP(H305,afectacion,1,FALSE),\"NO\")","v":"NO"},{"$f":"IFERROR(VLOOKUP(I305,programa,1,FALSE),\"NO\")","v":"NO"}]
[null,null,null,null,null,null,null,null,null,{"$f":"IF(ISERROR(VLOOKUP(I306,Eje_Pilar!$C$2:$E$47,2,FALSE)),\" \",VLOOKUP(I306,Eje_Pilar!$C$2:$E$47,2,FALSE))","v":" "},{"$f":"IF(ISERROR(VLOOKUP(I306,Eje_Pilar!$C$2:$E$47,3,FALSE)),\" \",VLOOKUP(I306,Eje_Pilar!$C$2:$E$47,3,FALSE))","v":" "},null,null,null,null,null,null,null,null,{"$f":"+O306+Q306+S306","v":0},null,null,null,null,null,null,null,null,null,null,null,"-",null,{"$f":"IF(SUMPRODUCT((A$14:A306=A306)*(B$14:B306=B306)*(C$14:C306=C306))>1,0,1)","v":0},{"$f":"IFERROR(VLOOKUP(D306,tipo,1,FALSE),\"NO\")","v":"NO"},{"$f":"IFERROR(VLOOKUP(E306,modal,1,FALSE),\"NO\")","v":"NO"},{"$f":"IFERROR(VLOOKUP(F306,Tipo!$C$12:$C$27,1,FALSE),\"NO\")","v":"NO"},{"$f":"IFERROR(VLOOKUP(H306,afectacion,1,FALSE),\"NO\")","v":"NO"},{"$f":"IFERROR(VLOOKUP(I306,programa,1,FALSE),\"NO\")","v":"NO"}]
[null,null,null,null,null,null,null,null,null,{"$f":"IF(ISERROR(VLOOKUP(I307,Eje_Pilar!$C$2:$E$47,2,FALSE)),\" \",VLOOKUP(I307,Eje_Pilar!$C$2:$E$47,2,FALSE))","v":" "},{"$f":"IF(ISERROR(VLOOKUP(I307,Eje_Pilar!$C$2:$E$47,3,FALSE)),\" \",VLOOKUP(I307,Eje_Pilar!$C$2:$E$47,3,FALSE))","v":" "},null,null,null,null,null,null,null,null,{"$f":"+O307+Q307+S307","v":0},null,null,null,null,null,null,null,null,null,null,null,"-",null,{"$f":"IF(SUMPRODUCT((A$14:A307=A307)*(B$14:B307=B307)*(C$14:C307=C307))>1,0,1)","v":0},{"$f":"IFERROR(VLOOKUP(D307,tipo,1,FALSE),\"NO\")","v":"NO"},{"$f":"IFERROR(VLOOKUP(E307,modal,1,FALSE),\"NO\")","v":"NO"},{"$f":"IFERROR(VLOOKUP(F307,Tipo!$C$12:$C$27,1,FALSE),\"NO\")","v":"NO"},{"$f":"IFERROR(VLOOKUP(H307,afectacion,1,FALSE),\"NO\")","v":"NO"},{"$f":"IFERROR(VLOOKUP(I307,programa,1,FALSE),\"NO\")","v":"NO"}]
[null,null,null,null,null,null,null,null,null,{"$f":"IF(ISERROR(VLOOKUP(I308,Eje_Pilar!$C$2:$E$47,2,FALSE)),\" \",VLOOKUP(I308,Eje_Pilar!$C$2:$E$47,2,FALSE))","v":" "},{"$f":"IF(ISERROR(VLOOKUP(I308,Eje_Pilar!$C$2:$E$47,3,FALSE)),\" \",VLOOKUP(I308,Eje_Pilar!$C$2:$E$47,3,FALSE))","v":" "},null,null,null,null,null,null,null,null,{"$f":"+O308+Q308+S308","v":0},null,null,null,null,null,null,null,null,null,null,null,"-",null,{"$f":"IF(SUMPRODUCT((A$14:A308=A308)*(B$14:B308=B308)*(C$14:C308=C308))>1,0,1)","v":0},{"$f":"IFERROR(VLOOKUP(D308,tipo,1,FALSE),\"NO\")","v":"NO"},{"$f":"IFERROR(VLOOKUP(E308,modal,1,FALSE),\"NO\")","v":"NO"},{"$f":"IFERROR(VLOOKUP(F308,Tipo!$C$12:$C$27,1,FALSE),\"NO\")","v":"NO"},{"$f":"IFERROR(VLOOKUP(H308,afectacion,1,FALSE),\"NO\")","v":"NO"},{"$f":"IFERROR(VLOOKUP(I308,programa,1,FALSE),\"NO\")","v":"NO"}]
[null,null,null,null,null,null,null,null,null,{"$f":"IF(ISERROR(VLOOKUP(I309,Eje_Pilar!$C$2:$E$47,2,FALSE)),\" \",VLOOKUP(I309,Eje_Pilar!$C$2:$E$47,2,FALSE))","v":" "},{"$f":"IF(ISERROR(VLOOKUP(I309,Eje_Pilar!$C$2:$E$47,3,FALSE)),\" \",VLOOKUP(I309,Eje_Pilar!$C$2:$E$47,3,FALSE))","v":" "},null,null,null,null,null,null,null,null,{"$f":"+O309+Q309+S309","v":0},null,null,null,null,null,null,null,null,null,null,null,"-",null,{"$f":"IF(SUMPRODUCT((A$14:A309=A309)*(B$14:B309=B309)*(C$14:C309=C309))>1,0,1)","v":0},{"$f":"IFERROR(VLOOKUP(D309,tipo,1,FALSE),\"NO\")","v":"NO"},{"$f":"IFERROR(VLOOKUP(E309,modal,1,FALSE),\"NO\")","v":"NO"},{"$f":"IFERROR(VLOOKUP(F309,Tipo!$C$12:$C$27,1,FALSE),\"NO\")","v":"NO"},{"$f":"IFERROR(VLOOKUP(H309,afectacion,1,FALSE),\"NO\")","v":"NO"},{"$f":"IFERROR(VLOOKUP(I309,programa,1,FALSE),\"NO\")","v":"NO"}]
[null,null,null,null,null,null,null,null,null,{"$f":"IF(ISERROR(VLOOKUP(I310,Eje_Pilar!$C$2:$E$47,2,FALSE)),\" \",VLOOKUP(I310,Eje_Pilar!$C$2:$E$47,2,FALSE))","v":" "},{"$f":"IF(ISERROR(VLOOKUP(I310,Eje_Pilar!$C$2:$E$47,3,FALSE)),\" \",VLOOKUP(I310,Eje_Pilar!$C$2:$E$47,3,FALSE))","v":" "},null,null,null,null,null,null,null,null,{"$f":"+O310+Q310+S310","v":0},null,null,null,null,null,null,null,null,null,null,null,"-",null,{"$f":"IF(SUMPRODUCT((A$14:A310=A310)*(B$14:B310=B310)*(C$14:C310=C310))>1,0,1)","v":0},{"$f":"IFERROR(VLOOKUP(D310,tipo,1,FALSE),\"NO\")","v":"NO"},{"$f":"IFERROR(VLOOKUP(E310,modal,1,FALSE),\"NO\")","v":"NO"},{"$f":"IFERROR(VLOOKUP(F310,Tipo!$C$12:$C$27,1,FALSE),\"NO\")","v":"NO"},{"$f":"IFERROR(VLOOKUP(H310,afectacion,1,FALSE),\"NO\")","v":"NO"},{"$f":"IFERROR(VLOOKUP(I310,programa,1,FALSE),\"NO\")","v":"NO"}]
[null,null,null,null,null,null,null,null,null,{"$f":"IF(ISERROR(VLOOKUP(I311,Eje_Pilar!$C$2:$E$47,2,FALSE)),\" \",VLOOKUP(I311,Eje_Pilar!$C$2:$E$47,2,FALSE))","v":" "},{"$f":"IF(ISERROR(VLOOKUP(I311,Eje_Pilar!$C$2:$E$47,3,FALSE)),\" \",VLOOKUP(I311,Eje_Pilar!$C$2:$E$47,3,FALSE))","v":" "},null,null,null,null,null,null,null,null,{"$f":"+O311+Q311+S311","v":0},null,null,null,null,null,null,null,null,null,null,null,"-",null,{"$f":"IF(SUMPRODUCT((A$14:A311=A311)*(B$14:B311=B311)*(C$14:C311=C311))>1,0,1)","v":0},{"$f":"IFERROR(VLOOKUP(D311,tipo,1,FALSE),\"NO\")","v":"NO"},{"$f":"IFERROR(VLOOKUP(E311,modal,1,FALSE),\"NO\")","v":"NO"},{"$f":"IFERROR(VLOOKUP(F311,Tipo!$C$12:$C$27,1,FALSE),\"NO\")","v":"NO"},{"$f":"IFERROR(VLOOKUP(H311,afectacion,1,FALSE),\"NO\")","v":"NO"},{"$f":"IFERROR(VLOOKUP(I311,programa,1,FALSE),\"NO\")","v":"NO"}]
[null,null,null,null,null,null,null,null,null,{"$f":"IF(ISERROR(VLOOKUP(I312,Eje_Pilar!$C$2:$E$47,2,FALSE)),\" \",VLOOKUP(I312,Eje_Pilar!$C$2:$E$47,2,FALSE))","v":" "},{"$f":"IF(ISERROR(VLOOKUP(I312,Eje_Pilar!$C$2:$E$47,3,FALSE)),\" \",VLOOKUP(I312,Eje_Pilar!$C$2:$E$47,3,FALSE))","v":" "},null,null,null,null,null,null,null,null,{"$f":"+O312+Q312+S312","v":0},null,null,null,null,null,null,null,null,null,null,null,"-",null,{"$f":"IF(SUMPRODUCT((A$14:A312=A312)*(B$14:B312=B312)*(C$14:C312=C312))>1,0,1)","v":0},{"$f":"IFERROR(VLOOKUP(D312,tipo,1,FALSE),\"NO\")","v":"NO"},{"$f":"IFERROR(VLOOKUP(E312,modal,1,FALSE),\"NO\")","v":"NO"},{"$f":"IFERROR(VLOOKUP(F312,Tipo!$C$12:$C$27,1,FALSE),\"NO\")","v":"NO"},{"$f":"IFERROR(VLOOKUP(H312,afectacion,1,FALSE),\"NO\")","v":"NO"},{"$f":"IFERROR(VLOOKUP(I312,programa,1,FALSE),\"NO\")","v":"NO"}]
[null,null,null,null,null,null,null,null,null,{"$f":"IF(ISERROR(VLOOKUP(I313,Eje_Pilar!$C$2:$E$47,2,FALSE)),\" \",VLOOKUP(I313,Eje_Pilar!$C$2:$E$47,2,FALSE))","v":" "},{"$f":"IF(ISERROR(VLOOKUP(I313,Eje_Pilar!$C$2:$E$47,3,FALSE)),\" \",VLOOKUP(I313,Eje_Pilar!$C$2:$E$47,3,FALSE))","v":" "},null,null,null,null,null,null,null,null,{"$f":"+O313+Q313+S313","v":0},null,null,null,null,null,null,null,null,null,null,null,"-",null,{"$f":"IF(SUMPRODUCT((A$14:A313=A313)*(B$14:B313=B313)*(C$14:C313=C313))>1,0,1)","v":0},{"$f":"IFERROR(VLOOKUP(D313,tipo,1,FALSE),\"NO\")","v":"NO"},{"$f":"IFERROR(VLOOKUP(E313,modal,1,FALSE),\"NO\")","v":"NO"},{"$f":"IFERROR(VLOOKUP(F313,Tipo!$C$12:$C$27,1,FALSE),\"NO\")","v":"NO"},{"$f":"IFERROR(VLOOKUP(H313,afectacion,1,FALSE),\"NO\")","v":"NO"},{"$f":"IFERROR(VLOOKUP(I313,programa,1,FALSE),\"NO\")","v":"NO"}]
[null,null,null,null,null,null,null,null,null,{"$f":"IF(ISERROR(VLOOKUP(I314,Eje_Pilar!$C$2:$E$47,2,FALSE)),\" \",VLOOKUP(I314,Eje_Pilar!$C$2:$E$47,2,FALSE))","v":" "},{"$f":"IF(ISERROR(VLOOKUP(I314,Eje_Pilar!$C$2:$E$47,3,FALSE)),\" \",VLOOKUP(I314,Eje_Pilar!$C$2:$E$47,3,FALSE))","v":" "},null,null,null,null,null,null,null,null,{"$f":"+O314+Q314+S314","v":0},null,null,null,null,null,null,null,null,null,null,null,"-",null,{"$f":"IF(SUMPRODUCT((A$14:A314=A314)*(B$14:B314=B314)*(C$14:C314=C314))>1,0,1)","v":0},{"$f":"IFERROR(VLOOKUP(D314,tipo,1,FALSE),\"NO\")","v":"NO"},{"$f":"IFERROR(VLOOKUP(E314,modal,1,FALSE),\"NO\")","v":"NO"},{"$f":"IFERROR(VLOOKUP(F314,Tipo!$C$12:$C$27,1,FALSE),\"NO\")","v":"NO"},{"$f":"IFERROR(VLOOKUP(H314,afectacion,1,FALSE),\"NO\")","v":"NO"},{"$f":"IFERROR(VLOOKUP(I314,programa,1,FALSE),\"NO\")","v":"NO"}]
[null,null,null,null,null,null,null,null,null,{"$f":"IF(ISERROR(VLOOKUP(I315,Eje_Pilar!$C$2:$E$47,2,FALSE)),\" \",VLOOKUP(I315,Eje_Pilar!$C$2:$E$47,2,FALSE))","v":" "},{"$f":"IF(ISERROR(VLOOKUP(I315,Eje_Pilar!$C$2:$E$47,3,FALSE)),\" \",VLOOKUP(I315,Eje_Pilar!$C$2:$E$47,3,FALSE))","v":" "},null,null,null,null,null,null,null,null,{"$f":"+O315+Q315+S315","v":0},null,null,null,null,null,null,null,null,null,null,null,"-",null,{"$f":"IF(SUMPRODUCT((A$14:A315=A315)*(B$14:B315=B315)*(C$14:C315=C315))>1,0,1)","v":0},{"$f":"IFERROR(VLOOKUP(D315,tipo,1,FALSE),\"NO\")","v":"NO"},{"$f":"IFERROR(VLOOKUP(E315,modal,1,FALSE),\"NO\")","v":"NO"},{"$f":"IFERROR(VLOOKUP(F315,Tipo!$C$12:$C$27,1,FALSE),\"NO\")","v":"NO"},{"$f":"IFERROR(VLOOKUP(H315,afectacion,1,FALSE),\"NO\")","v":"NO"},{"$f":"IFERROR(VLOOKUP(I315,programa,1,FALSE),\"NO\")","v":"NO"}]
[null,null,null,null,null,null,null,null,null,{"$f":"IF(ISERROR(VLOOKUP(I316,Eje_Pilar!$C$2:$E$47,2,FALSE)),\" \",VLOOKUP(I316,Eje_Pilar!$C$2:$E$47,2,FALSE))","v":" "},{"$f":"IF(ISERROR(VLOOKUP(I316,Eje_Pilar!$C$2:$E$47,3,FALSE)),\" \",VLOOKUP(I316,Eje_Pilar!$C$2:$E$47,3,FALSE))","v":" "},null,null,null,null,null,null,null,null,{"$f":"+O316+Q316+S316","v":0},null,null,null,null,null,null,null,null,null,null,null,"-",null,{"$f":"IF(SUMPRODUCT((A$14:A316=A316)*(B$14:B316=B316)*(C$14:C316=C316))>1,0,1)","v":0},{"$f":"IFERROR(VLOOKUP(D316,tipo,1,FALSE),\"NO\")","v":"NO"},{"$f":"IFERROR(VLOOKUP(E316,modal,1,FALSE),\"NO\")","v":"NO"},{"$f":"IFERROR(VLOOKUP(F316,Tipo!$C$12:$C$27,1,FALSE),\"NO\")","v":"NO"},{"$f":"IFERROR(VLOOKUP(H316,afectacion,1,FALSE),\"NO\")","v":"NO"},{"$f":"IFERROR(VLOOKUP(I316,programa,1,FALSE),\"NO\")","v":"NO"}]
[null,null,null,null,null,null,null,null,null,{"$f":"IF(ISERROR(VLOOKUP(I317,Eje_Pilar!$C$2:$E$47,2,FALSE)),\" \",VLOOKUP(I317,Eje_Pilar!$C$2:$E$47,2,FALSE))","v":" "},{"$f":"IF(ISERROR(VLOOKUP(I317,Eje_Pilar!$C$2:$E$47,3,FALSE)),\" \",VLOOKUP(I317,Eje_Pilar!$C$2:$E$47,3,FALSE))","v":" "},null,null,null,null,null,null,null,null,{"$f":"+O317+Q317+S317","v":0},null,null,null,null,null,null,null,null,null,null,null,"-",null,{"$f":"IF(SUMPRODUCT((A$14:A317=A317)*(B$14:B317=B317)*(C$14:C317=C317))>1,0,1)","v":0},{"$f":"IFERROR(VLOOKUP(D317,tipo,1,FALSE),\"NO\")","v":"NO"},{"$f":"IFERROR(VLOOKUP(E317,modal,1,FALSE),\"NO\")","v":"NO"},{"$f":"IFERROR(VLOOKUP(F317,Tipo!$C$12:$C$27,1,FALSE),\"NO\")","v":"NO"},{"$f":"IFERROR(VLOOKUP(H317,afectacion,1,FALSE),\"NO\")","v":"NO"},{"$f":"IFERROR(VLOOKUP(I317,programa,1,FALSE),\"NO\")","v":"NO"}]
[null,null,null,null,null,null,null,null,null,{"$f":"IF(ISERROR(VLOOKUP(I318,Eje_Pilar!$C$2:$E$47,2,FALSE)),\" \",VLOOKUP(I318,Eje_Pilar!$C$2:$E$47,2,FALSE))","v":" "},{"$f":"IF(ISERROR(VLOOKUP(I318,Eje_Pilar!$C$2:$E$47,3,FALSE)),\" \",VLOOKUP(I318,Eje_Pilar!$C$2:$E$47,3,FALSE))","v":" "},null,null,null,null,null,null,null,null,{"$f":"+O318+Q318+S318","v":0},null,null,null,null,null,null,null,null,null,null,null,{"$f":"IF(ISERROR(U318/T318),\"-\",(U318/T318))","v":"-"},null,{"$f":"IF(SUMPRODUCT((A$14:A318=A318)*(B$14:B318=B318)*(C$14:C318=C318))>1,0,1)","v":0},{"$f":"IFERROR(VLOOKUP(D318,tipo,1,FALSE),\"NO\")","v":"NO"},{"$f":"IFERROR(VLOOKUP(E318,modal,1,FALSE),\"NO\")","v":"NO"},{"$f":"IFERROR(VLOOKUP(F318,Tipo!$C$12:$C$27,1,FALSE),\"NO\")","v":"NO"},{"$f":"IFERROR(VLOOKUP(H318,afectacion,1,FALSE),\"NO\")","v":"NO"},{"$f":"IFERROR(VLOOKUP(I318,programa,1,FALSE),\"NO\")","v":"NO"}]
[null,null,null,null,null,null,null,null,null,{"$f":"IF(ISERROR(VLOOKUP(I319,Eje_Pilar!$C$2:$E$47,2,FALSE)),\" \",VLOOKUP(I319,Eje_Pilar!$C$2:$E$47,2,FALSE))","v":" "},{"$f":"IF(ISERROR(VLOOKUP(I319,Eje_Pilar!$C$2:$E$47,3,FALSE)),\" \",VLOOKUP(I319,Eje_Pilar!$C$2:$E$47,3,FALSE))","v":" "},null,null,null,null,null,null,null,null,{"$f":"+O319+Q319+S319","v":0},null,null,null,null,null,null,null,null,null,null,null,"-",null,{"$f":"IF(SUMPRODUCT((A$14:A319=A319)*(B$14:B319=B319)*(C$14:C319=C319))>1,0,1)","v":0},{"$f":"IFERROR(VLOOKUP(D319,tipo,1,FALSE),\"NO\")","v":"NO"},{"$f":"IFERROR(VLOOKUP(E319,modal,1,FALSE),\"NO\")","v":"NO"},{"$f":"IFERROR(VLOOKUP(F319,Tipo!$C$12:$C$27,1,FALSE),\"NO\")","v":"NO"},{"$f":"IFERROR(VLOOKUP(H319,afectacion,1,FALSE),\"NO\")","v":"NO"},{"$f":"IFERROR(VLOOKUP(I319,programa,1,FALSE),\"NO\")","v":"NO"}]
[null,null,null,null,null,null,null,null,null,{"$f":"IF(ISERROR(VLOOKUP(I320,Eje_Pilar!$C$2:$E$47,2,FALSE)),\" \",VLOOKUP(I320,Eje_Pilar!$C$2:$E$47,2,FALSE))","v":" "},{"$f":"IF(ISERROR(VLOOKUP(I320,Eje_Pilar!$C$2:$E$47,3,FALSE)),\" \",VLOOKUP(I320,Eje_Pilar!$C$2:$E$47,3,FALSE))","v":" "},null,null,null,null,null,null,null,null,{"$f":"+O320+Q320+S320","v":0},null,null,null,null,null,null,null,null,null,null,null,"-",null,{"$f":"IF(SUMPRODUCT((A$14:A320=A320)*(B$14:B320=B320)*(C$14:C320=C320))>1,0,1)","v":0},{"$f":"IFERROR(VLOOKUP(D320,tipo,1,FALSE),\"NO\")","v":"NO"},{"$f":"IFERROR(VLOOKUP(E320,modal,1,FALSE),\"NO\")","v":"NO"},{"$f":"IFERROR(VLOOKUP(F320,Tipo!$C$12:$C$27,1,FALSE),\"NO\")","v":"NO"},{"$f":"IFERROR(VLOOKUP(H320,afectacion,1,FALSE),\"NO\")","v":"NO"},{"$f":"IFERROR(VLOOKUP(I320,programa,1,FALSE),\"NO\")","v":"NO"}]
[null,null,null,null,null,null,null,null,null,{"$f":"IF(ISERROR(VLOOKUP(I321,Eje_Pilar!$C$2:$E$47,2,FALSE)),\" \",VLOOKUP(I321,Eje_Pilar!$C$2:$E$47,2,FALSE))","v":" "},{"$f":"IF(ISERROR(VLOOKUP(I321,Eje_Pilar!$C$2:$E$47,3,FALSE)),\" \",VLOOKUP(I321,Eje_Pilar!$C$2:$E$47,3,FALSE))","v":" "},null,null,null,null,null,null,null,null,{"$f":"+O321+Q321+S321","v":0},null,null,null,null,null,null,null,null,null,null,null,"-",null,{"$f":"IF(SUMPRODUCT((A$14:A321=A321)*(B$14:B321=B321)*(C$14:C321=C321))>1,0,1)","v":0},{"$f":"IFERROR(VLOOKUP(D321,tipo,1,FALSE),\"NO\")","v":"NO"},{"$f":"IFERROR(VLOOKUP(E321,modal,1,FALSE),\"NO\")","v":"NO"},{"$f":"IFERROR(VLOOKUP(F321,Tipo!$C$12:$C$27,1,FALSE),\"NO\")","v":"NO"},{"$f":"IFERROR(VLOOKUP(H321,afectacion,1,FALSE),\"NO\")","v":"NO"},{"$f":"IFERROR(VLOOKUP(I321,programa,1,FALSE),\"NO\")","v":"NO"}]
[null,null,null,null,null,null,null,null,null,{"$f":"IF(ISERROR(VLOOKUP(I322,Eje_Pilar!$C$2:$E$47,2,FALSE)),\" \",VLOOKUP(I322,Eje_Pilar!$C$2:$E$47,2,FALSE))","v":" "},{"$f":"IF(ISERROR(VLOOKUP(I322,Eje_Pilar!$C$2:$E$47,3,FALSE)),\" \",VLOOKUP(I322,Eje_Pilar!$C$2:$E$47,3,FALSE))","v":" "},null,null,null,null,null,null,null,null,{"$f":"+O322+Q322+S322","v":0},null,null,null,null,null,null,null,null,null,null,null,"-",null,{"$f":"IF(SUMPRODUCT((A$14:A322=A322)*(B$14:B322=B322)*(C$14:C322=C322))>1,0,1)","v":0},{"$f":"IFERROR(VLOOKUP(D322,tipo,1,FALSE),\"NO\")","v":"NO"},{"$f":"IFERROR(VLOOKUP(E322,modal,1,FALSE),\"NO\")","v":"NO"},{"$f":"IFERROR(VLOOKUP(F322,Tipo!$C$12:$C$27,1,FALSE),\"NO\")","v":"NO"},{"$f":"IFERROR(VLOOKUP(H322,afectacion,1,FALSE),\"NO\")","v":"NO"},{"$f":"IFERROR(VLOOKUP(I322,programa,1,FALSE),\"NO\")","v":"NO"}]
[null,null,null,null,null,null,null,null,null,{"$f":"IF(ISERROR(VLOOKUP(I323,Eje_Pilar!$C$2:$E$47,2,FALSE)),\" \",VLOOKUP(I323,Eje_Pilar!$C$2:$E$47,2,FALSE))","v":" "},{"$f":"IF(ISERROR(VLOOKUP(I323,Eje_Pilar!$C$2:$E$47,3,FALSE)),\" \",VLOOKUP(I323,Eje_Pilar!$C$2:$E$47,3,FALSE))","v":" "},null,null,null,null,null,null,null,null,{"$f":"+O323+Q323+S323","v":0},null,null,null,null,null,null,null,null,null,null,null,"-",null,{"$f":"IF(SUMPRODUCT((A$14:A323=A323)*(B$14:B323=B323)*(C$14:C323=C323))>1,0,1)","v":0},{"$f":"IFERROR(VLOOKUP(D323,tipo,1,FALSE),\"NO\")","v":"NO"},{"$f":"IFERROR(VLOOKUP(E323,modal,1,FALSE),\"NO\")","v":"NO"},{"$f":"IFERROR(VLOOKUP(F323,Tipo!$C$12:$C$27,1,FALSE),\"NO\")","v":"NO"},{"$f":"IFERROR(VLOOKUP(H323,afectacion,1,FALSE),\"NO\")","v":"NO"},{"$f":"IFERROR(VLOOKUP(I323,programa,1,FALSE),\"NO\")","v":"NO"}]
[null,null,null,null,null,null,null,null,null,{"$f":"IF(ISERROR(VLOOKUP(I324,Eje_Pilar!$C$2:$E$47,2,FALSE)),\" \",VLOOKUP(I324,Eje_Pilar!$C$2:$E$47,2,FALSE))","v":" "},{"$f":"IF(ISERROR(VLOOKUP(I324,Eje_Pilar!$C$2:$E$47,3,FALSE)),\" \",VLOOKUP(I324,Eje_Pilar!$C$2:$E$47,3,FALSE))","v":" "},null,null,null,null,null,null,null,null,{"$f":"+O324+Q324+S324","v":0},null,null,null,null,null,null,null,null,null,null,null,"-",null,{"$f":"IF(SUMPRODUCT((A$14:A324=A324)*(B$14:B324=B324)*(C$14:C324=C324))>1,0,1)","v":0},{"$f":"IFERROR(VLOOKUP(D324,tipo,1,FALSE),\"NO\")","v":"NO"},{"$f":"IFERROR(VLOOKUP(E324,modal,1,FALSE),\"NO\")","v":"NO"},{"$f":"IFERROR(VLOOKUP(F324,Tipo!$C$12:$C$27,1,FALSE),\"NO\")","v":"NO"},{"$f":"IFERROR(VLOOKUP(H324,afectacion,1,FALSE),\"NO\")","v":"NO"},{"$f":"IFERROR(VLOOKUP(I324,programa,1,FALSE),\"NO\")","v":"NO"}]
[null,null,null,null,null,null,null,null,null,{"$f":"IF(ISERROR(VLOOKUP(I325,Eje_Pilar!$C$2:$E$47,2,FALSE)),\" \",VLOOKUP(I325,Eje_Pilar!$C$2:$E$47,2,FALSE))","v":" "},{"$f":"IF(ISERROR(VLOOKUP(I325,Eje_Pilar!$C$2:$E$47,3,FALSE)),\" \",VLOOKUP(I325,Eje_Pilar!$C$2:$E$47,3,FALSE))","v":" "},null,null,null,null,null,null,null,null,{"$f":"+O325+Q325+S325","v":0},null,null,null,null,null,null,null,null,null,null,null,"-",null,{"$f":"IF(SUMPRODUCT((A$14:A325=A325)*(B$14:B325=B325)*(C$14:C325=C325))>1,0,1)","v":0},{"$f":"IFERROR(VLOOKUP(D325,tipo,1,FALSE),\"NO\")","v":"NO"},{"$f":"IFERROR(VLOOKUP(E325,modal,1,FALSE),\"NO\")","v":"NO"},{"$f":"IFERROR(VLOOKUP(F325,Tipo!$C$12:$C$27,1,FALSE),\"NO\")","v":"NO"},{"$f":"IFERROR(VLOOKUP(H325,afectacion,1,FALSE),\"NO\")","v":"NO"},{"$f":"IFERROR(VLOOKUP(I325,programa,1,FALSE),\"NO\")","v":"NO"}]
[null,null,null,null,null,null,null,null,null,{"$f":"IF(ISERROR(VLOOKUP(I326,Eje_Pilar!$C$2:$E$47,2,FALSE)),\" \",VLOOKUP(I326,Eje_Pilar!$C$2:$E$47,2,FALSE))","v":" "},{"$f":"IF(ISERROR(VLOOKUP(I326,Eje_Pilar!$C$2:$E$47,3,FALSE)),\" \",VLOOKUP(I326,Eje_Pilar!$C$2:$E$47,3,FALSE))","v":" "},null,null,null,null,null,null,null,null,{"$f":"+O326+Q326+S326","v":0},null,null,null,null,null,null,null,null,null,null,null,"-",null,{"$f":"IF(SUMPRODUCT((A$14:A326=A326)*(B$14:B326=B326)*(C$14:C326=C326))>1,0,1)","v":0},{"$f":"IFERROR(VLOOKUP(D326,tipo,1,FALSE),\"NO\")","v":"NO"},{"$f":"IFERROR(VLOOKUP(E326,modal,1,FALSE),\"NO\")","v":"NO"},{"$f":"IFERROR(VLOOKUP(F326,Tipo!$C$12:$C$27,1,FALSE),\"NO\")","v":"NO"},{"$f":"IFERROR(VLOOKUP(H326,afectacion,1,FALSE),\"NO\")","v":"NO"},{"$f":"IFERROR(VLOOKUP(I326,programa,1,FALSE),\"NO\")","v":"NO"}]
[null,null,null,null,null,null,null,null,null,{"$f":"IF(ISERROR(VLOOKUP(I327,Eje_Pilar!$C$2:$E$47,2,FALSE)),\" \",VLOOKUP(I327,Eje_Pilar!$C$2:$E$47,2,FALSE))","v":" "},{"$f":"IF(ISERROR(VLOOKUP(I327,Eje_Pilar!$C$2:$E$47,3,FALSE)),\" \",VLOOKUP(I327,Eje_Pilar!$C$2:$E$47,3,FALSE))","v":" "},null,null,null,null,null,null,null,null,{"$f":"+O327+Q327+S327","v":0},null,null,null,null,null,null,null,null,null,null,null,"-",null,{"$f":"IF(SUMPRODUCT((A$14:A327=A327)*(B$14:B327=B327)*(C$14:C327=C327))>1,0,1)","v":0},{"$f":"IFERROR(VLOOKUP(D327,tipo,1,FALSE),\"NO\")","v":"NO"},{"$f":"IFERROR(VLOOKUP(E327,modal,1,FALSE),\"NO\")","v":"NO"},{"$f":"IFERROR(VLOOKUP(F327,Tipo!$C$12:$C$27,1,FALSE),\"NO\")","v":"NO"},{"$f":"IFERROR(VLOOKUP(H327,afectacion,1,FALSE),\"NO\")","v":"NO"},{"$f":"IFERROR(VLOOKUP(I327,programa,1,FALSE),\"NO\")","v":"NO"}]
[null,null,null,null,null,null,null,null,null,{"$f":"IF(ISERROR(VLOOKUP(I328,Eje_Pilar!$C$2:$E$47,2,FALSE)),\" \",VLOOKUP(I328,Eje_Pilar!$C$2:$E$47,2,FALSE))","v":" "},{"$f":"IF(ISERROR(VLOOKUP(I328,Eje_Pilar!$C$2:$E$47,3,FALSE)),\" \",VLOOKUP(I328,Eje_Pilar!$C$2:$E$47,3,FALSE))","v":" "},null,null,null,null,null,null,null,null,{"$f":"+O328+Q328+S328","v":0},null,null,null,null,null,null,null,null,null,null,null,"-",null,{"$f":"IF(SUMPRODUCT((A$14:A328=A328)*(B$14:B328=B328)*(C$14:C328=C328))>1,0,1)","v":0},{"$f":"IFERROR(VLOOKUP(D328,tipo,1,FALSE),\"NO\")","v":"NO"},{"$f":"IFERROR(VLOOKUP(E328,modal,1,FALSE),\"NO\")","v":"NO"},{"$f":"IFERROR(VLOOKUP(F328,Tipo!$C$12:$C$27,1,FALSE),\"NO\")","v":"NO"},{"$f":"IFERROR(VLOOKUP(H328,afectacion,1,FALSE),\"NO\")","v":"NO"},{"$f":"IFERROR(VLOOKUP(I328,programa,1,FALSE),\"NO\")","v":"NO"}]
[null,null,null,null,null,null,null,null,null,{"$f":"IF(ISERROR(VLOOKUP(I329,Eje_Pilar!$C$2:$E$47,2,FALSE)),\" \",VLOOKUP(I329,Eje_Pilar!$C$2:$E$47,2,FALSE))","v":" "},{"$f":"IF(ISERROR(VLOOKUP(I329,Eje_Pilar!$C$2:$E$47,3,FALSE)),\" \",VLOOKUP(I329,Eje_Pilar!$C$2:$E$47,3,FALSE))","v":" "},null,null,null,null,null,null,null,null,{"$f":"+O329+Q329+S329","v":0},null,null,null,null,null,null,null,null,null,null,null,"-",null,{"$f":"IF(SUMPRODUCT((A$14:A329=A329)*(B$14:B329=B329)*(C$14:C329=C329))>1,0,1)","v":0},{"$f":"IFERROR(VLOOKUP(D329,tipo,1,FALSE),\"NO\")","v":"NO"},{"$f":"IFERROR(VLOOKUP(E329,modal,1,FALSE),\"NO\")","v":"NO"},{"$f":"IFERROR(VLOOKUP(F329,Tipo!$C$12:$C$27,1,FALSE),\"NO\")","v":"NO"},{"$f":"IFERROR(VLOOKUP(H329,afectacion,1,FALSE),\"NO\")","v":"NO"},{"$f":"IFERROR(VLOOKUP(I329,programa,1,FALSE),\"NO\")","v":"NO"}]
[null,null,null,null,null,null,null,null,null,{"$f":"IF(ISERROR(VLOOKUP(I330,Eje_Pilar!$C$2:$E$47,2,FALSE)),\" \",VLOOKUP(I330,Eje_Pilar!$C$2:$E$47,2,FALSE))","v":" "},{"$f":"IF(ISERROR(VLOOKUP(I330,Eje_Pilar!$C$2:$E$47,3,FALSE)),\" \",VLOOKUP(I330,Eje_Pilar!$C$2:$E$47,3,FALSE))","v":" "},null,null,null,null,null,null,null,null,{"$f":"+O330+Q330+S330","v":0},null,null,null,null,null,null,null,null,null,null,null,"-",null,{"$f":"IF(SUMPRODUCT((A$14:A330=A330)*(B$14:B330=B330)*(C$14:C330=C330))>1,0,1)","v":0},{"$f":"IFERROR(VLOOKUP(D330,tipo,1,FALSE),\"NO\")","v":"NO"},{"$f":"IFERROR(VLOOKUP(E330,modal,1,FALSE),\"NO\")","v":"NO"},{"$f":"IFERROR(VLOOKUP(F330,Tipo!$C$12:$C$27,1,FALSE),\"NO\")","v":"NO"},{"$f":"IFERROR(VLOOKUP(H330,afectacion,1,FALSE),\"NO\")","v":"NO"},{"$f":"IFERROR(VLOOKUP(I330,programa,1,FALSE),\"NO\")","v":"NO"}]
[null,null,null,null,null,null,null,null,null,{"$f":"IF(ISERROR(VLOOKUP(I331,Eje_Pilar!$C$2:$E$47,2,FALSE)),\" \",VLOOKUP(I331,Eje_Pilar!$C$2:$E$47,2,FALSE))","v":" "},{"$f":"IF(ISERROR(VLOOKUP(I331,Eje_Pilar!$C$2:$E$47,3,FALSE)),\" \",VLOOKUP(I331,Eje_Pilar!$C$2:$E$47,3,FALSE))","v":" "},null,null,null,null,null,null,null,null,{"$f":"+O331+Q331+S331","v":0},null,null,null,null,null,null,null,null,null,null,null,"-",null,{"$f":"IF(SUMPRODUCT((A$14:A331=A331)*(B$14:B331=B331)*(C$14:C331=C331))>1,0,1)","v":0},{"$f":"IFERROR(VLOOKUP(D331,tipo,1,FALSE),\"NO\")","v":"NO"},{"$f":"IFERROR(VLOOKUP(E331,modal,1,FALSE),\"NO\")","v":"NO"},{"$f":"IFERROR(VLOOKUP(F331,Tipo!$C$12:$C$27,1,FALSE),\"NO\")","v":"NO"},{"$f":"IFERROR(VLOOKUP(H331,afectacion,1,FALSE),\"NO\")","v":"NO"},{"$f":"IFERROR(VLOOKUP(I331,programa,1,FALSE),\"NO\")","v":"NO"}]
[null,null,null,null,null,null,null,null,null,{"$f":"IF(ISERROR(VLOOKUP(I332,Eje_Pilar!$C$2:$E$47,2,FALSE)),\" \",VLOOKUP(I332,Eje_Pilar!$C$2:$E$47,2,FALSE))","v":" "},{"$f":"IF(ISERROR(VLOOKUP(I332,Eje_Pilar!$C$2:$E$47,3,FALSE)),\" \",VLOOKUP(I332,Eje_Pilar!$C$2:$E$47,3,FALSE))","v":" "},null,null,null,null,null,null,null,null,{"$f":"+O332+Q332+S332","v":0},null,null,null,null,null,null,null,null,null,null,null,"-",null,{"$f":"IF(SUMPRODUCT((A$14:A332=A332)*(B$14:B332=B332)*(C$14:C332=C332))>1,0,1)","v":0},{"$f":"IFERROR(VLOOKUP(D332,tipo,1,FALSE),\"NO\")","v":"NO"},{"$f":"IFERROR(VLOOKUP(E332,modal,1,FALSE),\"NO\")","v":"NO"},{"$f":"IFERROR(VLOOKUP(F332,Tipo!$C$12:$C$27,1,FALSE),\"NO\")","v":"NO"},{"$f":"IFERROR(VLOOKUP(H332,afectacion,1,FALSE),\"NO\")","v":"NO"},{"$f":"IFERROR(VLOOKUP(I332,programa,1,FALSE),\"NO\")","v":"NO"}]
[null,null,null,null,null,null,null,null,null,{"$f":"IF(ISERROR(VLOOKUP(I333,Eje_Pilar!$C$2:$E$47,2,FALSE)),\" \",VLOOKUP(I333,Eje_Pilar!$C$2:$E$47,2,FALSE))","v":" "},{"$f":"IF(ISERROR(VLOOKUP(I333,Eje_Pilar!$C$2:$E$47,3,FALSE)),\" \",VLOOKUP(I333,Eje_Pilar!$C$2:$E$47,3,FALSE))","v":" "},null,null,null,null,null,null,null,null,{"$f":"+O333+Q333+S333","v":0},null,null,null,null,null,null,null,null,null,null,null,"-",null,{"$f":"IF(SUMPRODUCT((A$14:A333=A333)*(B$14:B333=B333)*(C$14:C333=C333))>1,0,1)","v":0},{"$f":"IFERROR(VLOOKUP(D333,tipo,1,FALSE),\"NO\")","v":"NO"},{"$f":"IFERROR(VLOOKUP(E333,modal,1,FALSE),\"NO\")","v":"NO"},{"$f":"IFERROR(VLOOKUP(F333,Tipo!$C$12:$C$27,1,FALSE),\"NO\")","v":"NO"},{"$f":"IFERROR(VLOOKUP(H333,afectacion,1,FALSE),\"NO\")","v":"NO"},{"$f":"IFERROR(VLOOKUP(I333,programa,1,FALSE),\"NO\")","v":"NO"}]
[null,null,null,null,null,null,null,null,null,{"$f":"IF(ISERROR(VLOOKUP(I334,Eje_Pilar!$C$2:$E$47,2,FALSE)),\" \",VLOOKUP(I334,Eje_Pilar!$C$2:$E$47,2,FALSE))","v":" "},{"$f":"IF(ISERROR(VLOOKUP(I334,Eje_Pilar!$C$2:$E$47,3,FALSE)),\" \",VLOOKUP(I334,Eje_Pilar!$C$2:$E$47,3,FALSE))","v":" "},null,null,null,null,null,null,null,null,{"$f":"+O334+Q334+S334","v":0},null,null,null,null,null,null,null,null,null,null,null,"-",null,{"$f":"IF(SUMPRODUCT((A$14:A334=A334)*(B$14:B334=B334)*(C$14:C334=C334))>1,0,1)","v":0},{"$f":"IFERROR(VLOOKUP(D334,tipo,1,FALSE),\"NO\")","v":"NO"},{"$f":"IFERROR(VLOOKUP(E334,modal,1,FALSE),\"NO\")","v":"NO"},{"$f":"IFERROR(VLOOKUP(F334,Tipo!$C$12:$C$27,1,FALSE),\"NO\")","v":"NO"},{"$f":"IFERROR(VLOOKUP(H334,afectacion,1,FALSE),\"NO\")","v":"NO"},{"$f":"IFERROR(VLOOKUP(I334,programa,1,FALSE),\"NO\")","v":"NO"}]
[null,null,null,null,null,null,null,null,null,{"$f":"IF(ISERROR(VLOOKUP(I335,Eje_Pilar!$C$2:$E$47,2,FALSE)),\" \",VLOOKUP(I335,Eje_Pilar!$C$2:$E$47,2,FALSE))","v":" "},{"$f":"IF(ISERROR(VLOOKUP(I335,Eje_Pilar!$C$2:$E$47,3,FALSE)),\" \",VLOOKUP(I335,Eje_Pilar!$C$2:$E$47,3,FALSE))","v":" "},null,null,null,null,null,null,null,null,{"$f":"+O335+Q335+S335","v":0},null,null,null,null,null,null,null,null,null,null,null,"-",null,{"$f":"IF(SUMPRODUCT((A$14:A335=A335)*(B$14:B335=B335)*(C$14:C335=C335))>1,0,1)","v":0},{"$f":"IFERROR(VLOOKUP(D335,tipo,1,FALSE),\"NO\")","v":"NO"},{"$f":"IFERROR(VLOOKUP(E335,modal,1,FALSE),\"NO\")","v":"NO"},{"$f":"IFERROR(VLOOKUP(F335,Tipo!$C$12:$C$27,1,FALSE),\"NO\")","v":"NO"},{"$f":"IFERROR(VLOOKUP(H335,afectacion,1,FALSE),\"NO\")","v":"NO"},{"$f":"IFERROR(VLOOKUP(I335,programa,1,FALSE),\"NO\")","v":"NO"}]
[null,null,null,null,null,null,null,null,null,{"$f":"IF(ISERROR(VLOOKUP(I336,Eje_Pilar!$C$2:$E$47,2,FALSE)),\" \",VLOOKUP(I336,Eje_Pilar!$C$2:$E$47,2,FALSE))","v":" "},{"$f":"IF(ISERROR(VLOOKUP(I336,Eje_Pilar!$C$2:$E$47,3,FALSE)),\" \",VLOOKUP(I336,Eje_Pilar!$C$2:$E$47,3,FALSE))","v":" "},null,null,null,null,null,null,null,null,{"$f":"+O336+Q336+S336","v":0},null,null,null,null,null,null,null,null,null,null,null,"-",null,{"$f":"IF(SUMPRODUCT((A$14:A336=A336)*(B$14:B336=B336)*(C$14:C336=C336))>1,0,1)","v":0},{"$f":"IFERROR(VLOOKUP(D336,tipo,1,FALSE),\"NO\")","v":"NO"},{"$f":"IFERROR(VLOOKUP(E336,modal,1,FALSE),\"NO\")","v":"NO"},{"$f":"IFERROR(VLOOKUP(F336,Tipo!$C$12:$C$27,1,FALSE),\"NO\")","v":"NO"},{"$f":"IFERROR(VLOOKUP(H336,afectacion,1,FALSE),\"NO\")","v":"NO"},{"$f":"IFERROR(VLOOKUP(I336,programa,1,FALSE),\"NO\")","v":"NO"}]
[null,null,null,null,null,null,null,null,null,{"$f":"IF(ISERROR(VLOOKUP(I337,Eje_Pilar!$C$2:$E$47,2,FALSE)),\" \",VLOOKUP(I337,Eje_Pilar!$C$2:$E$47,2,FALSE))","v":" "},{"$f":"IF(ISERROR(VLOOKUP(I337,Eje_Pilar!$C$2:$E$47,3,FALSE)),\" \",VLOOKUP(I337,Eje_Pilar!$C$2:$E$47,3,FALSE))","v":" "},null,null,null,null,null,null,null,null,{"$f":"+O337+Q337+S337","v":0},null,null,null,null,null,null,null,null,null,null,null,"-",null,{"$f":"IF(SUMPRODUCT((A$14:A337=A337)*(B$14:B337=B337)*(C$14:C337=C337))>1,0,1)","v":0},{"$f":"IFERROR(VLOOKUP(D337,tipo,1,FALSE),\"NO\")","v":"NO"},{"$f":"IFERROR(VLOOKUP(E337,modal,1,FALSE),\"NO\")","v":"NO"},{"$f":"IFERROR(VLOOKUP(F337,Tipo!$C$12:$C$27,1,FALSE),\"NO\")","v":"NO"},{"$f":"IFERROR(VLOOKUP(H337,afectacion,1,FALSE),\"NO\")","v":"NO"},{"$f":"IFERROR(VLOOKUP(I337,programa,1,FALSE),\"NO\")","v":"NO"}]
[null,null,null,null,null,null,null,null,null,{"$f":"IF(ISERROR(VLOOKUP(I338,Eje_Pilar!$C$2:$E$47,2,FALSE)),\" \",VLOOKUP(I338,Eje_Pilar!$C$2:$E$47,2,FALSE))","v":" "},{"$f":"IF(ISERROR(VLOOKUP(I338,Eje_Pilar!$C$2:$E$47,3,FALSE)),\" \",VLOOKUP(I338,Eje_Pilar!$C$2:$E$47,3,FALSE))","v":" "},null,null,null,null,null,null,null,null,{"$f":"+O338+Q338+S338","v":0},null,null,null,null,null,null,null,null,null,null,null,"-",null,{"$f":"IF(SUMPRODUCT((A$14:A338=A338)*(B$14:B338=B338)*(C$14:C338=C338))>1,0,1)","v":0},{"$f":"IFERROR(VLOOKUP(D338,tipo,1,FALSE),\"NO\")","v":"NO"},{"$f":"IFERROR(VLOOKUP(E338,modal,1,FALSE),\"NO\")","v":"NO"},{"$f":"IFERROR(VLOOKUP(F338,Tipo!$C$12:$C$27,1,FALSE),\"NO\")","v":"NO"},{"$f":"IFERROR(VLOOKUP(H338,afectacion,1,FALSE),\"NO\")","v":"NO"},{"$f":"IFERROR(VLOOKUP(I338,programa,1,FALSE),\"NO\")","v":"NO"}]
[null,null,null,null,null,null,null,null,null,{"$f":"IF(ISERROR(VLOOKUP(I339,Eje_Pilar!$C$2:$E$47,2,FALSE)),\" \",VLOOKUP(I339,Eje_Pilar!$C$2:$E$47,2,FALSE))","v":" "},{"$f":"IF(ISERROR(VLOOKUP(I339,Eje_Pilar!$C$2:$E$47,3,FALSE)),\" \",VLOOKUP(I339,Eje_Pilar!$C$2:$E$47,3,FALSE))","v":" "},null,null,null,null,null,null,null,null,{"$f":"+O339+Q339+S339","v":0},null,null,null,null,null,null,null,null,null,null,null,"-",null,{"$f":"IF(SUMPRODUCT((A$14:A339=A339)*(B$14:B339=B339)*(C$14:C339=C339))>1,0,1)","v":0},{"$f":"IFERROR(VLOOKUP(D339,tipo,1,FALSE),\"NO\")","v":"NO"},{"$f":"IFERROR(VLOOKUP(E339,modal,1,FALSE),\"NO\")","v":"NO"},{"$f":"IFERROR(VLOOKUP(F339,Tipo!$C$12:$C$27,1,FALSE),\"NO\")","v":"NO"},{"$f":"IFERROR(VLOOKUP(H339,afectacion,1,FALSE),\"NO\")","v":"NO"},{"$f":"IFERROR(VLOOKUP(I339,programa,1,FALSE),\"NO\")","v":"NO"}]
[null,null,null,null,null,null,null,null,null,{"$f":"IF(ISERROR(VLOOKUP(I340,Eje_Pilar!$C$2:$E$47,2,FALSE)),\" \",VLOOKUP(I340,Eje_Pilar!$C$2:$E$47,2,FALSE))","v":" "},{"$f":"IF(ISERROR(VLOOKUP(I340,Eje_Pilar!$C$2:$E$47,3,FALSE)),\" \",VLOOKUP(I340,Eje_Pilar!$C$2:$E$47,3,FALSE))","v":" "},null,null,null,null,null,null,null,null,{"$f":"+O340+Q340+S340","v":0},null,null,null,null,null,null,null,null,null,null,null,"-",null,{"$f":"IF(SUMPRODUCT((A$14:A340=A340)*(B$14:B340=B340)*(C$14:C340=C340))>1,0,1)","v":0},{"$f":"IFERROR(VLOOKUP(D340,tipo,1,FALSE),\"NO\")","v":"NO"},{"$f":"IFERROR(VLOOKUP(E340,modal,1,FALSE),\"NO\")","v":"NO"},{"$f":"IFERROR(VLOOKUP(F340,Tipo!$C$12:$C$27,1,FALSE),\"NO\")","v":"NO"},{"$f":"IFERROR(VLOOKUP(H340,afectacion,1,FALSE),\"NO\")","v":"NO"},{"$f":"IFERROR(VLOOKUP(I340,programa,1,FALSE),\"NO\")","v":"NO"}]
[null,null,null,null,null,null,null,null,null,{"$f":"IF(ISERROR(VLOOKUP(I341,Eje_Pilar!$C$2:$E$47,2,FALSE)),\" \",VLOOKUP(I341,Eje_Pilar!$C$2:$E$47,2,FALSE))","v":" "},{"$f":"IF(ISERROR(VLOOKUP(I341,Eje_Pilar!$C$2:$E$47,3,FALSE)),\" \",VLOOKUP(I341,Eje_Pilar!$C$2:$E$47,3,FALSE))","v":" "},null,null,null,null,null,null,null,null,{"$f":"+O341+Q341+S341","v":0},null,null,null,null,null,null,null,null,null,null,null,"-",null,{"$f":"IF(SUMPRODUCT((A$14:A341=A341)*(B$14:B341=B341)*(C$14:C341=C341))>1,0,1)","v":0},{"$f":"IFERROR(VLOOKUP(D341,tipo,1,FALSE),\"NO\")","v":"NO"},{"$f":"IFERROR(VLOOKUP(E341,modal,1,FALSE),\"NO\")","v":"NO"},{"$f":"IFERROR(VLOOKUP(F341,Tipo!$C$12:$C$27,1,FALSE),\"NO\")","v":"NO"},{"$f":"IFERROR(VLOOKUP(H341,afectacion,1,FALSE),\"NO\")","v":"NO"},{"$f":"IFERROR(VLOOKUP(I341,programa,1,FALSE),\"NO\")","v":"NO"}]
[null,null,null,null,null,null,null,null,null,{"$f":"IF(ISERROR(VLOOKUP(I342,Eje_Pilar!$C$2:$E$47,2,FALSE)),\" \",VLOOKUP(I342,Eje_Pilar!$C$2:$E$47,2,FALSE))","v":" "},{"$f":"IF(ISERROR(VLOOKUP(I342,Eje_Pilar!$C$2:$E$47,3,FALSE)),\" \",VLOOKUP(I342,Eje_Pilar!$C$2:$E$47,3,FALSE))","v":" "},null,null,null,null,null,null,null,null,{"$f":"+O342+Q342+S342","v":0},null,null,null,null,null,null,null,null,null,null,null,"-",null,{"$f":"IF(SUMPRODUCT((A$14:A342=A342)*(B$14:B342=B342)*(C$14:C342=C342))>1,0,1)","v":0},{"$f":"IFERROR(VLOOKUP(D342,tipo,1,FALSE),\"NO\")","v":"NO"},{"$f":"IFERROR(VLOOKUP(E342,modal,1,FALSE),\"NO\")","v":"NO"},{"$f":"IFERROR(VLOOKUP(F342,Tipo!$C$12:$C$27,1,FALSE),\"NO\")","v":"NO"},{"$f":"IFERROR(VLOOKUP(H342,afectacion,1,FALSE),\"NO\")","v":"NO"},{"$f":"IFERROR(VLOOKUP(I342,programa,1,FALSE),\"NO\")","v":"NO"}]
[null,null,null,null,null,null,null,null,null,{"$f":"IF(ISERROR(VLOOKUP(I343,Eje_Pilar!$C$2:$E$47,2,FALSE)),\" \",VLOOKUP(I343,Eje_Pilar!$C$2:$E$47,2,FALSE))","v":" "},{"$f":"IF(ISERROR(VLOOKUP(I343,Eje_Pilar!$C$2:$E$47,3,FALSE)),\" \",VLOOKUP(I343,Eje_Pilar!$C$2:$E$47,3,FALSE))","v":" "},null,null,null,null,null,null,null,null,{"$f":"+O343+Q343+S343","v":0},null,null,null,null,null,null,null,null,null,null,null,"-",null,{"$f":"IF(SUMPRODUCT((A$14:A343=A343)*(B$14:B343=B343)*(C$14:C343=C343))>1,0,1)","v":0},{"$f":"IFERROR(VLOOKUP(D343,tipo,1,FALSE),\"NO\")","v":"NO"},{"$f":"IFERROR(VLOOKUP(E343,modal,1,FALSE),\"NO\")","v":"NO"},{"$f":"IFERROR(VLOOKUP(F343,Tipo!$C$12:$C$27,1,FALSE),\"NO\")","v":"NO"},{"$f":"IFERROR(VLOOKUP(H343,afectacion,1,FALSE),\"NO\")","v":"NO"},{"$f":"IFERROR(VLOOKUP(I343,programa,1,FALSE),\"NO\")","v":"NO"}]
[null,null,null,null,null,null,null,null,null,{"$f":"IF(ISERROR(VLOOKUP(I344,Eje_Pilar!$C$2:$E$47,2,FALSE)),\" \",VLOOKUP(I344,Eje_Pilar!$C$2:$E$47,2,FALSE))","v":" "},{"$f":"IF(ISERROR(VLOOKUP(I344,Eje_Pilar!$C$2:$E$47,3,FALSE)),\" \",VLOOKUP(I344,Eje_Pilar!$C$2:$E$47,3,FALSE))","v":" "},null,null,null,null,null,null,null,null,{"$f":"+O344+Q344+S344","v":0},null,null,null,null,null,null,null,null,null,null,null,"-",null,{"$f":"IF(SUMPRODUCT((A$14:A344=A344)*(B$14:B344=B344)*(C$14:C344=C344))>1,0,1)","v":0},{"$f":"IFERROR(VLOOKUP(D344,tipo,1,FALSE),\"NO\")","v":"NO"},{"$f":"IFERROR(VLOOKUP(E344,modal,1,FALSE),\"NO\")","v":"NO"},{"$f":"IFERROR(VLOOKUP(F344,Tipo!$C$12:$C$27,1,FALSE),\"NO\")","v":"NO"},{"$f":"IFERROR(VLOOKUP(H344,afectacion,1,FALSE),\"NO\")","v":"NO"},{"$f":"IFERROR(VLOOKUP(I344,programa,1,FALSE),\"NO\")","v":"NO"}]
[null,null,null,null,null,null,null,null,null,{"$f":"IF(ISERROR(VLOOKUP(I345,Eje_Pilar!$C$2:$E$47,2,FALSE)),\" \",VLOOKUP(I345,Eje_Pilar!$C$2:$E$47,2,FALSE))","v":" "},{"$f":"IF(ISERROR(VLOOKUP(I345,Eje_Pilar!$C$2:$E$47,3,FALSE)),\" \",VLOOKUP(I345,Eje_Pilar!$C$2:$E$47,3,FALSE))","v":" "},null,null,null,null,null,null,null,null,{"$f":"+O345+Q345+S345","v":0},null,null,null,null,null,null,null,null,null,null,null,"-",null,{"$f":"IF(SUMPRODUCT((A$14:A345=A345)*(B$14:B345=B345)*(C$14:C345=C345))>1,0,1)","v":0},{"$f":"IFERROR(VLOOKUP(D345,tipo,1,FALSE),\"NO\")","v":"NO"},{"$f":"IFERROR(VLOOKUP(E345,modal,1,FALSE),\"NO\")","v":"NO"},{"$f":"IFERROR(VLOOKUP(F345,Tipo!$C$12:$C$27,1,FALSE),\"NO\")","v":"NO"},{"$f":"IFERROR(VLOOKUP(H345,afectacion,1,FALSE),\"NO\")","v":"NO"},{"$f":"IFERROR(VLOOKUP(I345,programa,1,FALSE),\"NO\")","v":"NO"}]
[null,null,null,null,null,null,null,null,null,{"$f":"IF(ISERROR(VLOOKUP(I346,Eje_Pilar!$C$2:$E$47,2,FALSE)),\" \",VLOOKUP(I346,Eje_Pilar!$C$2:$E$47,2,FALSE))","v":" "},{"$f":"IF(ISERROR(VLOOKUP(I346,Eje_Pilar!$C$2:$E$47,3,FALSE)),\" \",VLOOKUP(I346,Eje_Pilar!$C$2:$E$47,3,FALSE))","v":" "},null,null,null,null,null,null,null,null,{"$f":"+O346+Q346+S346","v":0},null,null,null,null,null,null,null,null,null,null,null,"-",null,{"$f":"IF(SUMPRODUCT((A$14:A346=A346)*(B$14:B346=B346)*(C$14:C346=C346))>1,0,1)","v":0},{"$f":"IFERROR(VLOOKUP(D346,tipo,1,FALSE),\"NO\")","v":"NO"},{"$f":"IFERROR(VLOOKUP(E346,modal,1,FALSE),\"NO\")","v":"NO"},{"$f":"IFERROR(VLOOKUP(F346,Tipo!$C$12:$C$27,1,FALSE),\"NO\")","v":"NO"},{"$f":"IFERROR(VLOOKUP(H346,afectacion,1,FALSE),\"NO\")","v":"NO"},{"$f":"IFERROR(VLOOKUP(I346,programa,1,FALSE),\"NO\")","v":"NO"}]
[null,null,null,null,null,null,null,null,null,{"$f":"IF(ISERROR(VLOOKUP(I347,Eje_Pilar!$C$2:$E$47,2,FALSE)),\" \",VLOOKUP(I347,Eje_Pilar!$C$2:$E$47,2,FALSE))","v":" "},{"$f":"IF(ISERROR(VLOOKUP(I347,Eje_Pilar!$C$2:$E$47,3,FALSE)),\" \",VLOOKUP(I347,Eje_Pilar!$C$2:$E$47,3,FALSE))","v":" "},null,null,null,null,null,null,null,null,{"$f":"+O347+Q347+S347","v":0},null,null,null,null,null,null,null,null,null,null,null,"-",null,{"$f":"IF(SUMPRODUCT((A$14:A347=A347)*(B$14:B347=B347)*(C$14:C347=C347))>1,0,1)","v":0},{"$f":"IFERROR(VLOOKUP(D347,tipo,1,FALSE),\"NO\")","v":"NO"},{"$f":"IFERROR(VLOOKUP(E347,modal,1,FALSE),\"NO\")","v":"NO"},{"$f":"IFERROR(VLOOKUP(F347,Tipo!$C$12:$C$27,1,FALSE),\"NO\")","v":"NO"},{"$f":"IFERROR(VLOOKUP(H347,afectacion,1,FALSE),\"NO\")","v":"NO"},{"$f":"IFERROR(VLOOKUP(I347,programa,1,FALSE),\"NO\")","v":"NO"}]
[null,null,null,null,null,null,null,null,null,{"$f":"IF(ISERROR(VLOOKUP(I348,Eje_Pilar!$C$2:$E$47,2,FALSE)),\" \",VLOOKUP(I348,Eje_Pilar!$C$2:$E$47,2,FALSE))","v":" "},{"$f":"IF(ISERROR(VLOOKUP(I348,Eje_Pilar!$C$2:$E$47,3,FALSE)),\" \",VLOOKUP(I348,Eje_Pilar!$C$2:$E$47,3,FALSE))","v":" "},null,null,null,null,null,null,null,null,{"$f":"+O348+Q348+S348","v":0},null,null,null,null,null,null,null,null,null,null,null,"-",null,{"$f":"IF(SUMPRODUCT((A$14:A348=A348)*(B$14:B348=B348)*(C$14:C348=C348))>1,0,1)","v":0},{"$f":"IFERROR(VLOOKUP(D348,tipo,1,FALSE),\"NO\")","v":"NO"},{"$f":"IFERROR(VLOOKUP(E348,modal,1,FALSE),\"NO\")","v":"NO"},{"$f":"IFERROR(VLOOKUP(F348,Tipo!$C$12:$C$27,1,FALSE),\"NO\")","v":"NO"},{"$f":"IFERROR(VLOOKUP(H348,afectacion,1,FALSE),\"NO\")","v":"NO"},{"$f":"IFERROR(VLOOKUP(I348,programa,1,FALSE),\"NO\")","v":"NO"}]
[null,null,null,null,null,null,null,null,null,{"$f":"IF(ISERROR(VLOOKUP(I349,Eje_Pilar!$C$2:$E$47,2,FALSE)),\" \",VLOOKUP(I349,Eje_Pilar!$C$2:$E$47,2,FALSE))","v":" "},{"$f":"IF(ISERROR(VLOOKUP(I349,Eje_Pilar!$C$2:$E$47,3,FALSE)),\" \",VLOOKUP(I349,Eje_Pilar!$C$2:$E$47,3,FALSE))","v":" "},null,null,null,null,null,null,null,null,{"$f":"+O349+Q349+S349","v":0},null,null,null,null,null,null,null,null,null,null,null,"-",null,{"$f":"IF(SUMPRODUCT((A$14:A349=A349)*(B$14:B349=B349)*(C$14:C349=C349))>1,0,1)","v":0},{"$f":"IFERROR(VLOOKUP(D349,tipo,1,FALSE),\"NO\")","v":"NO"},{"$f":"IFERROR(VLOOKUP(E349,modal,1,FALSE),\"NO\")","v":"NO"},{"$f":"IFERROR(VLOOKUP(F349,Tipo!$C$12:$C$27,1,FALSE),\"NO\")","v":"NO"},{"$f":"IFERROR(VLOOKUP(H349,afectacion,1,FALSE),\"NO\")","v":"NO"},{"$f":"IFERROR(VLOOKUP(I349,programa,1,FALSE),\"NO\")","v":"NO"}]
[null,null,null,null,null,null,null,null,null,{"$f":"IF(ISERROR(VLOOKUP(I350,Eje_Pilar!$C$2:$E$47,2,FALSE)),\" \",VLOOKUP(I350,Eje_Pilar!$C$2:$E$47,2,FALSE))","v":" "},{"$f":"IF(ISERROR(VLOOKUP(I350,Eje_Pilar!$C$2:$E$47,3,FALSE)),\" \",VLOOKUP(I350,Eje_Pilar!$C$2:$E$47,3,FALSE))","v":" "},null,null,null,null,null,null,null,null,{"$f":"+O350+Q350+S350","v":0},null,null,null,null,null,null,null,null,null,null,null,"-",null,{"$f":"IF(SUMPRODUCT((A$14:A350=A350)*(B$14:B350=B350)*(C$14:C350=C350))>1,0,1)","v":0},{"$f":"IFERROR(VLOOKUP(D350,tipo,1,FALSE),\"NO\")","v":"NO"},{"$f":"IFERROR(VLOOKUP(E350,modal,1,FALSE),\"NO\")","v":"NO"},{"$f":"IFERROR(VLOOKUP(F350,Tipo!$C$12:$C$27,1,FALSE),\"NO\")","v":"NO"},{"$f":"IFERROR(VLOOKUP(H350,afectacion,1,FALSE),\"NO\")","v":"NO"},{"$f":"IFERROR(VLOOKUP(I350,programa,1,FALSE),\"NO\")","v":"NO"}]
[null,null,null,null,null,null,null,null,null,{"$f":"IF(ISERROR(VLOOKUP(I351,Eje_Pilar!$C$2:$E$47,2,FALSE)),\" \",VLOOKUP(I351,Eje_Pilar!$C$2:$E$47,2,FALSE))","v":" "},{"$f":"IF(ISERROR(VLOOKUP(I351,Eje_Pilar!$C$2:$E$47,3,FALSE)),\" \",VLOOKUP(I351,Eje_Pilar!$C$2:$E$47,3,FALSE))","v":" "},null,null,null,null,null,null,null,null,{"$f":"+O351+Q351+S351","v":0},null,null,null,null,null,null,null,null,null,null,null,"-",null,{"$f":"IF(SUMPRODUCT((A$14:A351=A351)*(B$14:B351=B351)*(C$14:C351=C351))>1,0,1)","v":0},{"$f":"IFERROR(VLOOKUP(D351,tipo,1,FALSE),\"NO\")","v":"NO"},{"$f":"IFERROR(VLOOKUP(E351,modal,1,FALSE),\"NO\")","v":"NO"},{"$f":"IFERROR(VLOOKUP(F351,Tipo!$C$12:$C$27,1,FALSE),\"NO\")","v":"NO"},{"$f":"IFERROR(VLOOKUP(H351,afectacion,1,FALSE),\"NO\")","v":"NO"},{"$f":"IFERROR(VLOOKUP(I351,programa,1,FALSE),\"NO\")","v":"NO"}]
[null,null,null,null,null,null,null,null,null,{"$f":"IF(ISERROR(VLOOKUP(I352,Eje_Pilar!$C$2:$E$47,2,FALSE)),\" \",VLOOKUP(I352,Eje_Pilar!$C$2:$E$47,2,FALSE))","v":" "},{"$f":"IF(ISERROR(VLOOKUP(I352,Eje_Pilar!$C$2:$E$47,3,FALSE)),\" \",VLOOKUP(I352,Eje_Pilar!$C$2:$E$47,3,FALSE))","v":" "},null,null,null,null,null,null,null,null,{"$f":"+O352+Q352+S352","v":0},null,null,null,null,null,null,null,null,null,null,null,"-",null,{"$f":"IF(SUMPRODUCT((A$14:A352=A352)*(B$14:B352=B352)*(C$14:C352=C352))>1,0,1)","v":0},{"$f":"IFERROR(VLOOKUP(D352,tipo,1,FALSE),\"NO\")","v":"NO"},{"$f":"IFERROR(VLOOKUP(E352,modal,1,FALSE),\"NO\")","v":"NO"},{"$f":"IFERROR(VLOOKUP(F352,Tipo!$C$12:$C$27,1,FALSE),\"NO\")","v":"NO"},{"$f":"IFERROR(VLOOKUP(H352,afectacion,1,FALSE),\"NO\")","v":"NO"},{"$f":"IFERROR(VLOOKUP(I352,programa,1,FALSE),\"NO\")","v":"NO"}]
[null,null,null,null,null,null,null,null,null,{"$f":"IF(ISERROR(VLOOKUP(I353,Eje_Pilar!$C$2:$E$47,2,FALSE)),\" \",VLOOKUP(I353,Eje_Pilar!$C$2:$E$47,2,FALSE))","v":" "},{"$f":"IF(ISERROR(VLOOKUP(I353,Eje_Pilar!$C$2:$E$47,3,FALSE)),\" \",VLOOKUP(I353,Eje_Pilar!$C$2:$E$47,3,FALSE))","v":" "},null,null,null,null,null,null,null,null,{"$f":"+O353+Q353+S353","v":0},null,null,null,null,null,null,null,null,null,null,null,"-",null,{"$f":"IF(SUMPRODUCT((A$14:A353=A353)*(B$14:B353=B353)*(C$14:C353=C353))>1,0,1)","v":0},{"$f":"IFERROR(VLOOKUP(D353,tipo,1,FALSE),\"NO\")","v":"NO"},{"$f":"IFERROR(VLOOKUP(E353,modal,1,FALSE),\"NO\")","v":"NO"},{"$f":"IFERROR(VLOOKUP(F353,Tipo!$C$12:$C$27,1,FALSE),\"NO\")","v":"NO"},{"$f":"IFERROR(VLOOKUP(H353,afectacion,1,FALSE),\"NO\")","v":"NO"},{"$f":"IFERROR(VLOOKUP(I353,programa,1,FALSE),\"NO\")","v":"NO"}]
[null,null,null,null,null,null,null,null,null,{"$f":"IF(ISERROR(VLOOKUP(I354,Eje_Pilar!$C$2:$E$47,2,FALSE)),\" \",VLOOKUP(I354,Eje_Pilar!$C$2:$E$47,2,FALSE))","v":" "},{"$f":"IF(ISERROR(VLOOKUP(I354,Eje_Pilar!$C$2:$E$47,3,FALSE)),\" \",VLOOKUP(I354,Eje_Pilar!$C$2:$E$47,3,FALSE))","v":" "},null,null,null,null,null,null,null,null,{"$f":"+O354+Q354+S354","v":0},null,null,null,null,null,null,null,null,null,null,null,"-",null,{"$f":"IF(SUMPRODUCT((A$14:A354=A354)*(B$14:B354=B354)*(C$14:C354=C354))>1,0,1)","v":0},{"$f":"IFERROR(VLOOKUP(D354,tipo,1,FALSE),\"NO\")","v":"NO"},{"$f":"IFERROR(VLOOKUP(E354,modal,1,FALSE),\"NO\")","v":"NO"},{"$f":"IFERROR(VLOOKUP(F354,Tipo!$C$12:$C$27,1,FALSE),\"NO\")","v":"NO"},{"$f":"IFERROR(VLOOKUP(H354,afectacion,1,FALSE),\"NO\")","v":"NO"},{"$f":"IFERROR(VLOOKUP(I354,programa,1,FALSE),\"NO\")","v":"NO"}]
[null,null,null,null,null,null,null,null,null,{"$f":"IF(ISERROR(VLOOKUP(I355,Eje_Pilar!$C$2:$E$47,2,FALSE)),\" \",VLOOKUP(I355,Eje_Pilar!$C$2:$E$47,2,FALSE))","v":" "},{"$f":"IF(ISERROR(VLOOKUP(I355,Eje_Pilar!$C$2:$E$47,3,FALSE)),\" \",VLOOKUP(I355,Eje_Pilar!$C$2:$E$47,3,FALSE))","v":" "},null,null,null,null,null,null,null,null,{"$f":"+O355+Q355+S355","v":0},null,null,null,null,null,null,null,null,null,null,null,"-",null,{"$f":"IF(SUMPRODUCT((A$14:A355=A355)*(B$14:B355=B355)*(C$14:C355=C355))>1,0,1)","v":0},{"$f":"IFERROR(VLOOKUP(D355,tipo,1,FALSE),\"NO\")","v":"NO"},{"$f":"IFERROR(VLOOKUP(E355,modal,1,FALSE),\"NO\")","v":"NO"},{"$f":"IFERROR(VLOOKUP(F355,Tipo!$C$12:$C$27,1,FALSE),\"NO\")","v":"NO"},{"$f":"IFERROR(VLOOKUP(H355,afectacion,1,FALSE),\"NO\")","v":"NO"},{"$f":"IFERROR(VLOOKUP(I355,programa,1,FALSE),\"NO\")","v":"NO"}]
[null,null,null,null,null,null,null,null,null,{"$f":"IF(ISERROR(VLOOKUP(I356,Eje_Pilar!$C$2:$E$47,2,FALSE)),\" \",VLOOKUP(I356,Eje_Pilar!$C$2:$E$47,2,FALSE))","v":" "},{"$f":"IF(ISERROR(VLOOKUP(I356,Eje_Pilar!$C$2:$E$47,3,FALSE)),\" \",VLOOKUP(I356,Eje_Pilar!$C$2:$E$47,3,FALSE))","v":" "},null,null,null,null,null,null,null,null,{"$f":"+O356+Q356+S356","v":0},null,null,null,null,null,null,null,null,null,null,null,"-",null,{"$f":"IF(SUMPRODUCT((A$14:A356=A356)*(B$14:B356=B356)*(C$14:C356=C356))>1,0,1)","v":0},{"$f":"IFERROR(VLOOKUP(D356,tipo,1,FALSE),\"NO\")","v":"NO"},{"$f":"IFERROR(VLOOKUP(E356,modal,1,FALSE),\"NO\")","v":"NO"},{"$f":"IFERROR(VLOOKUP(F356,Tipo!$C$12:$C$27,1,FALSE),\"NO\")","v":"NO"},{"$f":"IFERROR(VLOOKUP(H356,afectacion,1,FALSE),\"NO\")","v":"NO"},{"$f":"IFERROR(VLOOKUP(I356,programa,1,FALSE),\"NO\")","v":"NO"}]
[null,null,null,null,null,null,null,null,null,{"$f":"IF(ISERROR(VLOOKUP(I357,Eje_Pilar!$C$2:$E$47,2,FALSE)),\" \",VLOOKUP(I357,Eje_Pilar!$C$2:$E$47,2,FALSE))","v":" "},{"$f":"IF(ISERROR(VLOOKUP(I357,Eje_Pilar!$C$2:$E$47,3,FALSE)),\" \",VLOOKUP(I357,Eje_Pilar!$C$2:$E$47,3,FALSE))","v":" "},null,null,null,null,null,null,null,null,{"$f":"+O357+Q357+S357","v":0},null,null,null,null,null,null,null,null,null,null,null,"-",null,{"$f":"IF(SUMPRODUCT((A$14:A357=A357)*(B$14:B357=B357)*(C$14:C357=C357))>1,0,1)","v":0},{"$f":"IFERROR(VLOOKUP(D357,tipo,1,FALSE),\"NO\")","v":"NO"},{"$f":"IFERROR(VLOOKUP(E357,modal,1,FALSE),\"NO\")","v":"NO"},{"$f":"IFERROR(VLOOKUP(F357,Tipo!$C$12:$C$27,1,FALSE),\"NO\")","v":"NO"},{"$f":"IFERROR(VLOOKUP(H357,afectacion,1,FALSE),\"NO\")","v":"NO"},{"$f":"IFERROR(VLOOKUP(I357,programa,1,FALSE),\"NO\")","v":"NO"}]
[null,null,null,null,null,null,null,null,null,{"$f":"IF(ISERROR(VLOOKUP(I358,Eje_Pilar!$C$2:$E$47,2,FALSE)),\" \",VLOOKUP(I358,Eje_Pilar!$C$2:$E$47,2,FALSE))","v":" "},{"$f":"IF(ISERROR(VLOOKUP(I358,Eje_Pilar!$C$2:$E$47,3,FALSE)),\" \",VLOOKUP(I358,Eje_Pilar!$C$2:$E$47,3,FALSE))","v":" "},null,null,null,null,null,null,null,null,{"$f":"+O358+Q358+S358","v":0},null,null,null,null,null,null,null,null,null,null,null,"-",null,{"$f":"IF(SUMPRODUCT((A$14:A358=A358)*(B$14:B358=B358)*(C$14:C358=C358))>1,0,1)","v":0},{"$f":"IFERROR(VLOOKUP(D358,tipo,1,FALSE),\"NO\")","v":"NO"},{"$f":"IFERROR(VLOOKUP(E358,modal,1,FALSE),\"NO\")","v":"NO"},{"$f":"IFERROR(VLOOKUP(F358,Tipo!$C$12:$C$27,1,FALSE),\"NO\")","v":"NO"},{"$f":"IFERROR(VLOOKUP(H358,afectacion,1,FALSE),\"NO\")","v":"NO"},{"$f":"IFERROR(VLOOKUP(I358,programa,1,FALSE),\"NO\")","v":"NO"}]
[null,null,null,null,null,null,null,null,null,{"$f":"IF(ISERROR(VLOOKUP(I359,Eje_Pilar!$C$2:$E$47,2,FALSE)),\" \",VLOOKUP(I359,Eje_Pilar!$C$2:$E$47,2,FALSE))","v":" "},{"$f":"IF(ISERROR(VLOOKUP(I359,Eje_Pilar!$C$2:$E$47,3,FALSE)),\" \",VLOOKUP(I359,Eje_Pilar!$C$2:$E$47,3,FALSE))","v":" "},null,null,null,null,null,null,null,null,{"$f":"+O359+Q359+S359","v":0},null,null,null,null,null,null,null,null,null,null,null,"-",null,{"$f":"IF(SUMPRODUCT((A$14:A359=A359)*(B$14:B359=B359)*(C$14:C359=C359))>1,0,1)","v":0},{"$f":"IFERROR(VLOOKUP(D359,tipo,1,FALSE),\"NO\")","v":"NO"},{"$f":"IFERROR(VLOOKUP(E359,modal,1,FALSE),\"NO\")","v":"NO"},{"$f":"IFERROR(VLOOKUP(F359,Tipo!$C$12:$C$27,1,FALSE),\"NO\")","v":"NO"},{"$f":"IFERROR(VLOOKUP(H359,afectacion,1,FALSE),\"NO\")","v":"NO"},{"$f":"IFERROR(VLOOKUP(I359,programa,1,FALSE),\"NO\")","v":"NO"}]
[null,null,null,null,null,null,null,null,null,{"$f":"IF(ISERROR(VLOOKUP(I360,Eje_Pilar!$C$2:$E$47,2,FALSE)),\" \",VLOOKUP(I360,Eje_Pilar!$C$2:$E$47,2,FALSE))","v":" "},{"$f":"IF(ISERROR(VLOOKUP(I360,Eje_Pilar!$C$2:$E$47,3,FALSE)),\" \",VLOOKUP(I360,Eje_Pilar!$C$2:$E$47,3,FALSE))","v":" "},null,null,null,null,null,null,null,null,{"$f":"+O360+Q360+S360","v":0},null,null,null,null,null,null,null,null,null,null,null,"-",null,{"$f":"IF(SUMPRODUCT((A$14:A360=A360)*(B$14:B360=B360)*(C$14:C360=C360))>1,0,1)","v":0},{"$f":"IFERROR(VLOOKUP(D360,tipo,1,FALSE),\"NO\")","v":"NO"},{"$f":"IFERROR(VLOOKUP(E360,modal,1,FALSE),\"NO\")","v":"NO"},{"$f":"IFERROR(VLOOKUP(F360,Tipo!$C$12:$C$27,1,FALSE),\"NO\")","v":"NO"},{"$f":"IFERROR(VLOOKUP(H360,afectacion,1,FALSE),\"NO\")","v":"NO"},{"$f":"IFERROR(VLOOKUP(I360,programa,1,FALSE),\"NO\")","v":"NO"}]
[null,null,null,null,null,null,null,null,null,{"$f":"IF(ISERROR(VLOOKUP(I361,Eje_Pilar!$C$2:$E$47,2,FALSE)),\" \",VLOOKUP(I361,Eje_Pilar!$C$2:$E$47,2,FALSE))","v":" "},{"$f":"IF(ISERROR(VLOOKUP(I361,Eje_Pilar!$C$2:$E$47,3,FALSE)),\" \",VLOOKUP(I361,Eje_Pilar!$C$2:$E$47,3,FALSE))","v":" "},null,null,null,null,null,null,null,null,{"$f":"+O361+Q361+S361","v":0},null,null,null,null,null,null,null,null,null,null,null,"-",null,{"$f":"IF(SUMPRODUCT((A$14:A361=A361)*(B$14:B361=B361)*(C$14:C361=C361))>1,0,1)","v":0},{"$f":"IFERROR(VLOOKUP(D361,tipo,1,FALSE),\"NO\")","v":"NO"},{"$f":"IFERROR(VLOOKUP(E361,modal,1,FALSE),\"NO\")","v":"NO"},{"$f":"IFERROR(VLOOKUP(F361,Tipo!$C$12:$C$27,1,FALSE),\"NO\")","v":"NO"},{"$f":"IFERROR(VLOOKUP(H361,afectacion,1,FALSE),\"NO\")","v":"NO"},{"$f":"IFERROR(VLOOKUP(I361,programa,1,FALSE),\"NO\")","v":"NO"}]
[null,null,null,null,null,null,null,null,null,{"$f":"IF(ISERROR(VLOOKUP(I362,Eje_Pilar!$C$2:$E$47,2,FALSE)),\" \",VLOOKUP(I362,Eje_Pilar!$C$2:$E$47,2,FALSE))","v":" "},{"$f":"IF(ISERROR(VLOOKUP(I362,Eje_Pilar!$C$2:$E$47,3,FALSE)),\" \",VLOOKUP(I362,Eje_Pilar!$C$2:$E$47,3,FALSE))","v":" "},null,null,null,null,null,null,null,null,{"$f":"+O362+Q362+S362","v":0},null,null,null,null,null,null,null,null,null,null,null,"-",null,{"$f":"IF(SUMPRODUCT((A$14:A362=A362)*(B$14:B362=B362)*(C$14:C362=C362))>1,0,1)","v":0},{"$f":"IFERROR(VLOOKUP(D362,tipo,1,FALSE),\"NO\")","v":"NO"},{"$f":"IFERROR(VLOOKUP(E362,modal,1,FALSE),\"NO\")","v":"NO"},{"$f":"IFERROR(VLOOKUP(F362,Tipo!$C$12:$C$27,1,FALSE),\"NO\")","v":"NO"},{"$f":"IFERROR(VLOOKUP(H362,afectacion,1,FALSE),\"NO\")","v":"NO"},{"$f":"IFERROR(VLOOKUP(I362,programa,1,FALSE),\"NO\")","v":"NO"}]
[null,null,null,null,null,null,null,null,null,{"$f":"IF(ISERROR(VLOOKUP(I363,Eje_Pilar!$C$2:$E$47,2,FALSE)),\" \",VLOOKUP(I363,Eje_Pilar!$C$2:$E$47,2,FALSE))","v":" "},{"$f":"IF(ISERROR(VLOOKUP(I363,Eje_Pilar!$C$2:$E$47,3,FALSE)),\" \",VLOOKUP(I363,Eje_Pilar!$C$2:$E$47,3,FALSE))","v":" "},null,null,null,null,null,null,null,null,{"$f":"+O363+Q363+S363","v":0},null,null,null,null,null,null,null,null,null,null,null,"-",null,{"$f":"IF(SUMPRODUCT((A$14:A363=A363)*(B$14:B363=B363)*(C$14:C363=C363))>1,0,1)","v":0},{"$f":"IFERROR(VLOOKUP(D363,tipo,1,FALSE),\"NO\")","v":"NO"},{"$f":"IFERROR(VLOOKUP(E363,modal,1,FALSE),\"NO\")","v":"NO"},{"$f":"IFERROR(VLOOKUP(F363,Tipo!$C$12:$C$27,1,FALSE),\"NO\")","v":"NO"},{"$f":"IFERROR(VLOOKUP(H363,afectacion,1,FALSE),\"NO\")","v":"NO"},{"$f":"IFERROR(VLOOKUP(I363,programa,1,FALSE),\"NO\")","v":"NO"}]
[null,null,null,null,null,null,null,null,null,{"$f":"IF(ISERROR(VLOOKUP(I364,Eje_Pilar!$C$2:$E$47,2,FALSE)),\" \",VLOOKUP(I364,Eje_Pilar!$C$2:$E$47,2,FALSE))","v":" "},{"$f":"IF(ISERROR(VLOOKUP(I364,Eje_Pilar!$C$2:$E$47,3,FALSE)),\" \",VLOOKUP(I364,Eje_Pilar!$C$2:$E$47,3,FALSE))","v":" "},null,null,null,null,null,null,null,null,{"$f":"+O364+Q364+S364","v":0},null,null,null,null,null,null,null,null,null,null,null,"-",null,{"$f":"IF(SUMPRODUCT((A$14:A364=A364)*(B$14:B364=B364)*(C$14:C364=C364))>1,0,1)","v":0},{"$f":"IFERROR(VLOOKUP(D364,tipo,1,FALSE),\"NO\")","v":"NO"},{"$f":"IFERROR(VLOOKUP(E364,modal,1,FALSE),\"NO\")","v":"NO"},{"$f":"IFERROR(VLOOKUP(F364,Tipo!$C$12:$C$27,1,FALSE),\"NO\")","v":"NO"},{"$f":"IFERROR(VLOOKUP(H364,afectacion,1,FALSE),\"NO\")","v":"NO"},{"$f":"IFERROR(VLOOKUP(I364,programa,1,FALSE),\"NO\")","v":"NO"}]
[null,null,null,null,null,null,null,null,null,{"$f":"IF(ISERROR(VLOOKUP(I365,Eje_Pilar!$C$2:$E$47,2,FALSE)),\" \",VLOOKUP(I365,Eje_Pilar!$C$2:$E$47,2,FALSE))","v":" "},{"$f":"IF(ISERROR(VLOOKUP(I365,Eje_Pilar!$C$2:$E$47,3,FALSE)),\" \",VLOOKUP(I365,Eje_Pilar!$C$2:$E$47,3,FALSE))","v":" "},null,null,null,null,null,null,null,null,{"$f":"+O365+Q365+S365","v":0},null,null,null,null,null,null,null,null,null,null,null,"-",null,{"$f":"IF(SUMPRODUCT((A$14:A365=A365)*(B$14:B365=B365)*(C$14:C365=C365))>1,0,1)","v":0},{"$f":"IFERROR(VLOOKUP(D365,tipo,1,FALSE),\"NO\")","v":"NO"},{"$f":"IFERROR(VLOOKUP(E365,modal,1,FALSE),\"NO\")","v":"NO"},{"$f":"IFERROR(VLOOKUP(F365,Tipo!$C$12:$C$27,1,FALSE),\"NO\")","v":"NO"},{"$f":"IFERROR(VLOOKUP(H365,afectacion,1,FALSE),\"NO\")","v":"NO"},{"$f":"IFERROR(VLOOKUP(I365,programa,1,FALSE),\"NO\")","v":"NO"}]
[null,null,null,null,null,null,null,null,null,{"$f":"IF(ISERROR(VLOOKUP(I366,Eje_Pilar!$C$2:$E$47,2,FALSE)),\" \",VLOOKUP(I366,Eje_Pilar!$C$2:$E$47,2,FALSE))","v":" "},{"$f":"IF(ISERROR(VLOOKUP(I366,Eje_Pilar!$C$2:$E$47,3,FALSE)),\" \",VLOOKUP(I366,Eje_Pilar!$C$2:$E$47,3,FALSE))","v":" "},null,null,null,null,null,null,null,null,{"$f":"+O366+Q366+S366","v":0},null,null,null,null,null,null,null,null,null,null,null,"-",null,{"$f":"IF(SUMPRODUCT((A$14:A366=A366)*(B$14:B366=B366)*(C$14:C366=C366))>1,0,1)","v":0},{"$f":"IFERROR(VLOOKUP(D366,tipo,1,FALSE),\"NO\")","v":"NO"},{"$f":"IFERROR(VLOOKUP(E366,modal,1,FALSE),\"NO\")","v":"NO"},{"$f":"IFERROR(VLOOKUP(F366,Tipo!$C$12:$C$27,1,FALSE),\"NO\")","v":"NO"},{"$f":"IFERROR(VLOOKUP(H366,afectacion,1,FALSE),\"NO\")","v":"NO"},{"$f":"IFERROR(VLOOKUP(I366,programa,1,FALSE),\"NO\")","v":"NO"}]
[null,null,null,null,null,null,null,null,null,{"$f":"IF(ISERROR(VLOOKUP(I367,Eje_Pilar!$C$2:$E$47,2,FALSE)),\" \",VLOOKUP(I367,Eje_Pilar!$C$2:$E$47,2,FALSE))","v":" "},{"$f":"IF(ISERROR(VLOOKUP(I367,Eje_Pilar!$C$2:$E$47,3,FALSE)),\" \",VLOOKUP(I367,Eje_Pilar!$C$2:$E$47,3,FALSE))","v":" "},null,null,null,null,null,null,null,null,{"$f":"+O367+Q367+S367","v":0},null,null,null,null,null,null,null,null,null,null,null,"-",null,{"$f":"IF(SUMPRODUCT((A$14:A367=A367)*(B$14:B367=B367)*(C$14:C367=C367))>1,0,1)","v":0},{"$f":"IFERROR(VLOOKUP(D367,tipo,1,FALSE),\"NO\")","v":"NO"},{"$f":"IFERROR(VLOOKUP(E367,modal,1,FALSE),\"NO\")","v":"NO"},{"$f":"IFERROR(VLOOKUP(F367,Tipo!$C$12:$C$27,1,FALSE),\"NO\")","v":"NO"},{"$f":"IFERROR(VLOOKUP(H367,afectacion,1,FALSE),\"NO\")","v":"NO"},{"$f":"IFERROR(VLOOKUP(I367,programa,1,FALSE),\"NO\")","v":"NO"}]
[null,null,null,null,null,null,null,null,null,{"$f":"IF(ISERROR(VLOOKUP(I368,Eje_Pilar!$C$2:$E$47,2,FALSE)),\" \",VLOOKUP(I368,Eje_Pilar!$C$2:$E$47,2,FALSE))","v":" "},{"$f":"IF(ISERROR(VLOOKUP(I368,Eje_Pilar!$C$2:$E$47,3,FALSE)),\" \",VLOOKUP(I368,Eje_Pilar!$C$2:$E$47,3,FALSE))","v":" "},null,null,null,null,null,null,null,null,{"$f":"+O368+Q368+S368","v":0},null,null,null,null,null,null,null,null,null,null,null,"-",null,{"$f":"IF(SUMPRODUCT((A$14:A368=A368)*(B$14:B368=B368)*(C$14:C368=C368))>1,0,1)","v":0},{"$f":"IFERROR(VLOOKUP(D368,tipo,1,FALSE),\"NO\")","v":"NO"},{"$f":"IFERROR(VLOOKUP(E368,modal,1,FALSE),\"NO\")","v":"NO"},{"$f":"IFERROR(VLOOKUP(F368,Tipo!$C$12:$C$27,1,FALSE),\"NO\")","v":"NO"},{"$f":"IFERROR(VLOOKUP(H368,afectacion,1,FALSE),\"NO\")","v":"NO"},{"$f":"IFERROR(VLOOKUP(I368,programa,1,FALSE),\"NO\")","v":"NO"}]
[null,null,null,null,null,null,null,null,null,{"$f":"IF(ISERROR(VLOOKUP(I369,Eje_Pilar!$C$2:$E$47,2,FALSE)),\" \",VLOOKUP(I369,Eje_Pilar!$C$2:$E$47,2,FALSE))","v":" "},{"$f":"IF(ISERROR(VLOOKUP(I369,Eje_Pilar!$C$2:$E$47,3,FALSE)),\" \",VLOOKUP(I369,Eje_Pilar!$C$2:$E$47,3,FALSE))","v":" "},null,null,null,null,null,null,null,null,{"$f":"+O369+Q369+S369","v":0},null,null,null,null,null,null,null,null,null,null,null,"-",null,{"$f":"IF(SUMPRODUCT((A$14:A369=A369)*(B$14:B369=B369)*(C$14:C369=C369))>1,0,1)","v":0},{"$f":"IFERROR(VLOOKUP(D369,tipo,1,FALSE),\"NO\")","v":"NO"},{"$f":"IFERROR(VLOOKUP(E369,modal,1,FALSE),\"NO\")","v":"NO"},{"$f":"IFERROR(VLOOKUP(F369,Tipo!$C$12:$C$27,1,FALSE),\"NO\")","v":"NO"},{"$f":"IFERROR(VLOOKUP(H369,afectacion,1,FALSE),\"NO\")","v":"NO"},{"$f":"IFERROR(VLOOKUP(I369,programa,1,FALSE),\"NO\")","v":"NO"}]
[null,null,null,null,null,null,null,null,null,{"$f":"IF(ISERROR(VLOOKUP(I370,Eje_Pilar!$C$2:$E$47,2,FALSE)),\" \",VLOOKUP(I370,Eje_Pilar!$C$2:$E$47,2,FALSE))","v":" "},{"$f":"IF(ISERROR(VLOOKUP(I370,Eje_Pilar!$C$2:$E$47,3,FALSE)),\" \",VLOOKUP(I370,Eje_Pilar!$C$2:$E$47,3,FALSE))","v":" "},null,null,null,null,null,null,null,null,{"$f":"+O370+Q370+S370","v":0},null,null,null,null,null,null,null,null,null,null,null,"-",null,{"$f":"IF(SUMPRODUCT((A$14:A370=A370)*(B$14:B370=B370)*(C$14:C370=C370))>1,0,1)","v":0},{"$f":"IFERROR(VLOOKUP(D370,tipo,1,FALSE),\"NO\")","v":"NO"},{"$f":"IFERROR(VLOOKUP(E370,modal,1,FALSE),\"NO\")","v":"NO"},{"$f":"IFERROR(VLOOKUP(F370,Tipo!$C$12:$C$27,1,FALSE),\"NO\")","v":"NO"},{"$f":"IFERROR(VLOOKUP(H370,afectacion,1,FALSE),\"NO\")","v":"NO"},{"$f":"IFERROR(VLOOKUP(I370,programa,1,FALSE),\"NO\")","v":"NO"}]
[null,null,null,null,null,null,null,null,null,{"$f":"IF(ISERROR(VLOOKUP(I371,Eje_Pilar!$C$2:$E$47,2,FALSE)),\" \",VLOOKUP(I371,Eje_Pilar!$C$2:$E$47,2,FALSE))","v":" "},{"$f":"IF(ISERROR(VLOOKUP(I371,Eje_Pilar!$C$2:$E$47,3,FALSE)),\" \",VLOOKUP(I371,Eje_Pilar!$C$2:$E$47,3,FALSE))","v":" "},null,null,null,null,null,null,null,null,{"$f":"+O371+Q371+S371","v":0},null,null,null,null,null,null,null,null,null,null,null,"-",null,{"$f":"IF(SUMPRODUCT((A$14:A371=A371)*(B$14:B371=B371)*(C$14:C371=C371))>1,0,1)","v":0},{"$f":"IFERROR(VLOOKUP(D371,tipo,1,FALSE),\"NO\")","v":"NO"},{"$f":"IFERROR(VLOOKUP(E371,modal,1,FALSE),\"NO\")","v":"NO"},{"$f":"IFERROR(VLOOKUP(F371,Tipo!$C$12:$C$27,1,FALSE),\"NO\")","v":"NO"},{"$f":"IFERROR(VLOOKUP(H371,afectacion,1,FALSE),\"NO\")","v":"NO"},{"$f":"IFERROR(VLOOKUP(I371,programa,1,FALSE),\"NO\")","v":"NO"}]
[null,null,null,null,null,null,null,null,null,{"$f":"IF(ISERROR(VLOOKUP(I372,Eje_Pilar!$C$2:$E$47,2,FALSE)),\" \",VLOOKUP(I372,Eje_Pilar!$C$2:$E$47,2,FALSE))","v":" "},{"$f":"IF(ISERROR(VLOOKUP(I372,Eje_Pilar!$C$2:$E$47,3,FALSE)),\" \",VLOOKUP(I372,Eje_Pilar!$C$2:$E$47,3,FALSE))","v":" "},null,null,null,null,null,null,null,null,{"$f":"+O372+Q372+S372","v":0},null,null,null,null,null,null,null,null,null,null,null,"-",null,{"$f":"IF(SUMPRODUCT((A$14:A372=A372)*(B$14:B372=B372)*(C$14:C372=C372))>1,0,1)","v":0},{"$f":"IFERROR(VLOOKUP(D372,tipo,1,FALSE),\"NO\")","v":"NO"},{"$f":"IFERROR(VLOOKUP(E372,modal,1,FALSE),\"NO\")","v":"NO"},{"$f":"IFERROR(VLOOKUP(F372,Tipo!$C$12:$C$27,1,FALSE),\"NO\")","v":"NO"},{"$f":"IFERROR(VLOOKUP(H372,afectacion,1,FALSE),\"NO\")","v":"NO"},{"$f":"IFERROR(VLOOKUP(I372,programa,1,FALSE),\"NO\")","v":"NO"}]
[null,null,null,null,null,null,null,null,null,{"$f":"IF(ISERROR(VLOOKUP(I373,Eje_Pilar!$C$2:$E$47,2,FALSE)),\" \",VLOOKUP(I373,Eje_Pilar!$C$2:$E$47,2,FALSE))","v":" "},{"$f":"IF(ISERROR(VLOOKUP(I373,Eje_Pilar!$C$2:$E$47,3,FALSE)),\" \",VLOOKUP(I373,Eje_Pilar!$C$2:$E$47,3,FALSE))","v":" "},null,null,null,null,null,null,null,null,{"$f":"+O373+Q373+S373","v":0},null,null,null,null,null,null,null,null,null,null,null,"-",null,{"$f":"IF(SUMPRODUCT((A$14:A373=A373)*(B$14:B373=B373)*(C$14:C373=C373))>1,0,1)","v":0},{"$f":"IFERROR(VLOOKUP(D373,tipo,1,FALSE),\"NO\")","v":"NO"},{"$f":"IFERROR(VLOOKUP(E373,modal,1,FALSE),\"NO\")","v":"NO"},{"$f":"IFERROR(VLOOKUP(F373,Tipo!$C$12:$C$27,1,FALSE),\"NO\")","v":"NO"},{"$f":"IFERROR(VLOOKUP(H373,afectacion,1,FALSE),\"NO\")","v":"NO"},{"$f":"IFERROR(VLOOKUP(I373,programa,1,FALSE),\"NO\")","v":"NO"}]
[null,null,null,null,null,null,null,null,null,{"$f":"IF(ISERROR(VLOOKUP(I374,Eje_Pilar!$C$2:$E$47,2,FALSE)),\" \",VLOOKUP(I374,Eje_Pilar!$C$2:$E$47,2,FALSE))","v":" "},{"$f":"IF(ISERROR(VLOOKUP(I374,Eje_Pilar!$C$2:$E$47,3,FALSE)),\" \",VLOOKUP(I374,Eje_Pilar!$C$2:$E$47,3,FALSE))","v":" "},null,null,null,null,null,null,null,null,{"$f":"+O374+Q374+S374","v":0},null,null,null,null,null,null,null,null,null,null,null,"-",null,{"$f":"IF(SUMPRODUCT((A$14:A374=A374)*(B$14:B374=B374)*(C$14:C374=C374))>1,0,1)","v":0},{"$f":"IFERROR(VLOOKUP(D374,tipo,1,FALSE),\"NO\")","v":"NO"},{"$f":"IFERROR(VLOOKUP(E374,modal,1,FALSE),\"NO\")","v":"NO"},{"$f":"IFERROR(VLOOKUP(F374,Tipo!$C$12:$C$27,1,FALSE),\"NO\")","v":"NO"},{"$f":"IFERROR(VLOOKUP(H374,afectacion,1,FALSE),\"NO\")","v":"NO"},{"$f":"IFERROR(VLOOKUP(I374,programa,1,FALSE),\"NO\")","v":"NO"}]
[null,null,null,null,null,null,null,null,null,{"$f":"IF(ISERROR(VLOOKUP(I375,Eje_Pilar!$C$2:$E$47,2,FALSE)),\" \",VLOOKUP(I375,Eje_Pilar!$C$2:$E$47,2,FALSE))","v":" "},{"$f":"IF(ISERROR(VLOOKUP(I375,Eje_Pilar!$C$2:$E$47,3,FALSE)),\" \",VLOOKUP(I375,Eje_Pilar!$C$2:$E$47,3,FALSE))","v":" "},null,null,null,null,null,null,null,null,{"$f":"+O375+Q375+S375","v":0},null,null,null,null,null,null,null,null,null,null,null,"-",null,{"$f":"IF(SUMPRODUCT((A$14:A375=A375)*(B$14:B375=B375)*(C$14:C375=C375))>1,0,1)","v":0},{"$f":"IFERROR(VLOOKUP(D375,tipo,1,FALSE),\"NO\")","v":"NO"},{"$f":"IFERROR(VLOOKUP(E375,modal,1,FALSE),\"NO\")","v":"NO"},{"$f":"IFERROR(VLOOKUP(F375,Tipo!$C$12:$C$27,1,FALSE),\"NO\")","v":"NO"},{"$f":"IFERROR(VLOOKUP(H375,afectacion,1,FALSE),\"NO\")","v":"NO"},{"$f":"IFERROR(VLOOKUP(I375,programa,1,FALSE),\"NO\")","v":"NO"}]
[null,null,null,null,null,null,null,null,null,{"$f":"IF(ISERROR(VLOOKUP(I376,Eje_Pilar!$C$2:$E$47,2,FALSE)),\" \",VLOOKUP(I376,Eje_Pilar!$C$2:$E$47,2,FALSE))","v":" "},{"$f":"IF(ISERROR(VLOOKUP(I376,Eje_Pilar!$C$2:$E$47,3,FALSE)),\" \",VLOOKUP(I376,Eje_Pilar!$C$2:$E$47,3,FALSE))","v":" "},null,null,null,null,null,null,null,null,{"$f":"+O376+Q376+S376","v":0},null,null,null,null,null,null,null,null,null,null,null,"-",null,{"$f":"IF(SUMPRODUCT((A$14:A376=A376)*(B$14:B376=B376)*(C$14:C376=C376))>1,0,1)","v":0},{"$f":"IFERROR(VLOOKUP(D376,tipo,1,FALSE),\"NO\")","v":"NO"},{"$f":"IFERROR(VLOOKUP(E376,modal,1,FALSE),\"NO\")","v":"NO"},{"$f":"IFERROR(VLOOKUP(F376,Tipo!$C$12:$C$27,1,FALSE),\"NO\")","v":"NO"},{"$f":"IFERROR(VLOOKUP(H376,afectacion,1,FALSE),\"NO\")","v":"NO"},{"$f":"IFERROR(VLOOKUP(I376,programa,1,FALSE),\"NO\")","v":"NO"}]
[null,null,null,null,null,null,null,null,null,{"$f":"IF(ISERROR(VLOOKUP(I377,Eje_Pilar!$C$2:$E$47,2,FALSE)),\" \",VLOOKUP(I377,Eje_Pilar!$C$2:$E$47,2,FALSE))","v":" "},{"$f":"IF(ISERROR(VLOOKUP(I377,Eje_Pilar!$C$2:$E$47,3,FALSE)),\" \",VLOOKUP(I377,Eje_Pilar!$C$2:$E$47,3,FALSE))","v":" "},null,null,null,null,null,null,null,null,{"$f":"+O377+Q377+S377","v":0},null,null,null,null,null,null,null,null,null,null,null,"-",null,{"$f":"IF(SUMPRODUCT((A$14:A377=A377)*(B$14:B377=B377)*(C$14:C377=C377))>1,0,1)","v":0},{"$f":"IFERROR(VLOOKUP(D377,tipo,1,FALSE),\"NO\")","v":"NO"},{"$f":"IFERROR(VLOOKUP(E377,modal,1,FALSE),\"NO\")","v":"NO"},{"$f":"IFERROR(VLOOKUP(F377,Tipo!$C$12:$C$27,1,FALSE),\"NO\")","v":"NO"},{"$f":"IFERROR(VLOOKUP(H377,afectacion,1,FALSE),\"NO\")","v":"NO"},{"$f":"IFERROR(VLOOKUP(I377,programa,1,FALSE),\"NO\")","v":"NO"}]
[null,null,null,null,null,null,null,null,null,{"$f":"IF(ISERROR(VLOOKUP(I378,Eje_Pilar!$C$2:$E$47,2,FALSE)),\" \",VLOOKUP(I378,Eje_Pilar!$C$2:$E$47,2,FALSE))","v":" "},{"$f":"IF(ISERROR(VLOOKUP(I378,Eje_Pilar!$C$2:$E$47,3,FALSE)),\" \",VLOOKUP(I378,Eje_Pilar!$C$2:$E$47,3,FALSE))","v":" "},null,null,null,null,null,null,null,null,{"$f":"+O378+Q378+S378","v":0},null,null,null,null,null,null,null,null,null,null,null,"-",null,{"$f":"IF(SUMPRODUCT((A$14:A378=A378)*(B$14:B378=B378)*(C$14:C378=C378))>1,0,1)","v":0},{"$f":"IFERROR(VLOOKUP(D378,tipo,1,FALSE),\"NO\")","v":"NO"},{"$f":"IFERROR(VLOOKUP(E378,modal,1,FALSE),\"NO\")","v":"NO"},{"$f":"IFERROR(VLOOKUP(F378,Tipo!$C$12:$C$27,1,FALSE),\"NO\")","v":"NO"},{"$f":"IFERROR(VLOOKUP(H378,afectacion,1,FALSE),\"NO\")","v":"NO"},{"$f":"IFERROR(VLOOKUP(I378,programa,1,FALSE),\"NO\")","v":"NO"}]
[null,null,null,null,null,null,null,null,null,{"$f":"IF(ISERROR(VLOOKUP(I379,Eje_Pilar!$C$2:$E$47,2,FALSE)),\" \",VLOOKUP(I379,Eje_Pilar!$C$2:$E$47,2,FALSE))","v":" "},{"$f":"IF(ISERROR(VLOOKUP(I379,Eje_Pilar!$C$2:$E$47,3,FALSE)),\" \",VLOOKUP(I379,Eje_Pilar!$C$2:$E$47,3,FALSE))","v":" "},null,null,null,null,null,null,null,null,{"$f":"+O379+Q379+S379","v":0},null,null,null,null,null,null,null,null,null,null,null,"-",null,{"$f":"IF(SUMPRODUCT((A$14:A379=A379)*(B$14:B379=B379)*(C$14:C379=C379))>1,0,1)","v":0},{"$f":"IFERROR(VLOOKUP(D379,tipo,1,FALSE),\"NO\")","v":"NO"},{"$f":"IFERROR(VLOOKUP(E379,modal,1,FALSE),\"NO\")","v":"NO"},{"$f":"IFERROR(VLOOKUP(F379,Tipo!$C$12:$C$27,1,FALSE),\"NO\")","v":"NO"},{"$f":"IFERROR(VLOOKUP(H379,afectacion,1,FALSE),\"NO\")","v":"NO"},{"$f":"IFERROR(VLOOKUP(I379,programa,1,FALSE),\"NO\")","v":"NO"}]
[null,null,null,null,null,null,null,null,null,{"$f":"IF(ISERROR(VLOOKUP(I380,Eje_Pilar!$C$2:$E$47,2,FALSE)),\" \",VLOOKUP(I380,Eje_Pilar!$C$2:$E$47,2,FALSE))","v":" "},{"$f":"IF(ISERROR(VLOOKUP(I380,Eje_Pilar!$C$2:$E$47,3,FALSE)),\" \",VLOOKUP(I380,Eje_Pilar!$C$2:$E$47,3,FALSE))","v":" "},null,null,null,null,null,null,null,null,{"$f":"+O380+Q380+S380","v":0},null,null,null,null,null,null,null,null,null,null,null,"-",null,{"$f":"IF(SUMPRODUCT((A$14:A380=A380)*(B$14:B380=B380)*(C$14:C380=C380))>1,0,1)","v":0},{"$f":"IFERROR(VLOOKUP(D380,tipo,1,FALSE),\"NO\")","v":"NO"},{"$f":"IFERROR(VLOOKUP(E380,modal,1,FALSE),\"NO\")","v":"NO"},{"$f":"IFERROR(VLOOKUP(F380,Tipo!$C$12:$C$27,1,FALSE),\"NO\")","v":"NO"},{"$f":"IFERROR(VLOOKUP(H380,afectacion,1,FALSE),\"NO\")","v":"NO"},{"$f":"IFERROR(VLOOKUP(I380,programa,1,FALSE),\"NO\")","v":"NO"}]
[null,null,null,null,null,null,null,null,null,{"$f":"IF(ISERROR(VLOOKUP(I381,Eje_Pilar!$C$2:$E$47,2,FALSE)),\" \",VLOOKUP(I381,Eje_Pilar!$C$2:$E$47,2,FALSE))","v":" "},{"$f":"IF(ISERROR(VLOOKUP(I381,Eje_Pilar!$C$2:$E$47,3,FALSE)),\" \",VLOOKUP(I381,Eje_Pilar!$C$2:$E$47,3,FALSE))","v":" "},null,null,null,null,null,null,null,null,{"$f":"+O381+Q381+S381","v":0},null,null,null,null,null,null,null,null,null,null,null,"-",null,{"$f":"IF(SUMPRODUCT((A$14:A381=A381)*(B$14:B381=B381)*(C$14:C381=C381))>1,0,1)","v":0},{"$f":"IFERROR(VLOOKUP(D381,tipo,1,FALSE),\"NO\")","v":"NO"},{"$f":"IFERROR(VLOOKUP(E381,modal,1,FALSE),\"NO\")","v":"NO"},{"$f":"IFERROR(VLOOKUP(F381,Tipo!$C$12:$C$27,1,FALSE),\"NO\")","v":"NO"},{"$f":"IFERROR(VLOOKUP(H381,afectacion,1,FALSE),\"NO\")","v":"NO"},{"$f":"IFERROR(VLOOKUP(I381,programa,1,FALSE),\"NO\")","v":"NO"}]
[null,null,null,null,null,null,null,null,null,{"$f":"IF(ISERROR(VLOOKUP(I382,Eje_Pilar!$C$2:$E$47,2,FALSE)),\" \",VLOOKUP(I382,Eje_Pilar!$C$2:$E$47,2,FALSE))","v":" "},{"$f":"IF(ISERROR(VLOOKUP(I382,Eje_Pilar!$C$2:$E$47,3,FALSE)),\" \",VLOOKUP(I382,Eje_Pilar!$C$2:$E$47,3,FALSE))","v":" "},null,null,null,null,null,null,null,null,{"$f":"+O382+Q382+S382","v":0},null,null,null,null,null,null,null,null,null,null,null,{"$f":"IF(ISERROR(U382/T382),\"-\",(U382/T382))","v":"-"},null,{"$f":"IF(SUMPRODUCT((A$14:A382=A382)*(B$14:B382=B382)*(C$14:C382=C382))>1,0,1)","v":0},{"$f":"IFERROR(VLOOKUP(D382,tipo,1,FALSE),\"NO\")","v":"NO"},{"$f":"IFERROR(VLOOKUP(E382,modal,1,FALSE),\"NO\")","v":"NO"},{"$f":"IFERROR(VLOOKUP(F382,Tipo!$C$12:$C$27,1,FALSE),\"NO\")","v":"NO"},{"$f":"IFERROR(VLOOKUP(H382,afectacion,1,FALSE),\"NO\")","v":"NO"},{"$f":"IFERROR(VLOOKUP(I382,programa,1,FALSE),\"NO\")","v":"NO"}]
[null,null,null,null,null,null,null,null,null,{"$f":"IF(ISERROR(VLOOKUP(I383,Eje_Pilar!$C$2:$E$47,2,FALSE)),\" \",VLOOKUP(I383,Eje_Pilar!$C$2:$E$47,2,FALSE))","v":" "},{"$f":"IF(ISERROR(VLOOKUP(I383,Eje_Pilar!$C$2:$E$47,3,FALSE)),\" \",VLOOKUP(I383,Eje_Pilar!$C$2:$E$47,3,FALSE))","v":" "},null,null,null,null,null,null,null,null,{"$f":"+O383+Q383+S383","v":0},null,null,null,null,null,null,null,null,null,null,null,"-",null,{"$f":"IF(SUMPRODUCT((A$14:A383=A383)*(B$14:B383=B383)*(C$14:C383=C383))>1,0,1)","v":0},{"$f":"IFERROR(VLOOKUP(D383,tipo,1,FALSE),\"NO\")","v":"NO"},{"$f":"IFERROR(VLOOKUP(E383,modal,1,FALSE),\"NO\")","v":"NO"},{"$f":"IFERROR(VLOOKUP(F383,Tipo!$C$12:$C$27,1,FALSE),\"NO\")","v":"NO"},{"$f":"IFERROR(VLOOKUP(H383,afectacion,1,FALSE),\"NO\")","v":"NO"},{"$f":"IFERROR(VLOOKUP(I383,programa,1,FALSE),\"NO\")","v":"NO"}]
[null,null,null,null,null,null,null,null,null,{"$f":"IF(ISERROR(VLOOKUP(I384,Eje_Pilar!$C$2:$E$47,2,FALSE)),\" \",VLOOKUP(I384,Eje_Pilar!$C$2:$E$47,2,FALSE))","v":" "},{"$f":"IF(ISERROR(VLOOKUP(I384,Eje_Pilar!$C$2:$E$47,3,FALSE)),\" \",VLOOKUP(I384,Eje_Pilar!$C$2:$E$47,3,FALSE))","v":" "},null,null,null,null,null,null,null,null,{"$f":"+O384+Q384+S384","v":0},null,null,null,null,null,null,null,null,null,null,null,"-",null,{"$f":"IF(SUMPRODUCT((A$14:A384=A384)*(B$14:B384=B384)*(C$14:C384=C384))>1,0,1)","v":0},{"$f":"IFERROR(VLOOKUP(D384,tipo,1,FALSE),\"NO\")","v":"NO"},{"$f":"IFERROR(VLOOKUP(E384,modal,1,FALSE),\"NO\")","v":"NO"},{"$f":"IFERROR(VLOOKUP(F384,Tipo!$C$12:$C$27,1,FALSE),\"NO\")","v":"NO"},{"$f":"IFERROR(VLOOKUP(H384,afectacion,1,FALSE),\"NO\")","v":"NO"},{"$f":"IFERROR(VLOOKUP(I384,programa,1,FALSE),\"NO\")","v":"NO"}]
[null,null,null,null,null,null,null,null,null,{"$f":"IF(ISERROR(VLOOKUP(I385,Eje_Pilar!$C$2:$E$47,2,FALSE)),\" \",VLOOKUP(I385,Eje_Pilar!$C$2:$E$47,2,FALSE))","v":" "},{"$f":"IF(ISERROR(VLOOKUP(I385,Eje_Pilar!$C$2:$E$47,3,FALSE)),\" \",VLOOKUP(I385,Eje_Pilar!$C$2:$E$47,3,FALSE))","v":" "},null,null,null,null,null,null,null,null,{"$f":"+O385+Q385+S385","v":0},null,null,null,null,null,null,null,null,null,null,null,"-",null,{"$f":"IF(SUMPRODUCT((A$14:A385=A385)*(B$14:B385=B385)*(C$14:C385=C385))>1,0,1)","v":0},{"$f":"IFERROR(VLOOKUP(D385,tipo,1,FALSE),\"NO\")","v":"NO"},{"$f":"IFERROR(VLOOKUP(E385,modal,1,FALSE),\"NO\")","v":"NO"},{"$f":"IFERROR(VLOOKUP(F385,Tipo!$C$12:$C$27,1,FALSE),\"NO\")","v":"NO"},{"$f":"IFERROR(VLOOKUP(H385,afectacion,1,FALSE),\"NO\")","v":"NO"},{"$f":"IFERROR(VLOOKUP(I385,programa,1,FALSE),\"NO\")","v":"NO"}]
[null,null,null,null,null,null,null,null,null,{"$f":"IF(ISERROR(VLOOKUP(I386,Eje_Pilar!$C$2:$E$47,2,FALSE)),\" \",VLOOKUP(I386,Eje_Pilar!$C$2:$E$47,2,FALSE))","v":" "},{"$f":"IF(ISERROR(VLOOKUP(I386,Eje_Pilar!$C$2:$E$47,3,FALSE)),\" \",VLOOKUP(I386,Eje_Pilar!$C$2:$E$47,3,FALSE))","v":" "},null,null,null,null,null,null,null,null,{"$f":"+O386+Q386+S386","v":0},null,null,null,null,null,null,null,null,null,null,null,"-",null,{"$f":"IF(SUMPRODUCT((A$14:A386=A386)*(B$14:B386=B386)*(C$14:C386=C386))>1,0,1)","v":0},{"$f":"IFERROR(VLOOKUP(D386,tipo,1,FALSE),\"NO\")","v":"NO"},{"$f":"IFERROR(VLOOKUP(E386,modal,1,FALSE),\"NO\")","v":"NO"},{"$f":"IFERROR(VLOOKUP(F386,Tipo!$C$12:$C$27,1,FALSE),\"NO\")","v":"NO"},{"$f":"IFERROR(VLOOKUP(H386,afectacion,1,FALSE),\"NO\")","v":"NO"},{"$f":"IFERROR(VLOOKUP(I386,programa,1,FALSE),\"NO\")","v":"NO"}]
[null,null,null,null,null,null,null,null,null,{"$f":"IF(ISERROR(VLOOKUP(I387,Eje_Pilar!$C$2:$E$47,2,FALSE)),\" \",VLOOKUP(I387,Eje_Pilar!$C$2:$E$47,2,FALSE))","v":" "},{"$f":"IF(ISERROR(VLOOKUP(I387,Eje_Pilar!$C$2:$E$47,3,FALSE)),\" \",VLOOKUP(I387,Eje_Pilar!$C$2:$E$47,3,FALSE))","v":" "},null,null,null,null,null,null,null,null,{"$f":"+O387+Q387+S387","v":0},null,null,null,null,null,null,null,null,null,null,null,"-",null,{"$f":"IF(SUMPRODUCT((A$14:A387=A387)*(B$14:B387=B387)*(C$14:C387=C387))>1,0,1)","v":0},{"$f":"IFERROR(VLOOKUP(D387,tipo,1,FALSE),\"NO\")","v":"NO"},{"$f":"IFERROR(VLOOKUP(E387,modal,1,FALSE),\"NO\")","v":"NO"},{"$f":"IFERROR(VLOOKUP(F387,Tipo!$C$12:$C$27,1,FALSE),\"NO\")","v":"NO"},{"$f":"IFERROR(VLOOKUP(H387,afectacion,1,FALSE),\"NO\")","v":"NO"},{"$f":"IFERROR(VLOOKUP(I387,programa,1,FALSE),\"NO\")","v":"NO"}]
[null,null,null,null,null,null,null,null,null,{"$f":"IF(ISERROR(VLOOKUP(I388,Eje_Pilar!$C$2:$E$47,2,FALSE)),\" \",VLOOKUP(I388,Eje_Pilar!$C$2:$E$47,2,FALSE))","v":" "},{"$f":"IF(ISERROR(VLOOKUP(I388,Eje_Pilar!$C$2:$E$47,3,FALSE)),\" \",VLOOKUP(I388,Eje_Pilar!$C$2:$E$47,3,FALSE))","v":" "},null,null,null,null,null,null,null,null,{"$f":"+O388+Q388+S388","v":0},null,null,null,null,null,null,null,null,null,null,null,"-",null,{"$f":"IF(SUMPRODUCT((A$14:A388=A388)*(B$14:B388=B388)*(C$14:C388=C388))>1,0,1)","v":0},{"$f":"IFERROR(VLOOKUP(D388,tipo,1,FALSE),\"NO\")","v":"NO"},{"$f":"IFERROR(VLOOKUP(E388,modal,1,FALSE),\"NO\")","v":"NO"},{"$f":"IFERROR(VLOOKUP(F388,Tipo!$C$12:$C$27,1,FALSE),\"NO\")","v":"NO"},{"$f":"IFERROR(VLOOKUP(H388,afectacion,1,FALSE),\"NO\")","v":"NO"},{"$f":"IFERROR(VLOOKUP(I388,programa,1,FALSE),\"NO\")","v":"NO"}]
[null,null,null,null,null,null,null,null,null,{"$f":"IF(ISERROR(VLOOKUP(I389,Eje_Pilar!$C$2:$E$47,2,FALSE)),\" \",VLOOKUP(I389,Eje_Pilar!$C$2:$E$47,2,FALSE))","v":" "},{"$f":"IF(ISERROR(VLOOKUP(I389,Eje_Pilar!$C$2:$E$47,3,FALSE)),\" \",VLOOKUP(I389,Eje_Pilar!$C$2:$E$47,3,FALSE))","v":" "},null,null,null,null,null,null,null,null,{"$f":"+O389+Q389+S389","v":0},null,null,null,null,null,null,null,null,null,null,null,"-",null,{"$f":"IF(SUMPRODUCT((A$14:A389=A389)*(B$14:B389=B389)*(C$14:C389=C389))>1,0,1)","v":0},{"$f":"IFERROR(VLOOKUP(D389,tipo,1,FALSE),\"NO\")","v":"NO"},{"$f":"IFERROR(VLOOKUP(E389,modal,1,FALSE),\"NO\")","v":"NO"},{"$f":"IFERROR(VLOOKUP(F389,Tipo!$C$12:$C$27,1,FALSE),\"NO\")","v":"NO"},{"$f":"IFERROR(VLOOKUP(H389,afectacion,1,FALSE),\"NO\")","v":"NO"},{"$f":"IFERROR(VLOOKUP(I389,programa,1,FALSE),\"NO\")","v":"NO"}]
[null,null,null,null,null,null,null,null,null,{"$f":"IF(ISERROR(VLOOKUP(I390,Eje_Pilar!$C$2:$E$47,2,FALSE)),\" \",VLOOKUP(I390,Eje_Pilar!$C$2:$E$47,2,FALSE))","v":" "},{"$f":"IF(ISERROR(VLOOKUP(I390,Eje_Pilar!$C$2:$E$47,3,FALSE)),\" \",VLOOKUP(I390,Eje_Pilar!$C$2:$E$47,3,FALSE))","v":" "},null,null,null,null,null,null,null,null,{"$f":"+O390+Q390+S390","v":0},null,null,null,null,null,null,null,null,null,null,null,"-",null,{"$f":"IF(SUMPRODUCT((A$14:A390=A390)*(B$14:B390=B390)*(C$14:C390=C390))>1,0,1)","v":0},{"$f":"IFERROR(VLOOKUP(D390,tipo,1,FALSE),\"NO\")","v":"NO"},{"$f":"IFERROR(VLOOKUP(E390,modal,1,FALSE),\"NO\")","v":"NO"},{"$f":"IFERROR(VLOOKUP(F390,Tipo!$C$12:$C$27,1,FALSE),\"NO\")","v":"NO"},{"$f":"IFERROR(VLOOKUP(H390,afectacion,1,FALSE),\"NO\")","v":"NO"},{"$f":"IFERROR(VLOOKUP(I390,programa,1,FALSE),\"NO\")","v":"NO"}]
[null,null,null,null,null,null,null,null,null,{"$f":"IF(ISERROR(VLOOKUP(I391,Eje_Pilar!$C$2:$E$47,2,FALSE)),\" \",VLOOKUP(I391,Eje_Pilar!$C$2:$E$47,2,FALSE))","v":" "},{"$f":"IF(ISERROR(VLOOKUP(I391,Eje_Pilar!$C$2:$E$47,3,FALSE)),\" \",VLOOKUP(I391,Eje_Pilar!$C$2:$E$47,3,FALSE))","v":" "},null,null,null,null,null,null,null,null,{"$f":"+O391+Q391+S391","v":0},null,null,null,null,null,null,null,null,null,null,null,"-",null,{"$f":"IF(SUMPRODUCT((A$14:A391=A391)*(B$14:B391=B391)*(C$14:C391=C391))>1,0,1)","v":0},{"$f":"IFERROR(VLOOKUP(D391,tipo,1,FALSE),\"NO\")","v":"NO"},{"$f":"IFERROR(VLOOKUP(E391,modal,1,FALSE),\"NO\")","v":"NO"},{"$f":"IFERROR(VLOOKUP(F391,Tipo!$C$12:$C$27,1,FALSE),\"NO\")","v":"NO"},{"$f":"IFERROR(VLOOKUP(H391,afectacion,1,FALSE),\"NO\")","v":"NO"},{"$f":"IFERROR(VLOOKUP(I391,programa,1,FALSE),\"NO\")","v":"NO"}]
[null,null,null,null,null,null,null,null,null,{"$f":"IF(ISERROR(VLOOKUP(I392,Eje_Pilar!$C$2:$E$47,2,FALSE)),\" \",VLOOKUP(I392,Eje_Pilar!$C$2:$E$47,2,FALSE))","v":" "},{"$f":"IF(ISERROR(VLOOKUP(I392,Eje_Pilar!$C$2:$E$47,3,FALSE)),\" \",VLOOKUP(I392,Eje_Pilar!$C$2:$E$47,3,FALSE))","v":" "},null,null,null,null,null,null,null,null,{"$f":"+O392+Q392+S392","v":0},null,null,null,null,null,null,null,null,null,null,null,"-",null,{"$f":"IF(SUMPRODUCT((A$14:A392=A392)*(B$14:B392=B392)*(C$14:C392=C392))>1,0,1)","v":0},{"$f":"IFERROR(VLOOKUP(D392,tipo,1,FALSE),\"NO\")","v":"NO"},{"$f":"IFERROR(VLOOKUP(E392,modal,1,FALSE),\"NO\")","v":"NO"},{"$f":"IFERROR(VLOOKUP(F392,Tipo!$C$12:$C$27,1,FALSE),\"NO\")","v":"NO"},{"$f":"IFERROR(VLOOKUP(H392,afectacion,1,FALSE),\"NO\")","v":"NO"},{"$f":"IFERROR(VLOOKUP(I392,programa,1,FALSE),\"NO\")","v":"NO"}]
[null,null,null,null,null,null,null,null,null,{"$f":"IF(ISERROR(VLOOKUP(I393,Eje_Pilar!$C$2:$E$47,2,FALSE)),\" \",VLOOKUP(I393,Eje_Pilar!$C$2:$E$47,2,FALSE))","v":" "},{"$f":"IF(ISERROR(VLOOKUP(I393,Eje_Pilar!$C$2:$E$47,3,FALSE)),\" \",VLOOKUP(I393,Eje_Pilar!$C$2:$E$47,3,FALSE))","v":" "},null,null,null,null,null,null,null,null,{"$f":"+O393+Q393+S393","v":0},null,null,null,null,null,null,null,null,null,null,null,"-",null,{"$f":"IF(SUMPRODUCT((A$14:A393=A393)*(B$14:B393=B393)*(C$14:C393=C393))>1,0,1)","v":0},{"$f":"IFERROR(VLOOKUP(D393,tipo,1,FALSE),\"NO\")","v":"NO"},{"$f":"IFERROR(VLOOKUP(E393,modal,1,FALSE),\"NO\")","v":"NO"},{"$f":"IFERROR(VLOOKUP(F393,Tipo!$C$12:$C$27,1,FALSE),\"NO\")","v":"NO"},{"$f":"IFERROR(VLOOKUP(H393,afectacion,1,FALSE),\"NO\")","v":"NO"},{"$f":"IFERROR(VLOOKUP(I393,programa,1,FALSE),\"NO\")","v":"NO"}]
[null,null,null,null,null,null,null,null,null,{"$f":"IF(ISERROR(VLOOKUP(I394,Eje_Pilar!$C$2:$E$47,2,FALSE)),\" \",VLOOKUP(I394,Eje_Pilar!$C$2:$E$47,2,FALSE))","v":" "},{"$f":"IF(ISERROR(VLOOKUP(I394,Eje_Pilar!$C$2:$E$47,3,FALSE)),\" \",VLOOKUP(I394,Eje_Pilar!$C$2:$E$47,3,FALSE))","v":" "},null,null,null,null,null,null,null,null,{"$f":"+O394+Q394+S394","v":0},null,null,null,null,null,null,null,null,null,null,null,"-",null,{"$f":"IF(SUMPRODUCT((A$14:A394=A394)*(B$14:B394=B394)*(C$14:C394=C394))>1,0,1)","v":0},{"$f":"IFERROR(VLOOKUP(D394,tipo,1,FALSE),\"NO\")","v":"NO"},{"$f":"IFERROR(VLOOKUP(E394,modal,1,FALSE),\"NO\")","v":"NO"},{"$f":"IFERROR(VLOOKUP(F394,Tipo!$C$12:$C$27,1,FALSE),\"NO\")","v":"NO"},{"$f":"IFERROR(VLOOKUP(H394,afectacion,1,FALSE),\"NO\")","v":"NO"},{"$f":"IFERROR(VLOOKUP(I394,programa,1,FALSE),\"NO\")","v":"NO"}]
[null,null,null,null,null,null,null,null,null,{"$f":"IF(ISERROR(VLOOKUP(I395,Eje_Pilar!$C$2:$E$47,2,FALSE)),\" \",VLOOKUP(I395,Eje_Pilar!$C$2:$E$47,2,FALSE))","v":" "},{"$f":"IF(ISERROR(VLOOKUP(I395,Eje_Pilar!$C$2:$E$47,3,FALSE)),\" \",VLOOKUP(I395,Eje_Pilar!$C$2:$E$47,3,FALSE))","v":" "},null,null,null,null,null,null,null,null,{"$f":"+O395+Q395+S395","v":0},null,null,null,null,null,null,null,null,null,null,null,"-",null,{"$f":"IF(SUMPRODUCT((A$14:A395=A395)*(B$14:B395=B395)*(C$14:C395=C395))>1,0,1)","v":0},{"$f":"IFERROR(VLOOKUP(D395,tipo,1,FALSE),\"NO\")","v":"NO"},{"$f":"IFERROR(VLOOKUP(E395,modal,1,FALSE),\"NO\")","v":"NO"},{"$f":"IFERROR(VLOOKUP(F395,Tipo!$C$12:$C$27,1,FALSE),\"NO\")","v":"NO"},{"$f":"IFERROR(VLOOKUP(H395,afectacion,1,FALSE),\"NO\")","v":"NO"},{"$f":"IFERROR(VLOOKUP(I395,programa,1,FALSE),\"NO\")","v":"NO"}]
[null,null,null,null,null,null,null,null,null,{"$f":"IF(ISERROR(VLOOKUP(I396,Eje_Pilar!$C$2:$E$47,2,FALSE)),\" \",VLOOKUP(I396,Eje_Pilar!$C$2:$E$47,2,FALSE))","v":" "},{"$f":"IF(ISERROR(VLOOKUP(I396,Eje_Pilar!$C$2:$E$47,3,FALSE)),\" \",VLOOKUP(I396,Eje_Pilar!$C$2:$E$47,3,FALSE))","v":" "},null,null,null,null,null,null,null,null,{"$f":"+O396+Q396+S396","v":0},null,null,null,null,null,null,null,null,null,null,null,"-",null,{"$f":"IF(SUMPRODUCT((A$14:A396=A396)*(B$14:B396=B396)*(C$14:C396=C396))>1,0,1)","v":0},{"$f":"IFERROR(VLOOKUP(D396,tipo,1,FALSE),\"NO\")","v":"NO"},{"$f":"IFERROR(VLOOKUP(E396,modal,1,FALSE),\"NO\")","v":"NO"},{"$f":"IFERROR(VLOOKUP(F396,Tipo!$C$12:$C$27,1,FALSE),\"NO\")","v":"NO"},{"$f":"IFERROR(VLOOKUP(H396,afectacion,1,FALSE),\"NO\")","v":"NO"},{"$f":"IFERROR(VLOOKUP(I396,programa,1,FALSE),\"NO\")","v":"NO"}]
[null,null,null,null,null,null,null,null,null,{"$f":"IF(ISERROR(VLOOKUP(I397,Eje_Pilar!$C$2:$E$47,2,FALSE)),\" \",VLOOKUP(I397,Eje_Pilar!$C$2:$E$47,2,FALSE))","v":" "},{"$f":"IF(ISERROR(VLOOKUP(I397,Eje_Pilar!$C$2:$E$47,3,FALSE)),\" \",VLOOKUP(I397,Eje_Pilar!$C$2:$E$47,3,FALSE))","v":" "},null,null,null,null,null,null,null,null,{"$f":"+O397+Q397+S397","v":0},null,null,null,null,null,null,null,null,null,null,null,"-",null,{"$f":"IF(SUMPRODUCT((A$14:A397=A397)*(B$14:B397=B397)*(C$14:C397=C397))>1,0,1)","v":0},{"$f":"IFERROR(VLOOKUP(D397,tipo,1,FALSE),\"NO\")","v":"NO"},{"$f":"IFERROR(VLOOKUP(E397,modal,1,FALSE),\"NO\")","v":"NO"},{"$f":"IFERROR(VLOOKUP(F397,Tipo!$C$12:$C$27,1,FALSE),\"NO\")","v":"NO"},{"$f":"IFERROR(VLOOKUP(H397,afectacion,1,FALSE),\"NO\")","v":"NO"},{"$f":"IFERROR(VLOOKUP(I397,programa,1,FALSE),\"NO\")","v":"NO"}]
[null,null,null,null,null,null,null,null,null,{"$f":"IF(ISERROR(VLOOKUP(I398,Eje_Pilar!$C$2:$E$47,2,FALSE)),\" \",VLOOKUP(I398,Eje_Pilar!$C$2:$E$47,2,FALSE))","v":" "},{"$f":"IF(ISERROR(VLOOKUP(I398,Eje_Pilar!$C$2:$E$47,3,FALSE)),\" \",VLOOKUP(I398,Eje_Pilar!$C$2:$E$47,3,FALSE))","v":" "},null,null,null,null,null,null,null,null,{"$f":"+O398+Q398+S398","v":0},null,null,null,null,null,null,null,null,null,null,null,"-",null,{"$f":"IF(SUMPRODUCT((A$14:A398=A398)*(B$14:B398=B398)*(C$14:C398=C398))>1,0,1)","v":0},{"$f":"IFERROR(VLOOKUP(D398,tipo,1,FALSE),\"NO\")","v":"NO"},{"$f":"IFERROR(VLOOKUP(E398,modal,1,FALSE),\"NO\")","v":"NO"},{"$f":"IFERROR(VLOOKUP(F398,Tipo!$C$12:$C$27,1,FALSE),\"NO\")","v":"NO"},{"$f":"IFERROR(VLOOKUP(H398,afectacion,1,FALSE),\"NO\")","v":"NO"},{"$f":"IFERROR(VLOOKUP(I398,programa,1,FALSE),\"NO\")","v":"NO"}]
[null,null,null,null,null,null,null,null,null,{"$f":"IF(ISERROR(VLOOKUP(I399,Eje_Pilar!$C$2:$E$47,2,FALSE)),\" \",VLOOKUP(I399,Eje_Pilar!$C$2:$E$47,2,FALSE))","v":" "},{"$f":"IF(ISERROR(VLOOKUP(I399,Eje_Pilar!$C$2:$E$47,3,FALSE)),\" \",VLOOKUP(I399,Eje_Pilar!$C$2:$E$47,3,FALSE))","v":" "},null,null,null,null,null,null,null,null,{"$f":"+O399+Q399+S399","v":0},null,null,null,null,null,null,null,null,null,null,null,"-",null,{"$f":"IF(SUMPRODUCT((A$14:A399=A399)*(B$14:B399=B399)*(C$14:C399=C399))>1,0,1)","v":0},{"$f":"IFERROR(VLOOKUP(D399,tipo,1,FALSE),\"NO\")","v":"NO"},{"$f":"IFERROR(VLOOKUP(E399,modal,1,FALSE),\"NO\")","v":"NO"},{"$f":"IFERROR(VLOOKUP(F399,Tipo!$C$12:$C$27,1,FALSE),\"NO\")","v":"NO"},{"$f":"IFERROR(VLOOKUP(H399,afectacion,1,FALSE),\"NO\")","v":"NO"},{"$f":"IFERROR(VLOOKUP(I399,programa,1,FALSE),\"NO\")","v":"NO"}]
[null,null,null,null,null,null,null,null,null,{"$f":"IF(ISERROR(VLOOKUP(I400,Eje_Pilar!$C$2:$E$47,2,FALSE)),\" \",VLOOKUP(I400,Eje_Pilar!$C$2:$E$47,2,FALSE))","v":" "},{"$f":"IF(ISERROR(VLOOKUP(I400,Eje_Pilar!$C$2:$E$47,3,FALSE)),\" \",VLOOKUP(I400,Eje_Pilar!$C$2:$E$47,3,FALSE))","v":" "},null,null,null,null,null,null,null,null,{"$f":"+O400+Q400+S400","v":0},null,null,null,null,null,null,null,null,null,null,null,"-",null,{"$f":"IF(SUMPRODUCT((A$14:A400=A400)*(B$14:B400=B400)*(C$14:C400=C400))>1,0,1)","v":0},{"$f":"IFERROR(VLOOKUP(D400,tipo,1,FALSE),\"NO\")","v":"NO"},{"$f":"IFERROR(VLOOKUP(E400,modal,1,FALSE),\"NO\")","v":"NO"},{"$f":"IFERROR(VLOOKUP(F400,Tipo!$C$12:$C$27,1,FALSE),\"NO\")","v":"NO"},{"$f":"IFERROR(VLOOKUP(H400,afectacion,1,FALSE),\"NO\")","v":"NO"},{"$f":"IFERROR(VLOOKUP(I400,programa,1,FALSE),\"NO\")","v":"NO"}]
[null,null,null,null,null,null,null,null,null,{"$f":"IF(ISERROR(VLOOKUP(I401,Eje_Pilar!$C$2:$E$47,2,FALSE)),\" \",VLOOKUP(I401,Eje_Pilar!$C$2:$E$47,2,FALSE))","v":" "},{"$f":"IF(ISERROR(VLOOKUP(I401,Eje_Pilar!$C$2:$E$47,3,FALSE)),\" \",VLOOKUP(I401,Eje_Pilar!$C$2:$E$47,3,FALSE))","v":" "},null,null,null,null,null,null,null,null,{"$f":"+O401+Q401+S401","v":0},null,null,null,null,null,null,null,null,null,null,null,"-",null,{"$f":"IF(SUMPRODUCT((A$14:A401=A401)*(B$14:B401=B401)*(C$14:C401=C401))>1,0,1)","v":0},{"$f":"IFERROR(VLOOKUP(D401,tipo,1,FALSE),\"NO\")","v":"NO"},{"$f":"IFERROR(VLOOKUP(E401,modal,1,FALSE),\"NO\")","v":"NO"},{"$f":"IFERROR(VLOOKUP(F401,Tipo!$C$12:$C$27,1,FALSE),\"NO\")","v":"NO"},{"$f":"IFERROR(VLOOKUP(H401,afectacion,1,FALSE),\"NO\")","v":"NO"},{"$f":"IFERROR(VLOOKUP(I401,programa,1,FALSE),\"NO\")","v":"NO"}]
[null,null,null,null,null,null,null,null,null,{"$f":"IF(ISERROR(VLOOKUP(I402,Eje_Pilar!$C$2:$E$47,2,FALSE)),\" \",VLOOKUP(I402,Eje_Pilar!$C$2:$E$47,2,FALSE))","v":" "},{"$f":"IF(ISERROR(VLOOKUP(I402,Eje_Pilar!$C$2:$E$47,3,FALSE)),\" \",VLOOKUP(I402,Eje_Pilar!$C$2:$E$47,3,FALSE))","v":" "},null,null,null,null,null,null,null,null,{"$f":"+O402+Q402+S402","v":0},null,null,null,null,null,null,null,null,null,null,null,"-",null,{"$f":"IF(SUMPRODUCT((A$14:A402=A402)*(B$14:B402=B402)*(C$14:C402=C402))>1,0,1)","v":0},{"$f":"IFERROR(VLOOKUP(D402,tipo,1,FALSE),\"NO\")","v":"NO"},{"$f":"IFERROR(VLOOKUP(E402,modal,1,FALSE),\"NO\")","v":"NO"},{"$f":"IFERROR(VLOOKUP(F402,Tipo!$C$12:$C$27,1,FALSE),\"NO\")","v":"NO"},{"$f":"IFERROR(VLOOKUP(H402,afectacion,1,FALSE),\"NO\")","v":"NO"},{"$f":"IFERROR(VLOOKUP(I402,programa,1,FALSE),\"NO\")","v":"NO"}]
[null,null,null,null,null,null,null,null,null,{"$f":"IF(ISERROR(VLOOKUP(I403,Eje_Pilar!$C$2:$E$47,2,FALSE)),\" \",VLOOKUP(I403,Eje_Pilar!$C$2:$E$47,2,FALSE))","v":" "},{"$f":"IF(ISERROR(VLOOKUP(I403,Eje_Pilar!$C$2:$E$47,3,FALSE)),\" \",VLOOKUP(I403,Eje_Pilar!$C$2:$E$47,3,FALSE))","v":" "},null,null,null,null,null,null,null,null,{"$f":"+O403+Q403+S403","v":0},null,null,null,null,null,null,null,null,null,null,null,"-",null,{"$f":"IF(SUMPRODUCT((A$14:A403=A403)*(B$14:B403=B403)*(C$14:C403=C403))>1,0,1)","v":0},{"$f":"IFERROR(VLOOKUP(D403,tipo,1,FALSE),\"NO\")","v":"NO"},{"$f":"IFERROR(VLOOKUP(E403,modal,1,FALSE),\"NO\")","v":"NO"},{"$f":"IFERROR(VLOOKUP(F403,Tipo!$C$12:$C$27,1,FALSE),\"NO\")","v":"NO"},{"$f":"IFERROR(VLOOKUP(H403,afectacion,1,FALSE),\"NO\")","v":"NO"},{"$f":"IFERROR(VLOOKUP(I403,programa,1,FALSE),\"NO\")","v":"NO"}]
[null,null,null,null,null,null,null,null,null,{"$f":"IF(ISERROR(VLOOKUP(I404,Eje_Pilar!$C$2:$E$47,2,FALSE)),\" \",VLOOKUP(I404,Eje_Pilar!$C$2:$E$47,2,FALSE))","v":" "},{"$f":"IF(ISERROR(VLOOKUP(I404,Eje_Pilar!$C$2:$E$47,3,FALSE)),\" \",VLOOKUP(I404,Eje_Pilar!$C$2:$E$47,3,FALSE))","v":" "},null,null,null,null,null,null,null,null,{"$f":"+O404+Q404+S404","v":0},null,null,null,null,null,null,null,null,null,null,null,"-",null,{"$f":"IF(SUMPRODUCT((A$14:A404=A404)*(B$14:B404=B404)*(C$14:C404=C404))>1,0,1)","v":0},{"$f":"IFERROR(VLOOKUP(D404,tipo,1,FALSE),\"NO\")","v":"NO"},{"$f":"IFERROR(VLOOKUP(E404,modal,1,FALSE),\"NO\")","v":"NO"},{"$f":"IFERROR(VLOOKUP(F404,Tipo!$C$12:$C$27,1,FALSE),\"NO\")","v":"NO"},{"$f":"IFERROR(VLOOKUP(H404,afectacion,1,FALSE),\"NO\")","v":"NO"},{"$f":"IFERROR(VLOOKUP(I404,programa,1,FALSE),\"NO\")","v":"NO"}]
[null,null,null,null,null,null,null,null,null,{"$f":"IF(ISERROR(VLOOKUP(I405,Eje_Pilar!$C$2:$E$47,2,FALSE)),\" \",VLOOKUP(I405,Eje_Pilar!$C$2:$E$47,2,FALSE))","v":" "},{"$f":"IF(ISERROR(VLOOKUP(I405,Eje_Pilar!$C$2:$E$47,3,FALSE)),\" \",VLOOKUP(I405,Eje_Pilar!$C$2:$E$47,3,FALSE))","v":" "},null,null,null,null,null,null,null,null,{"$f":"+O405+Q405+S405","v":0},null,null,null,null,null,null,null,null,null,null,null,"-",null,{"$f":"IF(SUMPRODUCT((A$14:A405=A405)*(B$14:B405=B405)*(C$14:C405=C405))>1,0,1)","v":0},{"$f":"IFERROR(VLOOKUP(D405,tipo,1,FALSE),\"NO\")","v":"NO"},{"$f":"IFERROR(VLOOKUP(E405,modal,1,FALSE),\"NO\")","v":"NO"},{"$f":"IFERROR(VLOOKUP(F405,Tipo!$C$12:$C$27,1,FALSE),\"NO\")","v":"NO"},{"$f":"IFERROR(VLOOKUP(H405,afectacion,1,FALSE),\"NO\")","v":"NO"},{"$f":"IFERROR(VLOOKUP(I405,programa,1,FALSE),\"NO\")","v":"NO"}]
[null,null,null,null,null,null,null,null,null,{"$f":"IF(ISERROR(VLOOKUP(I406,Eje_Pilar!$C$2:$E$47,2,FALSE)),\" \",VLOOKUP(I406,Eje_Pilar!$C$2:$E$47,2,FALSE))","v":" "},{"$f":"IF(ISERROR(VLOOKUP(I406,Eje_Pilar!$C$2:$E$47,3,FALSE)),\" \",VLOOKUP(I406,Eje_Pilar!$C$2:$E$47,3,FALSE))","v":" "},null,null,null,null,null,null,null,null,{"$f":"+O406+Q406+S406","v":0},null,null,null,null,null,null,null,null,null,null,null,"-",null,{"$f":"IF(SUMPRODUCT((A$14:A406=A406)*(B$14:B406=B406)*(C$14:C406=C406))>1,0,1)","v":0},{"$f":"IFERROR(VLOOKUP(D406,tipo,1,FALSE),\"NO\")","v":"NO"},{"$f":"IFERROR(VLOOKUP(E406,modal,1,FALSE),\"NO\")","v":"NO"},{"$f":"IFERROR(VLOOKUP(F406,Tipo!$C$12:$C$27,1,FALSE),\"NO\")","v":"NO"},{"$f":"IFERROR(VLOOKUP(H406,afectacion,1,FALSE),\"NO\")","v":"NO"},{"$f":"IFERROR(VLOOKUP(I406,programa,1,FALSE),\"NO\")","v":"NO"}]
[null,null,null,null,null,null,null,null,null,{"$f":"IF(ISERROR(VLOOKUP(I407,Eje_Pilar!$C$2:$E$47,2,FALSE)),\" \",VLOOKUP(I407,Eje_Pilar!$C$2:$E$47,2,FALSE))","v":" "},{"$f":"IF(ISERROR(VLOOKUP(I407,Eje_Pilar!$C$2:$E$47,3,FALSE)),\" \",VLOOKUP(I407,Eje_Pilar!$C$2:$E$47,3,FALSE))","v":" "},null,null,null,null,null,null,null,null,{"$f":"+O407+Q407+S407","v":0},null,null,null,null,null,null,null,null,null,null,null,"-",null,{"$f":"IF(SUMPRODUCT((A$14:A407=A407)*(B$14:B407=B407)*(C$14:C407=C407))>1,0,1)","v":0},{"$f":"IFERROR(VLOOKUP(D407,tipo,1,FALSE),\"NO\")","v":"NO"},{"$f":"IFERROR(VLOOKUP(E407,modal,1,FALSE),\"NO\")","v":"NO"},{"$f":"IFERROR(VLOOKUP(F407,Tipo!$C$12:$C$27,1,FALSE),\"NO\")","v":"NO"},{"$f":"IFERROR(VLOOKUP(H407,afectacion,1,FALSE),\"NO\")","v":"NO"},{"$f":"IFERROR(VLOOKUP(I407,programa,1,FALSE),\"NO\")","v":"NO"}]
[null,null,null,null,null,null,null,null,null,{"$f":"IF(ISERROR(VLOOKUP(I408,Eje_Pilar!$C$2:$E$47,2,FALSE)),\" \",VLOOKUP(I408,Eje_Pilar!$C$2:$E$47,2,FALSE))","v":" "},{"$f":"IF(ISERROR(VLOOKUP(I408,Eje_Pilar!$C$2:$E$47,3,FALSE)),\" \",VLOOKUP(I408,Eje_Pilar!$C$2:$E$47,3,FALSE))","v":" "},null,null,null,null,null,null,null,null,{"$f":"+O408+Q408+S408","v":0},null,null,null,null,null,null,null,null,null,null,null,"-",null,{"$f":"IF(SUMPRODUCT((A$14:A408=A408)*(B$14:B408=B408)*(C$14:C408=C408))>1,0,1)","v":0},{"$f":"IFERROR(VLOOKUP(D408,tipo,1,FALSE),\"NO\")","v":"NO"},{"$f":"IFERROR(VLOOKUP(E408,modal,1,FALSE),\"NO\")","v":"NO"},{"$f":"IFERROR(VLOOKUP(F408,Tipo!$C$12:$C$27,1,FALSE),\"NO\")","v":"NO"},{"$f":"IFERROR(VLOOKUP(H408,afectacion,1,FALSE),\"NO\")","v":"NO"},{"$f":"IFERROR(VLOOKUP(I408,programa,1,FALSE),\"NO\")","v":"NO"}]
[null,null,null,null,null,null,null,null,null,{"$f":"IF(ISERROR(VLOOKUP(I409,Eje_Pilar!$C$2:$E$47,2,FALSE)),\" \",VLOOKUP(I409,Eje_Pilar!$C$2:$E$47,2,FALSE))","v":" "},{"$f":"IF(ISERROR(VLOOKUP(I409,Eje_Pilar!$C$2:$E$47,3,FALSE)),\" \",VLOOKUP(I409,Eje_Pilar!$C$2:$E$47,3,FALSE))","v":" "},null,null,null,null,null,null,null,null,{"$f":"+O409+Q409+S409","v":0},null,null,null,null,null,null,null,null,null,null,null,"-",null,{"$f":"IF(SUMPRODUCT((A$14:A409=A409)*(B$14:B409=B409)*(C$14:C409=C409))>1,0,1)","v":0},{"$f":"IFERROR(VLOOKUP(D409,tipo,1,FALSE),\"NO\")","v":"NO"},{"$f":"IFERROR(VLOOKUP(E409,modal,1,FALSE),\"NO\")","v":"NO"},{"$f":"IFERROR(VLOOKUP(F409,Tipo!$C$12:$C$27,1,FALSE),\"NO\")","v":"NO"},{"$f":"IFERROR(VLOOKUP(H409,afectacion,1,FALSE),\"NO\")","v":"NO"},{"$f":"IFERROR(VLOOKUP(I409,programa,1,FALSE),\"NO\")","v":"NO"}]
[null,null,null,null,null,null,null,null,null,{"$f":"IF(ISERROR(VLOOKUP(I410,Eje_Pilar!$C$2:$E$47,2,FALSE)),\" \",VLOOKUP(I410,Eje_Pilar!$C$2:$E$47,2,FALSE))","v":" "},{"$f":"IF(ISERROR(VLOOKUP(I410,Eje_Pilar!$C$2:$E$47,3,FALSE)),\" \",VLOOKUP(I410,Eje_Pilar!$C$2:$E$47,3,FALSE))","v":" "},null,null,null,null,null,null,null,null,{"$f":"+O410+Q410+S410","v":0},null,null,null,null,null,null,null,null,null,null,null,"-",null,{"$f":"IF(SUMPRODUCT((A$14:A410=A410)*(B$14:B410=B410)*(C$14:C410=C410))>1,0,1)","v":0},{"$f":"IFERROR(VLOOKUP(D410,tipo,1,FALSE),\"NO\")","v":"NO"},{"$f":"IFERROR(VLOOKUP(E410,modal,1,FALSE),\"NO\")","v":"NO"},{"$f":"IFERROR(VLOOKUP(F410,Tipo!$C$12:$C$27,1,FALSE),\"NO\")","v":"NO"},{"$f":"IFERROR(VLOOKUP(H410,afectacion,1,FALSE),\"NO\")","v":"NO"},{"$f":"IFERROR(VLOOKUP(I410,programa,1,FALSE),\"NO\")","v":"NO"}]
[null,null,null,null,null,null,null,null,null,{"$f":"IF(ISERROR(VLOOKUP(I411,Eje_Pilar!$C$2:$E$47,2,FALSE)),\" \",VLOOKUP(I411,Eje_Pilar!$C$2:$E$47,2,FALSE))","v":" "},{"$f":"IF(ISERROR(VLOOKUP(I411,Eje_Pilar!$C$2:$E$47,3,FALSE)),\" \",VLOOKUP(I411,Eje_Pilar!$C$2:$E$47,3,FALSE))","v":" "},null,null,null,null,null,null,null,null,{"$f":"+O411+Q411+S411","v":0},null,null,null,null,null,null,null,null,null,null,null,"-",null,{"$f":"IF(SUMPRODUCT((A$14:A411=A411)*(B$14:B411=B411)*(C$14:C411=C411))>1,0,1)","v":0},{"$f":"IFERROR(VLOOKUP(D411,tipo,1,FALSE),\"NO\")","v":"NO"},{"$f":"IFERROR(VLOOKUP(E411,modal,1,FALSE),\"NO\")","v":"NO"},{"$f":"IFERROR(VLOOKUP(F411,Tipo!$C$12:$C$27,1,FALSE),\"NO\")","v":"NO"},{"$f":"IFERROR(VLOOKUP(H411,afectacion,1,FALSE),\"NO\")","v":"NO"},{"$f":"IFERROR(VLOOKUP(I411,programa,1,FALSE),\"NO\")","v":"NO"}]
[null,null,null,null,null,null,null,null,null,{"$f":"IF(ISERROR(VLOOKUP(I412,Eje_Pilar!$C$2:$E$47,2,FALSE)),\" \",VLOOKUP(I412,Eje_Pilar!$C$2:$E$47,2,FALSE))","v":" "},{"$f":"IF(ISERROR(VLOOKUP(I412,Eje_Pilar!$C$2:$E$47,3,FALSE)),\" \",VLOOKUP(I412,Eje_Pilar!$C$2:$E$47,3,FALSE))","v":" "},null,null,null,null,null,null,null,null,{"$f":"+O412+Q412+S412","v":0},null,null,null,null,null,null,null,null,null,null,null,"-",null,{"$f":"IF(SUMPRODUCT((A$14:A412=A412)*(B$14:B412=B412)*(C$14:C412=C412))>1,0,1)","v":0},{"$f":"IFERROR(VLOOKUP(D412,tipo,1,FALSE),\"NO\")","v":"NO"},{"$f":"IFERROR(VLOOKUP(E412,modal,1,FALSE),\"NO\")","v":"NO"},{"$f":"IFERROR(VLOOKUP(F412,Tipo!$C$12:$C$27,1,FALSE),\"NO\")","v":"NO"},{"$f":"IFERROR(VLOOKUP(H412,afectacion,1,FALSE),\"NO\")","v":"NO"},{"$f":"IFERROR(VLOOKUP(I412,programa,1,FALSE),\"NO\")","v":"NO"}]
[null,null,null,null,null,null,null,null,null,{"$f":"IF(ISERROR(VLOOKUP(I413,Eje_Pilar!$C$2:$E$47,2,FALSE)),\" \",VLOOKUP(I413,Eje_Pilar!$C$2:$E$47,2,FALSE))","v":" "},{"$f":"IF(ISERROR(VLOOKUP(I413,Eje_Pilar!$C$2:$E$47,3,FALSE)),\" \",VLOOKUP(I413,Eje_Pilar!$C$2:$E$47,3,FALSE))","v":" "},null,null,null,null,null,null,null,null,{"$f":"+O413+Q413+S413","v":0},null,null,null,null,null,null,null,null,null,null,null,"-",null,{"$f":"IF(SUMPRODUCT((A$14:A413=A413)*(B$14:B413=B413)*(C$14:C413=C413))>1,0,1)","v":0},{"$f":"IFERROR(VLOOKUP(D413,tipo,1,FALSE),\"NO\")","v":"NO"},{"$f":"IFERROR(VLOOKUP(E413,modal,1,FALSE),\"NO\")","v":"NO"},{"$f":"IFERROR(VLOOKUP(F413,Tipo!$C$12:$C$27,1,FALSE),\"NO\")","v":"NO"},{"$f":"IFERROR(VLOOKUP(H413,afectacion,1,FALSE),\"NO\")","v":"NO"},{"$f":"IFERROR(VLOOKUP(I413,programa,1,FALSE),\"NO\")","v":"NO"}]
[null,null,null,null,null,null,null,null,null,{"$f":"IF(ISERROR(VLOOKUP(I414,Eje_Pilar!$C$2:$E$47,2,FALSE)),\" \",VLOOKUP(I414,Eje_Pilar!$C$2:$E$47,2,FALSE))","v":" "},{"$f":"IF(ISERROR(VLOOKUP(I414,Eje_Pilar!$C$2:$E$47,3,FALSE)),\" \",VLOOKUP(I414,Eje_Pilar!$C$2:$E$47,3,FALSE))","v":" "},null,null,null,null,null,null,null,null,{"$f":"+O414+Q414+S414","v":0},null,null,null,null,null,null,null,null,null,null,null,"-",null,{"$f":"IF(SUMPRODUCT((A$14:A414=A414)*(B$14:B414=B414)*(C$14:C414=C414))>1,0,1)","v":0},{"$f":"IFERROR(VLOOKUP(D414,tipo,1,FALSE),\"NO\")","v":"NO"},{"$f":"IFERROR(VLOOKUP(E414,modal,1,FALSE),\"NO\")","v":"NO"},{"$f":"IFERROR(VLOOKUP(F414,Tipo!$C$12:$C$27,1,FALSE),\"NO\")","v":"NO"},{"$f":"IFERROR(VLOOKUP(H414,afectacion,1,FALSE),\"NO\")","v":"NO"},{"$f":"IFERROR(VLOOKUP(I414,programa,1,FALSE),\"NO\")","v":"NO"}]
[null,null,null,null,null,null,null,null,null,{"$f":"IF(ISERROR(VLOOKUP(I415,Eje_Pilar!$C$2:$E$47,2,FALSE)),\" \",VLOOKUP(I415,Eje_Pilar!$C$2:$E$47,2,FALSE))","v":" "},{"$f":"IF(ISERROR(VLOOKUP(I415,Eje_Pilar!$C$2:$E$47,3,FALSE)),\" \",VLOOKUP(I415,Eje_Pilar!$C$2:$E$47,3,FALSE))","v":" "},null,null,null,null,null,null,null,null,{"$f":"+O415+Q415+S415","v":0},null,null,null,null,null,null,null,null,null,null,null,"-",null,{"$f":"IF(SUMPRODUCT((A$14:A415=A415)*(B$14:B415=B415)*(C$14:C415=C415))>1,0,1)","v":0},{"$f":"IFERROR(VLOOKUP(D415,tipo,1,FALSE),\"NO\")","v":"NO"},{"$f":"IFERROR(VLOOKUP(E415,modal,1,FALSE),\"NO\")","v":"NO"},{"$f":"IFERROR(VLOOKUP(F415,Tipo!$C$12:$C$27,1,FALSE),\"NO\")","v":"NO"},{"$f":"IFERROR(VLOOKUP(H415,afectacion,1,FALSE),\"NO\")","v":"NO"},{"$f":"IFERROR(VLOOKUP(I415,programa,1,FALSE),\"NO\")","v":"NO"}]
[null,null,null,null,null,null,null,null,null,{"$f":"IF(ISERROR(VLOOKUP(I416,Eje_Pilar!$C$2:$E$47,2,FALSE)),\" \",VLOOKUP(I416,Eje_Pilar!$C$2:$E$47,2,FALSE))","v":" "},{"$f":"IF(ISERROR(VLOOKUP(I416,Eje_Pilar!$C$2:$E$47,3,FALSE)),\" \",VLOOKUP(I416,Eje_Pilar!$C$2:$E$47,3,FALSE))","v":" "},null,null,null,null,null,null,null,null,{"$f":"+O416+Q416+S416","v":0},null,null,null,null,null,null,null,null,null,null,null,"-",null,{"$f":"IF(SUMPRODUCT((A$14:A416=A416)*(B$14:B416=B416)*(C$14:C416=C416))>1,0,1)","v":0},{"$f":"IFERROR(VLOOKUP(D416,tipo,1,FALSE),\"NO\")","v":"NO"},{"$f":"IFERROR(VLOOKUP(E416,modal,1,FALSE),\"NO\")","v":"NO"},{"$f":"IFERROR(VLOOKUP(F416,Tipo!$C$12:$C$27,1,FALSE),\"NO\")","v":"NO"},{"$f":"IFERROR(VLOOKUP(H416,afectacion,1,FALSE),\"NO\")","v":"NO"},{"$f":"IFERROR(VLOOKUP(I416,programa,1,FALSE),\"NO\")","v":"NO"}]
[null,null,null,null,null,null,null,null,null,{"$f":"IF(ISERROR(VLOOKUP(I417,Eje_Pilar!$C$2:$E$47,2,FALSE)),\" \",VLOOKUP(I417,Eje_Pilar!$C$2:$E$47,2,FALSE))","v":" "},{"$f":"IF(ISERROR(VLOOKUP(I417,Eje_Pilar!$C$2:$E$47,3,FALSE)),\" \",VLOOKUP(I417,Eje_Pilar!$C$2:$E$47,3,FALSE))","v":" "},null,null,null,null,null,null,null,null,{"$f":"+O417+Q417+S417","v":0},null,null,null,null,null,null,null,null,null,null,null,"-",null,{"$f":"IF(SUMPRODUCT((A$14:A417=A417)*(B$14:B417=B417)*(C$14:C417=C417))>1,0,1)","v":0},{"$f":"IFERROR(VLOOKUP(D417,tipo,1,FALSE),\"NO\")","v":"NO"},{"$f":"IFERROR(VLOOKUP(E417,modal,1,FALSE),\"NO\")","v":"NO"},{"$f":"IFERROR(VLOOKUP(F417,Tipo!$C$12:$C$27,1,FALSE),\"NO\")","v":"NO"},{"$f":"IFERROR(VLOOKUP(H417,afectacion,1,FALSE),\"NO\")","v":"NO"},{"$f":"IFERROR(VLOOKUP(I417,programa,1,FALSE),\"NO\")","v":"NO"}]
[null,null,null,null,null,null,null,null,null,{"$f":"IF(ISERROR(VLOOKUP(I418,Eje_Pilar!$C$2:$E$47,2,FALSE)),\" \",VLOOKUP(I418,Eje_Pilar!$C$2:$E$47,2,FALSE))","v":" "},{"$f":"IF(ISERROR(VLOOKUP(I418,Eje_Pilar!$C$2:$E$47,3,FALSE)),\" \",VLOOKUP(I418,Eje_Pilar!$C$2:$E$47,3,FALSE))","v":" "},null,null,null,null,null,null,null,null,{"$f":"+O418+Q418+S418","v":0},null,null,null,null,null,null,null,null,null,null,null,"-",null,{"$f":"IF(SUMPRODUCT((A$14:A418=A418)*(B$14:B418=B418)*(C$14:C418=C418))>1,0,1)","v":0},{"$f":"IFERROR(VLOOKUP(D418,tipo,1,FALSE),\"NO\")","v":"NO"},{"$f":"IFERROR(VLOOKUP(E418,modal,1,FALSE),\"NO\")","v":"NO"},{"$f":"IFERROR(VLOOKUP(F418,Tipo!$C$12:$C$27,1,FALSE),\"NO\")","v":"NO"},{"$f":"IFERROR(VLOOKUP(H418,afectacion,1,FALSE),\"NO\")","v":"NO"},{"$f":"IFERROR(VLOOKUP(I418,programa,1,FALSE),\"NO\")","v":"NO"}]
[null,null,null,null,null,null,null,null,null,{"$f":"IF(ISERROR(VLOOKUP(I419,Eje_Pilar!$C$2:$E$47,2,FALSE)),\" \",VLOOKUP(I419,Eje_Pilar!$C$2:$E$47,2,FALSE))","v":" "},{"$f":"IF(ISERROR(VLOOKUP(I419,Eje_Pilar!$C$2:$E$47,3,FALSE)),\" \",VLOOKUP(I419,Eje_Pilar!$C$2:$E$47,3,FALSE))","v":" "},null,null,null,null,null,null,null,null,{"$f":"+O419+Q419+S419","v":0},null,null,null,null,null,null,null,null,null,null,null,"-",null,{"$f":"IF(SUMPRODUCT((A$14:A419=A419)*(B$14:B419=B419)*(C$14:C419=C419))>1,0,1)","v":0},{"$f":"IFERROR(VLOOKUP(D419,tipo,1,FALSE),\"NO\")","v":"NO"},{"$f":"IFERROR(VLOOKUP(E419,modal,1,FALSE),\"NO\")","v":"NO"},{"$f":"IFERROR(VLOOKUP(F419,Tipo!$C$12:$C$27,1,FALSE),\"NO\")","v":"NO"},{"$f":"IFERROR(VLOOKUP(H419,afectacion,1,FALSE),\"NO\")","v":"NO"},{"$f":"IFERROR(VLOOKUP(I419,programa,1,FALSE),\"NO\")","v":"NO"}]
[null,null,null,null,null,null,null,null,null,{"$f":"IF(ISERROR(VLOOKUP(I420,Eje_Pilar!$C$2:$E$47,2,FALSE)),\" \",VLOOKUP(I420,Eje_Pilar!$C$2:$E$47,2,FALSE))","v":" "},{"$f":"IF(ISERROR(VLOOKUP(I420,Eje_Pilar!$C$2:$E$47,3,FALSE)),\" \",VLOOKUP(I420,Eje_Pilar!$C$2:$E$47,3,FALSE))","v":" "},null,null,null,null,null,null,null,null,{"$f":"+O420+Q420+S420","v":0},null,null,null,null,null,null,null,null,null,null,null,"-",null,{"$f":"IF(SUMPRODUCT((A$14:A420=A420)*(B$14:B420=B420)*(C$14:C420=C420))>1,0,1)","v":0},{"$f":"IFERROR(VLOOKUP(D420,tipo,1,FALSE),\"NO\")","v":"NO"},{"$f":"IFERROR(VLOOKUP(E420,modal,1,FALSE),\"NO\")","v":"NO"},{"$f":"IFERROR(VLOOKUP(F420,Tipo!$C$12:$C$27,1,FALSE),\"NO\")","v":"NO"},{"$f":"IFERROR(VLOOKUP(H420,afectacion,1,FALSE),\"NO\")","v":"NO"},{"$f":"IFERROR(VLOOKUP(I420,programa,1,FALSE),\"NO\")","v":"NO"}]
[null,null,null,null,null,null,null,null,null,{"$f":"IF(ISERROR(VLOOKUP(I421,Eje_Pilar!$C$2:$E$47,2,FALSE)),\" \",VLOOKUP(I421,Eje_Pilar!$C$2:$E$47,2,FALSE))","v":" "},{"$f":"IF(ISERROR(VLOOKUP(I421,Eje_Pilar!$C$2:$E$47,3,FALSE)),\" \",VLOOKUP(I421,Eje_Pilar!$C$2:$E$47,3,FALSE))","v":" "},null,null,null,null,null,null,null,null,{"$f":"+O421+Q421+S421","v":0},null,null,null,null,null,null,null,null,null,null,null,"-",null,{"$f":"IF(SUMPRODUCT((A$14:A421=A421)*(B$14:B421=B421)*(C$14:C421=C421))>1,0,1)","v":0},{"$f":"IFERROR(VLOOKUP(D421,tipo,1,FALSE),\"NO\")","v":"NO"},{"$f":"IFERROR(VLOOKUP(E421,modal,1,FALSE),\"NO\")","v":"NO"},{"$f":"IFERROR(VLOOKUP(F421,Tipo!$C$12:$C$27,1,FALSE),\"NO\")","v":"NO"},{"$f":"IFERROR(VLOOKUP(H421,afectacion,1,FALSE),\"NO\")","v":"NO"},{"$f":"IFERROR(VLOOKUP(I421,programa,1,FALSE),\"NO\")","v":"NO"}]
[null,null,null,null,null,null,null,null,null,{"$f":"IF(ISERROR(VLOOKUP(I422,Eje_Pilar!$C$2:$E$47,2,FALSE)),\" \",VLOOKUP(I422,Eje_Pilar!$C$2:$E$47,2,FALSE))","v":" "},{"$f":"IF(ISERROR(VLOOKUP(I422,Eje_Pilar!$C$2:$E$47,3,FALSE)),\" \",VLOOKUP(I422,Eje_Pilar!$C$2:$E$47,3,FALSE))","v":" "},null,null,null,null,null,null,null,null,{"$f":"+O422+Q422+S422","v":0},null,null,null,null,null,null,null,null,null,null,null,"-",null,{"$f":"IF(SUMPRODUCT((A$14:A422=A422)*(B$14:B422=B422)*(C$14:C422=C422))>1,0,1)","v":0},{"$f":"IFERROR(VLOOKUP(D422,tipo,1,FALSE),\"NO\")","v":"NO"},{"$f":"IFERROR(VLOOKUP(E422,modal,1,FALSE),\"NO\")","v":"NO"},{"$f":"IFERROR(VLOOKUP(F422,Tipo!$C$12:$C$27,1,FALSE),\"NO\")","v":"NO"},{"$f":"IFERROR(VLOOKUP(H422,afectacion,1,FALSE),\"NO\")","v":"NO"},{"$f":"IFERROR(VLOOKUP(I422,programa,1,FALSE),\"NO\")","v":"NO"}]
[null,null,null,null,null,null,null,null,null,{"$f":"IF(ISERROR(VLOOKUP(I423,Eje_Pilar!$C$2:$E$47,2,FALSE)),\" \",VLOOKUP(I423,Eje_Pilar!$C$2:$E$47,2,FALSE))","v":" "},{"$f":"IF(ISERROR(VLOOKUP(I423,Eje_Pilar!$C$2:$E$47,3,FALSE)),\" \",VLOOKUP(I423,Eje_Pilar!$C$2:$E$47,3,FALSE))","v":" "},null,null,null,null,null,null,null,null,{"$f":"+O423+Q423+S423","v":0},null,null,null,null,null,null,null,null,null,null,null,"-",null,{"$f":"IF(SUMPRODUCT((A$14:A423=A423)*(B$14:B423=B423)*(C$14:C423=C423))>1,0,1)","v":0},{"$f":"IFERROR(VLOOKUP(D423,tipo,1,FALSE),\"NO\")","v":"NO"},{"$f":"IFERROR(VLOOKUP(E423,modal,1,FALSE),\"NO\")","v":"NO"},{"$f":"IFERROR(VLOOKUP(F423,Tipo!$C$12:$C$27,1,FALSE),\"NO\")","v":"NO"},{"$f":"IFERROR(VLOOKUP(H423,afectacion,1,FALSE),\"NO\")","v":"NO"},{"$f":"IFERROR(VLOOKUP(I423,programa,1,FALSE),\"NO\")","v":"NO"}]
[null,null,null,null,null,null,null,null,null,{"$f":"IF(ISERROR(VLOOKUP(I424,Eje_Pilar!$C$2:$E$47,2,FALSE)),\" \",VLOOKUP(I424,Eje_Pilar!$C$2:$E$47,2,FALSE))","v":" "},{"$f":"IF(ISERROR(VLOOKUP(I424,Eje_Pilar!$C$2:$E$47,3,FALSE)),\" \",VLOOKUP(I424,Eje_Pilar!$C$2:$E$47,3,FALSE))","v":" "},null,null,null,null,null,null,null,null,{"$f":"+O424+Q424+S424","v":0},null,null,null,null,null,null,null,null,null,null,null,"-",null,{"$f":"IF(SUMPRODUCT((A$14:A424=A424)*(B$14:B424=B424)*(C$14:C424=C424))>1,0,1)","v":0},{"$f":"IFERROR(VLOOKUP(D424,tipo,1,FALSE),\"NO\")","v":"NO"},{"$f":"IFERROR(VLOOKUP(E424,modal,1,FALSE),\"NO\")","v":"NO"},{"$f":"IFERROR(VLOOKUP(F424,Tipo!$C$12:$C$27,1,FALSE),\"NO\")","v":"NO"},{"$f":"IFERROR(VLOOKUP(H424,afectacion,1,FALSE),\"NO\")","v":"NO"},{"$f":"IFERROR(VLOOKUP(I424,programa,1,FALSE),\"NO\")","v":"NO"}]
[null,null,null,null,null,null,null,null,null,{"$f":"IF(ISERROR(VLOOKUP(I425,Eje_Pilar!$C$2:$E$47,2,FALSE)),\" \",VLOOKUP(I425,Eje_Pilar!$C$2:$E$47,2,FALSE))","v":" "},{"$f":"IF(ISERROR(VLOOKUP(I425,Eje_Pilar!$C$2:$E$47,3,FALSE)),\" \",VLOOKUP(I425,Eje_Pilar!$C$2:$E$47,3,FALSE))","v":" "},null,null,null,null,null,null,null,null,{"$f":"+O425+Q425+S425","v":0},null,null,null,null,null,null,null,null,null,null,null,"-",null,{"$f":"IF(SUMPRODUCT((A$14:A425=A425)*(B$14:B425=B425)*(C$14:C425=C425))>1,0,1)","v":0},{"$f":"IFERROR(VLOOKUP(D425,tipo,1,FALSE),\"NO\")","v":"NO"},{"$f":"IFERROR(VLOOKUP(E425,modal,1,FALSE),\"NO\")","v":"NO"},{"$f":"IFERROR(VLOOKUP(F425,Tipo!$C$12:$C$27,1,FALSE),\"NO\")","v":"NO"},{"$f":"IFERROR(VLOOKUP(H425,afectacion,1,FALSE),\"NO\")","v":"NO"},{"$f":"IFERROR(VLOOKUP(I425,programa,1,FALSE),\"NO\")","v":"NO"}]
[null,null,null,null,null,null,null,null,null,{"$f":"IF(ISERROR(VLOOKUP(I426,Eje_Pilar!$C$2:$E$47,2,FALSE)),\" \",VLOOKUP(I426,Eje_Pilar!$C$2:$E$47,2,FALSE))","v":" "},{"$f":"IF(ISERROR(VLOOKUP(I426,Eje_Pilar!$C$2:$E$47,3,FALSE)),\" \",VLOOKUP(I426,Eje_Pilar!$C$2:$E$47,3,FALSE))","v":" "},null,null,null,null,null,null,null,null,{"$f":"+O426+Q426+S426","v":0},null,null,null,null,null,null,null,null,null,null,null,"-",null,{"$f":"IF(SUMPRODUCT((A$14:A426=A426)*(B$14:B426=B426)*(C$14:C426=C426))>1,0,1)","v":0},{"$f":"IFERROR(VLOOKUP(D426,tipo,1,FALSE),\"NO\")","v":"NO"},{"$f":"IFERROR(VLOOKUP(E426,modal,1,FALSE),\"NO\")","v":"NO"},{"$f":"IFERROR(VLOOKUP(F426,Tipo!$C$12:$C$27,1,FALSE),\"NO\")","v":"NO"},{"$f":"IFERROR(VLOOKUP(H426,afectacion,1,FALSE),\"NO\")","v":"NO"},{"$f":"IFERROR(VLOOKUP(I426,programa,1,FALSE),\"NO\")","v":"NO"}]
[null,null,null,null,null,null,null,null,null,{"$f":"IF(ISERROR(VLOOKUP(I427,Eje_Pilar!$C$2:$E$47,2,FALSE)),\" \",VLOOKUP(I427,Eje_Pilar!$C$2:$E$47,2,FALSE))","v":" "},{"$f":"IF(ISERROR(VLOOKUP(I427,Eje_Pilar!$C$2:$E$47,3,FALSE)),\" \",VLOOKUP(I427,Eje_Pilar!$C$2:$E$47,3,FALSE))","v":" "},null,null,null,null,null,null,null,null,0,null,null,null,null,null,null,null,null,null,null,null,"-",null,{"$f":"IF(SUMPRODUCT((A$14:A427=A427)*(B$14:B427=B427)*(C$14:C427=C427))>1,0,1)","v":0},"NO","NO",{"$f":"IFERROR(VLOOKUP(F427,Tipo!$C$12:$C$27,1,FALSE),\"NO\")","v":"NO"},"NO","NO"]
[null,null,null,null,null,null,null,null,null,{"$f":"IF(ISERROR(VLOOKUP(I428,Eje_Pilar!$C$2:$E$47,2,FALSE)),\" \",VLOOKUP(I428,Eje_Pilar!$C$2:$E$47,2,FALSE))","v":" "},{"$f":"IF(ISERROR(VLOOKUP(I428,Eje_Pilar!$C$2:$E$47,3,FALSE)),\" \",VLOOKUP(I428,Eje_Pilar!$C$2:$E$47,3,FALSE))","v":" "},null,null,null,null,null,null,null,null,0,null,null,null,null,null,null,null,null,null,null,null,"-",null,{"$f":"IF(SUMPRODUCT((A$14:A428=A428)*(B$14:B428=B428)*(C$14:C428=C428))>1,0,1)","v":0},"NO","NO",{"$f":"IFERROR(VLOOKUP(F428,Tipo!$C$12:$C$27,1,FALSE),\"NO\")","v":"NO"},"NO","NO"]
[null,null,null,null,null,null,null,null,null,{"$f":"IF(ISERROR(VLOOKUP(I429,Eje_Pilar!$C$2:$E$47,2,FALSE)),\" \",VLOOKUP(I429,Eje_Pilar!$C$2:$E$47,2,FALSE))","v":" "},{"$f":"IF(ISERROR(VLOOKUP(I429,Eje_Pilar!$C$2:$E$47,3,FALSE)),\" \",VLOOKUP(I429,Eje_Pilar!$C$2:$E$47,3,FALSE))","v":" "},null,null,null,null,null,null,null,null,0,null,null,null,null,null,null,null,null,null,null,null,"-",null,{"$f":"IF(SUMPRODUCT((A$14:A429=A429)*(B$14:B429=B429)*(C$14:C429=C429))>1,0,1)","v":0},"NO","NO",{"$f":"IFERROR(VLOOKUP(F429,Tipo!$C$12:$C$27,1,FALSE),\"NO\")","v":"NO"},"NO","NO"]
[null,null,null,null,null,null,null,null,null,{"$f":"IF(ISERROR(VLOOKUP(I430,Eje_Pilar!$C$2:$E$47,2,FALSE)),\" \",VLOOKUP(I430,Eje_Pilar!$C$2:$E$47,2,FALSE))","v":" "},{"$f":"IF(ISERROR(VLOOKUP(I430,Eje_Pilar!$C$2:$E$47,3,FALSE)),\" \",VLOOKUP(I430,Eje_Pilar!$C$2:$E$47,3,FALSE))","v":" "},null,null,null,null,null,null,null,null,{"$f":"+O430+Q430+S430","v":0},null,null,null,null,null,null,null,null,null,null,null,"-",null,{"$f":"IF(SUMPRODUCT((A$14:A430=A430)*(B$14:B430=B430)*(C$14:C430=C430))>1,0,1)","v":0},{"$f":"IFERROR(VLOOKUP(D430,tipo,1,FALSE),\"NO\")","v":"NO"},{"$f":"IFERROR(VLOOKUP(E430,modal,1,FALSE),\"NO\")","v":"NO"},{"$f":"IFERROR(VLOOKUP(F430,Tipo!$C$12:$C$27,1,FALSE),\"NO\")","v":"NO"},{"$f":"IFERROR(VLOOKUP(H430,afectacion,1,FALSE),\"NO\")","v":"NO"},{"$f":"IFERROR(VLOOKUP(I430,programa,1,FALSE),\"NO\")","v":"NO"}]
[null,null,null,null,null,null,null,null,null,{"$f":"IF(ISERROR(VLOOKUP(I431,Eje_Pilar!$C$2:$E$47,2,FALSE)),\" \",VLOOKUP(I431,Eje_Pilar!$C$2:$E$47,2,FALSE))","v":" "},{"$f":"IF(ISERROR(VLOOKUP(I431,Eje_Pilar!$C$2:$E$47,3,FALSE)),\" \",VLOOKUP(I431,Eje_Pilar!$C$2:$E$47,3,FALSE))","v":" "},null,null,null,null,null,null,null,null,{"$f":"+O431+Q431+S431","v":0},null,null,null,null,null,null,null,null,null,null,null,"-",null,{"$f":"IF(SUMPRODUCT((A$14:A431=A431)*(B$14:B431=B431)*(C$14:C431=C431))>1,0,1)","v":0},{"$f":"IFERROR(VLOOKUP(D431,tipo,1,FALSE),\"NO\")","v":"NO"},{"$f":"IFERROR(VLOOKUP(E431,modal,1,FALSE),\"NO\")","v":"NO"},{"$f":"IFERROR(VLOOKUP(F431,Tipo!$C$12:$C$27,1,FALSE),\"NO\")","v":"NO"},{"$f":"IFERROR(VLOOKUP(H431,afectacion,1,FALSE),\"NO\")","v":"NO"},{"$f":"IFERROR(VLOOKUP(I431,programa,1,FALSE),\"NO\")","v":"NO"}]
[null,null,null,null,null,null,null,null,null,{"$f":"IF(ISERROR(VLOOKUP(I432,Eje_Pilar!$C$2:$E$47,2,FALSE)),\" \",VLOOKUP(I432,Eje_Pilar!$C$2:$E$47,2,FALSE))","v":" "},{"$f":"IF(ISERROR(VLOOKUP(I432,Eje_Pilar!$C$2:$E$47,3,FALSE)),\" \",VLOOKUP(I432,Eje_Pilar!$C$2:$E$47,3,FALSE))","v":" "},null,null,null,null,null,null,null,null,0,null,null,null,null,null,null,null,null,null,null,null,"-",null,{"$f":"IF(SUMPRODUCT((A$14:A432=A432)*(B$14:B432=B432)*(C$14:C432=C432))>1,0,1)","v":0},"NO","NO",{"$f":"IFERROR(VLOOKUP(F432,Tipo!$C$12:$C$27,1,FALSE),\"NO\")","v":"NO"},"NO","NO"]
[null,null,null,null,null,null,null,null,null,{"$f":"IF(ISERROR(VLOOKUP(I433,Eje_Pilar!$C$2:$E$47,2,FALSE)),\" \",VLOOKUP(I433,Eje_Pilar!$C$2:$E$47,2,FALSE))","v":" "},{"$f":"IF(ISERROR(VLOOKUP(I433,Eje_Pilar!$C$2:$E$47,3,FALSE)),\" \",VLOOKUP(I433,Eje_Pilar!$C$2:$E$47,3,FALSE))","v":" "},null,null,null,null,null,null,null,null,0,null,null,null,null,null,null,null,null,null,null,null,"-",null,{"$f":"IF(SUMPRODUCT((A$14:A433=A433)*(B$14:B433=B433)*(C$14:C433=C433))>1,0,1)","v":0},"NO","NO",{"$f":"IFERROR(VLOOKUP(F433,Tipo!$C$12:$C$27,1,FALSE),\"NO\")","v":"NO"},"NO","NO"]
[null,null,null,null,null,null,null,null,null,{"$f":"IF(ISERROR(VLOOKUP(I434,Eje_Pilar!$C$2:$E$47,2,FALSE)),\" \",VLOOKUP(I434,Eje_Pilar!$C$2:$E$47,2,FALSE))","v":" "},{"$f":"IF(ISERROR(VLOOKUP(I434,Eje_Pilar!$C$2:$E$47,3,FALSE)),\" \",VLOOKUP(I434,Eje_Pilar!$C$2:$E$47,3,FALSE))","v":" "},null,null,null,null,null,null,null,null,{"$f":"+O434+Q434+S434","v":0},null,null,null,null,null,null,null,null,null,null,null,"-",null,{"$f":"IF(SUMPRODUCT((A$14:A434=A434)*(B$14:B434=B434)*(C$14:C434=C434))>1,0,1)","v":0},{"$f":"IFERROR(VLOOKUP(D434,tipo,1,FALSE),\"NO\")","v":"NO"},{"$f":"IFERROR(VLOOKUP(E434,modal,1,FALSE),\"NO\")","v":"NO"},{"$f":"IFERROR(VLOOKUP(F434,Tipo!$C$12:$C$27,1,FALSE),\"NO\")","v":"NO"},{"$f":"IFERROR(VLOOKUP(H434,afectacion,1,FALSE),\"NO\")","v":"NO"},{"$f":"IFERROR(VLOOKUP(I434,programa,1,FALSE),\"NO\")","v":"NO"}]
["TOTALES",null,null,null,null,null,null,null,null,null,null,null,null,null,{"$f":"SUM(O14:O434)","v":33600562202},{"$f":"SUM(P14:P434)","v":18},-528879611,31,2623798793,35695481384,11261987159]

{"sheet":"Instructivo","index":1,"n_rows":90,"n_cols":4,"rows_kept":90,"cut":false,"hidden":false,"merged":[[1,1,1,3],[2,1,2,3],[4,1,4,3],[5,1,5,3],[6,1,6,3],[8,1,8,3],[9,1,9,3],[10,1,10,3],[3,1,3,3],[23,1,23,3],[12,1,12,3],[7,1,7,3],[63,1,63,3],[24,1,25,1],[24,2,25,2],[28,1,29,1],[28,2,29,2],[30,1,50,1],[32,2,33,2],[51,1,53,1],[51,2,53,2],[56,1,58,1],[57,2,58,2],[60,1,61,1],[87,1,87,3],[64,1,66,1],[64,2,66,2],[67,1,68,1],[67,2,68,2],[70,1,71,1],[70,2,71,2],[73,1,76,1],[73,2,76,2],[79,1,79,3],[80,1,81,1],[80,2,81,2]]}
[]
[null,"OBSERVACIONES INICIALES"]
[null,"Recomendamos leer cuidadosamente y poner en práctica las instrucciones que se explican en este instructivo. De la calidad de la información que se registre, depende en gran medida la calidad del informe de rendición de cuentas de la Gestión Contractual que presenta el Alcalde Mayor, consolidado por la Veeduría Distrital."]
[null,"La base en Excel a diligenciar es inmodificable, debe utilizar versión Excel 2010 o posteriores, la versión 2007 no habilita los macros.  La base no permite que se incluyan columnas con otro tipo de información que la Veeduría Distrital no está solicitando o que se cambie el formato de celda establecido. Tenga en cuenta que muchas celdas están bloqueadas y/o solo permiten el registro de una información determinada."]
[null,"La información que se registre en la base, debe coincidir con los reportes realizados en PREDIS y en el SECOP"]
[null,"Diligencie la totalidad de celdas."]
[null,"Para insertar una o varias filas, haga click  en el opción Insertar Filas y digite el número de filas a insertar. Si usted no sigue este procedimiento las filas que copie no tomaran el formato de las filas anteriores."]
[null,"Si requiere inserte una o varias filas realícelo despues de la fila A15 y antes de la fila de Totales para que tomen el formato de las filas anteriores."]
[null,"En primer lugar diligencie toda la información correspondiente a los contratos suscritos con cargo a la vigencia 2019."]
[null,"Una vez incluidos todos los contratos de la vigencia 2019, a continuación diligencie el formato completo con la información correspondiente a las adiciones efectuadas con cargo a la vigencia 2019 de contratos suscritos en vigencias anteriores. La información general del contrato como: modalidad de selección, tipología contractual, objeto, entre otros, debe corresponder a la información del contrato adicionado o modificado. Respecto al valor solo se diligencia el valor en la columna adiciòn, es decir la columna de valor inicial debe quedar en blanco. No olvide registrar el nùmero de adiciones realizadas, en la columna correspondiente."]
[null,"En caso de haber realizado apropiaciones presupuestales en la vigencia a través de resoluciones, caja menor, honorarios ediles, servicios públicos, debe relacionar dicha información en una sola fila al final de la base, indicando de que se trata la apropiación y número de proyecto si hay lugar a ello. En el tipo de contrato se registra Otros gastos."]
[]
[null,"ENCABEZADO DEL FORMATO"]
[null,1,"Entidad","Indique el nombre completo de la Entidad."]
[null,2,"Sector","Relacione el sector al cual pertenece la Entidad."]
[null,3,"Presupuesto Disponible Inversión Directa","Indique el valor total del presupuesto disponible de inversión directa, de acuerdo con el PREDIS, a 31 de diciembre de 2019."]
[null,4,"Presupuesto Comprometido de Inversión Directa ","Escriba el valor total del presupuesto comprometido de inversión directa, de acuerdo con el PREDIS a 31 de diciembre de 2019."]
[null,5,"Presupuesto Disponible Funcionamiento","Indique el valor total del presupuesto de funcionamiento disponible, de acuerdo con el PREDIS a 31 de diciembre de 2019."]
[null,6,"Presupuesto Comprometido funcionamiento ","Escriba el monto del presupuesto de funcionamiento, comprometido mediante contratos, de acuerdo con el PREDIS a 31 de diciembre de 2019."]
[null,7,"Presupuesto Disponible Operación","Coloque el monto del presupuesto de operación disponible, de acuerdo con el PREDIS, a 31 de diciembre de 2019. Los gastos de operación corresponden solamente a aquellas entidades de régimen de contratación  privado."]
[null,8,"Presupuesto Comprometido operación mediante contratos","Escriba el monto del presupuesto de operación comprometido mediante contratos a 31 de diciembre de 2019."]
[null,9,"Nombre de quien diligencia el formato:","Indique el nombre completo, cargo, número de teléfono con extensión y correo electrónico del profesional que diligencia el formato y que posteriormente realizará los ajustes y aclaraciones a que haya lugar por solicitud de la Veeduría Distrital."]
[]
[null,"1- INFORMACIÓN GENERAL"]
[null,1,"Número de Contrato","En estricto orden consecutivo registre el número del contrato, sin incluir los contratos que fueron anulados."]
[null,null,null,"Una vez terminado el registro de los contratos con cargo a la vigencia 2019, en las siguientes filas registre la información correspondiente a las adiciones efectuadas con cargo a la vigencia 2019 de contratos suscritos en vigencias anteriores, especificando el año de suscripción en la columna dos."]
[null,2,"Año","Registre el año de celebración del contrato."]
[null,3,"Número de proceso en el SECOP","Relacione el número de proceso con el cual se encuentra publicado el contrato en el SECOP. Ejemplo IDU-CMA-DTDP-240-2019"]
[null,4,"Tipo de Contrato","En esta columna seleccione de la lista el tipo de contrato que corresponde al contrato suscrito. El formato no permite incluir tipo de contratos diferentes a los señaladas en la lista desplegable.  "]
[null,null,null,"Para las adiciones a contratos de años anteriores se debe diligenciar el tipo del contrato adicionado o modificado."]
[null,4,"Obra ","Son contratos de obra los que celebren las entidades estatales para la construcción, mantenimiento, instalación y, en general, para la realización de cualquier otro trabajo material sobre bienes inmuebles, cualquiera que sea la modalidad de ejecución y pago. Numeral 1 del Artículo 32 de la Ley 80 de 1993. "]
[null,null,"Consultoría","Aquellos que celebran las entidades estatales, referidos a los estudios necesarios para la ejecución de proyectos de inversión, de diagnósticos, prefactibilidad o factibilidad para programas o proyectos específicos, así como a las asesorías técnicas de coordinación, control y supervisión. Numeral 2 del Artículo 32 de la Ley 80 de 1993. "]
[null,null,"Interventoría","Son también  contratos de consultoría los que tienen por objeto la Interventoría, asesoría, gerencia de obras o de proyectos, dirección, programación y la ejecución de diseños, planos, anteproyectos y proyectos. Numeral 2 del Artículo 32 de la Ley 80 de 1993."]
[null,null,null,"El contrato de Interventoría tiene por objeto la  supervisión, seguimiento y vigilancia a la ejecución material de un contrato principal."]
[null,null,"Contrato de Prestación de servicios","Son contratos de prestación de servicios los que celebren las entidades estatales para desarrollar actividades relacionadas con la administración o funcionamiento de la entidad. Numeral 3 del Artículo 32 de la Ley 80 de 1993."]
[null,null,"Contrato de Prestación de servicios profesionales y de apoyo a la gestión","Corresponden a aquellos de naturaleza intelectual diferentes a los de consultoría que se derivan del cumplimiento de las funciones de la entidad estatal; así como los relacionados con actividades operativas, logísticas, o asistenciales. Art. 2.2.1.2.1.4.9, Decreto 1082 de 2015"]
[null,null,"Compraventa de bienes muebles","Son aquellos contratos donde se transfiere el dominio de un bien mueble (aquellos susceptibles de ser trasladadas de un lugar a otro sin alterar ni su forma ni su esencia, tal es el caso del mobiliario y equipo de oficina, maquinaria, automóviles, etc.), cuya ejecución se agota de manera instantánea. Artículo 660, Código Civil."]
[null,null,"Compraventa de bienes inmuebles","Son aquellos contratos donde se transfiere el dominio de un bien inmueble (todos aquellos bienes considerados bienes raíces, por tener de común la circunstancia de estar íntimamente ligados al suelo, unidos de modo inseparable, física o jurídicamente, al terreno). Artículo 656, Código Civil."]
[null,null,"Arrendamiento de bienes muebles","Es un contrato que tiene por objeto, conceder el uso y goce de un bien mueble a cambio de un precio determinado.  Artículo 1974 Código Civil."]
[null,null,"Arrendamiento de bienes inmuebles","Es un contrato que tiene por objeto, conceder el uso y goce de un bien inmueble a cambio de un precio determinado.  Artículo 2.2.1.2.1.4.11 Decreto 1082 de 2015"]
[null,null,"Seguros","El seguro es un contrato, en virtud del cual una persona jurídica llamada asegurador, asume, a cambio de una prima, un riesgo que le es trasladado por una persona natural o jurídica llamado tomador y en el cual éste tiene un interés asegurable, con el fin de indemnizarlo, en el evento de que ocurra la realización del riesgo amparado. de conformidad con el Título V, del Libro Cuarto del Código de Comercio "]
[null,null,"Suministro","El suministro es el contrato por el cual una parte se obliga, a cambio de una contraprestación, a cumplir en favor de otra, en forma independiente, prestaciones periódicas o continuadas de cosas o servicios. Artículo 968, Código de Comercio"]
[null,null,"Empréstitos","Son contratos de empréstito los que tienen por objeto proveer a la entidad estatal contratante de recursos en moneda nacional o extranjera con plazo para su pago. Artículo 7,  Decreto 2681 de 1996. "]
[null,null,"Fiducia mercantil o encargo fiduciario","Son contratos que tienen por objeto la administración o el manejo de los recursos vinculados a los contratos que tales entidades celebren. Numeral 5 de Articulo 32 de la Ley 80 de 1993."]
[null,null,"Concesión","Este contrato tiene por objeto otorgar a una persona llamada CONCESIONARIO  la prestación, operación, explotación, organización o gestión, total o parcial, de un servicio público, o la construcción, explotación o conservación total o parcial, de una obra o bien destinados al servicio o uso público, así como todas aquellas actividades necesarias para la adecuada prestación o funcionamiento de la obra o servicio por cuenta y riesgo del CONCESIONARIO, y bajo la vigilancia y control de la entidad concedente, a cambio de una remuneración que puede consistir en derechos, tarifas, tasas, valorización, o en la participación que se le otorgue en la explotación del bien, obra o servicio, o en una suma periódica, única o porcentual, y en general, en cualquier otra modalidad de contraprestación que las partes acuerden. Numeral 4 del Artículo 32 de la Ley 80 de 1993 "]
[null,null,"Convenios de cooperación","Son aquellos mediante los cuales se formaliza la asistencia, ayuda, auxilio, soporte o colaboración entre entidades de una misma nación, de distintos países o por parte de organizaciones internacionales de naturaleza pública o privada a favor de entidades públicas. Artículo 20 de la ley 1150"]
[null,null,"Convenios/Contratos interadministrativos","El convenio interadministrativo es el negocio jurídico en el cual están presentes dos entidades públicas en desarrollo de relaciones interadministrativas cuyo objeto es coordinar, cooperar, colaborar o distribuir competencias en la realización de funciones administrativas de interés común a los sujetos negóciales. Artículo 95 de la ley 489 de 1998."]
[null,null,"Convenios de Apoyo y/o Convenios de Asociación","Los contratos que en desarrollo de lo dispuesto en el segundo inciso del artículo 355 de la Constitución Política celebren la Nación, los Departamentos, Distritos y Municipios con entidades privadas sin ánimo de lucro y de reconocida idoneidad, con el propósito de impulsar programas y actividades de interés público.  Reglamentado mediante Decreto 92 de 2017"]
[null,null,"Asociaciones Público Privadas","Los contratos con personas naturales o jurídicas que se celebran en desarrollo de lo dispuesto en el Decreto 1508 de 2012."]
[null,null,"Otros","Los demás tipos de contratos que no se encuentren definidos en las anteriores tipologías."]
[null,null,"Otros gastos","Incluye los gastos no contractuales, estos se registran al final de la base, no cuentan con nùmero de contrato, tipo, proceso o modalidad.  Estos gastos en los que no media un acuerdo de voluntades, en caso de ser del rubro de inversiòn, se deben discriminar por programa y proyecto. En el caso de ser del rubro de funcionamiento no requieren ser discriminados."]
[null,5,"Modalidad de Selección","Al ubicarse en la celda, se despliega una lista de modalidades de selección, de las cuales debe seleccionar la indicada. El formato no permite incluir modalidades diferentes a las señaladas en la lista desplegable.  "]
[null,null,null,"Para las adiciones a contratos de años anteriores se debe diligenciar la modalidad de selección del contrato adicionado o modificado"]
[null,null,null,"La modalidad regimen especial se refiere a todos los contratos realizados en cumplimiento del Decreto 092 de 2017, convenios de asociaciòn con ESAL. Regimen Privado es para todas aquellas entidades, que no se rigen por el Estatuto General de Contrataciòn, para el caso, en estas entidades todos sus contratos deben ser identificados con esta modalidad."]
[null,6,"Procedimiento o causal","Esta columna solo se habilita y debe ser diligenciada, para las modalidades de selección abreviada y contratación directa. Al ubicarse en la celda, se despliega una lista de procedimientos o causales, de las cuales debe seleccionar la indicada. El formato no permite incluir procedimientos o causales diferentes a las señaladas en la lista desplegable.  "]
[null,7,"Objeto","Registre el objeto del contrato."]
[null,8,"Afectación ","Registre la afectación según la clasificación de cuentas del presupuesto de gastos. Funcionamiento, Inversión y Operación, esta última aplica únicamente para entidades de régimen privado. La celda solamente permite registrar estas tres opciones."]
[null,null,"Número Programa","Si en la columna anterior “Afectación”,  indicó funcionamiento u operación deje en blanco el número de programa, es decir esta columna solamente aplica para gastos de Inversión."]
[null,null,null,"Identifíquelo de acuerdo con el código presupuestal del plan de desarrollo Bogotá Mejor Para Todos. Si un mismo contrato afecta más de un código presupuestal discrimine el contrato por cada código que afecte en filas separadas. Si se registra el número del programa (de 1 a 45), automáticamente en la columna j y k se despliega el nombre del programa y el eje o pilar según corresponda."]
[null,9,"Número Proyecto","Indique el código presupuestal con el que se identifica el proyecto. Si un mismo contrato afecta más de un proyecto, discriminar el contrato por cada proyecto que afecte en filas separadas."]
[null,10,"Número de Identificación del contratista","Indicar el número de identificación del contratista persona natural o jurídica con quien se suscribió el contrato, con digito de verificación (DV), el formato de celda no permite guiones, puntos o comas, solo números. "]
[null,null,"Nombre del Contratista","Indicar el nombre del contratista, persona natural o jurídica."]
[]
[null,"2- INFORMACIÓN FINANCIERA"]
[null,11,"Valor Inicial ","Registre el valor inicial del contrato con cargo a la vigencia 2019, el formato de celda no permite guiones, puntos, comas o texto escrito. Esta columna solo debe contener información numérica."]
[null,null,null,"En el caso de adiciones a contratos de años anteriores,  no diligencie esta columna, solamente la columna 15 \"Adiciones\" "]
[null,null,null,"Excluya las reservas de apropiación y cuentas por pagar."]
[null,12,"Número de reducciones ","Diligencie esta columna solo en el caso de reducciones, reintegros, liberaciones, saldos a favor o cualquier factor que disminuya el valor de los contratos con cargo a la vigencia."]
[null,null,null,"Registre en esta celda la cantidad de reducciones que se realizaron al contrato."]
[null,13,"Valor total reducciones (En valor negativo)","Registre el valor total de las reducciones que se realizaron al contrato, el formato de celda no permite guiones, puntos, comas o texto escrito. Esta columna solo debe contener información numérica."]
[null,14,"Número de adiciones ","Diligencie esta columna solo en el caso de adiciones al valor inicial que aumenten el valor del contrato con cargo a la vigencia."]
[null,null,null,"Registre en esta celda el número de adiciones que se realizaron al contrato."]
[null,15,"Valor total de adiciones","Registre el valor total de las adiciones que se realizaron al contrato,  el formato de celda no permite guiones, puntos, comas o texto escrito. Esta columna solo debe contener información numérica."]
[null,16,"Valor Final","Esta columna se encuentra formulada y bloqueada, sí el valor final no coincide, es porque están mal diligenciadas las columnas valor inicial, valor de reducciones y/o valor de adiciones. En tal caso se debe verificar dicha información."]
[null,null,null,"La sumatoria de la columna 16 (valor final) para los contratos de Inversión Directa, según el programa del Plan de Desarrollo, deberá coincidir con el rubro registrado en el encabezado 4, Presupuesto comprometido de inversión según PREDIS, este valor debe coincidir a la vez con los informes de ejecución presupuestal del PREDIS.  "]
[null,null,null,"Si los valores no coinciden debe especificarse al final del formato en qué está representada la diferencia Otros gastos(discriminando los conceptos por Programa y Proyecto de inversión), con sus respectivos valores."]
[null,null,null,"Las bases donde dichos valores no coincidan serán devueltas por la Veeduría Distrital a cada entidad para los respectivos ajustes."]
[null,17,"Giros"," "]
[]
[null,"3- PLAZOS"]
[null,18,"Fecha de Suscripción","Relacionar la fecha en que se suscribió el contrato original. La celda solo admite el formato Día/Mes/Año así  17/02/2019."]
[null,null,null,"Para las adiciones a contratos de años anteriores se debe registrar en esta columna la fecha de suscripción de la adición en la vigencia 2019."]
[null,19,"Fecha de inicio","Indicar la fecha de inicio del contrato. Para las adiciones a contratos de años anteriores se debe diligenciar la fecha de inicio de la adición en la vigencia 2019. La celda solo admite el formato Día/Mes/Año así  13/03/2019."]
[null,20,"Fecha de terminación","Indicar la fecha efectiva de terminación del contrato. La celda solo admite el formato Día/Mes/Año así  15/02/2019."]
[null,21,"Plazo en días","Esta columna contiene el plazo inicial del contrato con el número total de días a ejecutar (sólo número de días, no mes, no texto)."]
[null,22,"Prórroga en días","En caso de presentarse este evento, indicar en días, el tiempo por el cual se prorrogó el contrato a partir de la fecha inicial de terminación (sólo número de días, no mes, no texto)."]
[]
[null,"4- ESTADO A 31 DE DICIEMBRE DE 2019"]
[null,23,"Estado","Marque con una X en la respectiva columna si el contrato se encuentra Anulado, Por Iniciar, En Ejecución, Terminado o Liquidado."]
[null,24,"% Avance y/o cumplimiento","Indica el porcentaje de avance o de cumplimiento del mismo en términos presupuestales, es decir lo efectivamente pagado al contratista. Si no se ha iniciado la ejecución, él % de avance es 0%. La celda se encuentra formulada y protegida. Es la relación entre el valor de los giros y el valor final del contrato. Si el porcentaje de avance no coincide, se debe revisar los valores que se registraron en estas columnas.  Este porcentaje no debe ser superior al 100%"]

{"sheet":"Tipo","index":2,"n_rows":31,"n_cols":4,"rows_kept":31,"cut":false,"hidden":true,"merged":[]}
[null,"Tipo","Modalidad de Selección","afectacion"]
[1,"Obra pública","Concurso de méritos","Funcionamiento"]
[2,"Consultoría","Contratación directa","Inversión"]
[3,"Interventoría","Contratación mínima cuantia","Operación"]
[4,"Contratos de prestación de servicios","Selección abreviada"]
[5,"Contratos de prestación de servicios profesionales y de apoyo a la gestión","Licitación pública"]
[6,"Compraventa de bienes muebles","Régimen privado"]
[7,"Compraventa de bienes inmuebles","Régimen especial"]
[8,"Arrendamiento de bienes muebles"]
[9,"Arrendamiento de bienes inmuebles"]
[10,"Seguros","Selección abreviada"]
[11,"Suministro","Subasta inversa "]
[12,"Empréstitos","Bolsas de productos"]
[13,"Fiducia mercantil o encargo fiduciario","Acuerdo marco de precios "]
[14,"Concesión ","Selección abreviada por menor cuantía "]
[15,"Convenios de cooperacion"]
[16,"Contratos interadministrativos","contratacion directa"]
[17,"Convenios de apoyo y/o convenios de asociación ","Urgencia manifiesta"]
[18,"Asociaciones público privadas","Contratación de empréstitos"]
[19,"Otros","Contratos interadministrativos"]
[20,"Otros gastos","Contratación de bienes y servicios en el sector Defensa y en el Departamento Administrativo de Seguridad, DAS"]
[null,null,"Contratos para el desarrollo de actividades científicas y tecnológicas"]
[null,null,"Contratos de encargo fiduciario que celebren las entidades territoriales cuando inician el Acuerdo de Reestructuración de Pasivos"]
[null,null,"Cuando no exista pluralidad de oferentes en el mercado"]
[null,null,"Prestación de servicios profesionales y de apoyo a la gestión, o para la ejecución de trabajos artísticos que sólo puedan encomendarse a determinadas personas naturales;"]
[null,null,"El arrendamiento o adquisición de inmuebles"]
[null,null,"Contratación de bienes y servicios de la Dirección Nacional de Inteligencia (DNI)"]
[]
[]
[null,null,"Decreto 92 de 2017"]
[null,null,"No aplica"]

{"sheet":"Eje_Pilar","index":3,"n_rows":47,"n_cols":5,"rows_kept":47,"cut":false,"hidden":false,"merged":[]}
[]
[null,null,"Código","Programa - Bogotá Mejor para Todos","Pilar /Eje"]
[null,null,1,"Prevención y atención de la maternidad y la paternidad tempranas","Pilar 1 Igualdad de Calidad de Vida"]
[null,null,2,"Desarrollo integral desde la gestación hasta la adolescencia","Pilar 1 Igualdad de Calidad de Vida"]
[null,null,3,"Igualdad y autonomía para una Bogotá incluyente","Pilar 1 Igualdad de Calidad de Vida"]
[null,null,4,"Familias protegidas y adaptadas al cambio climático","Pilar 1 Igualdad de Calidad de Vida"]
[null,null,5,"Desarrollo integral para la felicidad y el ejercicio de la ciudadanía","Pilar 1 Igualdad de Calidad de Vida"]
[null,null,6,"Calidad educativa para todos","Pilar 1 Igualdad de Calidad de Vida"]
[null,null,7,"Inclusión educativa para la equidad","Pilar 1 Igualdad de Calidad de Vida"]
[null,null,8,"Acceso con calidad a la educación superior","Pilar 1 Igualdad de Calidad de Vida"]
[null,null,9,"Atención integral y eficiente en salud","Pilar 1 Igualdad de Calidad de Vida"]
[null,null,10,"Modernización de la infraestructura física y tecnológica en salud","Pilar 1 Igualdad de Calidad de Vida"]
[null,null,11,"Mejores oportunidades para el desarrollo a través de la cultura, la recreación y el deporte","Pilar 1 Igualdad de Calidad de Vida"]
[null,null,12,"Mujeres protagonistas, activas y empoderadas en el cierre de brechas de género","Pilar 1 Igualdad de Calidad de Vida"]
[null,null,13,"Infraestructura para el desarrollo del hábitat","Pilar 2 Democracía Urbana"]
[null,null,14,"Intervenciones integrales del hábitat","Pilar 2 Democracía Urbana"]
[null,null,15,"Recuperación, incorporación, vida urbana y control de la ilegalidad","Pilar 2 Democracía Urbana"]
[null,null,16,"Integración social para una ciudad de oportunidades","Pilar 2 Democracía Urbana"]
[null,null,17,"Espacio público, derecho de todos","Pilar 2 Democracía Urbana"]
[null,null,18,"Mejor movilidad para todos","Pilar 2 Democracía Urbana"]
[null,null,19,"Seguridad y convivencia para todos","Pilar 3 Construcción de Comunidad y Cultura Ciudadana"]
[null,null,20,"Fortalecimiento del Sistema de Protección Integral a Mujeres Víctimas de Violencia - SOFIA","Pilar 3 Construcción de Comunidad y Cultura Ciudadana"]
[null,null,21,"Justicia para todos: consolidación del Sistema Distrital de Justicia","Pilar 3 Construcción de Comunidad y Cultura Ciudadana"]
[null,null,22,"Bogotá vive los derechos humanos","Pilar 3 Construcción de Comunidad y Cultura Ciudadana"]
[null,null,23,"Bogotá mejor para las víctimas, la paz y la reconciliación","Pilar 3 Construcción de Comunidad y Cultura Ciudadana"]
[null,null,24,"Equipo por la educación para el reencuentro, la reconciliación y la paz","Pilar 3 Construcción de Comunidad y Cultura Ciudadana"]
[null,null,25,"Cambio cultural y construcción del tejido social para la vida","Pilar 3 Construcción de Comunidad y Cultura Ciudadana"]
[null,null,26,"Información relevante e integral para la planeación territorial","Eje Transversal 1 Nuevo Ordenamiento Territorial"]
[null,null,27,"Proyectos urbanos integrales con visión de ciudad","Eje Transversal 1 Nuevo Ordenamiento Territorial"]
[null,null,28,"Suelo para reducir el déficit habitacional de suelo urbanizable, vivienda y soportes urbanos","Eje Transversal 1 Nuevo Ordenamiento Territorial"]
[null,null,29,"Articulación regional y planeación integral del transporte","Eje Transversal 1 Nuevo Ordenamiento Territorial"]
[null,null,30,"Financiación para el Desarrollo Territorial","Eje Transversal 1 Nuevo Ordenamiento Territorial"]
[null,null,31,"Fundamentar el desarrollo económico en la generación y uso del conocimiento para mejorar la competitividad de la Ciudad Región","Eje Transversal 2 Desarrollo Económico basado en el conocimiento"]
[null,null,32,"Generar alternativas de ingreso y empleo de mejor calidad","Eje Transversal 2 Desarrollo Económico basado en el conocimiento"]
[null,null,33,"Elevar la eficiencia de los mercados de la ciudad","Eje Transversal 2 Desarrollo Económico basado en el conocimiento"]
[null,null,34,"Mejorar y fortalecer el recaudo tributario de la ciudad e impulsar el uso de mecanismos de vinculación de capital privado","Eje Transversal 2 Desarrollo Económico basado en el conocimiento"]
[null,null,35,"Bogotá, ciudad inteligente","Eje Transversal 2 Desarrollo Económico basado en el conocimiento"]
[null,null,36,"Bogotá, una ciudad digital","Eje Transversal 2 Desarrollo Económico basado en el conocimiento"]
[null,null,37,"Consolidar el turismo como factor de desarrollo, confianza y felicidad para Bogotá Región","Eje Transversal 2 Desarrollo Económico basado en el conocimiento"]
[null,null,38,"Recuperación y manejo de la Estructura Ecológica Principal","Eje Transversal 3 Sostenibilidad Ambiental basada en la eficiencia energética"]
[null,null,39,"Ambiente sano para la equidad y disfrute del ciudadano","Eje Transversal 3 Sostenibilidad Ambiental basada en la eficiencia energética"]
[null,null,40,"Gestión de la huella ambiental urbana","Eje Transversal 3 Sostenibilidad Ambiental basada en la eficiencia energética"]
[null,null,41,"Desarrollo rural sostenible","Eje Transversal 3 Sostenibilidad Ambiental basada en la eficiencia energética"]
[null,null,42,"Transparencia, gestión pública y servicio a la ciudadanía","Eje Transversal 4 Gobierno Legitimo, Fortalecimiento Local y Eficiencia"]
[null,null,43,"Modernización institucional","Eje Transversal 4 Gobierno Legitimo, Fortalecimiento Local y Eficiencia"]
[null,null,44,"Gobierno y ciudadanía digital","Eje Transversal 4 Gobierno Legitimo, Fortalecimiento Local y Eficiencia"]
[null,null,45,"Gobernanza e influencia local, regional e internacional","Eje Transversal 4 Gobierno Legitimo, Fortalecimiento Local y Eficiencia"]