{"text_format":"1","workbook":"xlsx","n_sheets":5,"sheets":["Formato a Dici 31 de 2016","Instructivo","Equivalencia BH-BMPT","Tipo ","Hoja1"],"not_rendered":{"charts":0,"images":0,"macros":1,"external_links":0,"defined_names":8,"comments":0,"pivot_tables":0},"unopened":[],"bounds":{"document_bytes":16777216,"sheet_cells":100000,"rows_first":2000,"rows_last":500,"rows_between":2000,"halvings":0,"cell_chars":16384,"cell_head_chars":4096},"cells_cut":0,"cells_raw":0,"read":"whole","date_system":"1900"}

{"sheet":"Formato a Dici 31 de 2016","index":0,"n_rows":215,"n_cols":34,"rows_kept":215,"cut":false,"hidden":false,"merged":[[5,0,5,3],[3,9,3,10],[9,26,9,30],[11,30,12,30],[11,29,12,29],[5,9,5,10],[5,21,5,31],[6,0,6,13],[6,21,6,31],[7,0,7,3],[7,5,7,7],[7,9,8,13],[7,21,7,31],[8,0,8,3],[8,5,8,7],[8,21,8,31],[1,0,1,31],[2,0,2,31],[3,0,3,3],[3,12,3,13],[4,0,4,3],[4,9,4,10],[4,21,4,31],[3,20,3,31],[11,2,12,2],[11,3,12,3],[11,9,11,11],[11,0,12,0],[11,28,12,28],[11,5,12,5],[11,7,12,7],[11,12,11,13],[11,14,12,14],[11,16,12,16],[11,18,12,18],[11,19,12,19],[11,20,12,20],[9,0,9,13],[9,14,9,20],[9,21,9,25],[10,12,10,13],[10,3,10,4],[10,8,10,10],[10,26,10,30],[11,31,12,31],[11,21,12,21],[11,22,12,22],[11,23,12,23],[11,24,12,24],[11,27,12,27]]}
[]
["VEEDURIA DISTRITAL - RENDICION DE CUENTAS DE LA GESTION CONTRACTUAL EN EL DISTRITO CAPITAL (Acuerdo 380 de 2009)"]
["INFORMACION GENERAL DE CONTRATACION ENTIDADES DISTRITALES -  ENERO 1 A DICIEMBRE 31 DE 2017"]
["1, Entidad:",null,null,null,"FONDO DE DESARROLLO LOCL DE SANTA FE",null,null,"2, Sector:",null,null,null,null,null,null,null,null,null,null,null,null,"9, Nombre de quien diligencia el formato:"]
["3, Presupuesto Disponible Inversión directa PREDIS:",null,null,null,null,null,null,"5, Presupuesto Disponible Funcionamiento PREDIS:"]
["4, Presupuesto comprometido de inversión según PREDIS :",null,null,null,null,null,null,"6, Presupuesto comprometido funcionamiento según PREDIS",null,null,null,null,null,null,null,null,null,null,null,null,"Cargo:"]
[null,null,null,null,null,null,null,null,null,null,null,null,null,null,null,null,null,null,null,null,"Dependencia"]
["7, Presupuesto Disponible Operación (Regimen Privado):",null,null,null,null,null,null,null,null,null,null,null,null,null,null,null,null,null,null,null,"Teléfono: "]
["8, Presupuesto comprometido operación mediante contratos:",null,null,null,null,null,null,null,null,null,null,null,null,null,null,null,null,null,null,null,"Correo Electrónico"]
["1- INFORMACION GENERAL",null,null,null,null,null,null,null,null,null,null,null,null,null,"2- INFORMACION FINANCIERA",null,null,null,null,null,null,"3 - PLAZOS ",null,null,null,null,"4 - ESTADO ",null,null,null,null,"5. %  Avance y/o cumplimiento"]
[1,2,3,4,null,5,6,7,8,null,null,9,10,null,11,12,13,14,15,16,17,18,19,20,21,22,23,null,null,null,null,24]
["Número Contrato",null,"Número de proceso SECOP","Tipo de Contrato        ",null,"Modalidad de Selección",null,"Objeto",null,"Presupuesto",null,null,"Contratista",null,"Valor Inicial del contrato",null,"Valor total reducciones (En valor negativo)",null,"Valor total de adiciones ","Valor Final ","Giros\n(Valor en pesos)","Fecha de suscripción (DD/MM/AAAA)","Fecha de inicio (DD/MM/AAAA)","Fecha de terminación (DD/MM/AAAA)","Plazo en días","Prórroga",null,"Celebrado o por iniciar","En Ejecución","Terminado","Liquidado","% Avance y/o Cumplimiento"]
[null,"Año",null,null,"Equivalencia Tipo de contrato ",null,"Procedimiento o causal",null,"Afectación ","Número Programa","Equivalencia número de programa","Número Proyecto","Número  de Identificación\ndel contratista","Nombre del contratista",null,"Número de reducciones en valor",null,"Número de adiciones en valor",null,null,null,null,null,null,null,"Prorroga en días","Anulado"]
[1,2017,"17-13-6086637",4,{"$f":"IF(D14=1,'Tipo '!$B$2,IF(D14=2,'Tipo '!$B$3,IF(D14=3,'Tipo '!$B$4,IF(D14=4,'Tipo '!$B$5,IF(D14=5,'Tipo '!$B$6,IF(D14=6,'Tipo '!$B$7,IF(D14=7,'Tipo '!$B$8,IF(D14=8,'Tipo '!$B$9,IF(D14=9,'Tipo '!$B$10,IF(D14=10,'Tipo '!$B$11,IF(D14=11,'Tipo '!$B$12,IF(D14=12,'Tipo '!$B$13,IF(D14=13,'Tipo '!$B$14,IF(D14=14,'Tipo '!$B$15,IF(D14=15,'Tipo '!$B$16,IF(D14=16,'Tipo '!$B$17,IF(D14=17,'Tipo '!$B$18,IF(D14=18,'Tipo '!$B$19,IF(D14=19,'Tipo '!$B$20,\"No ha seleccionado un tipo de contrato válido\")))))))))))))))))))","v":"CONTRATOS DE PRESTACIÓN DE SERVICIOS"},"Contratación directa","Prestación de servicios profesionales y de apoyo a la gestión, o para la ejecución de trabajos artísticos que sólo puedan encomendarse a determinadas personas naturales;","CONTRATAR EL SERVICIO DE REVISION, INSPECCION, MANTENIMIENTO Y RECARGA DE EXTINTORES DEL EDIFICIO DE LA ALCALDIA LOCAL DE SANTA FE, CASA DE LA PARTICIPACIÓN, UNIDAD DE MEDIACIÓN Y CONCILIACIÓN, BODEGA Y CASA SAN BERNANDO","Funcionamiento",1,{"$f":"IF(J14=1,'Equivalencia BH-BMPT'!$D$2,IF(J14=2,'Equivalencia BH-BMPT'!$D$3,IF(J14=3,'Equivalencia BH-BMPT'!$D$4,IF(J14=4,'Equivalencia BH-BMPT'!$D$5,IF(J14=5,'Equivalencia BH-BMPT'!$D$6,IF(J14=6,'Equivalencia BH-BMPT'!$D$7,IF(J14=7,'Equivalencia BH-BMPT'!$D$8,IF(J14=8,'Equivalencia BH-BMPT'!$D$9,IF(J14=9,'Equivalencia BH-BMPT'!$D$10,IF(J14=10,'Equivalencia BH-BMPT'!$D$11,IF(J14=11,'Equivalencia BH-BMPT'!$D$12,IF(J14=12,'Equivalencia BH-BMPT'!$D$13,IF(J14=13,'Equivalencia BH-BMPT'!$D$14,IF(J14=14,'Equivalencia BH-BMPT'!$D$15,IF(J14=15,'Equivalencia BH-BMPT'!$D$16,IF(J14=16,'Equivalencia BH-BMPT'!$D$17,IF(J14=17,'Equivalencia BH-BMPT'!$D$18,IF(J14=18,'Equivalencia BH-BMPT'!$D$19,IF(J14=19,'Equivalencia BH-BMPT'!$D$20,IF(J14=20,'Equivalencia BH-BMPT'!$D$21,IF(J14=21,'Equivalencia BH-BMPT'!$D$22,IF(J14=22,'Equivalencia BH-BMPT'!$D$23,IF(J14=23,'Equivalencia BH-BMPT'!D24,IF(J14=24,'Equivalencia BH-BMPT'!$D$25,IF(J14=25,'Equivalencia BH-BMPT'!$D$26,IF(J14=26,'Equivalencia BH-BMPT'!$D$27,IF(J14=27,'Equivalencia BH-BMPT'!$D$28,IF(J14=28,'Equivalencia BH-BMPT'!$D$29,IF(J14=29,'Equivalencia BH-BMPT'!$D$30,IF(J14=30,'Equivalencia BH-BMPT'!$D$31,IF(J14=31,'Equivalencia BH-BMPT'!$D$32,IF(J14=32,'Equivalencia BH-BMPT'!$D$33,IF(J14=33,'Equivalencia BH-BMPT'!$D$34,IF(J14=34,'Equivalencia BH-BMPT'!$D$35,IF(J14=35,'Equivalencia BH-BMPT'!$D$36,IF(J14=36,'Equivalencia BH-BMPT'!$D$37,IF(J14=37,'Equivalencia BH-BMPT'!$D$38,IF(J14=38,'Equivalencia BH-BMPT'!D39,IF(J14=39,'Equivalencia BH-BMPT'!$D$40,IF(J14=40,'Equivalencia BH-BMPT'!$D$41,IF(J14=41,'Equivalencia BH-BMPT'!$D$42,IF(J14=42,'Equivalencia BH-BMPT'!$D$43,IF(J14=43,'Equivalencia BH-BMPT'!$D$44,IF(J14=44,'Equivalencia BH-BMPT'!$D$45,IF(J14=45,'Equivalencia BH-BMPT'!$D$46,\"No ha seleccionado un número de programa\")))))))))))))))))))))))))))))))))))))))))))))","v":"Prevención y atención de la maternidad y la paternidad tempranas"},0,"80.807.003","EDER GIOVANNY CASTIBLANCO ORJUELA",621000,null,null,0,2600000,621000,621000,"2017-02-08","2017-02-28","2017-04-27",60,0,null,null,"X",null,null,{"$f":"SUM(U14/T14)","v":1},null,{"$f":"IF(I14=\"Funcionamiento\",J14=0,J14=\"\")","v":false}]
[2,2017,"17-4-6060818",16,{"$f":"IF(D15=1,'Tipo '!$B$2,IF(D15=2,'Tipo '!$B$3,IF(D15=3,'Tipo '!$B$4,IF(D15=4,'Tipo '!$B$5,IF(D15=5,'Tipo '!$B$6,IF(D15=6,'Tipo '!$B$7,IF(D15=7,'Tipo '!$B$8,IF(D15=8,'Tipo '!$B$9,IF(D15=9,'Tipo '!$B$10,IF(D15=10,'Tipo '!$B$11,IF(D15=11,'Tipo '!$B$12,IF(D15=12,'Tipo '!$B$13,IF(D15=13,'Tipo '!$B$14,IF(D15=14,'Tipo '!$B$15,IF(D15=15,'Tipo '!$B$16,IF(D15=16,'Tipo '!$B$17,IF(D15=17,'Tipo '!$B$18,IF(D15=18,'Tipo '!$B$19,IF(D15=19,'Tipo '!$B$20,\"No ha seleccionado un tipo de contrato válido\")))))))))))))))))))","v":"CONTRATOS INTERADMINISTRATIVOS"},"Contratación directa","Contratos interadministrativos","ADQUISICION A TRAVES DE LA BOLSA MERCANTIL DE COLOMBIA SA, EL SERVICIO DE VIGILANCIA Y SEGURIDAD PRIVADA EN LOS PREDIOS Y CON LAS CODICIONES TECNICAS QUE DESIGNE EL FONDO DE DESARROLLO LOCAL","Funcionamiento",1,{"$f":"IF(J15=1,'Equivalencia BH-BMPT'!$D$2,IF(J15=2,'Equivalencia BH-BMPT'!$D$3,IF(J15=3,'Equivalencia BH-BMPT'!$D$4,IF(J15=4,'Equivalencia BH-BMPT'!$D$5,IF(J15=5,'Equivalencia BH-BMPT'!$D$6,IF(J15=6,'Equivalencia BH-BMPT'!$D$7,IF(J15=7,'Equivalencia BH-BMPT'!$D$8,IF(J15=8,'Equivalencia BH-BMPT'!$D$9,IF(J15=9,'Equivalencia BH-BMPT'!$D$10,IF(J15=10,'Equivalencia BH-BMPT'!$D$11,IF(J15=11,'Equivalencia BH-BMPT'!$D$12,IF(J15=12,'Equivalencia BH-BMPT'!$D$13,IF(J15=13,'Equivalencia BH-BMPT'!$D$14,IF(J15=14,'Equivalencia BH-BMPT'!$D$15,IF(J15=15,'Equivalencia BH-BMPT'!$D$16,IF(J15=16,'Equivalencia BH-BMPT'!$D$17,IF(J15=17,'Equivalencia BH-BMPT'!$D$18,IF(J15=18,'Equivalencia BH-BMPT'!$D$19,IF(J15=19,'Equivalencia BH-BMPT'!$D$20,IF(J15=20,'Equivalencia BH-BMPT'!$D$21,IF(J15=21,'Equivalencia BH-BMPT'!$D$22,IF(J15=22,'Equivalencia BH-BMPT'!$D$23,IF(J15=23,'Equivalencia BH-BMPT'!#REF!,IF(J15=24,'Equivalencia BH-BMPT'!$D$25,IF(J15=25,'Equivalencia BH-BMPT'!$D$26,IF(J15=26,'Equivalencia BH-BMPT'!$D$27,IF(J15=27,'Equivalencia BH-BMPT'!$D$28,IF(J15=28,'Equivalencia BH-BMPT'!$D$29,IF(J15=29,'Equivalencia BH-BMPT'!$D$30,IF(J15=30,'Equivalencia BH-BMPT'!$D$31,IF(J15=31,'Equivalencia BH-BMPT'!$D$32,IF(J15=32,'Equivalencia BH-BMPT'!$D$33,IF(J15=33,'Equivalencia BH-BMPT'!$D$34,IF(J15=34,'Equivalencia BH-BMPT'!$D$35,IF(J15=35,'Equivalencia BH-BMPT'!$D$36,IF(J15=36,'Equivalencia BH-BMPT'!$D$37,IF(J15=37,'Equivalencia BH-BMPT'!$D$38,IF(J15=38,'Equivalencia BH-BMPT'!#REF!,IF(J15=39,'Equivalencia BH-BMPT'!$D$40,IF(J15=40,'Equivalencia BH-BMPT'!$D$41,IF(J15=41,'Equivalencia BH-BMPT'!$D$42,IF(J15=42,'Equivalencia BH-BMPT'!$D$43,IF(J15=43,'Equivalencia BH-BMPT'!$D$44,IF(J15=44,'Equivalencia BH-BMPT'!$D$45,IF(J15=45,'Equivalencia BH-BMPT'!$D$46,\"No ha seleccionado un número de programa\")))))))))))))))))))))))))))))))))))))))))))))","v":"Prevención y atención de la maternidad y la paternidad tempranas"},0,"805,000,867","SEGURIDAD NUEVA ERA LTDA",295992449,null,null,1,783333,325032924,295922467,"2017-02-10","2017-02-10","2017-12-09",300,30,null,null,"X",null,null,{"$f":"SUM(U15/T15)","v":0.9104384360767096},null,{"$f":"IF(I15=\"Funcionamiento\",J15=0,J15=\"\")","v":false}]
[3,2017,"17-12-6376682",19,{"$f":"IF(D16=1,'Tipo '!$B$2,IF(D16=2,'Tipo '!$B$3,IF(D16=3,'Tipo '!$B$4,IF(D16=4,'Tipo '!$B$5,IF(D16=5,'Tipo '!$B$6,IF(D16=6,'Tipo '!$B$7,IF(D16=7,'Tipo '!$B$8,IF(D16=8,'Tipo '!$B$9,IF(D16=9,'Tipo '!$B$10,IF(D16=10,'Tipo '!$B$11,IF(D16=11,'Tipo '!$B$12,IF(D16=12,'Tipo '!$B$13,IF(D16=13,'Tipo '!$B$14,IF(D16=14,'Tipo '!$B$15,IF(D16=15,'Tipo '!$B$16,IF(D16=16,'Tipo '!$B$17,IF(D16=17,'Tipo '!$B$18,IF(D16=18,'Tipo '!$B$19,IF(D16=19,'Tipo '!$B$20,\"No ha seleccionado un tipo de contrato válido\")))))))))))))))))))","v":"OTROS"},"Contratación mínima cuantia ","No aplica","Prestar sus servicios de apoyo al área de gestión policiva como auxiliar administrativo de la Alcaldía Local de Santa Fe de las actuaciones encaminadas a la protección y conservación de los cerros orientales en cumplimiento de la Acción Popular N 25000232500020050066203","Inversión",45,{"$f":"IF(J16=1,'Equivalencia BH-BMPT'!$D$2,IF(J16=2,'Equivalencia BH-BMPT'!$D$3,IF(J16=3,'Equivalencia BH-BMPT'!$D$4,IF(J16=4,'Equivalencia BH-BMPT'!$D$5,IF(J16=5,'Equivalencia BH-BMPT'!$D$6,IF(J16=6,'Equivalencia BH-BMPT'!$D$7,IF(J16=7,'Equivalencia BH-BMPT'!$D$8,IF(J16=8,'Equivalencia BH-BMPT'!$D$9,IF(J16=9,'Equivalencia BH-BMPT'!$D$10,IF(J16=10,'Equivalencia BH-BMPT'!$D$11,IF(J16=11,'Equivalencia BH-BMPT'!$D$12,IF(J16=12,'Equivalencia BH-BMPT'!$D$13,IF(J16=13,'Equivalencia BH-BMPT'!$D$14,IF(J16=14,'Equivalencia BH-BMPT'!$D$15,IF(J16=15,'Equivalencia BH-BMPT'!$D$16,IF(J16=16,'Equivalencia BH-BMPT'!$D$17,IF(J16=17,'Equivalencia BH-BMPT'!$D$18,IF(J16=18,'Equivalencia BH-BMPT'!$D$19,IF(J16=19,'Equivalencia BH-BMPT'!$D$20,IF(J16=20,'Equivalencia BH-BMPT'!$D$21,IF(J16=21,'Equivalencia BH-BMPT'!$D$22,IF(J16=22,'Equivalencia BH-BMPT'!$D$23,IF(J16=23,'Equivalencia BH-BMPT'!#REF!,IF(J16=24,'Equivalencia BH-BMPT'!$D$25,IF(J16=25,'Equivalencia BH-BMPT'!$D$26,IF(J16=26,'Equivalencia BH-BMPT'!$D$27,IF(J16=27,'Equivalencia BH-BMPT'!$D$28,IF(J16=28,'Equivalencia BH-BMPT'!$D$29,IF(J16=29,'Equivalencia BH-BMPT'!$D$30,IF(J16=30,'Equivalencia BH-BMPT'!$D$31,IF(J16=31,'Equivalencia BH-BMPT'!$D$32,IF(J16=32,'Equivalencia BH-BMPT'!$D$33,IF(J16=33,'Equivalencia BH-BMPT'!$D$34,IF(J16=34,'Equivalencia BH-BMPT'!$D$35,IF(J16=35,'Equivalencia BH-BMPT'!$D$36,IF(J16=36,'Equivalencia BH-BMPT'!$D$37,IF(J16=37,'Equivalencia BH-BMPT'!$D$38,IF(J16=38,'Equivalencia BH-BMPT'!#REF!,IF(J16=39,'Equivalencia BH-BMPT'!$D$40,IF(J16=40,'Equivalencia BH-BMPT'!$D$41,IF(J16=41,'Equivalencia BH-BMPT'!$D$42,IF(J16=42,'Equivalencia BH-BMPT'!$D$43,IF(J16=43,'Equivalencia BH-BMPT'!$D$44,IF(J16=44,'Equivalencia BH-BMPT'!$D$45,IF(J16=45,'Equivalencia BH-BMPT'!$D$46,\"No ha seleccionado un número de programa\")))))))))))))))))))))))))))))))))))))))))))))","v":"Gobernanza e influencia local, regional e internacional"},1326,1022362455,"MIGUEL AUGUSTO FLÓREZ ORTIZ",21200000,null,null,1,579300955,26500000,24644999,"2017/03/01","2017/03/01","2017-12-30",240,60,null,null," ","X",null,0.92999996226415094,null,false]
[4,2017,"17-12-6377905",4,{"$f":"IF(D17=1,'Tipo '!$B$2,IF(D17=2,'Tipo '!$B$3,IF(D17=3,'Tipo '!$B$4,IF(D17=4,'Tipo '!$B$5,IF(D17=5,'Tipo '!$B$6,IF(D17=6,'Tipo '!$B$7,IF(D17=7,'Tipo '!$B$8,IF(D17=8,'Tipo '!$B$9,IF(D17=9,'Tipo '!$B$10,IF(D17=10,'Tipo '!$B$11,IF(D17=11,'Tipo '!$B$12,IF(D17=12,'Tipo '!$B$13,IF(D17=13,'Tipo '!$B$14,IF(D17=14,'Tipo '!$B$15,IF(D17=15,'Tipo '!$B$16,IF(D17=16,'Tipo '!$B$17,IF(D17=17,'Tipo '!$B$18,IF(D17=18,'Tipo '!$B$19,IF(D17=19,'Tipo '!$B$20,\"No ha seleccionado un tipo de contrato válido\")))))))))))))))))))","v":"CONTRATOS DE PRESTACIÓN DE SERVICIOS"},"Selección abreviada ","Acuerdo marco de precios ","PRESTAR SERVICIOS PROFESIONALES PARA FORTALECER LOS PROCESOS TENDIENTES A DESARROLLAR LOS PROYECTOS DEL PLAN DE DESARROLLO LOCAL PARA LA VIGENCIA 2017","Inversión",45,{"$f":"IF(J17=1,'Equivalencia BH-BMPT'!$D$2,IF(J17=2,'Equivalencia BH-BMPT'!$D$3,IF(J17=3,'Equivalencia BH-BMPT'!$D$4,IF(J17=4,'Equivalencia BH-BMPT'!$D$5,IF(J17=5,'Equivalencia BH-BMPT'!$D$6,IF(J17=6,'Equivalencia BH-BMPT'!$D$7,IF(J17=7,'Equivalencia BH-BMPT'!$D$8,IF(J17=8,'Equivalencia BH-BMPT'!$D$9,IF(J17=9,'Equivalencia BH-BMPT'!$D$10,IF(J17=10,'Equivalencia BH-BMPT'!$D$11,IF(J17=11,'Equivalencia BH-BMPT'!$D$12,IF(J17=12,'Equivalencia BH-BMPT'!$D$13,IF(J17=13,'Equivalencia BH-BMPT'!$D$14,IF(J17=14,'Equivalencia BH-BMPT'!$D$15,IF(J17=15,'Equivalencia BH-BMPT'!$D$16,IF(J17=16,'Equivalencia BH-BMPT'!$D$17,IF(J17=17,'Equivalencia BH-BMPT'!$D$18,IF(J17=18,'Equivalencia BH-BMPT'!$D$19,IF(J17=19,'Equivalencia BH-BMPT'!$D$20,IF(J17=20,'Equivalencia BH-BMPT'!$D$21,IF(J17=21,'Equivalencia BH-BMPT'!$D$22,IF(J17=22,'Equivalencia BH-BMPT'!$D$23,IF(J17=23,'Equivalencia BH-BMPT'!#REF!,IF(J17=24,'Equivalencia BH-BMPT'!$D$25,IF(J17=25,'Equivalencia BH-BMPT'!$D$26,IF(J17=26,'Equivalencia BH-BMPT'!$D$27,IF(J17=27,'Equivalencia BH-BMPT'!$D$28,IF(J17=28,'Equivalencia BH-BMPT'!$D$29,IF(J17=29,'Equivalencia BH-BMPT'!$D$30,IF(J17=30,'Equivalencia BH-BMPT'!$D$31,IF(J17=31,'Equivalencia BH-BMPT'!$D$32,IF(J17=32,'Equivalencia BH-BMPT'!$D$33,IF(J17=33,'Equivalencia BH-BMPT'!$D$34,IF(J17=34,'Equivalencia BH-BMPT'!$D$35,IF(J17=35,'Equivalencia BH-BMPT'!$D$36,IF(J17=36,'Equivalencia BH-BMPT'!$D$37,IF(J17=37,'Equivalencia BH-BMPT'!$D$38,IF(J17=38,'Equivalencia BH-BMPT'!#REF!,IF(J17=39,'Equivalencia BH-BMPT'!$D$40,IF(J17=40,'Equivalencia BH-BMPT'!$D$41,IF(J17=41,'Equivalencia BH-BMPT'!$D$42,IF(J17=42,'Equivalencia BH-BMPT'!$D$43,IF(J17=43,'Equivalencia BH-BMPT'!$D$44,IF(J17=44,'Equivalencia BH-BMPT'!$D$45,IF(J17=45,'Equivalencia BH-BMPT'!$D$46,\"No ha seleccionado un número de programa\")))))))))))))))))))))))))))))))))))))))))))))","v":"Gobernanza e influencia local, regional e internacional"},1326,52808564,"ANDREA PÉREZ ARISMENDI",44000000,null,null,1,347555171,58300000,51150000,"2017/03/01","2017/03/01","2018-01-15",240,77,null,null,"X",null,null,{"$f":"SUM(U17/T17)","v":0.87735849056603776},null,{"$f":"IF(I17=\"Funcionamiento\",J17=0,J17=\"\")","v":false}]
[5,2017,"17-12-6378187",5,{"$f":"IF(D18=1,'Tipo '!$B$2,IF(D18=2,'Tipo '!$B$3,IF(D18=3,'Tipo '!$B$4,IF(D18=4,'Tipo '!$B$5,IF(D18=5,'Tipo '!$B$6,IF(D18=6,'Tipo '!$B$7,IF(D18=7,'Tipo '!$B$8,IF(D18=8,'Tipo '!$B$9,IF(D18=9,'Tipo '!$B$10,IF(D18=10,'Tipo '!$B$11,IF(D18=11,'Tipo '!$B$12,IF(D18=12,'Tipo '!$B$13,IF(D18=13,'Tipo '!$B$14,IF(D18=14,'Tipo '!$B$15,IF(D18=15,'Tipo '!$B$16,IF(D18=16,'Tipo '!$B$17,IF(D18=17,'Tipo '!$B$18,IF(D18=18,'Tipo '!$B$19,IF(D18=19,'Tipo '!$B$20,\"No ha seleccionado un tipo de contrato válido\")))))))))))))))))))","v":"CONTRATOS DE PRESTACIÓN DE SERVICIOS PROFESIONALES Y DE APOYO A LA GESTIÓN"},"Contratación directa","Prestación de servicios profesionales y de apoyo a la gestión, o para la ejecución de trabajos artísticos que sólo puedan encomendarse a determinadas personas naturales;","PRESTAR SERVICIOS COMO AUXILIAR ADMINISTRATIVO PARA QUE POYE LA REVISION DE LOS PROCESOS DE CLASIFICACION, ORDENACIÓN, SELECCION NATURAL, FOLIACION, IDENTIFICACION, LEVANTAMIENTO DE INVENTARIOS, ALMACENAMIENTO Y APLICACION DE PROTOCOLOS DE ELIMINACION Y TRANSFERENCIAS DOCUMENTALES.","Inversión",45,{"$f":"IF(J18=1,'Equivalencia BH-BMPT'!$D$2,IF(J18=2,'Equivalencia BH-BMPT'!$D$3,IF(J18=3,'Equivalencia BH-BMPT'!$D$4,IF(J18=4,'Equivalencia BH-BMPT'!$D$5,IF(J18=5,'Equivalencia BH-BMPT'!$D$6,IF(J18=6,'Equivalencia BH-BMPT'!$D$7,IF(J18=7,'Equivalencia BH-BMPT'!$D$8,IF(J18=8,'Equivalencia BH-BMPT'!$D$9,IF(J18=9,'Equivalencia BH-BMPT'!$D$10,IF(J18=10,'Equivalencia BH-BMPT'!$D$11,IF(J18=11,'Equivalencia BH-BMPT'!$D$12,IF(J18=12,'Equivalencia BH-BMPT'!$D$13,IF(J18=13,'Equivalencia BH-BMPT'!$D$14,IF(J18=14,'Equivalencia BH-BMPT'!$D$15,IF(J18=15,'Equivalencia BH-BMPT'!$D$16,IF(J18=16,'Equivalencia BH-BMPT'!$D$17,IF(J18=17,'Equivalencia BH-BMPT'!$D$18,IF(J18=18,'Equivalencia BH-BMPT'!$D$19,IF(J18=19,'Equivalencia BH-BMPT'!$D$20,IF(J18=20,'Equivalencia BH-BMPT'!$D$21,IF(J18=21,'Equivalencia BH-BMPT'!$D$22,IF(J18=22,'Equivalencia BH-BMPT'!$D$23,IF(J18=23,'Equivalencia BH-BMPT'!#REF!,IF(J18=24,'Equivalencia BH-BMPT'!$D$25,IF(J18=25,'Equivalencia BH-BMPT'!$D$26,IF(J18=26,'Equivalencia BH-BMPT'!$D$27,IF(J18=27,'Equivalencia BH-BMPT'!$D$28,IF(J18=28,'Equivalencia BH-BMPT'!$D$29,IF(J18=29,'Equivalencia BH-BMPT'!$D$30,IF(J18=30,'Equivalencia BH-BMPT'!$D$31,IF(J18=31,'Equivalencia BH-BMPT'!$D$32,IF(J18=32,'Equivalencia BH-BMPT'!$D$33,IF(J18=33,'Equivalencia BH-BMPT'!$D$34,IF(J18=34,'Equivalencia BH-BMPT'!$D$35,IF(J18=35,'Equivalencia BH-BMPT'!$D$36,IF(J18=36,'Equivalencia BH-BMPT'!$D$37,IF(J18=37,'Equivalencia BH-BMPT'!$D$38,IF(J18=38,'Equivalencia BH-BMPT'!#REF!,IF(J18=39,'Equivalencia BH-BMPT'!$D$40,IF(J18=40,'Equivalencia BH-BMPT'!$D$41,IF(J18=41,'Equivalencia BH-BMPT'!$D$42,IF(J18=42,'Equivalencia BH-BMPT'!$D$43,IF(J18=43,'Equivalencia BH-BMPT'!$D$44,IF(J18=44,'Equivalencia BH-BMPT'!$D$45,IF(J18=45,'Equivalencia BH-BMPT'!$D$46,\"No ha seleccionado un número de programa\")))))))))))))))))))))))))))))))))))))))))))))","v":"Gobernanza e influencia local, regional e internacional"},1326,19385050,"JOSE ANICETO LEON ORJUELA",15200000,null,null,1,1156010763,19000000,17670000,"2017/03/01","2017/03/01","2017-12-30",240,60,null,null," ","X",null,0.93,null,false]
[6,2017,"17-12-6378402",5,{"$f":"IF(D19=1,'Tipo '!$B$2,IF(D19=2,'Tipo '!$B$3,IF(D19=3,'Tipo '!$B$4,IF(D19=4,'Tipo '!$B$5,IF(D19=5,'Tipo '!$B$6,IF(D19=6,'Tipo '!$B$7,IF(D19=7,'Tipo '!$B$8,IF(D19=8,'Tipo '!$B$9,IF(D19=9,'Tipo '!$B$10,IF(D19=10,'Tipo '!$B$11,IF(D19=11,'Tipo '!$B$12,IF(D19=12,'Tipo '!$B$13,IF(D19=13,'Tipo '!$B$14,IF(D19=14,'Tipo '!$B$15,IF(D19=15,'Tipo '!$B$16,IF(D19=16,'Tipo '!$B$17,IF(D19=17,'Tipo '!$B$18,IF(D19=18,'Tipo '!$B$19,IF(D19=19,'Tipo '!$B$20,\"No ha seleccionado un tipo de contrato válido\")))))))))))))))))))","v":"CONTRATOS DE PRESTACIÓN DE SERVICIOS PROFESIONALES Y DE APOYO A LA GESTIÓN"},"Contratación directa","Prestación de servicios profesionales y de apoyo a la gestión, o para la ejecución de trabajos artísticos que sólo puedan encomendarse a determinadas personas naturales;","PRESTAR SERVICIO DE APOYO PARA EL RECIBO, ENTREGA, ALMACENAMIENTO, ORGANIZACION, CUSTODIA A LOS ELEMNTOS, BIENES Y MERCANCIAS RESPONSABILIDAD DE LA ALCALDIA LOCAL DE SANTA FE, LOS CUALES SE ENCUENTRAN EN LA BODEGA PROPIEDAD DE ESTA ENTIDAD","Inversión",45,{"$f":"IF(J19=1,'Equivalencia BH-BMPT'!$D$2,IF(J19=2,'Equivalencia BH-BMPT'!$D$3,IF(J19=3,'Equivalencia BH-BMPT'!$D$4,IF(J19=4,'Equivalencia BH-BMPT'!$D$5,IF(J19=5,'Equivalencia BH-BMPT'!$D$6,IF(J19=6,'Equivalencia BH-BMPT'!$D$7,IF(J19=7,'Equivalencia BH-BMPT'!$D$8,IF(J19=8,'Equivalencia BH-BMPT'!$D$9,IF(J19=9,'Equivalencia BH-BMPT'!$D$10,IF(J19=10,'Equivalencia BH-BMPT'!$D$11,IF(J19=11,'Equivalencia BH-BMPT'!$D$12,IF(J19=12,'Equivalencia BH-BMPT'!$D$13,IF(J19=13,'Equivalencia BH-BMPT'!$D$14,IF(J19=14,'Equivalencia BH-BMPT'!$D$15,IF(J19=15,'Equivalencia BH-BMPT'!$D$16,IF(J19=16,'Equivalencia BH-BMPT'!$D$17,IF(J19=17,'Equivalencia BH-BMPT'!$D$18,IF(J19=18,'Equivalencia BH-BMPT'!$D$19,IF(J19=19,'Equivalencia BH-BMPT'!$D$20,IF(J19=20,'Equivalencia BH-BMPT'!$D$21,IF(J19=21,'Equivalencia BH-BMPT'!$D$22,IF(J19=22,'Equivalencia BH-BMPT'!$D$23,IF(J19=23,'Equivalencia BH-BMPT'!#REF!,IF(J19=24,'Equivalencia BH-BMPT'!$D$25,IF(J19=25,'Equivalencia BH-BMPT'!$D$26,IF(J19=26,'Equivalencia BH-BMPT'!$D$27,IF(J19=27,'Equivalencia BH-BMPT'!$D$28,IF(J19=28,'Equivalencia BH-BMPT'!$D$29,IF(J19=29,'Equivalencia BH-BMPT'!$D$30,IF(J19=30,'Equivalencia BH-BMPT'!$D$31,IF(J19=31,'Equivalencia BH-BMPT'!$D$32,IF(J19=32,'Equivalencia BH-BMPT'!$D$33,IF(J19=33,'Equivalencia BH-BMPT'!$D$34,IF(J19=34,'Equivalencia BH-BMPT'!$D$35,IF(J19=35,'Equivalencia BH-BMPT'!$D$36,IF(J19=36,'Equivalencia BH-BMPT'!$D$37,IF(J19=37,'Equivalencia BH-BMPT'!$D$38,IF(J19=38,'Equivalencia BH-BMPT'!#REF!,IF(J19=39,'Equivalencia BH-BMPT'!$D$40,IF(J19=40,'Equivalencia BH-BMPT'!$D$41,IF(J19=41,'Equivalencia BH-BMPT'!$D$42,IF(J19=42,'Equivalencia BH-BMPT'!$D$43,IF(J19=43,'Equivalencia BH-BMPT'!$D$44,IF(J19=44,'Equivalencia BH-BMPT'!$D$45,IF(J19=45,'Equivalencia BH-BMPT'!$D$46,\"No ha seleccionado un número de programa\")))))))))))))))))))))))))))))))))))))))))))))","v":"Gobernanza e influencia local, regional e internacional"},1326,79310723,"GUILLERMO ERNESTO ROJAS GONZALEZ",15600000,null,null,1,93760760,20670000,18135000,"2017/03/01","2017/03/01","2018-01-15",240,77,null,null,"X",null,null,0.87735849056603776,null,false]
[7,2017,"17-12-6379110",5,{"$f":"IF(D20=1,'Tipo '!$B$2,IF(D20=2,'Tipo '!$B$3,IF(D20=3,'Tipo '!$B$4,IF(D20=4,'Tipo '!$B$5,IF(D20=5,'Tipo '!$B$6,IF(D20=6,'Tipo '!$B$7,IF(D20=7,'Tipo '!$B$8,IF(D20=8,'Tipo '!$B$9,IF(D20=9,'Tipo '!$B$10,IF(D20=10,'Tipo '!$B$11,IF(D20=11,'Tipo '!$B$12,IF(D20=12,'Tipo '!$B$13,IF(D20=13,'Tipo '!$B$14,IF(D20=14,'Tipo '!$B$15,IF(D20=15,'Tipo '!$B$16,IF(D20=16,'Tipo '!$B$17,IF(D20=17,'Tipo '!$B$18,IF(D20=18,'Tipo '!$B$19,IF(D20=19,'Tipo '!$B$20,\"No ha seleccionado un tipo de contrato válido\")))))))))))))))))))","v":"CONTRATOS DE PRESTACIÓN DE SERVICIOS PROFESIONALES Y DE APOYO A LA GESTIÓN"},"Contratación directa","Prestación de servicios profesionales y de apoyo a la gestión, o para la ejecución de trabajos artísticos que sólo puedan encomendarse a determinadas personas naturales;","PRESTAR SERVICIOS PROFESONALES EN AQUELLOS ASINTOS REFERENTE A LA ATENCIÓN DEL USUARIO Y DE LOS ORGANOS DE CONTROL QUE ACUDAN A LA ALCALDIA LOCAL DE SANTA FE","Inversión",45,{"$f":"IF(J20=1,'Equivalencia BH-BMPT'!$D$2,IF(J20=2,'Equivalencia BH-BMPT'!$D$3,IF(J20=3,'Equivalencia BH-BMPT'!$D$4,IF(J20=4,'Equivalencia BH-BMPT'!$D$5,IF(J20=5,'Equivalencia BH-BMPT'!$D$6,IF(J20=6,'Equivalencia BH-BMPT'!$D$7,IF(J20=7,'Equivalencia BH-BMPT'!$D$8,IF(J20=8,'Equivalencia BH-BMPT'!$D$9,IF(J20=9,'Equivalencia BH-BMPT'!$D$10,IF(J20=10,'Equivalencia BH-BMPT'!$D$11,IF(J20=11,'Equivalencia BH-BMPT'!$D$12,IF(J20=12,'Equivalencia BH-BMPT'!$D$13,IF(J20=13,'Equivalencia BH-BMPT'!$D$14,IF(J20=14,'Equivalencia BH-BMPT'!$D$15,IF(J20=15,'Equivalencia BH-BMPT'!$D$16,IF(J20=16,'Equivalencia BH-BMPT'!$D$17,IF(J20=17,'Equivalencia BH-BMPT'!$D$18,IF(J20=18,'Equivalencia BH-BMPT'!$D$19,IF(J20=19,'Equivalencia BH-BMPT'!$D$20,IF(J20=20,'Equivalencia BH-BMPT'!$D$21,IF(J20=21,'Equivalencia BH-BMPT'!$D$22,IF(J20=22,'Equivalencia BH-BMPT'!$D$23,IF(J20=23,'Equivalencia BH-BMPT'!#REF!,IF(J20=24,'Equivalencia BH-BMPT'!$D$25,IF(J20=25,'Equivalencia BH-BMPT'!$D$26,IF(J20=26,'Equivalencia BH-BMPT'!$D$27,IF(J20=27,'Equivalencia BH-BMPT'!$D$28,IF(J20=28,'Equivalencia BH-BMPT'!$D$29,IF(J20=29,'Equivalencia BH-BMPT'!$D$30,IF(J20=30,'Equivalencia BH-BMPT'!$D$31,IF(J20=31,'Equivalencia BH-BMPT'!$D$32,IF(J20=32,'Equivalencia BH-BMPT'!$D$33,IF(J20=33,'Equivalencia BH-BMPT'!$D$34,IF(J20=34,'Equivalencia BH-BMPT'!$D$35,IF(J20=35,'Equivalencia BH-BMPT'!$D$36,IF(J20=36,'Equivalencia BH-BMPT'!$D$37,IF(J20=37,'Equivalencia BH-BMPT'!$D$38,IF(J20=38,'Equivalencia BH-BMPT'!#REF!,IF(J20=39,'Equivalencia BH-BMPT'!$D$40,IF(J20=40,'Equivalencia BH-BMPT'!$D$41,IF(J20=41,'Equivalencia BH-BMPT'!$D$42,IF(J20=42,'Equivalencia BH-BMPT'!$D$43,IF(J20=43,'Equivalencia BH-BMPT'!$D$44,IF(J20=44,'Equivalencia BH-BMPT'!$D$45,IF(J20=45,'Equivalencia BH-BMPT'!$D$46,\"No ha seleccionado un número de programa\")))))))))))))))))))))))))))))))))))))))))))))","v":"Gobernanza e influencia local, regional e internacional"},1326,40989527,"CLAUDIA ANDREA SAGRA TORRES",44000000,null,null,1,558651578,58300000,51150000,"2017/03/07","2017/03/01","2018-01-15",240,77,null,null,"X",null,null,0.87735849056603776,null,false]
[8,2017,"17-12-6380191",5,{"$f":"IF(D21=1,'Tipo '!$B$2,IF(D21=2,'Tipo '!$B$3,IF(D21=3,'Tipo '!$B$4,IF(D21=4,'Tipo '!$B$5,IF(D21=5,'Tipo '!$B$6,IF(D21=6,'Tipo '!$B$7,IF(D21=7,'Tipo '!$B$8,IF(D21=8,'Tipo '!$B$9,IF(D21=9,'Tipo '!$B$10,IF(D21=10,'Tipo '!$B$11,IF(D21=11,'Tipo '!$B$12,IF(D21=12,'Tipo '!$B$13,IF(D21=13,'Tipo '!$B$14,IF(D21=14,'Tipo '!$B$15,IF(D21=15,'Tipo '!$B$16,IF(D21=16,'Tipo '!$B$17,IF(D21=17,'Tipo '!$B$18,IF(D21=18,'Tipo '!$B$19,IF(D21=19,'Tipo '!$B$20,\"No ha seleccionado un tipo de contrato válido\")))))))))))))))))))","v":"CONTRATOS DE PRESTACIÓN DE SERVICIOS PROFESIONALES Y DE APOYO A LA GESTIÓN"},"Contratación directa","Prestación de servicios profesionales y de apoyo a la gestión, o para la ejecución de trabajos artísticos que sólo puedan encomendarse a determinadas personas naturales;","PRESTAR SERVICIOS EN EL PUNTO VIVE DIGITAL UBICADO EN EL PAS (PUNTO DE ARTICULACION SOCIAL) DE LOURDES DE LA LOCALIDAD DE SANTA FE UBICADO EN LA CRA 2 #4-10, PARA DESARROLLAR TODAS LAS ACTIVIDADES DE ADMINISTRACION QUE PERMITAN PRESTAR UN EXCELENTE FUNCIONAMIENTO PARA LA COMUNIDAD","Inversión",45,{"$f":"IF(J21=1,'Equivalencia BH-BMPT'!$D$2,IF(J21=2,'Equivalencia BH-BMPT'!$D$3,IF(J21=3,'Equivalencia BH-BMPT'!$D$4,IF(J21=4,'Equivalencia BH-BMPT'!$D$5,IF(J21=5,'Equivalencia BH-BMPT'!$D$6,IF(J21=6,'Equivalencia BH-BMPT'!$D$7,IF(J21=7,'Equivalencia BH-BMPT'!$D$8,IF(J21=8,'Equivalencia BH-BMPT'!$D$9,IF(J21=9,'Equivalencia BH-BMPT'!$D$10,IF(J21=10,'Equivalencia BH-BMPT'!$D$11,IF(J21=11,'Equivalencia BH-BMPT'!$D$12,IF(J21=12,'Equivalencia BH-BMPT'!$D$13,IF(J21=13,'Equivalencia BH-BMPT'!$D$14,IF(J21=14,'Equivalencia BH-BMPT'!$D$15,IF(J21=15,'Equivalencia BH-BMPT'!$D$16,IF(J21=16,'Equivalencia BH-BMPT'!$D$17,IF(J21=17,'Equivalencia BH-BMPT'!$D$18,IF(J21=18,'Equivalencia BH-BMPT'!$D$19,IF(J21=19,'Equivalencia BH-BMPT'!$D$20,IF(J21=20,'Equivalencia BH-BMPT'!$D$21,IF(J21=21,'Equivalencia BH-BMPT'!$D$22,IF(J21=22,'Equivalencia BH-BMPT'!$D$23,IF(J21=23,'Equivalencia BH-BMPT'!#REF!,IF(J21=24,'Equivalencia BH-BMPT'!$D$25,IF(J21=25,'Equivalencia BH-BMPT'!$D$26,IF(J21=26,'Equivalencia BH-BMPT'!$D$27,IF(J21=27,'Equivalencia BH-BMPT'!$D$28,IF(J21=28,'Equivalencia BH-BMPT'!$D$29,IF(J21=29,'Equivalencia BH-BMPT'!$D$30,IF(J21=30,'Equivalencia BH-BMPT'!$D$31,IF(J21=31,'Equivalencia BH-BMPT'!$D$32,IF(J21=32,'Equivalencia BH-BMPT'!$D$33,IF(J21=33,'Equivalencia BH-BMPT'!$D$34,IF(J21=34,'Equivalencia BH-BMPT'!$D$35,IF(J21=35,'Equivalencia BH-BMPT'!$D$36,IF(J21=36,'Equivalencia BH-BMPT'!$D$37,IF(J21=37,'Equivalencia BH-BMPT'!$D$38,IF(J21=38,'Equivalencia BH-BMPT'!#REF!,IF(J21=39,'Equivalencia BH-BMPT'!$D$40,IF(J21=40,'Equivalencia BH-BMPT'!$D$41,IF(J21=41,'Equivalencia BH-BMPT'!$D$42,IF(J21=42,'Equivalencia BH-BMPT'!$D$43,IF(J21=43,'Equivalencia BH-BMPT'!$D$44,IF(J21=44,'Equivalencia BH-BMPT'!$D$45,IF(J21=45,'Equivalencia BH-BMPT'!$D$46,\"No ha seleccionado un número de programa\")))))))))))))))))))))))))))))))))))))))))))))","v":"Gobernanza e influencia local, regional e internacional"},1326,1030583992,"DANILO AMADOR VELASCO",25600000,null,null,1,6000000,32000000,29760000,"2017/03/01","2017/03/01","2017-12-30",240,60,null,null," ","X",null,0.93,null,false]
[9,2017,"17-12-6380406",5,{"$f":"IF(D22=1,'Tipo '!$B$2,IF(D22=2,'Tipo '!$B$3,IF(D22=3,'Tipo '!$B$4,IF(D22=4,'Tipo '!$B$5,IF(D22=5,'Tipo '!$B$6,IF(D22=6,'Tipo '!$B$7,IF(D22=7,'Tipo '!$B$8,IF(D22=8,'Tipo '!$B$9,IF(D22=9,'Tipo '!$B$10,IF(D22=10,'Tipo '!$B$11,IF(D22=11,'Tipo '!$B$12,IF(D22=12,'Tipo '!$B$13,IF(D22=13,'Tipo '!$B$14,IF(D22=14,'Tipo '!$B$15,IF(D22=15,'Tipo '!$B$16,IF(D22=16,'Tipo '!$B$17,IF(D22=17,'Tipo '!$B$18,IF(D22=18,'Tipo '!$B$19,IF(D22=19,'Tipo '!$B$20,\"No ha seleccionado un tipo de contrato válido\")))))))))))))))))))","v":"CONTRATOS DE PRESTACIÓN DE SERVICIOS PROFESIONALES Y DE APOYO A LA GESTIÓN"},"Contratación directa","Prestación de servicios profesionales y de apoyo a la gestión, o para la ejecución de trabajos artísticos que sólo puedan encomendarse a determinadas personas naturales;","PRESTAR SUS SERVICIOS PROFESONALES DE ABOGADO EN LA ALCALDIA LOCAL DE SANTA FE EN DESARROLLO DEL AREA DE GESTION POLICIVA A CARGO DE LA ENTIDAD","Inversión",45,{"$f":"IF(J22=1,'Equivalencia BH-BMPT'!$D$2,IF(J22=2,'Equivalencia BH-BMPT'!$D$3,IF(J22=3,'Equivalencia BH-BMPT'!$D$4,IF(J22=4,'Equivalencia BH-BMPT'!$D$5,IF(J22=5,'Equivalencia BH-BMPT'!$D$6,IF(J22=6,'Equivalencia BH-BMPT'!$D$7,IF(J22=7,'Equivalencia BH-BMPT'!$D$8,IF(J22=8,'Equivalencia BH-BMPT'!$D$9,IF(J22=9,'Equivalencia BH-BMPT'!$D$10,IF(J22=10,'Equivalencia BH-BMPT'!$D$11,IF(J22=11,'Equivalencia BH-BMPT'!$D$12,IF(J22=12,'Equivalencia BH-BMPT'!$D$13,IF(J22=13,'Equivalencia BH-BMPT'!$D$14,IF(J22=14,'Equivalencia BH-BMPT'!$D$15,IF(J22=15,'Equivalencia BH-BMPT'!$D$16,IF(J22=16,'Equivalencia BH-BMPT'!$D$17,IF(J22=17,'Equivalencia BH-BMPT'!$D$18,IF(J22=18,'Equivalencia BH-BMPT'!$D$19,IF(J22=19,'Equivalencia BH-BMPT'!$D$20,IF(J22=20,'Equivalencia BH-BMPT'!$D$21,IF(J22=21,'Equivalencia BH-BMPT'!$D$22,IF(J22=22,'Equivalencia BH-BMPT'!$D$23,IF(J22=23,'Equivalencia BH-BMPT'!#REF!,IF(J22=24,'Equivalencia BH-BMPT'!$D$25,IF(J22=25,'Equivalencia BH-BMPT'!$D$26,IF(J22=26,'Equivalencia BH-BMPT'!$D$27,IF(J22=27,'Equivalencia BH-BMPT'!$D$28,IF(J22=28,'Equivalencia BH-BMPT'!$D$29,IF(J22=29,'Equivalencia BH-BMPT'!$D$30,IF(J22=30,'Equivalencia BH-BMPT'!$D$31,IF(J22=31,'Equivalencia BH-BMPT'!$D$32,IF(J22=32,'Equivalencia BH-BMPT'!$D$33,IF(J22=33,'Equivalencia BH-BMPT'!$D$34,IF(J22=34,'Equivalencia BH-BMPT'!$D$35,IF(J22=35,'Equivalencia BH-BMPT'!$D$36,IF(J22=36,'Equivalencia BH-BMPT'!$D$37,IF(J22=37,'Equivalencia BH-BMPT'!$D$38,IF(J22=38,'Equivalencia BH-BMPT'!#REF!,IF(J22=39,'Equivalencia BH-BMPT'!$D$40,IF(J22=40,'Equivalencia BH-BMPT'!$D$41,IF(J22=41,'Equivalencia BH-BMPT'!$D$42,IF(J22=42,'Equivalencia BH-BMPT'!$D$43,IF(J22=43,'Equivalencia BH-BMPT'!$D$44,IF(J22=44,'Equivalencia BH-BMPT'!$D$45,IF(J22=45,'Equivalencia BH-BMPT'!$D$46,\"No ha seleccionado un número de programa\")))))))))))))))))))))))))))))))))))))))))))))","v":"Gobernanza e influencia local, regional e internacional"},1326,52849930,"MARTHA PATRICIA HERNANDEZ MUÑOZ",36000000,null,null,2,54012384,44700000,41550000,"2017/03/03","2017/03/03","2017-12-30",240,58,null,null,"X",null,null,0.92953020134228193,null,false]
[10,2017,"17-12-6380941",5,{"$f":"IF(D23=1,'Tipo '!$B$2,IF(D23=2,'Tipo '!$B$3,IF(D23=3,'Tipo '!$B$4,IF(D23=4,'Tipo '!$B$5,IF(D23=5,'Tipo '!$B$6,IF(D23=6,'Tipo '!$B$7,IF(D23=7,'Tipo '!$B$8,IF(D23=8,'Tipo '!$B$9,IF(D23=9,'Tipo '!$B$10,IF(D23=10,'Tipo '!$B$11,IF(D23=11,'Tipo '!$B$12,IF(D23=12,'Tipo '!$B$13,IF(D23=13,'Tipo '!$B$14,IF(D23=14,'Tipo '!$B$15,IF(D23=15,'Tipo '!$B$16,IF(D23=16,'Tipo '!$B$17,IF(D23=17,'Tipo '!$B$18,IF(D23=18,'Tipo '!$B$19,IF(D23=19,'Tipo '!$B$20,\"No ha seleccionado un tipo de contrato válido\")))))))))))))))))))","v":"CONTRATOS DE PRESTACIÓN DE SERVICIOS PROFESIONALES Y DE APOYO A LA GESTIÓN"},"Contratación directa","Prestación de servicios profesionales y de apoyo a la gestión, o para la ejecución de trabajos artísticos que sólo puedan encomendarse a determinadas personas naturales;","PRESTAR SUS SERVICIOS PROFESONALES DE ABOGADO EN LA ALCALDIA LOCAL DE SANTA FE EN DESARROLLO DEL AREA DE GESTION POLICIVA A CARGO DE LA ENTIDAD","Inversión",45,{"$f":"IF(J23=1,'Equivalencia BH-BMPT'!$D$2,IF(J23=2,'Equivalencia BH-BMPT'!$D$3,IF(J23=3,'Equivalencia BH-BMPT'!$D$4,IF(J23=4,'Equivalencia BH-BMPT'!$D$5,IF(J23=5,'Equivalencia BH-BMPT'!$D$6,IF(J23=6,'Equivalencia BH-BMPT'!$D$7,IF(J23=7,'Equivalencia BH-BMPT'!$D$8,IF(J23=8,'Equivalencia BH-BMPT'!$D$9,IF(J23=9,'Equivalencia BH-BMPT'!$D$10,IF(J23=10,'Equivalencia BH-BMPT'!$D$11,IF(J23=11,'Equivalencia BH-BMPT'!$D$12,IF(J23=12,'Equivalencia BH-BMPT'!$D$13,IF(J23=13,'Equivalencia BH-BMPT'!$D$14,IF(J23=14,'Equivalencia BH-BMPT'!$D$15,IF(J23=15,'Equivalencia BH-BMPT'!$D$16,IF(J23=16,'Equivalencia BH-BMPT'!$D$17,IF(J23=17,'Equivalencia BH-BMPT'!$D$18,IF(J23=18,'Equivalencia BH-BMPT'!$D$19,IF(J23=19,'Equivalencia BH-BMPT'!$D$20,IF(J23=20,'Equivalencia BH-BMPT'!$D$21,IF(J23=21,'Equivalencia BH-BMPT'!$D$22,IF(J23=22,'Equivalencia BH-BMPT'!$D$23,IF(J23=23,'Equivalencia BH-BMPT'!#REF!,IF(J23=24,'Equivalencia BH-BMPT'!$D$25,IF(J23=25,'Equivalencia BH-BMPT'!$D$26,IF(J23=26,'Equivalencia BH-BMPT'!$D$27,IF(J23=27,'Equivalencia BH-BMPT'!$D$28,IF(J23=28,'Equivalencia BH-BMPT'!$D$29,IF(J23=29,'Equivalencia BH-BMPT'!$D$30,IF(J23=30,'Equivalencia BH-BMPT'!$D$31,IF(J23=31,'Equivalencia BH-BMPT'!$D$32,IF(J23=32,'Equivalencia BH-BMPT'!$D$33,IF(J23=33,'Equivalencia BH-BMPT'!$D$34,IF(J23=34,'Equivalencia BH-BMPT'!$D$35,IF(J23=35,'Equivalencia BH-BMPT'!$D$36,IF(J23=36,'Equivalencia BH-BMPT'!$D$37,IF(J23=37,'Equivalencia BH-BMPT'!$D$38,IF(J23=38,'Equivalencia BH-BMPT'!#REF!,IF(J23=39,'Equivalencia BH-BMPT'!$D$40,IF(J23=40,'Equivalencia BH-BMPT'!$D$41,IF(J23=41,'Equivalencia BH-BMPT'!$D$42,IF(J23=42,'Equivalencia BH-BMPT'!$D$43,IF(J23=43,'Equivalencia BH-BMPT'!$D$44,IF(J23=44,'Equivalencia BH-BMPT'!$D$45,IF(J23=45,'Equivalencia BH-BMPT'!$D$46,\"No ha seleccionado un número de programa\")))))))))))))))))))))))))))))))))))))))))))))","v":"Gobernanza e influencia local, regional e internacional"},1326,1064976799,"ANDRES FELIPE SANTOS GÓMEZ",36000000,null,null,2,30080000,44700000,41550000,"2017/03/03","2017/03/03","2017-12-30",240,58,null,null," ","X",null,0.92953020134228193,null,false]
[11,2017,"17-12-6381136",5,{"$f":"IF(D24=1,'Tipo '!$B$2,IF(D24=2,'Tipo '!$B$3,IF(D24=3,'Tipo '!$B$4,IF(D24=4,'Tipo '!$B$5,IF(D24=5,'Tipo '!$B$6,IF(D24=6,'Tipo '!$B$7,IF(D24=7,'Tipo '!$B$8,IF(D24=8,'Tipo '!$B$9,IF(D24=9,'Tipo '!$B$10,IF(D24=10,'Tipo '!$B$11,IF(D24=11,'Tipo '!$B$12,IF(D24=12,'Tipo '!$B$13,IF(D24=13,'Tipo '!$B$14,IF(D24=14,'Tipo '!$B$15,IF(D24=15,'Tipo '!$B$16,IF(D24=16,'Tipo '!$B$17,IF(D24=17,'Tipo '!$B$18,IF(D24=18,'Tipo '!$B$19,IF(D24=19,'Tipo '!$B$20,\"No ha seleccionado un tipo de contrato válido\")))))))))))))))))))","v":"CONTRATOS DE PRESTACIÓN DE SERVICIOS PROFESIONALES Y DE APOYO A LA GESTIÓN"},"Contratación directa","Prestación de servicios profesionales y de apoyo a la gestión, o para la ejecución de trabajos artísticos que sólo puedan encomendarse a determinadas personas naturales;","PRESTAR SUS SERVICIOS PROFESONALES DE ABOGADO EN LA ALCALDIA LOCAL DE SANTA FE EN DESARROLLO DEL AREA DE GESTION POLICIVA A CARGO DE LA ENTIDAD","Inversión",45,{"$f":"IF(J24=1,'Equivalencia BH-BMPT'!$D$2,IF(J24=2,'Equivalencia BH-BMPT'!$D$3,IF(J24=3,'Equivalencia BH-BMPT'!$D$4,IF(J24=4,'Equivalencia BH-BMPT'!$D$5,IF(J24=5,'Equivalencia BH-BMPT'!$D$6,IF(J24=6,'Equivalencia BH-BMPT'!$D$7,IF(J24=7,'Equivalencia BH-BMPT'!$D$8,IF(J24=8,'Equivalencia BH-BMPT'!$D$9,IF(J24=9,'Equivalencia BH-BMPT'!$D$10,IF(J24=10,'Equivalencia BH-BMPT'!$D$11,IF(J24=11,'Equivalencia BH-BMPT'!$D$12,IF(J24=12,'Equivalencia BH-BMPT'!$D$13,IF(J24=13,'Equivalencia BH-BMPT'!$D$14,IF(J24=14,'Equivalencia BH-BMPT'!$D$15,IF(J24=15,'Equivalencia BH-BMPT'!$D$16,IF(J24=16,'Equivalencia BH-BMPT'!$D$17,IF(J24=17,'Equivalencia BH-BMPT'!$D$18,IF(J24=18,'Equivalencia BH-BMPT'!$D$19,IF(J24=19,'Equivalencia BH-BMPT'!$D$20,IF(J24=20,'Equivalencia BH-BMPT'!$D$21,IF(J24=21,'Equivalencia BH-BMPT'!$D$22,IF(J24=22,'Equivalencia BH-BMPT'!$D$23,IF(J24=23,'Equivalencia BH-BMPT'!#REF!,IF(J24=24,'Equivalencia BH-BMPT'!$D$25,IF(J24=25,'Equivalencia BH-BMPT'!$D$26,IF(J24=26,'Equivalencia BH-BMPT'!$D$27,IF(J24=27,'Equivalencia BH-BMPT'!$D$28,IF(J24=28,'Equivalencia BH-BMPT'!$D$29,IF(J24=29,'Equivalencia BH-BMPT'!$D$30,IF(J24=30,'Equivalencia BH-BMPT'!$D$31,IF(J24=31,'Equivalencia BH-BMPT'!$D$32,IF(J24=32,'Equivalencia BH-BMPT'!$D$33,IF(J24=33,'Equivalencia BH-BMPT'!$D$34,IF(J24=34,'Equivalencia BH-BMPT'!$D$35,IF(J24=35,'Equivalencia BH-BMPT'!$D$36,IF(J24=36,'Equivalencia BH-BMPT'!$D$37,IF(J24=37,'Equivalencia BH-BMPT'!$D$38,IF(J24=38,'Equivalencia BH-BMPT'!#REF!,IF(J24=39,'Equivalencia BH-BMPT'!$D$40,IF(J24=40,'Equivalencia BH-BMPT'!$D$41,IF(J24=41,'Equivalencia BH-BMPT'!$D$42,IF(J24=42,'Equivalencia BH-BMPT'!$D$43,IF(J24=43,'Equivalencia BH-BMPT'!$D$44,IF(J24=44,'Equivalencia BH-BMPT'!$D$45,IF(J24=45,'Equivalencia BH-BMPT'!$D$46,\"No ha seleccionado un número de programa\")))))))))))))))))))))))))))))))))))))))))))))","v":"Gobernanza e influencia local, regional e internacional"},1326,52927330,"ADRIANA DEL PILAR MARQUEZ ROJAS",40000000,null,null,2,98440163,49666666,46166666,"2017/03/03","2017/03/03","2017-12-30",240,58,null,null," ","X",null,0.92953020039637857,null,false]
[12,2017,"17-12-6381257",5,{"$f":"IF(D25=1,'Tipo '!$B$2,IF(D25=2,'Tipo '!$B$3,IF(D25=3,'Tipo '!$B$4,IF(D25=4,'Tipo '!$B$5,IF(D25=5,'Tipo '!$B$6,IF(D25=6,'Tipo '!$B$7,IF(D25=7,'Tipo '!$B$8,IF(D25=8,'Tipo '!$B$9,IF(D25=9,'Tipo '!$B$10,IF(D25=10,'Tipo '!$B$11,IF(D25=11,'Tipo '!$B$12,IF(D25=12,'Tipo '!$B$13,IF(D25=13,'Tipo '!$B$14,IF(D25=14,'Tipo '!$B$15,IF(D25=15,'Tipo '!$B$16,IF(D25=16,'Tipo '!$B$17,IF(D25=17,'Tipo '!$B$18,IF(D25=18,'Tipo '!$B$19,IF(D25=19,'Tipo '!$B$20,\"No ha seleccionado un tipo de contrato válido\")))))))))))))))))))","v":"CONTRATOS DE PRESTACIÓN DE SERVICIOS PROFESIONALES Y DE APOYO A LA GESTIÓN"},"Contratación directa","Prestación de servicios profesionales y de apoyo a la gestión, o para la ejecución de trabajos artísticos que sólo puedan encomendarse a determinadas personas naturales;","PRESTAR SUS SERVICIOS PROFESIONALES DE ABOGADO EN EL AREA DE GESTION POLICIVA DE LA ALCALDIA LOCAL DE SANTA FE PARA CONCEPTUAR, ANALIZAR Y TRAMITAR LAS DIFERENTES ACTUACIONES PROPIAS DE LA DEPENDENCIA","Inversión",45,{"$f":"IF(J25=1,'Equivalencia BH-BMPT'!$D$2,IF(J25=2,'Equivalencia BH-BMPT'!$D$3,IF(J25=3,'Equivalencia BH-BMPT'!$D$4,IF(J25=4,'Equivalencia BH-BMPT'!$D$5,IF(J25=5,'Equivalencia BH-BMPT'!$D$6,IF(J25=6,'Equivalencia BH-BMPT'!$D$7,IF(J25=7,'Equivalencia BH-BMPT'!$D$8,IF(J25=8,'Equivalencia BH-BMPT'!$D$9,IF(J25=9,'Equivalencia BH-BMPT'!$D$10,IF(J25=10,'Equivalencia BH-BMPT'!$D$11,IF(J25=11,'Equivalencia BH-BMPT'!$D$12,IF(J25=12,'Equivalencia BH-BMPT'!$D$13,IF(J25=13,'Equivalencia BH-BMPT'!$D$14,IF(J25=14,'Equivalencia BH-BMPT'!$D$15,IF(J25=15,'Equivalencia BH-BMPT'!$D$16,IF(J25=16,'Equivalencia BH-BMPT'!$D$17,IF(J25=17,'Equivalencia BH-BMPT'!$D$18,IF(J25=18,'Equivalencia BH-BMPT'!$D$19,IF(J25=19,'Equivalencia BH-BMPT'!$D$20,IF(J25=20,'Equivalencia BH-BMPT'!$D$21,IF(J25=21,'Equivalencia BH-BMPT'!$D$22,IF(J25=22,'Equivalencia BH-BMPT'!$D$23,IF(J25=23,'Equivalencia BH-BMPT'!#REF!,IF(J25=24,'Equivalencia BH-BMPT'!$D$25,IF(J25=25,'Equivalencia BH-BMPT'!$D$26,IF(J25=26,'Equivalencia BH-BMPT'!$D$27,IF(J25=27,'Equivalencia BH-BMPT'!$D$28,IF(J25=28,'Equivalencia BH-BMPT'!$D$29,IF(J25=29,'Equivalencia BH-BMPT'!$D$30,IF(J25=30,'Equivalencia BH-BMPT'!$D$31,IF(J25=31,'Equivalencia BH-BMPT'!$D$32,IF(J25=32,'Equivalencia BH-BMPT'!$D$33,IF(J25=33,'Equivalencia BH-BMPT'!$D$34,IF(J25=34,'Equivalencia BH-BMPT'!$D$35,IF(J25=35,'Equivalencia BH-BMPT'!$D$36,IF(J25=36,'Equivalencia BH-BMPT'!$D$37,IF(J25=37,'Equivalencia BH-BMPT'!$D$38,IF(J25=38,'Equivalencia BH-BMPT'!#REF!,IF(J25=39,'Equivalencia BH-BMPT'!$D$40,IF(J25=40,'Equivalencia BH-BMPT'!$D$41,IF(J25=41,'Equivalencia BH-BMPT'!$D$42,IF(J25=42,'Equivalencia BH-BMPT'!$D$43,IF(J25=43,'Equivalencia BH-BMPT'!$D$44,IF(J25=44,'Equivalencia BH-BMPT'!$D$45,IF(J25=45,'Equivalencia BH-BMPT'!$D$46,\"No ha seleccionado un número de programa\")))))))))))))))))))))))))))))))))))))))))))))","v":"Gobernanza e influencia local, regional e internacional"},1326,1010217972,"JESSICA TATIANA ROMERO POVEDA",32480000,null,null,2,2300000,40329333,37487333,"2017/03/03","2017/03/03","2017-12-30",240,58,null,null," ","X",null,0.92953020075982906,null,false]
[13,2017,"17-12-6381419",5,{"$f":"IF(D26=1,'Tipo '!$B$2,IF(D26=2,'Tipo '!$B$3,IF(D26=3,'Tipo '!$B$4,IF(D26=4,'Tipo '!$B$5,IF(D26=5,'Tipo '!$B$6,IF(D26=6,'Tipo '!$B$7,IF(D26=7,'Tipo '!$B$8,IF(D26=8,'Tipo '!$B$9,IF(D26=9,'Tipo '!$B$10,IF(D26=10,'Tipo '!$B$11,IF(D26=11,'Tipo '!$B$12,IF(D26=12,'Tipo '!$B$13,IF(D26=13,'Tipo '!$B$14,IF(D26=14,'Tipo '!$B$15,IF(D26=15,'Tipo '!$B$16,IF(D26=16,'Tipo '!$B$17,IF(D26=17,'Tipo '!$B$18,IF(D26=18,'Tipo '!$B$19,IF(D26=19,'Tipo '!$B$20,\"No ha seleccionado un tipo de contrato válido\")))))))))))))))))))","v":"CONTRATOS DE PRESTACIÓN DE SERVICIOS PROFESIONALES Y DE APOYO A LA GESTIÓN"},"Contratación directa","Prestación de servicios profesionales y de apoyo a la gestión, o para la ejecución de trabajos artísticos que sólo puedan encomendarse a determinadas personas naturales;","PRESTAR SUS SERVICIOS PROFESIONALES EN LA ALCALDIA LOCAL DE SANTA FE PARA EMITIR COCEPTOS TECNICOS EN LAS ACTUACIONES ADMINISTRATIVAS QUE SE ADELANTAN EN LA ENTIDAD EN EL AREA DE GESTION POLICIVA","Inversión",45,{"$f":"IF(J26=1,'Equivalencia BH-BMPT'!$D$2,IF(J26=2,'Equivalencia BH-BMPT'!$D$3,IF(J26=3,'Equivalencia BH-BMPT'!$D$4,IF(J26=4,'Equivalencia BH-BMPT'!$D$5,IF(J26=5,'Equivalencia BH-BMPT'!$D$6,IF(J26=6,'Equivalencia BH-BMPT'!$D$7,IF(J26=7,'Equivalencia BH-BMPT'!$D$8,IF(J26=8,'Equivalencia BH-BMPT'!$D$9,IF(J26=9,'Equivalencia BH-BMPT'!$D$10,IF(J26=10,'Equivalencia BH-BMPT'!$D$11,IF(J26=11,'Equivalencia BH-BMPT'!$D$12,IF(J26=12,'Equivalencia BH-BMPT'!$D$13,IF(J26=13,'Equivalencia BH-BMPT'!$D$14,IF(J26=14,'Equivalencia BH-BMPT'!$D$15,IF(J26=15,'Equivalencia BH-BMPT'!$D$16,IF(J26=16,'Equivalencia BH-BMPT'!$D$17,IF(J26=17,'Equivalencia BH-BMPT'!$D$18,IF(J26=18,'Equivalencia BH-BMPT'!$D$19,IF(J26=19,'Equivalencia BH-BMPT'!$D$20,IF(J26=20,'Equivalencia BH-BMPT'!$D$21,IF(J26=21,'Equivalencia BH-BMPT'!$D$22,IF(J26=22,'Equivalencia BH-BMPT'!$D$23,IF(J26=23,'Equivalencia BH-BMPT'!#REF!,IF(J26=24,'Equivalencia BH-BMPT'!$D$25,IF(J26=25,'Equivalencia BH-BMPT'!$D$26,IF(J26=26,'Equivalencia BH-BMPT'!$D$27,IF(J26=27,'Equivalencia BH-BMPT'!$D$28,IF(J26=28,'Equivalencia BH-BMPT'!$D$29,IF(J26=29,'Equivalencia BH-BMPT'!$D$30,IF(J26=30,'Equivalencia BH-BMPT'!$D$31,IF(J26=31,'Equivalencia BH-BMPT'!$D$32,IF(J26=32,'Equivalencia BH-BMPT'!$D$33,IF(J26=33,'Equivalencia BH-BMPT'!$D$34,IF(J26=34,'Equivalencia BH-BMPT'!$D$35,IF(J26=35,'Equivalencia BH-BMPT'!$D$36,IF(J26=36,'Equivalencia BH-BMPT'!$D$37,IF(J26=37,'Equivalencia BH-BMPT'!$D$38,IF(J26=38,'Equivalencia BH-BMPT'!#REF!,IF(J26=39,'Equivalencia BH-BMPT'!$D$40,IF(J26=40,'Equivalencia BH-BMPT'!$D$41,IF(J26=41,'Equivalencia BH-BMPT'!$D$42,IF(J26=42,'Equivalencia BH-BMPT'!$D$43,IF(J26=43,'Equivalencia BH-BMPT'!$D$44,IF(J26=44,'Equivalencia BH-BMPT'!$D$45,IF(J26=45,'Equivalencia BH-BMPT'!$D$46,\"No ha seleccionado un número de programa\")))))))))))))))))))))))))))))))))))))))))))))","v":"Gobernanza e influencia local, regional e internacional"},1326,80069750,"DANIEL GUSTAVO GUZMAN TEJEDA",33600000,null,null,2,2000000,41720000,38780000,"2017/03/03","2017/03/03","2017-12-30",240,58,null,null," ","X",null,0.92953020134228193,null,false]
[14,2017,"17-12-6392922",5,{"$f":"IF(D27=1,'Tipo '!$B$2,IF(D27=2,'Tipo '!$B$3,IF(D27=3,'Tipo '!$B$4,IF(D27=4,'Tipo '!$B$5,IF(D27=5,'Tipo '!$B$6,IF(D27=6,'Tipo '!$B$7,IF(D27=7,'Tipo '!$B$8,IF(D27=8,'Tipo '!$B$9,IF(D27=9,'Tipo '!$B$10,IF(D27=10,'Tipo '!$B$11,IF(D27=11,'Tipo '!$B$12,IF(D27=12,'Tipo '!$B$13,IF(D27=13,'Tipo '!$B$14,IF(D27=14,'Tipo '!$B$15,IF(D27=15,'Tipo '!$B$16,IF(D27=16,'Tipo '!$B$17,IF(D27=17,'Tipo '!$B$18,IF(D27=18,'Tipo '!$B$19,IF(D27=19,'Tipo '!$B$20,\"No ha seleccionado un tipo de contrato válido\")))))))))))))))))))","v":"CONTRATOS DE PRESTACIÓN DE SERVICIOS PROFESIONALES Y DE APOYO A LA GESTIÓN"},"Contratación directa","Prestación de servicios profesionales y de apoyo a la gestión, o para la ejecución de trabajos artísticos que sólo puedan encomendarse a determinadas personas naturales;","PRESTAR APOYO AL AREA DE GESTION DEL DESARROLLO LOCAL EN LA REALIZACION DE ESTRATEGIAS DE COMUNICACIÓN DE LA ALCALDIA LOCAL DE SANTA FE","Inversión",45,{"$f":"IF(J27=1,'Equivalencia BH-BMPT'!$D$2,IF(J27=2,'Equivalencia BH-BMPT'!$D$3,IF(J27=3,'Equivalencia BH-BMPT'!$D$4,IF(J27=4,'Equivalencia BH-BMPT'!$D$5,IF(J27=5,'Equivalencia BH-BMPT'!$D$6,IF(J27=6,'Equivalencia BH-BMPT'!$D$7,IF(J27=7,'Equivalencia BH-BMPT'!$D$8,IF(J27=8,'Equivalencia BH-BMPT'!$D$9,IF(J27=9,'Equivalencia BH-BMPT'!$D$10,IF(J27=10,'Equivalencia BH-BMPT'!$D$11,IF(J27=11,'Equivalencia BH-BMPT'!$D$12,IF(J27=12,'Equivalencia BH-BMPT'!$D$13,IF(J27=13,'Equivalencia BH-BMPT'!$D$14,IF(J27=14,'Equivalencia BH-BMPT'!$D$15,IF(J27=15,'Equivalencia BH-BMPT'!$D$16,IF(J27=16,'Equivalencia BH-BMPT'!$D$17,IF(J27=17,'Equivalencia BH-BMPT'!$D$18,IF(J27=18,'Equivalencia BH-BMPT'!$D$19,IF(J27=19,'Equivalencia BH-BMPT'!$D$20,IF(J27=20,'Equivalencia BH-BMPT'!$D$21,IF(J27=21,'Equivalencia BH-BMPT'!$D$22,IF(J27=22,'Equivalencia BH-BMPT'!$D$23,IF(J27=23,'Equivalencia BH-BMPT'!#REF!,IF(J27=24,'Equivalencia BH-BMPT'!$D$25,IF(J27=25,'Equivalencia BH-BMPT'!$D$26,IF(J27=26,'Equivalencia BH-BMPT'!$D$27,IF(J27=27,'Equivalencia BH-BMPT'!$D$28,IF(J27=28,'Equivalencia BH-BMPT'!$D$29,IF(J27=29,'Equivalencia BH-BMPT'!$D$30,IF(J27=30,'Equivalencia BH-BMPT'!$D$31,IF(J27=31,'Equivalencia BH-BMPT'!$D$32,IF(J27=32,'Equivalencia BH-BMPT'!$D$33,IF(J27=33,'Equivalencia BH-BMPT'!$D$34,IF(J27=34,'Equivalencia BH-BMPT'!$D$35,IF(J27=35,'Equivalencia BH-BMPT'!$D$36,IF(J27=36,'Equivalencia BH-BMPT'!$D$37,IF(J27=37,'Equivalencia BH-BMPT'!$D$38,IF(J27=38,'Equivalencia BH-BMPT'!#REF!,IF(J27=39,'Equivalencia BH-BMPT'!$D$40,IF(J27=40,'Equivalencia BH-BMPT'!$D$41,IF(J27=41,'Equivalencia BH-BMPT'!$D$42,IF(J27=42,'Equivalencia BH-BMPT'!$D$43,IF(J27=43,'Equivalencia BH-BMPT'!$D$44,IF(J27=44,'Equivalencia BH-BMPT'!$D$45,IF(J27=45,'Equivalencia BH-BMPT'!$D$46,\"No ha seleccionado un número de programa\")))))))))))))))))))))))))))))))))))))))))))))","v":"Gobernanza e influencia local, regional e internacional"},1326,80123303,"CARLOS ANDRES CACERES VIDAL",36000000,null,null,1,null,47250000,41550000,"2017/03/03","2017/03/03","2018-01-15",240,74,null,null,"X",null,null,0.87936507936507935,null,false]
[15,2017,"17-12-6393038",5,{"$f":"IF(D28=1,'Tipo '!$B$2,IF(D28=2,'Tipo '!$B$3,IF(D28=3,'Tipo '!$B$4,IF(D28=4,'Tipo '!$B$5,IF(D28=5,'Tipo '!$B$6,IF(D28=6,'Tipo '!$B$7,IF(D28=7,'Tipo '!$B$8,IF(D28=8,'Tipo '!$B$9,IF(D28=9,'Tipo '!$B$10,IF(D28=10,'Tipo '!$B$11,IF(D28=11,'Tipo '!$B$12,IF(D28=12,'Tipo '!$B$13,IF(D28=13,'Tipo '!$B$14,IF(D28=14,'Tipo '!$B$15,IF(D28=15,'Tipo '!$B$16,IF(D28=16,'Tipo '!$B$17,IF(D28=17,'Tipo '!$B$18,IF(D28=18,'Tipo '!$B$19,IF(D28=19,'Tipo '!$B$20,\"No ha seleccionado un tipo de contrato válido\")))))))))))))))))))","v":"CONTRATOS DE PRESTACIÓN DE SERVICIOS PROFESIONALES Y DE APOYO A LA GESTIÓN"},"Contratación directa","Prestación de servicios profesionales y de apoyo a la gestión, o para la ejecución de trabajos artísticos que sólo puedan encomendarse a determinadas personas naturales;","PRESTAR SUS SERVICIOS PROFESIONALES PARA EFECTUAR LA GESTION DE RELACIONES INTERINSTITUCIONALES, INTERGUBERNAMENTALES, EN CAMPO Y SEDE ADMINISTRATIVA, DESIGNADAS POR EL DESPACHO DELA ALCALDIA LOCAL DE SANTA FE, CON EL FIN DE PROMOVER LA INTEGRACION DE LOS DIFERENTES SECTORES HACIA LA ENTIDAD","Inversión",45,{"$f":"IF(J28=1,'Equivalencia BH-BMPT'!$D$2,IF(J28=2,'Equivalencia BH-BMPT'!$D$3,IF(J28=3,'Equivalencia BH-BMPT'!$D$4,IF(J28=4,'Equivalencia BH-BMPT'!$D$5,IF(J28=5,'Equivalencia BH-BMPT'!$D$6,IF(J28=6,'Equivalencia BH-BMPT'!$D$7,IF(J28=7,'Equivalencia BH-BMPT'!$D$8,IF(J28=8,'Equivalencia BH-BMPT'!$D$9,IF(J28=9,'Equivalencia BH-BMPT'!$D$10,IF(J28=10,'Equivalencia BH-BMPT'!$D$11,IF(J28=11,'Equivalencia BH-BMPT'!$D$12,IF(J28=12,'Equivalencia BH-BMPT'!$D$13,IF(J28=13,'Equivalencia BH-BMPT'!$D$14,IF(J28=14,'Equivalencia BH-BMPT'!$D$15,IF(J28=15,'Equivalencia BH-BMPT'!$D$16,IF(J28=16,'Equivalencia BH-BMPT'!$D$17,IF(J28=17,'Equivalencia BH-BMPT'!$D$18,IF(J28=18,'Equivalencia BH-BMPT'!$D$19,IF(J28=19,'Equivalencia BH-BMPT'!$D$20,IF(J28=20,'Equivalencia BH-BMPT'!$D$21,IF(J28=21,'Equivalencia BH-BMPT'!$D$22,IF(J28=22,'Equivalencia BH-BMPT'!$D$23,IF(J28=23,'Equivalencia BH-BMPT'!#REF!,IF(J28=24,'Equivalencia BH-BMPT'!$D$25,IF(J28=25,'Equivalencia BH-BMPT'!$D$26,IF(J28=26,'Equivalencia BH-BMPT'!$D$27,IF(J28=27,'Equivalencia BH-BMPT'!$D$28,IF(J28=28,'Equivalencia BH-BMPT'!$D$29,IF(J28=29,'Equivalencia BH-BMPT'!$D$30,IF(J28=30,'Equivalencia BH-BMPT'!$D$31,IF(J28=31,'Equivalencia BH-BMPT'!$D$32,IF(J28=32,'Equivalencia BH-BMPT'!$D$33,IF(J28=33,'Equivalencia BH-BMPT'!$D$34,IF(J28=34,'Equivalencia BH-BMPT'!$D$35,IF(J28=35,'Equivalencia BH-BMPT'!$D$36,IF(J28=36,'Equivalencia BH-BMPT'!$D$37,IF(J28=37,'Equivalencia BH-BMPT'!$D$38,IF(J28=38,'Equivalencia BH-BMPT'!#REF!,IF(J28=39,'Equivalencia BH-BMPT'!$D$40,IF(J28=40,'Equivalencia BH-BMPT'!$D$41,IF(J28=41,'Equivalencia BH-BMPT'!$D$42,IF(J28=42,'Equivalencia BH-BMPT'!$D$43,IF(J28=43,'Equivalencia BH-BMPT'!$D$44,IF(J28=44,'Equivalencia BH-BMPT'!$D$45,IF(J28=45,'Equivalencia BH-BMPT'!$D$46,\"No ha seleccionado un número de programa\")))))))))))))))))))))))))))))))))))))))))))))","v":"Gobernanza e influencia local, regional e internacional"},1326,40993157,"CATALINA DEL MAR CALDERON ALVAREZ",36000000,null,null,1,11250000,47250000,41550000,"2017/03/03","2017/03/03","2018-01-15",240,74,null,null,"X",null,null,0.87936507936507935,null,false]
[16,2017,"17-12-6474285",5,{"$f":"IF(D29=1,'Tipo '!$B$2,IF(D29=2,'Tipo '!$B$3,IF(D29=3,'Tipo '!$B$4,IF(D29=4,'Tipo '!$B$5,IF(D29=5,'Tipo '!$B$6,IF(D29=6,'Tipo '!$B$7,IF(D29=7,'Tipo '!$B$8,IF(D29=8,'Tipo '!$B$9,IF(D29=9,'Tipo '!$B$10,IF(D29=10,'Tipo '!$B$11,IF(D29=11,'Tipo '!$B$12,IF(D29=12,'Tipo '!$B$13,IF(D29=13,'Tipo '!$B$14,IF(D29=14,'Tipo '!$B$15,IF(D29=15,'Tipo '!$B$16,IF(D29=16,'Tipo '!$B$17,IF(D29=17,'Tipo '!$B$18,IF(D29=18,'Tipo '!$B$19,IF(D29=19,'Tipo '!$B$20,\"No ha seleccionado un tipo de contrato válido\")))))))))))))))))))","v":"CONTRATOS DE PRESTACIÓN DE SERVICIOS PROFESIONALES Y DE APOYO A LA GESTIÓN"},"Contratación directa","Prestación de servicios profesionales y de apoyo a la gestión, o para la ejecución de trabajos artísticos que sólo puedan encomendarse a determinadas personas naturales;","PRESTAR SUS SERVICIOS DE APOYO AL ÁREA GESTIÓN POLICÍVA COMO AUXILIAR ADMINISTRATIVO DE LA ALCALDÍA LOCAL DE SANTA FE,  DE ACUERDO A MEMORANDO RADICADO BAJO EL NÚMERO 2017-532-000-2073 DE FECHA MARZO 3  DE 2017, FIRMADO POR EL ALCALDE LOCAL, Y DOCUMENTO NOHAY NUMERO 686      DE FECHA FEBRERO 17   DE 2017 EXPEDIDO POR LA DIRECCION DE GESTION DEL TALENTO HUMANO DE LA SECRETARIA DISTRITAL DE GOBIERNO.","Inversión",45,{"$f":"IF(J29=1,'Equivalencia BH-BMPT'!$D$2,IF(J29=2,'Equivalencia BH-BMPT'!$D$3,IF(J29=3,'Equivalencia BH-BMPT'!$D$4,IF(J29=4,'Equivalencia BH-BMPT'!$D$5,IF(J29=5,'Equivalencia BH-BMPT'!$D$6,IF(J29=6,'Equivalencia BH-BMPT'!$D$7,IF(J29=7,'Equivalencia BH-BMPT'!$D$8,IF(J29=8,'Equivalencia BH-BMPT'!$D$9,IF(J29=9,'Equivalencia BH-BMPT'!$D$10,IF(J29=10,'Equivalencia BH-BMPT'!$D$11,IF(J29=11,'Equivalencia BH-BMPT'!$D$12,IF(J29=12,'Equivalencia BH-BMPT'!$D$13,IF(J29=13,'Equivalencia BH-BMPT'!$D$14,IF(J29=14,'Equivalencia BH-BMPT'!$D$15,IF(J29=15,'Equivalencia BH-BMPT'!$D$16,IF(J29=16,'Equivalencia BH-BMPT'!$D$17,IF(J29=17,'Equivalencia BH-BMPT'!$D$18,IF(J29=18,'Equivalencia BH-BMPT'!$D$19,IF(J29=19,'Equivalencia BH-BMPT'!$D$20,IF(J29=20,'Equivalencia BH-BMPT'!$D$21,IF(J29=21,'Equivalencia BH-BMPT'!$D$22,IF(J29=22,'Equivalencia BH-BMPT'!$D$23,IF(J29=23,'Equivalencia BH-BMPT'!#REF!,IF(J29=24,'Equivalencia BH-BMPT'!$D$25,IF(J29=25,'Equivalencia BH-BMPT'!$D$26,IF(J29=26,'Equivalencia BH-BMPT'!$D$27,IF(J29=27,'Equivalencia BH-BMPT'!$D$28,IF(J29=28,'Equivalencia BH-BMPT'!$D$29,IF(J29=29,'Equivalencia BH-BMPT'!$D$30,IF(J29=30,'Equivalencia BH-BMPT'!$D$31,IF(J29=31,'Equivalencia BH-BMPT'!$D$32,IF(J29=32,'Equivalencia BH-BMPT'!$D$33,IF(J29=33,'Equivalencia BH-BMPT'!$D$34,IF(J29=34,'Equivalencia BH-BMPT'!$D$35,IF(J29=35,'Equivalencia BH-BMPT'!$D$36,IF(J29=36,'Equivalencia BH-BMPT'!$D$37,IF(J29=37,'Equivalencia BH-BMPT'!$D$38,IF(J29=38,'Equivalencia BH-BMPT'!#REF!,IF(J29=39,'Equivalencia BH-BMPT'!$D$40,IF(J29=40,'Equivalencia BH-BMPT'!$D$41,IF(J29=41,'Equivalencia BH-BMPT'!$D$42,IF(J29=42,'Equivalencia BH-BMPT'!$D$43,IF(J29=43,'Equivalencia BH-BMPT'!$D$44,IF(J29=44,'Equivalencia BH-BMPT'!$D$45,IF(J29=45,'Equivalencia BH-BMPT'!$D$46,\"No ha seleccionado un número de programa\")))))))))))))))))))))))))))))))))))))))))))))","v":"Gobernanza e influencia local, regional e internacional"},1326,1109291034,"YEIMMI LORENA RIAÑO TORO",21200000,null,null,2,5123333,26323333,24468333,"2017/03/03","2017/03/03","2017-12-30",240,58,null,null," ","X",null,0.92953020044992019,null,false]
[17,2017,"17-12-6400861",5,{"$f":"IF(D30=1,'Tipo '!$B$2,IF(D30=2,'Tipo '!$B$3,IF(D30=3,'Tipo '!$B$4,IF(D30=4,'Tipo '!$B$5,IF(D30=5,'Tipo '!$B$6,IF(D30=6,'Tipo '!$B$7,IF(D30=7,'Tipo '!$B$8,IF(D30=8,'Tipo '!$B$9,IF(D30=9,'Tipo '!$B$10,IF(D30=10,'Tipo '!$B$11,IF(D30=11,'Tipo '!$B$12,IF(D30=12,'Tipo '!$B$13,IF(D30=13,'Tipo '!$B$14,IF(D30=14,'Tipo '!$B$15,IF(D30=15,'Tipo '!$B$16,IF(D30=16,'Tipo '!$B$17,IF(D30=17,'Tipo '!$B$18,IF(D30=18,'Tipo '!$B$19,IF(D30=19,'Tipo '!$B$20,\"No ha seleccionado un tipo de contrato válido\")))))))))))))))))))","v":"CONTRATOS DE PRESTACIÓN DE SERVICIOS PROFESIONALES Y DE APOYO A LA GESTIÓN"},"Contratación directa","Prestación de servicios profesionales y de apoyo a la gestión, o para la ejecución de trabajos artísticos que sólo puedan encomendarse a determinadas personas naturales;","PRESTAR LOS SERVICIOS DE APOYO AL AREA DE GESTION DEL DESARROLLO LOCAL, EN LO RELACIONADO CON LAS ACTIVIDADES DEL ALMACEN DE LA ALCALDIA LOCAL DE SANTA FE","Inversión",45,{"$f":"IF(J30=1,'Equivalencia BH-BMPT'!$D$2,IF(J30=2,'Equivalencia BH-BMPT'!$D$3,IF(J30=3,'Equivalencia BH-BMPT'!$D$4,IF(J30=4,'Equivalencia BH-BMPT'!$D$5,IF(J30=5,'Equivalencia BH-BMPT'!$D$6,IF(J30=6,'Equivalencia BH-BMPT'!$D$7,IF(J30=7,'Equivalencia BH-BMPT'!$D$8,IF(J30=8,'Equivalencia BH-BMPT'!$D$9,IF(J30=9,'Equivalencia BH-BMPT'!$D$10,IF(J30=10,'Equivalencia BH-BMPT'!$D$11,IF(J30=11,'Equivalencia BH-BMPT'!$D$12,IF(J30=12,'Equivalencia BH-BMPT'!$D$13,IF(J30=13,'Equivalencia BH-BMPT'!$D$14,IF(J30=14,'Equivalencia BH-BMPT'!$D$15,IF(J30=15,'Equivalencia BH-BMPT'!$D$16,IF(J30=16,'Equivalencia BH-BMPT'!$D$17,IF(J30=17,'Equivalencia BH-BMPT'!$D$18,IF(J30=18,'Equivalencia BH-BMPT'!$D$19,IF(J30=19,'Equivalencia BH-BMPT'!$D$20,IF(J30=20,'Equivalencia BH-BMPT'!$D$21,IF(J30=21,'Equivalencia BH-BMPT'!$D$22,IF(J30=22,'Equivalencia BH-BMPT'!$D$23,IF(J30=23,'Equivalencia BH-BMPT'!#REF!,IF(J30=24,'Equivalencia BH-BMPT'!$D$25,IF(J30=25,'Equivalencia BH-BMPT'!$D$26,IF(J30=26,'Equivalencia BH-BMPT'!$D$27,IF(J30=27,'Equivalencia BH-BMPT'!$D$28,IF(J30=28,'Equivalencia BH-BMPT'!$D$29,IF(J30=29,'Equivalencia BH-BMPT'!$D$30,IF(J30=30,'Equivalencia BH-BMPT'!$D$31,IF(J30=31,'Equivalencia BH-BMPT'!$D$32,IF(J30=32,'Equivalencia BH-BMPT'!$D$33,IF(J30=33,'Equivalencia BH-BMPT'!$D$34,IF(J30=34,'Equivalencia BH-BMPT'!$D$35,IF(J30=35,'Equivalencia BH-BMPT'!$D$36,IF(J30=36,'Equivalencia BH-BMPT'!$D$37,IF(J30=37,'Equivalencia BH-BMPT'!$D$38,IF(J30=38,'Equivalencia BH-BMPT'!#REF!,IF(J30=39,'Equivalencia BH-BMPT'!$D$40,IF(J30=40,'Equivalencia BH-BMPT'!$D$41,IF(J30=41,'Equivalencia BH-BMPT'!$D$42,IF(J30=42,'Equivalencia BH-BMPT'!$D$43,IF(J30=43,'Equivalencia BH-BMPT'!$D$44,IF(J30=44,'Equivalencia BH-BMPT'!$D$45,IF(J30=45,'Equivalencia BH-BMPT'!$D$46,\"No ha seleccionado un número de programa\")))))))))))))))))))))))))))))))))))))))))))))","v":"Gobernanza e influencia local, regional e internacional"},1326,76339794,"HORACIO HERRERA CARABALI",15200000,null,null,2,3673331,18873331,17543331,"2017/03/03","2017/03/03","2017-12-30",240,58,null,null," ","X",null,0.92953019263001324,null,false]
[18,2017,"17-12-6401882",5,{"$f":"IF(D31=1,'Tipo '!$B$2,IF(D31=2,'Tipo '!$B$3,IF(D31=3,'Tipo '!$B$4,IF(D31=4,'Tipo '!$B$5,IF(D31=5,'Tipo '!$B$6,IF(D31=6,'Tipo '!$B$7,IF(D31=7,'Tipo '!$B$8,IF(D31=8,'Tipo '!$B$9,IF(D31=9,'Tipo '!$B$10,IF(D31=10,'Tipo '!$B$11,IF(D31=11,'Tipo '!$B$12,IF(D31=12,'Tipo '!$B$13,IF(D31=13,'Tipo '!$B$14,IF(D31=14,'Tipo '!$B$15,IF(D31=15,'Tipo '!$B$16,IF(D31=16,'Tipo '!$B$17,IF(D31=17,'Tipo '!$B$18,IF(D31=18,'Tipo '!$B$19,IF(D31=19,'Tipo '!$B$20,\"No ha seleccionado un tipo de contrato válido\")))))))))))))))))))","v":"CONTRATOS DE PRESTACIÓN DE SERVICIOS PROFESIONALES Y DE APOYO A LA GESTIÓN"},"Contratación directa","Prestación de servicios profesionales y de apoyo a la gestión, o para la ejecución de trabajos artísticos que sólo puedan encomendarse a determinadas personas naturales;","PRESTAR SERVICIOS DE APOYO AL AREA DE GESTION POLICIVA COMO AUXILIAR ADMINISTRATIO DE LA ALCALDIA LOCAL DE SANTA FE","Inversión",45,{"$f":"IF(J31=1,'Equivalencia BH-BMPT'!$D$2,IF(J31=2,'Equivalencia BH-BMPT'!$D$3,IF(J31=3,'Equivalencia BH-BMPT'!$D$4,IF(J31=4,'Equivalencia BH-BMPT'!$D$5,IF(J31=5,'Equivalencia BH-BMPT'!$D$6,IF(J31=6,'Equivalencia BH-BMPT'!$D$7,IF(J31=7,'Equivalencia BH-BMPT'!$D$8,IF(J31=8,'Equivalencia BH-BMPT'!$D$9,IF(J31=9,'Equivalencia BH-BMPT'!$D$10,IF(J31=10,'Equivalencia BH-BMPT'!$D$11,IF(J31=11,'Equivalencia BH-BMPT'!$D$12,IF(J31=12,'Equivalencia BH-BMPT'!$D$13,IF(J31=13,'Equivalencia BH-BMPT'!$D$14,IF(J31=14,'Equivalencia BH-BMPT'!$D$15,IF(J31=15,'Equivalencia BH-BMPT'!$D$16,IF(J31=16,'Equivalencia BH-BMPT'!$D$17,IF(J31=17,'Equivalencia BH-BMPT'!$D$18,IF(J31=18,'Equivalencia BH-BMPT'!$D$19,IF(J31=19,'Equivalencia BH-BMPT'!$D$20,IF(J31=20,'Equivalencia BH-BMPT'!$D$21,IF(J31=21,'Equivalencia BH-BMPT'!$D$22,IF(J31=22,'Equivalencia BH-BMPT'!$D$23,IF(J31=23,'Equivalencia BH-BMPT'!#REF!,IF(J31=24,'Equivalencia BH-BMPT'!$D$25,IF(J31=25,'Equivalencia BH-BMPT'!$D$26,IF(J31=26,'Equivalencia BH-BMPT'!$D$27,IF(J31=27,'Equivalencia BH-BMPT'!$D$28,IF(J31=28,'Equivalencia BH-BMPT'!$D$29,IF(J31=29,'Equivalencia BH-BMPT'!$D$30,IF(J31=30,'Equivalencia BH-BMPT'!$D$31,IF(J31=31,'Equivalencia BH-BMPT'!$D$32,IF(J31=32,'Equivalencia BH-BMPT'!$D$33,IF(J31=33,'Equivalencia BH-BMPT'!$D$34,IF(J31=34,'Equivalencia BH-BMPT'!$D$35,IF(J31=35,'Equivalencia BH-BMPT'!$D$36,IF(J31=36,'Equivalencia BH-BMPT'!$D$37,IF(J31=37,'Equivalencia BH-BMPT'!$D$38,IF(J31=38,'Equivalencia BH-BMPT'!#REF!,IF(J31=39,'Equivalencia BH-BMPT'!$D$40,IF(J31=40,'Equivalencia BH-BMPT'!$D$41,IF(J31=41,'Equivalencia BH-BMPT'!$D$42,IF(J31=42,'Equivalencia BH-BMPT'!$D$43,IF(J31=43,'Equivalencia BH-BMPT'!$D$44,IF(J31=44,'Equivalencia BH-BMPT'!$D$45,IF(J31=45,'Equivalencia BH-BMPT'!$D$46,\"No ha seleccionado un número de programa\")))))))))))))))))))))))))))))))))))))))))))))","v":"Gobernanza e influencia local, regional e internacional"},1326,51657259,"IRLANDA PALACIOS TORRES",21200000,null,null,2,5123333,26323333,24468333,"2017/03/03","2017/03/03","2017-12-30",240,58,null,null," ","X",null,0.92953020044992019,null,false]
[19,2017,"17-12-6403736",5,{"$f":"IF(D32=1,'Tipo '!$B$2,IF(D32=2,'Tipo '!$B$3,IF(D32=3,'Tipo '!$B$4,IF(D32=4,'Tipo '!$B$5,IF(D32=5,'Tipo '!$B$6,IF(D32=6,'Tipo '!$B$7,IF(D32=7,'Tipo '!$B$8,IF(D32=8,'Tipo '!$B$9,IF(D32=9,'Tipo '!$B$10,IF(D32=10,'Tipo '!$B$11,IF(D32=11,'Tipo '!$B$12,IF(D32=12,'Tipo '!$B$13,IF(D32=13,'Tipo '!$B$14,IF(D32=14,'Tipo '!$B$15,IF(D32=15,'Tipo '!$B$16,IF(D32=16,'Tipo '!$B$17,IF(D32=17,'Tipo '!$B$18,IF(D32=18,'Tipo '!$B$19,IF(D32=19,'Tipo '!$B$20,\"No ha seleccionado un tipo de contrato válido\")))))))))))))))))))","v":"CONTRATOS DE PRESTACIÓN DE SERVICIOS PROFESIONALES Y DE APOYO A LA GESTIÓN"},"Contratación directa","Prestación de servicios profesionales y de apoyo a la gestión, o para la ejecución de trabajos artísticos que sólo puedan encomendarse a determinadas personas naturales;","PRESTAR SERVICIOS DE APOYO A LA GESTION AL AREA DE GESTION POLICIVA DE LA ALCALDIA LOCAL DE SANTA FE, DANDO SOPORTE A LAS ACTUACIONES ADMINISTRATIVAS","Inversión",45,{"$f":"IF(J32=1,'Equivalencia BH-BMPT'!$D$2,IF(J32=2,'Equivalencia BH-BMPT'!$D$3,IF(J32=3,'Equivalencia BH-BMPT'!$D$4,IF(J32=4,'Equivalencia BH-BMPT'!$D$5,IF(J32=5,'Equivalencia BH-BMPT'!$D$6,IF(J32=6,'Equivalencia BH-BMPT'!$D$7,IF(J32=7,'Equivalencia BH-BMPT'!$D$8,IF(J32=8,'Equivalencia BH-BMPT'!$D$9,IF(J32=9,'Equivalencia BH-BMPT'!$D$10,IF(J32=10,'Equivalencia BH-BMPT'!$D$11,IF(J32=11,'Equivalencia BH-BMPT'!$D$12,IF(J32=12,'Equivalencia BH-BMPT'!$D$13,IF(J32=13,'Equivalencia BH-BMPT'!$D$14,IF(J32=14,'Equivalencia BH-BMPT'!$D$15,IF(J32=15,'Equivalencia BH-BMPT'!$D$16,IF(J32=16,'Equivalencia BH-BMPT'!$D$17,IF(J32=17,'Equivalencia BH-BMPT'!$D$18,IF(J32=18,'Equivalencia BH-BMPT'!$D$19,IF(J32=19,'Equivalencia BH-BMPT'!$D$20,IF(J32=20,'Equivalencia BH-BMPT'!$D$21,IF(J32=21,'Equivalencia BH-BMPT'!$D$22,IF(J32=22,'Equivalencia BH-BMPT'!$D$23,IF(J32=23,'Equivalencia BH-BMPT'!#REF!,IF(J32=24,'Equivalencia BH-BMPT'!$D$25,IF(J32=25,'Equivalencia BH-BMPT'!$D$26,IF(J32=26,'Equivalencia BH-BMPT'!$D$27,IF(J32=27,'Equivalencia BH-BMPT'!$D$28,IF(J32=28,'Equivalencia BH-BMPT'!$D$29,IF(J32=29,'Equivalencia BH-BMPT'!$D$30,IF(J32=30,'Equivalencia BH-BMPT'!$D$31,IF(J32=31,'Equivalencia BH-BMPT'!$D$32,IF(J32=32,'Equivalencia BH-BMPT'!$D$33,IF(J32=33,'Equivalencia BH-BMPT'!$D$34,IF(J32=34,'Equivalencia BH-BMPT'!$D$35,IF(J32=35,'Equivalencia BH-BMPT'!$D$36,IF(J32=36,'Equivalencia BH-BMPT'!$D$37,IF(J32=37,'Equivalencia BH-BMPT'!$D$38,IF(J32=38,'Equivalencia BH-BMPT'!#REF!,IF(J32=39,'Equivalencia BH-BMPT'!$D$40,IF(J32=40,'Equivalencia BH-BMPT'!$D$41,IF(J32=41,'Equivalencia BH-BMPT'!$D$42,IF(J32=42,'Equivalencia BH-BMPT'!$D$43,IF(J32=43,'Equivalencia BH-BMPT'!$D$44,IF(J32=44,'Equivalencia BH-BMPT'!$D$45,IF(J32=45,'Equivalencia BH-BMPT'!$D$46,\"No ha seleccionado un número de programa\")))))))))))))))))))))))))))))))))))))))))))))","v":"Gobernanza e influencia local, regional e internacional"},1326,1014284302,"LAURA BANESSA LAVERDE ARANDA",21200000,null,null,2,4858333,26058333,24203333,"2017/03/06","2017/03/06","2017-12-30",240,55,null,null," ","X",null,0.92881355841143021,null,false]
[20,2017,"17-12-6403906",5,{"$f":"IF(D33=1,'Tipo '!$B$2,IF(D33=2,'Tipo '!$B$3,IF(D33=3,'Tipo '!$B$4,IF(D33=4,'Tipo '!$B$5,IF(D33=5,'Tipo '!$B$6,IF(D33=6,'Tipo '!$B$7,IF(D33=7,'Tipo '!$B$8,IF(D33=8,'Tipo '!$B$9,IF(D33=9,'Tipo '!$B$10,IF(D33=10,'Tipo '!$B$11,IF(D33=11,'Tipo '!$B$12,IF(D33=12,'Tipo '!$B$13,IF(D33=13,'Tipo '!$B$14,IF(D33=14,'Tipo '!$B$15,IF(D33=15,'Tipo '!$B$16,IF(D33=16,'Tipo '!$B$17,IF(D33=17,'Tipo '!$B$18,IF(D33=18,'Tipo '!$B$19,IF(D33=19,'Tipo '!$B$20,\"No ha seleccionado un tipo de contrato válido\")))))))))))))))))))","v":"CONTRATOS DE PRESTACIÓN DE SERVICIOS PROFESIONALES Y DE APOYO A LA GESTIÓN"},"Contratación directa","Prestación de servicios profesionales y de apoyo a la gestión, o para la ejecución de trabajos artísticos que sólo puedan encomendarse a determinadas personas naturales;","CONTRATAR LOS SERVICIOS PROFESIONALES DE UN ABOGADO PARA APOYAR AL FONDO DE DESARROLLO LOCAL EN TODO LO RELACIONADO CON LA ACTIVIDAD CONTRACTUAL DE LA ALCALDIA LOCAL DE SANTA FE, EN EL MARCO DE LOS PLANES, PROGRAMAS Y PROYECTOS ENCAMINADOS AL FORTALECIMIENTO INSTITUCIONAL PARA EL MEJORAMIENTO DE LA GESTION DEL FONDO","Inversión",45,{"$f":"IF(J33=1,'Equivalencia BH-BMPT'!$D$2,IF(J33=2,'Equivalencia BH-BMPT'!$D$3,IF(J33=3,'Equivalencia BH-BMPT'!$D$4,IF(J33=4,'Equivalencia BH-BMPT'!$D$5,IF(J33=5,'Equivalencia BH-BMPT'!$D$6,IF(J33=6,'Equivalencia BH-BMPT'!$D$7,IF(J33=7,'Equivalencia BH-BMPT'!$D$8,IF(J33=8,'Equivalencia BH-BMPT'!$D$9,IF(J33=9,'Equivalencia BH-BMPT'!$D$10,IF(J33=10,'Equivalencia BH-BMPT'!$D$11,IF(J33=11,'Equivalencia BH-BMPT'!$D$12,IF(J33=12,'Equivalencia BH-BMPT'!$D$13,IF(J33=13,'Equivalencia BH-BMPT'!$D$14,IF(J33=14,'Equivalencia BH-BMPT'!$D$15,IF(J33=15,'Equivalencia BH-BMPT'!$D$16,IF(J33=16,'Equivalencia BH-BMPT'!$D$17,IF(J33=17,'Equivalencia BH-BMPT'!$D$18,IF(J33=18,'Equivalencia BH-BMPT'!$D$19,IF(J33=19,'Equivalencia BH-BMPT'!$D$20,IF(J33=20,'Equivalencia BH-BMPT'!$D$21,IF(J33=21,'Equivalencia BH-BMPT'!$D$22,IF(J33=22,'Equivalencia BH-BMPT'!$D$23,IF(J33=23,'Equivalencia BH-BMPT'!#REF!,IF(J33=24,'Equivalencia BH-BMPT'!$D$25,IF(J33=25,'Equivalencia BH-BMPT'!$D$26,IF(J33=26,'Equivalencia BH-BMPT'!$D$27,IF(J33=27,'Equivalencia BH-BMPT'!$D$28,IF(J33=28,'Equivalencia BH-BMPT'!$D$29,IF(J33=29,'Equivalencia BH-BMPT'!$D$30,IF(J33=30,'Equivalencia BH-BMPT'!$D$31,IF(J33=31,'Equivalencia BH-BMPT'!$D$32,IF(J33=32,'Equivalencia BH-BMPT'!$D$33,IF(J33=33,'Equivalencia BH-BMPT'!$D$34,IF(J33=34,'Equivalencia BH-BMPT'!$D$35,IF(J33=35,'Equivalencia BH-BMPT'!$D$36,IF(J33=36,'Equivalencia BH-BMPT'!$D$37,IF(J33=37,'Equivalencia BH-BMPT'!$D$38,IF(J33=38,'Equivalencia BH-BMPT'!#REF!,IF(J33=39,'Equivalencia BH-BMPT'!$D$40,IF(J33=40,'Equivalencia BH-BMPT'!$D$41,IF(J33=41,'Equivalencia BH-BMPT'!$D$42,IF(J33=42,'Equivalencia BH-BMPT'!$D$43,IF(J33=43,'Equivalencia BH-BMPT'!$D$44,IF(J33=44,'Equivalencia BH-BMPT'!$D$45,IF(J33=45,'Equivalencia BH-BMPT'!$D$46,\"No ha seleccionado un número de programa\")))))))))))))))))))))))))))))))))))))))))))))","v":"Gobernanza e influencia local, regional e internacional"},1326,80198946,"CAMILO ALFREDO D'COSTA RODRIGUEZ",44000000,null,null,1,13750000,57750000,50783333,"2017/03/03","2017/03/03","2018-01-15",240,74,null,null,"X",null,null,0.87936507359307359,null,false]
[21,2017,"17-12-6404119",5,{"$f":"IF(D34=1,'Tipo '!$B$2,IF(D34=2,'Tipo '!$B$3,IF(D34=3,'Tipo '!$B$4,IF(D34=4,'Tipo '!$B$5,IF(D34=5,'Tipo '!$B$6,IF(D34=6,'Tipo '!$B$7,IF(D34=7,'Tipo '!$B$8,IF(D34=8,'Tipo '!$B$9,IF(D34=9,'Tipo '!$B$10,IF(D34=10,'Tipo '!$B$11,IF(D34=11,'Tipo '!$B$12,IF(D34=12,'Tipo '!$B$13,IF(D34=13,'Tipo '!$B$14,IF(D34=14,'Tipo '!$B$15,IF(D34=15,'Tipo '!$B$16,IF(D34=16,'Tipo '!$B$17,IF(D34=17,'Tipo '!$B$18,IF(D34=18,'Tipo '!$B$19,IF(D34=19,'Tipo '!$B$20,\"No ha seleccionado un tipo de contrato válido\")))))))))))))))))))","v":"CONTRATOS DE PRESTACIÓN DE SERVICIOS PROFESIONALES Y DE APOYO A LA GESTIÓN"},"Contratación directa","Prestación de servicios profesionales y de apoyo a la gestión, o para la ejecución de trabajos artísticos que sólo puedan encomendarse a determinadas personas naturales;","PRESTAR LOS SERVICIOS PROFESIONALES COMO INGENIERO CIVIL PARA EL DESARROLLO DE LAS ACTIVIDADES VINCULADAS A LA GESTION JURIDICA Y POLICIVA DE LA ALCALDIA LOCAL, EN LOS TEMAS RELACIONADOS CON LA PROTECCION Y CONSERVACION DE LOS CERROS ORIENTALES, EN CUMPLIMIENTO DE LA ACCION POPULAR N° 25000232500020050066203","Inversión",45,{"$f":"IF(J34=1,'Equivalencia BH-BMPT'!$D$2,IF(J34=2,'Equivalencia BH-BMPT'!$D$3,IF(J34=3,'Equivalencia BH-BMPT'!$D$4,IF(J34=4,'Equivalencia BH-BMPT'!$D$5,IF(J34=5,'Equivalencia BH-BMPT'!$D$6,IF(J34=6,'Equivalencia BH-BMPT'!$D$7,IF(J34=7,'Equivalencia BH-BMPT'!$D$8,IF(J34=8,'Equivalencia BH-BMPT'!$D$9,IF(J34=9,'Equivalencia BH-BMPT'!$D$10,IF(J34=10,'Equivalencia BH-BMPT'!$D$11,IF(J34=11,'Equivalencia BH-BMPT'!$D$12,IF(J34=12,'Equivalencia BH-BMPT'!$D$13,IF(J34=13,'Equivalencia BH-BMPT'!$D$14,IF(J34=14,'Equivalencia BH-BMPT'!$D$15,IF(J34=15,'Equivalencia BH-BMPT'!$D$16,IF(J34=16,'Equivalencia BH-BMPT'!$D$17,IF(J34=17,'Equivalencia BH-BMPT'!$D$18,IF(J34=18,'Equivalencia BH-BMPT'!$D$19,IF(J34=19,'Equivalencia BH-BMPT'!$D$20,IF(J34=20,'Equivalencia BH-BMPT'!$D$21,IF(J34=21,'Equivalencia BH-BMPT'!$D$22,IF(J34=22,'Equivalencia BH-BMPT'!$D$23,IF(J34=23,'Equivalencia BH-BMPT'!#REF!,IF(J34=24,'Equivalencia BH-BMPT'!$D$25,IF(J34=25,'Equivalencia BH-BMPT'!$D$26,IF(J34=26,'Equivalencia BH-BMPT'!$D$27,IF(J34=27,'Equivalencia BH-BMPT'!$D$28,IF(J34=28,'Equivalencia BH-BMPT'!$D$29,IF(J34=29,'Equivalencia BH-BMPT'!$D$30,IF(J34=30,'Equivalencia BH-BMPT'!$D$31,IF(J34=31,'Equivalencia BH-BMPT'!$D$32,IF(J34=32,'Equivalencia BH-BMPT'!$D$33,IF(J34=33,'Equivalencia BH-BMPT'!$D$34,IF(J34=34,'Equivalencia BH-BMPT'!$D$35,IF(J34=35,'Equivalencia BH-BMPT'!$D$36,IF(J34=36,'Equivalencia BH-BMPT'!$D$37,IF(J34=37,'Equivalencia BH-BMPT'!$D$38,IF(J34=38,'Equivalencia BH-BMPT'!#REF!,IF(J34=39,'Equivalencia BH-BMPT'!$D$40,IF(J34=40,'Equivalencia BH-BMPT'!$D$41,IF(J34=41,'Equivalencia BH-BMPT'!$D$42,IF(J34=42,'Equivalencia BH-BMPT'!$D$43,IF(J34=43,'Equivalencia BH-BMPT'!$D$44,IF(J34=44,'Equivalencia BH-BMPT'!$D$45,IF(J34=45,'Equivalencia BH-BMPT'!$D$46,\"No ha seleccionado un número de programa\")))))))))))))))))))))))))))))))))))))))))))))","v":"Gobernanza e influencia local, regional e internacional"},1326,19389669,"FABIO ALBERTO BELTRAN BELTRAN",32480000,null,null,1,7308000,39788000,36946000,"2017/03/07","2017/03/07","2017-12-30",240,54,null,null," ","X",null,0.9285714285714286,null,false]
[22,2017,"17-12-6404670",5,{"$f":"IF(D35=1,'Tipo '!$B$2,IF(D35=2,'Tipo '!$B$3,IF(D35=3,'Tipo '!$B$4,IF(D35=4,'Tipo '!$B$5,IF(D35=5,'Tipo '!$B$6,IF(D35=6,'Tipo '!$B$7,IF(D35=7,'Tipo '!$B$8,IF(D35=8,'Tipo '!$B$9,IF(D35=9,'Tipo '!$B$10,IF(D35=10,'Tipo '!$B$11,IF(D35=11,'Tipo '!$B$12,IF(D35=12,'Tipo '!$B$13,IF(D35=13,'Tipo '!$B$14,IF(D35=14,'Tipo '!$B$15,IF(D35=15,'Tipo '!$B$16,IF(D35=16,'Tipo '!$B$17,IF(D35=17,'Tipo '!$B$18,IF(D35=18,'Tipo '!$B$19,IF(D35=19,'Tipo '!$B$20,\"No ha seleccionado un tipo de contrato válido\")))))))))))))))))))","v":"CONTRATOS DE PRESTACIÓN DE SERVICIOS PROFESIONALES Y DE APOYO A LA GESTIÓN"},"Contratación directa","Prestación de servicios profesionales y de apoyo a la gestión, o para la ejecución de trabajos artísticos que sólo puedan encomendarse a determinadas personas naturales;","PRESTAR SERVICIOS DE APOYO ADMINISTRATIVO AL AREA DE GESTION DEL DESARROLLO LOCAL DE LA ALCALDIA LOCAL DE SANTA FE EN ASPECTOS RELACIONADOS CON EL DESARROLLO DE INFRAESTRUCTURA Y OBRA CIVIL","Inversión",45,{"$f":"IF(J35=1,'Equivalencia BH-BMPT'!$D$2,IF(J35=2,'Equivalencia BH-BMPT'!$D$3,IF(J35=3,'Equivalencia BH-BMPT'!$D$4,IF(J35=4,'Equivalencia BH-BMPT'!$D$5,IF(J35=5,'Equivalencia BH-BMPT'!$D$6,IF(J35=6,'Equivalencia BH-BMPT'!$D$7,IF(J35=7,'Equivalencia BH-BMPT'!$D$8,IF(J35=8,'Equivalencia BH-BMPT'!$D$9,IF(J35=9,'Equivalencia BH-BMPT'!$D$10,IF(J35=10,'Equivalencia BH-BMPT'!$D$11,IF(J35=11,'Equivalencia BH-BMPT'!$D$12,IF(J35=12,'Equivalencia BH-BMPT'!$D$13,IF(J35=13,'Equivalencia BH-BMPT'!$D$14,IF(J35=14,'Equivalencia BH-BMPT'!$D$15,IF(J35=15,'Equivalencia BH-BMPT'!$D$16,IF(J35=16,'Equivalencia BH-BMPT'!$D$17,IF(J35=17,'Equivalencia BH-BMPT'!$D$18,IF(J35=18,'Equivalencia BH-BMPT'!$D$19,IF(J35=19,'Equivalencia BH-BMPT'!$D$20,IF(J35=20,'Equivalencia BH-BMPT'!$D$21,IF(J35=21,'Equivalencia BH-BMPT'!$D$22,IF(J35=22,'Equivalencia BH-BMPT'!$D$23,IF(J35=23,'Equivalencia BH-BMPT'!#REF!,IF(J35=24,'Equivalencia BH-BMPT'!$D$25,IF(J35=25,'Equivalencia BH-BMPT'!$D$26,IF(J35=26,'Equivalencia BH-BMPT'!$D$27,IF(J35=27,'Equivalencia BH-BMPT'!$D$28,IF(J35=28,'Equivalencia BH-BMPT'!$D$29,IF(J35=29,'Equivalencia BH-BMPT'!$D$30,IF(J35=30,'Equivalencia BH-BMPT'!$D$31,IF(J35=31,'Equivalencia BH-BMPT'!$D$32,IF(J35=32,'Equivalencia BH-BMPT'!$D$33,IF(J35=33,'Equivalencia BH-BMPT'!$D$34,IF(J35=34,'Equivalencia BH-BMPT'!$D$35,IF(J35=35,'Equivalencia BH-BMPT'!$D$36,IF(J35=36,'Equivalencia BH-BMPT'!$D$37,IF(J35=37,'Equivalencia BH-BMPT'!$D$38,IF(J35=38,'Equivalencia BH-BMPT'!#REF!,IF(J35=39,'Equivalencia BH-BMPT'!$D$40,IF(J35=40,'Equivalencia BH-BMPT'!$D$41,IF(J35=41,'Equivalencia BH-BMPT'!$D$42,IF(J35=42,'Equivalencia BH-BMPT'!$D$43,IF(J35=43,'Equivalencia BH-BMPT'!$D$44,IF(J35=44,'Equivalencia BH-BMPT'!$D$45,IF(J35=45,'Equivalencia BH-BMPT'!$D$46,\"No ha seleccionado un número de programa\")))))))))))))))))))))))))))))))))))))))))))))","v":"Gobernanza e influencia local, regional e internacional"},1326,52485106,"MONICA ANDREA CASTRO CASTRO",21200000,null,null,1,6095000,27295000,23850000,"2017/03/07","2017/03/08","2018-01-15",240,70,null,null,"X",null,null,0.87378640776699024,null,false]
[23,2017,"17-12-6405789",5,{"$f":"IF(D36=1,'Tipo '!$B$2,IF(D36=2,'Tipo '!$B$3,IF(D36=3,'Tipo '!$B$4,IF(D36=4,'Tipo '!$B$5,IF(D36=5,'Tipo '!$B$6,IF(D36=6,'Tipo '!$B$7,IF(D36=7,'Tipo '!$B$8,IF(D36=8,'Tipo '!$B$9,IF(D36=9,'Tipo '!$B$10,IF(D36=10,'Tipo '!$B$11,IF(D36=11,'Tipo '!$B$12,IF(D36=12,'Tipo '!$B$13,IF(D36=13,'Tipo '!$B$14,IF(D36=14,'Tipo '!$B$15,IF(D36=15,'Tipo '!$B$16,IF(D36=16,'Tipo '!$B$17,IF(D36=17,'Tipo '!$B$18,IF(D36=18,'Tipo '!$B$19,IF(D36=19,'Tipo '!$B$20,\"No ha seleccionado un tipo de contrato válido\")))))))))))))))))))","v":"CONTRATOS DE PRESTACIÓN DE SERVICIOS PROFESIONALES Y DE APOYO A LA GESTIÓN"},"Contratación directa","Prestación de servicios profesionales y de apoyo a la gestión, o para la ejecución de trabajos artísticos que sólo puedan encomendarse a determinadas personas naturales;","PRESTAR SERICIOS PROFESIONALES PARA LA ARTICULACION JURIDICA EN EL SEGUIMIENTO DE LOS TEMAS RELACIONADOS CON LA ACTIVIDAD CONTRAACTUAL DEL FONDO DE DESARROLLO LOCAL EN LA ETAPAS PRECONTRACTUAL, CONTRACTUAL Y POSTCONTRACTUAL DEL FDLSF","Inversión",45,{"$f":"IF(J36=1,'Equivalencia BH-BMPT'!$D$2,IF(J36=2,'Equivalencia BH-BMPT'!$D$3,IF(J36=3,'Equivalencia BH-BMPT'!$D$4,IF(J36=4,'Equivalencia BH-BMPT'!$D$5,IF(J36=5,'Equivalencia BH-BMPT'!$D$6,IF(J36=6,'Equivalencia BH-BMPT'!$D$7,IF(J36=7,'Equivalencia BH-BMPT'!$D$8,IF(J36=8,'Equivalencia BH-BMPT'!$D$9,IF(J36=9,'Equivalencia BH-BMPT'!$D$10,IF(J36=10,'Equivalencia BH-BMPT'!$D$11,IF(J36=11,'Equivalencia BH-BMPT'!$D$12,IF(J36=12,'Equivalencia BH-BMPT'!$D$13,IF(J36=13,'Equivalencia BH-BMPT'!$D$14,IF(J36=14,'Equivalencia BH-BMPT'!$D$15,IF(J36=15,'Equivalencia BH-BMPT'!$D$16,IF(J36=16,'Equivalencia BH-BMPT'!$D$17,IF(J36=17,'Equivalencia BH-BMPT'!$D$18,IF(J36=18,'Equivalencia BH-BMPT'!$D$19,IF(J36=19,'Equivalencia BH-BMPT'!$D$20,IF(J36=20,'Equivalencia BH-BMPT'!$D$21,IF(J36=21,'Equivalencia BH-BMPT'!$D$22,IF(J36=22,'Equivalencia BH-BMPT'!$D$23,IF(J36=23,'Equivalencia BH-BMPT'!#REF!,IF(J36=24,'Equivalencia BH-BMPT'!$D$25,IF(J36=25,'Equivalencia BH-BMPT'!$D$26,IF(J36=26,'Equivalencia BH-BMPT'!$D$27,IF(J36=27,'Equivalencia BH-BMPT'!$D$28,IF(J36=28,'Equivalencia BH-BMPT'!$D$29,IF(J36=29,'Equivalencia BH-BMPT'!$D$30,IF(J36=30,'Equivalencia BH-BMPT'!$D$31,IF(J36=31,'Equivalencia BH-BMPT'!$D$32,IF(J36=32,'Equivalencia BH-BMPT'!$D$33,IF(J36=33,'Equivalencia BH-BMPT'!$D$34,IF(J36=34,'Equivalencia BH-BMPT'!$D$35,IF(J36=35,'Equivalencia BH-BMPT'!$D$36,IF(J36=36,'Equivalencia BH-BMPT'!$D$37,IF(J36=37,'Equivalencia BH-BMPT'!$D$38,IF(J36=38,'Equivalencia BH-BMPT'!#REF!,IF(J36=39,'Equivalencia BH-BMPT'!$D$40,IF(J36=40,'Equivalencia BH-BMPT'!$D$41,IF(J36=41,'Equivalencia BH-BMPT'!$D$42,IF(J36=42,'Equivalencia BH-BMPT'!$D$43,IF(J36=43,'Equivalencia BH-BMPT'!$D$44,IF(J36=44,'Equivalencia BH-BMPT'!$D$45,IF(J36=45,'Equivalencia BH-BMPT'!$D$46,\"No ha seleccionado un número de programa\")))))))))))))))))))))))))))))))))))))))))))))","v":"Gobernanza e influencia local, regional e internacional"},1326,73583076,"PAUL BERNARDO ORDOSGOITIA AHUMADA",53600000,null,null,1,15410000,69010000,60746667,"2017/03/07","2017/03/09","2018-01-15",240,69,null,null,"X",null,null,0.88025890450659328,null,false]
[24,2017,"17-12-6474289",5,{"$f":"IF(D37=1,'Tipo '!$B$2,IF(D37=2,'Tipo '!$B$3,IF(D37=3,'Tipo '!$B$4,IF(D37=4,'Tipo '!$B$5,IF(D37=5,'Tipo '!$B$6,IF(D37=6,'Tipo '!$B$7,IF(D37=7,'Tipo '!$B$8,IF(D37=8,'Tipo '!$B$9,IF(D37=9,'Tipo '!$B$10,IF(D37=10,'Tipo '!$B$11,IF(D37=11,'Tipo '!$B$12,IF(D37=12,'Tipo '!$B$13,IF(D37=13,'Tipo '!$B$14,IF(D37=14,'Tipo '!$B$15,IF(D37=15,'Tipo '!$B$16,IF(D37=16,'Tipo '!$B$17,IF(D37=17,'Tipo '!$B$18,IF(D37=18,'Tipo '!$B$19,IF(D37=19,'Tipo '!$B$20,\"No ha seleccionado un tipo de contrato válido\")))))))))))))))))))","v":"CONTRATOS DE PRESTACIÓN DE SERVICIOS PROFESIONALES Y DE APOYO A LA GESTIÓN"},"Contratación directa","Prestación de servicios profesionales y de apoyo a la gestión, o para la ejecución de trabajos artísticos que sólo puedan encomendarse a determinadas personas naturales;","PRESTAR LOS SERVICIOS PROFESIONALES PARA LA OPERACIÓN, PRESTACION, SEGUIMIENTO Y CUMPLIMIENTO DE LOS PROCEDIMIENTOS ADMINISTRATIVOS, OPERATIVOS Y PROGRAMATICOS DEL SERVICIO SOCIAL APOYO ECONOMICO TIPO C, QUE CONTRIBUYAN A LA GARANTIA DE LOS DERECHOS DE LA POBLACION MAYOR EN EL MARCO DE LA POLITICA PUBLICA SOCIAL PARA EL ENVEJECIMIENTO Y LA VEJEZ EN EL DISTRITO CAPITAL A CARGO DE LA ALCALDIA LOCAL","Inversión",3,{"$f":"IF(J37=1,'Equivalencia BH-BMPT'!$D$2,IF(J37=2,'Equivalencia BH-BMPT'!$D$3,IF(J37=3,'Equivalencia BH-BMPT'!$D$4,IF(J37=4,'Equivalencia BH-BMPT'!$D$5,IF(J37=5,'Equivalencia BH-BMPT'!$D$6,IF(J37=6,'Equivalencia BH-BMPT'!$D$7,IF(J37=7,'Equivalencia BH-BMPT'!$D$8,IF(J37=8,'Equivalencia BH-BMPT'!$D$9,IF(J37=9,'Equivalencia BH-BMPT'!$D$10,IF(J37=10,'Equivalencia BH-BMPT'!$D$11,IF(J37=11,'Equivalencia BH-BMPT'!$D$12,IF(J37=12,'Equivalencia BH-BMPT'!$D$13,IF(J37=13,'Equivalencia BH-BMPT'!$D$14,IF(J37=14,'Equivalencia BH-BMPT'!$D$15,IF(J37=15,'Equivalencia BH-BMPT'!$D$16,IF(J37=16,'Equivalencia BH-BMPT'!$D$17,IF(J37=17,'Equivalencia BH-BMPT'!$D$18,IF(J37=18,'Equivalencia BH-BMPT'!$D$19,IF(J37=19,'Equivalencia BH-BMPT'!$D$20,IF(J37=20,'Equivalencia BH-BMPT'!$D$21,IF(J37=21,'Equivalencia BH-BMPT'!$D$22,IF(J37=22,'Equivalencia BH-BMPT'!$D$23,IF(J37=23,'Equivalencia BH-BMPT'!#REF!,IF(J37=24,'Equivalencia BH-BMPT'!$D$25,IF(J37=25,'Equivalencia BH-BMPT'!$D$26,IF(J37=26,'Equivalencia BH-BMPT'!$D$27,IF(J37=27,'Equivalencia BH-BMPT'!$D$28,IF(J37=28,'Equivalencia BH-BMPT'!$D$29,IF(J37=29,'Equivalencia BH-BMPT'!$D$30,IF(J37=30,'Equivalencia BH-BMPT'!$D$31,IF(J37=31,'Equivalencia BH-BMPT'!$D$32,IF(J37=32,'Equivalencia BH-BMPT'!$D$33,IF(J37=33,'Equivalencia BH-BMPT'!$D$34,IF(J37=34,'Equivalencia BH-BMPT'!$D$35,IF(J37=35,'Equivalencia BH-BMPT'!$D$36,IF(J37=36,'Equivalencia BH-BMPT'!$D$37,IF(J37=37,'Equivalencia BH-BMPT'!$D$38,IF(J37=38,'Equivalencia BH-BMPT'!#REF!,IF(J37=39,'Equivalencia BH-BMPT'!$D$40,IF(J37=40,'Equivalencia BH-BMPT'!$D$41,IF(J37=41,'Equivalencia BH-BMPT'!$D$42,IF(J37=42,'Equivalencia BH-BMPT'!$D$43,IF(J37=43,'Equivalencia BH-BMPT'!$D$44,IF(J37=44,'Equivalencia BH-BMPT'!$D$45,IF(J37=45,'Equivalencia BH-BMPT'!$D$46,\"No ha seleccionado un número de programa\")))))))))))))))))))))))))))))))))))))))))))))","v":"Igualdad y autonomía para una Bogotá incluyente"},1315,1023951493,"EDDIE JOHJAN AMAYA NOSSA",21200000,null,null,1,4593333,25793333,23850000,"2017/03/08","2017/03/09","2017-12-30",240,52,null,null," ","X",null,0.92465754619614304,null,false]
[25,2017,"17-12-6410310",5,{"$f":"IF(D38=1,'Tipo '!$B$2,IF(D38=2,'Tipo '!$B$3,IF(D38=3,'Tipo '!$B$4,IF(D38=4,'Tipo '!$B$5,IF(D38=5,'Tipo '!$B$6,IF(D38=6,'Tipo '!$B$7,IF(D38=7,'Tipo '!$B$8,IF(D38=8,'Tipo '!$B$9,IF(D38=9,'Tipo '!$B$10,IF(D38=10,'Tipo '!$B$11,IF(D38=11,'Tipo '!$B$12,IF(D38=12,'Tipo '!$B$13,IF(D38=13,'Tipo '!$B$14,IF(D38=14,'Tipo '!$B$15,IF(D38=15,'Tipo '!$B$16,IF(D38=16,'Tipo '!$B$17,IF(D38=17,'Tipo '!$B$18,IF(D38=18,'Tipo '!$B$19,IF(D38=19,'Tipo '!$B$20,\"No ha seleccionado un tipo de contrato válido\")))))))))))))))))))","v":"CONTRATOS DE PRESTACIÓN DE SERVICIOS PROFESIONALES Y DE APOYO A LA GESTIÓN"},"Contratación directa","Prestación de servicios profesionales y de apoyo a la gestión, o para la ejecución de trabajos artísticos que sólo puedan encomendarse a determinadas personas naturales;","PRESTAR SERVICIOS DE APOYO TECNICO AL CONSEJO LOCAL DE GESTION DEL RIESGO Y CAMBIO CLIMATICO DE LA ALCALDIA LOCAL DE SANTA FE","Inversión",45,{"$f":"IF(J38=1,'Equivalencia BH-BMPT'!$D$2,IF(J38=2,'Equivalencia BH-BMPT'!$D$3,IF(J38=3,'Equivalencia BH-BMPT'!$D$4,IF(J38=4,'Equivalencia BH-BMPT'!$D$5,IF(J38=5,'Equivalencia BH-BMPT'!$D$6,IF(J38=6,'Equivalencia BH-BMPT'!$D$7,IF(J38=7,'Equivalencia BH-BMPT'!$D$8,IF(J38=8,'Equivalencia BH-BMPT'!$D$9,IF(J38=9,'Equivalencia BH-BMPT'!$D$10,IF(J38=10,'Equivalencia BH-BMPT'!$D$11,IF(J38=11,'Equivalencia BH-BMPT'!$D$12,IF(J38=12,'Equivalencia BH-BMPT'!$D$13,IF(J38=13,'Equivalencia BH-BMPT'!$D$14,IF(J38=14,'Equivalencia BH-BMPT'!$D$15,IF(J38=15,'Equivalencia BH-BMPT'!$D$16,IF(J38=16,'Equivalencia BH-BMPT'!$D$17,IF(J38=17,'Equivalencia BH-BMPT'!$D$18,IF(J38=18,'Equivalencia BH-BMPT'!$D$19,IF(J38=19,'Equivalencia BH-BMPT'!$D$20,IF(J38=20,'Equivalencia BH-BMPT'!$D$21,IF(J38=21,'Equivalencia BH-BMPT'!$D$22,IF(J38=22,'Equivalencia BH-BMPT'!$D$23,IF(J38=23,'Equivalencia BH-BMPT'!#REF!,IF(J38=24,'Equivalencia BH-BMPT'!$D$25,IF(J38=25,'Equivalencia BH-BMPT'!$D$26,IF(J38=26,'Equivalencia BH-BMPT'!$D$27,IF(J38=27,'Equivalencia BH-BMPT'!$D$28,IF(J38=28,'Equivalencia BH-BMPT'!$D$29,IF(J38=29,'Equivalencia BH-BMPT'!$D$30,IF(J38=30,'Equivalencia BH-BMPT'!$D$31,IF(J38=31,'Equivalencia BH-BMPT'!$D$32,IF(J38=32,'Equivalencia BH-BMPT'!$D$33,IF(J38=33,'Equivalencia BH-BMPT'!$D$34,IF(J38=34,'Equivalencia BH-BMPT'!$D$35,IF(J38=35,'Equivalencia BH-BMPT'!$D$36,IF(J38=36,'Equivalencia BH-BMPT'!$D$37,IF(J38=37,'Equivalencia BH-BMPT'!$D$38,IF(J38=38,'Equivalencia BH-BMPT'!#REF!,IF(J38=39,'Equivalencia BH-BMPT'!$D$40,IF(J38=40,'Equivalencia BH-BMPT'!$D$41,IF(J38=41,'Equivalencia BH-BMPT'!$D$42,IF(J38=42,'Equivalencia BH-BMPT'!$D$43,IF(J38=43,'Equivalencia BH-BMPT'!$D$44,IF(J38=44,'Equivalencia BH-BMPT'!$D$45,IF(J38=45,'Equivalencia BH-BMPT'!$D$46,\"No ha seleccionado un número de programa\")))))))))))))))))))))))))))))))))))))))))))))","v":"Gobernanza e influencia local, regional e internacional"},1326,79577635,"MIGUEL ANTONIO RAMIREZ MESA",21200000,null,null,1,6095000,27295000,23983333,"2017/03/09","2017/03/10","2018-01-15",240,68,null,null,"X",null,null,0.87867129510899433,null,false]
[26,2017,"17-12-6474293",5,{"$f":"IF(D39=1,'Tipo '!$B$2,IF(D39=2,'Tipo '!$B$3,IF(D39=3,'Tipo '!$B$4,IF(D39=4,'Tipo '!$B$5,IF(D39=5,'Tipo '!$B$6,IF(D39=6,'Tipo '!$B$7,IF(D39=7,'Tipo '!$B$8,IF(D39=8,'Tipo '!$B$9,IF(D39=9,'Tipo '!$B$10,IF(D39=10,'Tipo '!$B$11,IF(D39=11,'Tipo '!$B$12,IF(D39=12,'Tipo '!$B$13,IF(D39=13,'Tipo '!$B$14,IF(D39=14,'Tipo '!$B$15,IF(D39=15,'Tipo '!$B$16,IF(D39=16,'Tipo '!$B$17,IF(D39=17,'Tipo '!$B$18,IF(D39=18,'Tipo '!$B$19,IF(D39=19,'Tipo '!$B$20,\"No ha seleccionado un tipo de contrato válido\")))))))))))))))))))","v":"CONTRATOS DE PRESTACIÓN DE SERVICIOS PROFESIONALES Y DE APOYO A LA GESTIÓN"},"Contratación directa","Prestación de servicios profesionales y de apoyo a la gestión, o para la ejecución de trabajos artísticos que sólo puedan encomendarse a determinadas personas naturales;","PRESTAR SERVICIOS PROFESIONALES PARA LA OPERACIÓN, SEGUIMIENTO Y CUMPLIMIENTO DE LOS PROCESOS Y PROCEDIMIENTOS DEL SERVICIO SOCIAL APOYOS PARA LA SEGURIDAD ECONOMICA TIPO C REQUERIDOS PARA EL OPORTUNO Y ADECUADO REGISTRO, CRUCE Y REPORTE DE LOS DATOS EN EL SISTEMA DE INFORMACION Y REGISTRO DE BENEFICIARIOS - SIRBE, QUE CONTRIBUYAN A LA GARANTIA DE LOS DERECHOS DE LA POBLACION MAYOR EN EL MARCO DE LA POLITICA PUBLICA, SOCIAL PARA EL ENVEJECIMIENTO Y LA VEJEZ EN EL DISTRITO CAPITAL A CARGO DE LA ALCALDIA LOCAL","Inversión",3,{"$f":"IF(J39=1,'Equivalencia BH-BMPT'!$D$2,IF(J39=2,'Equivalencia BH-BMPT'!$D$3,IF(J39=3,'Equivalencia BH-BMPT'!$D$4,IF(J39=4,'Equivalencia BH-BMPT'!$D$5,IF(J39=5,'Equivalencia BH-BMPT'!$D$6,IF(J39=6,'Equivalencia BH-BMPT'!$D$7,IF(J39=7,'Equivalencia BH-BMPT'!$D$8,IF(J39=8,'Equivalencia BH-BMPT'!$D$9,IF(J39=9,'Equivalencia BH-BMPT'!$D$10,IF(J39=10,'Equivalencia BH-BMPT'!$D$11,IF(J39=11,'Equivalencia BH-BMPT'!$D$12,IF(J39=12,'Equivalencia BH-BMPT'!$D$13,IF(J39=13,'Equivalencia BH-BMPT'!$D$14,IF(J39=14,'Equivalencia BH-BMPT'!$D$15,IF(J39=15,'Equivalencia BH-BMPT'!$D$16,IF(J39=16,'Equivalencia BH-BMPT'!$D$17,IF(J39=17,'Equivalencia BH-BMPT'!$D$18,IF(J39=18,'Equivalencia BH-BMPT'!$D$19,IF(J39=19,'Equivalencia BH-BMPT'!$D$20,IF(J39=20,'Equivalencia BH-BMPT'!$D$21,IF(J39=21,'Equivalencia BH-BMPT'!$D$22,IF(J39=22,'Equivalencia BH-BMPT'!$D$23,IF(J39=23,'Equivalencia BH-BMPT'!#REF!,IF(J39=24,'Equivalencia BH-BMPT'!$D$25,IF(J39=25,'Equivalencia BH-BMPT'!$D$26,IF(J39=26,'Equivalencia BH-BMPT'!$D$27,IF(J39=27,'Equivalencia BH-BMPT'!$D$28,IF(J39=28,'Equivalencia BH-BMPT'!$D$29,IF(J39=29,'Equivalencia BH-BMPT'!$D$30,IF(J39=30,'Equivalencia BH-BMPT'!$D$31,IF(J39=31,'Equivalencia BH-BMPT'!$D$32,IF(J39=32,'Equivalencia BH-BMPT'!$D$33,IF(J39=33,'Equivalencia BH-BMPT'!$D$34,IF(J39=34,'Equivalencia BH-BMPT'!$D$35,IF(J39=35,'Equivalencia BH-BMPT'!$D$36,IF(J39=36,'Equivalencia BH-BMPT'!$D$37,IF(J39=37,'Equivalencia BH-BMPT'!$D$38,IF(J39=38,'Equivalencia BH-BMPT'!#REF!,IF(J39=39,'Equivalencia BH-BMPT'!$D$40,IF(J39=40,'Equivalencia BH-BMPT'!$D$41,IF(J39=41,'Equivalencia BH-BMPT'!$D$42,IF(J39=42,'Equivalencia BH-BMPT'!$D$43,IF(J39=43,'Equivalencia BH-BMPT'!$D$44,IF(J39=44,'Equivalencia BH-BMPT'!$D$45,IF(J39=45,'Equivalencia BH-BMPT'!$D$46,\"No ha seleccionado un número de programa\")))))))))))))))))))))))))))))))))))))))))))))","v":"Igualdad y autonomía para una Bogotá incluyente"},1315,1015413608,"RAFAEL ENRIQUE RIVEROS OTALORA",32480000,null,null,1,6902000,39382000,36540000,"2017/03/10","2017/03/10","2017-12-30",240,51,null,null," ","X",null,0.92783505154639179,null,false]
[27,2017,"17-12-6474294",5,{"$f":"IF(D40=1,'Tipo '!$B$2,IF(D40=2,'Tipo '!$B$3,IF(D40=3,'Tipo '!$B$4,IF(D40=4,'Tipo '!$B$5,IF(D40=5,'Tipo '!$B$6,IF(D40=6,'Tipo '!$B$7,IF(D40=7,'Tipo '!$B$8,IF(D40=8,'Tipo '!$B$9,IF(D40=9,'Tipo '!$B$10,IF(D40=10,'Tipo '!$B$11,IF(D40=11,'Tipo '!$B$12,IF(D40=12,'Tipo '!$B$13,IF(D40=13,'Tipo '!$B$14,IF(D40=14,'Tipo '!$B$15,IF(D40=15,'Tipo '!$B$16,IF(D40=16,'Tipo '!$B$17,IF(D40=17,'Tipo '!$B$18,IF(D40=18,'Tipo '!$B$19,IF(D40=19,'Tipo '!$B$20,\"No ha seleccionado un tipo de contrato válido\")))))))))))))))))))","v":"CONTRATOS DE PRESTACIÓN DE SERVICIOS PROFESIONALES Y DE APOYO A LA GESTIÓN"},"Contratación directa","Prestación de servicios profesionales y de apoyo a la gestión, o para la ejecución de trabajos artísticos que sólo puedan encomendarse a determinadas personas naturales;","PRESTAR SUS SERVICIOS PROFESIONALES AL DESPACHO EN LOS ASPECTOS RELACIONADOS CON PRODUCTIVIDAD, EMPRENDIMIENTO Y CONTROL, ASI COMO EL MANEJO DE LAS RELACIONES INTERINSTITUCIONALES CON SECTOR PRIVADO DE LA LOCALIDAD DE SANTA FE","Inversión",45,{"$f":"IF(J40=1,'Equivalencia BH-BMPT'!$D$2,IF(J40=2,'Equivalencia BH-BMPT'!$D$3,IF(J40=3,'Equivalencia BH-BMPT'!$D$4,IF(J40=4,'Equivalencia BH-BMPT'!$D$5,IF(J40=5,'Equivalencia BH-BMPT'!$D$6,IF(J40=6,'Equivalencia BH-BMPT'!$D$7,IF(J40=7,'Equivalencia BH-BMPT'!$D$8,IF(J40=8,'Equivalencia BH-BMPT'!$D$9,IF(J40=9,'Equivalencia BH-BMPT'!$D$10,IF(J40=10,'Equivalencia BH-BMPT'!$D$11,IF(J40=11,'Equivalencia BH-BMPT'!$D$12,IF(J40=12,'Equivalencia BH-BMPT'!$D$13,IF(J40=13,'Equivalencia BH-BMPT'!$D$14,IF(J40=14,'Equivalencia BH-BMPT'!$D$15,IF(J40=15,'Equivalencia BH-BMPT'!$D$16,IF(J40=16,'Equivalencia BH-BMPT'!$D$17,IF(J40=17,'Equivalencia BH-BMPT'!$D$18,IF(J40=18,'Equivalencia BH-BMPT'!$D$19,IF(J40=19,'Equivalencia BH-BMPT'!$D$20,IF(J40=20,'Equivalencia BH-BMPT'!$D$21,IF(J40=21,'Equivalencia BH-BMPT'!$D$22,IF(J40=22,'Equivalencia BH-BMPT'!$D$23,IF(J40=23,'Equivalencia BH-BMPT'!#REF!,IF(J40=24,'Equivalencia BH-BMPT'!$D$25,IF(J40=25,'Equivalencia BH-BMPT'!$D$26,IF(J40=26,'Equivalencia BH-BMPT'!$D$27,IF(J40=27,'Equivalencia BH-BMPT'!$D$28,IF(J40=28,'Equivalencia BH-BMPT'!$D$29,IF(J40=29,'Equivalencia BH-BMPT'!$D$30,IF(J40=30,'Equivalencia BH-BMPT'!$D$31,IF(J40=31,'Equivalencia BH-BMPT'!$D$32,IF(J40=32,'Equivalencia BH-BMPT'!$D$33,IF(J40=33,'Equivalencia BH-BMPT'!$D$34,IF(J40=34,'Equivalencia BH-BMPT'!$D$35,IF(J40=35,'Equivalencia BH-BMPT'!$D$36,IF(J40=36,'Equivalencia BH-BMPT'!$D$37,IF(J40=37,'Equivalencia BH-BMPT'!$D$38,IF(J40=38,'Equivalencia BH-BMPT'!#REF!,IF(J40=39,'Equivalencia BH-BMPT'!$D$40,IF(J40=40,'Equivalencia BH-BMPT'!$D$41,IF(J40=41,'Equivalencia BH-BMPT'!$D$42,IF(J40=42,'Equivalencia BH-BMPT'!$D$43,IF(J40=43,'Equivalencia BH-BMPT'!$D$44,IF(J40=44,'Equivalencia BH-BMPT'!$D$45,IF(J40=45,'Equivalencia BH-BMPT'!$D$46,\"No ha seleccionado un número de programa\")))))))))))))))))))))))))))))))))))))))))))))","v":"Gobernanza e influencia local, regional e internacional"},1326,52451354,"ANGELICA LEGUIZAMON JARAMILLO",42000000,null,null,1,11550000,53550000,47250000,"2017/03/10","2017/03/10","2018-01-15",240,67,null,null,"X",null,null,0.88235294117647056,null,false]
[28,2017,"17-12-6474308",5,{"$f":"IF(D41=1,'Tipo '!$B$2,IF(D41=2,'Tipo '!$B$3,IF(D41=3,'Tipo '!$B$4,IF(D41=4,'Tipo '!$B$5,IF(D41=5,'Tipo '!$B$6,IF(D41=6,'Tipo '!$B$7,IF(D41=7,'Tipo '!$B$8,IF(D41=8,'Tipo '!$B$9,IF(D41=9,'Tipo '!$B$10,IF(D41=10,'Tipo '!$B$11,IF(D41=11,'Tipo '!$B$12,IF(D41=12,'Tipo '!$B$13,IF(D41=13,'Tipo '!$B$14,IF(D41=14,'Tipo '!$B$15,IF(D41=15,'Tipo '!$B$16,IF(D41=16,'Tipo '!$B$17,IF(D41=17,'Tipo '!$B$18,IF(D41=18,'Tipo '!$B$19,IF(D41=19,'Tipo '!$B$20,\"No ha seleccionado un tipo de contrato válido\")))))))))))))))))))","v":"CONTRATOS DE PRESTACIÓN DE SERVICIOS PROFESIONALES Y DE APOYO A LA GESTIÓN"},"Contratación directa","Prestación de servicios profesionales y de apoyo a la gestión, o para la ejecución de trabajos artísticos que sólo puedan encomendarse a determinadas personas naturales;","PRESTAR LOS SERVICIOS PROFESIONALES CON EL FIN DE LIDERAR Y GARANTIZAR LA IMPLEMENTACION Y SEGUIMIENTO DE LOS PROCESOS Y PROCEDIMIENTOS DEL SERVICIO SOCIAL BONO TIPO C","Inversión",3,{"$f":"IF(J41=1,'Equivalencia BH-BMPT'!$D$2,IF(J41=2,'Equivalencia BH-BMPT'!$D$3,IF(J41=3,'Equivalencia BH-BMPT'!$D$4,IF(J41=4,'Equivalencia BH-BMPT'!$D$5,IF(J41=5,'Equivalencia BH-BMPT'!$D$6,IF(J41=6,'Equivalencia BH-BMPT'!$D$7,IF(J41=7,'Equivalencia BH-BMPT'!$D$8,IF(J41=8,'Equivalencia BH-BMPT'!$D$9,IF(J41=9,'Equivalencia BH-BMPT'!$D$10,IF(J41=10,'Equivalencia BH-BMPT'!$D$11,IF(J41=11,'Equivalencia BH-BMPT'!$D$12,IF(J41=12,'Equivalencia BH-BMPT'!$D$13,IF(J41=13,'Equivalencia BH-BMPT'!$D$14,IF(J41=14,'Equivalencia BH-BMPT'!$D$15,IF(J41=15,'Equivalencia BH-BMPT'!$D$16,IF(J41=16,'Equivalencia BH-BMPT'!$D$17,IF(J41=17,'Equivalencia BH-BMPT'!$D$18,IF(J41=18,'Equivalencia BH-BMPT'!$D$19,IF(J41=19,'Equivalencia BH-BMPT'!$D$20,IF(J41=20,'Equivalencia BH-BMPT'!$D$21,IF(J41=21,'Equivalencia BH-BMPT'!$D$22,IF(J41=22,'Equivalencia BH-BMPT'!$D$23,IF(J41=23,'Equivalencia BH-BMPT'!#REF!,IF(J41=24,'Equivalencia BH-BMPT'!$D$25,IF(J41=25,'Equivalencia BH-BMPT'!$D$26,IF(J41=26,'Equivalencia BH-BMPT'!$D$27,IF(J41=27,'Equivalencia BH-BMPT'!$D$28,IF(J41=28,'Equivalencia BH-BMPT'!$D$29,IF(J41=29,'Equivalencia BH-BMPT'!$D$30,IF(J41=30,'Equivalencia BH-BMPT'!$D$31,IF(J41=31,'Equivalencia BH-BMPT'!$D$32,IF(J41=32,'Equivalencia BH-BMPT'!$D$33,IF(J41=33,'Equivalencia BH-BMPT'!$D$34,IF(J41=34,'Equivalencia BH-BMPT'!$D$35,IF(J41=35,'Equivalencia BH-BMPT'!$D$36,IF(J41=36,'Equivalencia BH-BMPT'!$D$37,IF(J41=37,'Equivalencia BH-BMPT'!$D$38,IF(J41=38,'Equivalencia BH-BMPT'!#REF!,IF(J41=39,'Equivalencia BH-BMPT'!$D$40,IF(J41=40,'Equivalencia BH-BMPT'!$D$41,IF(J41=41,'Equivalencia BH-BMPT'!$D$42,IF(J41=42,'Equivalencia BH-BMPT'!$D$43,IF(J41=43,'Equivalencia BH-BMPT'!$D$44,IF(J41=44,'Equivalencia BH-BMPT'!$D$45,IF(J41=45,'Equivalencia BH-BMPT'!$D$46,\"No ha seleccionado un número de programa\")))))))))))))))))))))))))))))))))))))))))))))","v":"Igualdad y autonomía para una Bogotá incluyente"},1315,79781116,"GERMAN RODRIGUEZ MORENO",33563760,null,null,1,6712752,40276512,37339683,"2017/03/10","2017/03/13","2017-12-30",240,48,null,null," ","X",null,0.92708333333333337,null,false]
[29,2017,"17-12-6474311",5,{"$f":"IF(D42=1,'Tipo '!$B$2,IF(D42=2,'Tipo '!$B$3,IF(D42=3,'Tipo '!$B$4,IF(D42=4,'Tipo '!$B$5,IF(D42=5,'Tipo '!$B$6,IF(D42=6,'Tipo '!$B$7,IF(D42=7,'Tipo '!$B$8,IF(D42=8,'Tipo '!$B$9,IF(D42=9,'Tipo '!$B$10,IF(D42=10,'Tipo '!$B$11,IF(D42=11,'Tipo '!$B$12,IF(D42=12,'Tipo '!$B$13,IF(D42=13,'Tipo '!$B$14,IF(D42=14,'Tipo '!$B$15,IF(D42=15,'Tipo '!$B$16,IF(D42=16,'Tipo '!$B$17,IF(D42=17,'Tipo '!$B$18,IF(D42=18,'Tipo '!$B$19,IF(D42=19,'Tipo '!$B$20,\"No ha seleccionado un tipo de contrato válido\")))))))))))))))))))","v":"CONTRATOS DE PRESTACIÓN DE SERVICIOS PROFESIONALES Y DE APOYO A LA GESTIÓN"},"Contratación directa","Prestación de servicios profesionales y de apoyo a la gestión, o para la ejecución de trabajos artísticos que sólo puedan encomendarse a determinadas personas naturales;","PRESTAR SERVICIOS PROFESIONALES PARA LA OPERACIÓN, SEGUIMIENTO Y CUMPLIMIENTO DE LOS PROCESOS Y PROCEDIMIENTOS DEL SERVICIO SOCIAL APOYOS PARA LA SEGURIDAD ECONOMICA TIPO C REQUERIDOS PARA EL OPORTUNO Y ADECUADO REGISTRO, CRUCE Y REPORTE DE LOS DATOS EN EL SISTEMA DE INFORMACION Y REGISTRO DE BENEFICIARIOS - SIRBE, QUE CONTRIBUYAN A LA GARANTIA DE LOS DERECHOS DE LA POBLACION MAYOR EN EL MARCO DE LA POLITICA PUBLICA, SOCIAL PARA EL ENVEJECIMIENTO Y LA VEJEZ EN EL DISTRITO CAPITAL A CARGO DE LA ALCALDIA LOCAL","Inversión",3,{"$f":"IF(J42=1,'Equivalencia BH-BMPT'!$D$2,IF(J42=2,'Equivalencia BH-BMPT'!$D$3,IF(J42=3,'Equivalencia BH-BMPT'!$D$4,IF(J42=4,'Equivalencia BH-BMPT'!$D$5,IF(J42=5,'Equivalencia BH-BMPT'!$D$6,IF(J42=6,'Equivalencia BH-BMPT'!$D$7,IF(J42=7,'Equivalencia BH-BMPT'!$D$8,IF(J42=8,'Equivalencia BH-BMPT'!$D$9,IF(J42=9,'Equivalencia BH-BMPT'!$D$10,IF(J42=10,'Equivalencia BH-BMPT'!$D$11,IF(J42=11,'Equivalencia BH-BMPT'!$D$12,IF(J42=12,'Equivalencia BH-BMPT'!$D$13,IF(J42=13,'Equivalencia BH-BMPT'!$D$14,IF(J42=14,'Equivalencia BH-BMPT'!$D$15,IF(J42=15,'Equivalencia BH-BMPT'!$D$16,IF(J42=16,'Equivalencia BH-BMPT'!$D$17,IF(J42=17,'Equivalencia BH-BMPT'!$D$18,IF(J42=18,'Equivalencia BH-BMPT'!$D$19,IF(J42=19,'Equivalencia BH-BMPT'!$D$20,IF(J42=20,'Equivalencia BH-BMPT'!$D$21,IF(J42=21,'Equivalencia BH-BMPT'!$D$22,IF(J42=22,'Equivalencia BH-BMPT'!$D$23,IF(J42=23,'Equivalencia BH-BMPT'!#REF!,IF(J42=24,'Equivalencia BH-BMPT'!$D$25,IF(J42=25,'Equivalencia BH-BMPT'!$D$26,IF(J42=26,'Equivalencia BH-BMPT'!$D$27,IF(J42=27,'Equivalencia BH-BMPT'!$D$28,IF(J42=28,'Equivalencia BH-BMPT'!$D$29,IF(J42=29,'Equivalencia BH-BMPT'!$D$30,IF(J42=30,'Equivalencia BH-BMPT'!$D$31,IF(J42=31,'Equivalencia BH-BMPT'!$D$32,IF(J42=32,'Equivalencia BH-BMPT'!$D$33,IF(J42=33,'Equivalencia BH-BMPT'!$D$34,IF(J42=34,'Equivalencia BH-BMPT'!$D$35,IF(J42=35,'Equivalencia BH-BMPT'!$D$36,IF(J42=36,'Equivalencia BH-BMPT'!$D$37,IF(J42=37,'Equivalencia BH-BMPT'!$D$38,IF(J42=38,'Equivalencia BH-BMPT'!#REF!,IF(J42=39,'Equivalencia BH-BMPT'!$D$40,IF(J42=40,'Equivalencia BH-BMPT'!$D$41,IF(J42=41,'Equivalencia BH-BMPT'!$D$42,IF(J42=42,'Equivalencia BH-BMPT'!$D$43,IF(J42=43,'Equivalencia BH-BMPT'!$D$44,IF(J42=44,'Equivalencia BH-BMPT'!$D$45,IF(J42=45,'Equivalencia BH-BMPT'!$D$46,\"No ha seleccionado un número de programa\")))))))))))))))))))))))))))))))))))))))))))))","v":"Igualdad y autonomía para una Bogotá incluyente"},1315,1098683674,"LUIS GABRIEL ORDOÑEZ CARDENAS",32480000,null,null,1,6496000,38976000,36134000,"2017/03/10","2017/03/13","2017-12-30",240,48,null,null," ","X",null,0.92708333333333337,null,false]
[30,2017,"17-12-6480504",5,{"$f":"IF(D43=1,'Tipo '!$B$2,IF(D43=2,'Tipo '!$B$3,IF(D43=3,'Tipo '!$B$4,IF(D43=4,'Tipo '!$B$5,IF(D43=5,'Tipo '!$B$6,IF(D43=6,'Tipo '!$B$7,IF(D43=7,'Tipo '!$B$8,IF(D43=8,'Tipo '!$B$9,IF(D43=9,'Tipo '!$B$10,IF(D43=10,'Tipo '!$B$11,IF(D43=11,'Tipo '!$B$12,IF(D43=12,'Tipo '!$B$13,IF(D43=13,'Tipo '!$B$14,IF(D43=14,'Tipo '!$B$15,IF(D43=15,'Tipo '!$B$16,IF(D43=16,'Tipo '!$B$17,IF(D43=17,'Tipo '!$B$18,IF(D43=18,'Tipo '!$B$19,IF(D43=19,'Tipo '!$B$20,\"No ha seleccionado un tipo de contrato válido\")))))))))))))))))))","v":"CONTRATOS DE PRESTACIÓN DE SERVICIOS PROFESIONALES Y DE APOYO A LA GESTIÓN"},"Contratación directa","Prestación de servicios profesionales y de apoyo a la gestión, o para la ejecución de trabajos artísticos que sólo puedan encomendarse a determinadas personas naturales;","PRESTAR SERVICIOS PROFESIONALES PARA LA OPERACIÓN,PRESTACION, SEGUIMIENTO Y CUMPLIMIENTO DE LOS  PROCEDIMIENTOS ADMINISTRATIVOS, OPERATIVOS Y PROGRAMATICOS DEL SERVICIO SOCIAL APOYO ECONOMICO TIPO C, QUE CONTRIBUYAN A LA GARANTIA DE LOS DERECHOS DE LA POBLACION MAYOR EN EL MARCO DE LA POLITICA PUBLICA, SOCIAL PARA EL ENVEJECIMIENTO Y LA VEJEZ EN EL DISTRITO CAPITAL A CARGO DE LA ALCALDIA LOCAL","Inversión",3,{"$f":"IF(J43=1,'Equivalencia BH-BMPT'!$D$2,IF(J43=2,'Equivalencia BH-BMPT'!$D$3,IF(J43=3,'Equivalencia BH-BMPT'!$D$4,IF(J43=4,'Equivalencia BH-BMPT'!$D$5,IF(J43=5,'Equivalencia BH-BMPT'!$D$6,IF(J43=6,'Equivalencia BH-BMPT'!$D$7,IF(J43=7,'Equivalencia BH-BMPT'!$D$8,IF(J43=8,'Equivalencia BH-BMPT'!$D$9,IF(J43=9,'Equivalencia BH-BMPT'!$D$10,IF(J43=10,'Equivalencia BH-BMPT'!$D$11,IF(J43=11,'Equivalencia BH-BMPT'!$D$12,IF(J43=12,'Equivalencia BH-BMPT'!$D$13,IF(J43=13,'Equivalencia BH-BMPT'!$D$14,IF(J43=14,'Equivalencia BH-BMPT'!$D$15,IF(J43=15,'Equivalencia BH-BMPT'!$D$16,IF(J43=16,'Equivalencia BH-BMPT'!$D$17,IF(J43=17,'Equivalencia BH-BMPT'!$D$18,IF(J43=18,'Equivalencia BH-BMPT'!$D$19,IF(J43=19,'Equivalencia BH-BMPT'!$D$20,IF(J43=20,'Equivalencia BH-BMPT'!$D$21,IF(J43=21,'Equivalencia BH-BMPT'!$D$22,IF(J43=22,'Equivalencia BH-BMPT'!$D$23,IF(J43=23,'Equivalencia BH-BMPT'!#REF!,IF(J43=24,'Equivalencia BH-BMPT'!$D$25,IF(J43=25,'Equivalencia BH-BMPT'!$D$26,IF(J43=26,'Equivalencia BH-BMPT'!$D$27,IF(J43=27,'Equivalencia BH-BMPT'!$D$28,IF(J43=28,'Equivalencia BH-BMPT'!$D$29,IF(J43=29,'Equivalencia BH-BMPT'!$D$30,IF(J43=30,'Equivalencia BH-BMPT'!$D$31,IF(J43=31,'Equivalencia BH-BMPT'!$D$32,IF(J43=32,'Equivalencia BH-BMPT'!$D$33,IF(J43=33,'Equivalencia BH-BMPT'!$D$34,IF(J43=34,'Equivalencia BH-BMPT'!$D$35,IF(J43=35,'Equivalencia BH-BMPT'!$D$36,IF(J43=36,'Equivalencia BH-BMPT'!$D$37,IF(J43=37,'Equivalencia BH-BMPT'!$D$38,IF(J43=38,'Equivalencia BH-BMPT'!#REF!,IF(J43=39,'Equivalencia BH-BMPT'!$D$40,IF(J43=40,'Equivalencia BH-BMPT'!$D$41,IF(J43=41,'Equivalencia BH-BMPT'!$D$42,IF(J43=42,'Equivalencia BH-BMPT'!$D$43,IF(J43=43,'Equivalencia BH-BMPT'!$D$44,IF(J43=44,'Equivalencia BH-BMPT'!$D$45,IF(J43=45,'Equivalencia BH-BMPT'!$D$46,\"No ha seleccionado un número de programa\")))))))))))))))))))))))))))))))))))))))))))))","v":"Igualdad y autonomía para una Bogotá incluyente"},1315,91539259,"MAURICIO JAVIER CADENA GATICA",32480000,null,null,1,6496000,38976000,36134000,"2017/03/10","2017/03/13","2017-12-30",240,48,null,null," ","X",null,0.92708333333333337,null,false]
[31,2017,"17-12-6411002",5,{"$f":"IF(D44=1,'Tipo '!$B$2,IF(D44=2,'Tipo '!$B$3,IF(D44=3,'Tipo '!$B$4,IF(D44=4,'Tipo '!$B$5,IF(D44=5,'Tipo '!$B$6,IF(D44=6,'Tipo '!$B$7,IF(D44=7,'Tipo '!$B$8,IF(D44=8,'Tipo '!$B$9,IF(D44=9,'Tipo '!$B$10,IF(D44=10,'Tipo '!$B$11,IF(D44=11,'Tipo '!$B$12,IF(D44=12,'Tipo '!$B$13,IF(D44=13,'Tipo '!$B$14,IF(D44=14,'Tipo '!$B$15,IF(D44=15,'Tipo '!$B$16,IF(D44=16,'Tipo '!$B$17,IF(D44=17,'Tipo '!$B$18,IF(D44=18,'Tipo '!$B$19,IF(D44=19,'Tipo '!$B$20,\"No ha seleccionado un tipo de contrato válido\")))))))))))))))))))","v":"CONTRATOS DE PRESTACIÓN DE SERVICIOS PROFESIONALES Y DE APOYO A LA GESTIÓN"},"Contratación directa","Prestación de servicios profesionales y de apoyo a la gestión, o para la ejecución de trabajos artísticos que sólo puedan encomendarse a determinadas personas naturales;","PRESTAR SERVICIOS DE APOYO AL AREA DE GESTION DEL DESARROLLO LOCAL EN LO ATINENTE A LA ATENCIÓN AL CIUDADANO DE LA ALCALDIA LOCAL DE SANTA FE","Inversión",45,{"$f":"IF(J44=1,'Equivalencia BH-BMPT'!$D$2,IF(J44=2,'Equivalencia BH-BMPT'!$D$3,IF(J44=3,'Equivalencia BH-BMPT'!$D$4,IF(J44=4,'Equivalencia BH-BMPT'!$D$5,IF(J44=5,'Equivalencia BH-BMPT'!$D$6,IF(J44=6,'Equivalencia BH-BMPT'!$D$7,IF(J44=7,'Equivalencia BH-BMPT'!$D$8,IF(J44=8,'Equivalencia BH-BMPT'!$D$9,IF(J44=9,'Equivalencia BH-BMPT'!$D$10,IF(J44=10,'Equivalencia BH-BMPT'!$D$11,IF(J44=11,'Equivalencia BH-BMPT'!$D$12,IF(J44=12,'Equivalencia BH-BMPT'!$D$13,IF(J44=13,'Equivalencia BH-BMPT'!$D$14,IF(J44=14,'Equivalencia BH-BMPT'!$D$15,IF(J44=15,'Equivalencia BH-BMPT'!$D$16,IF(J44=16,'Equivalencia BH-BMPT'!$D$17,IF(J44=17,'Equivalencia BH-BMPT'!$D$18,IF(J44=18,'Equivalencia BH-BMPT'!$D$19,IF(J44=19,'Equivalencia BH-BMPT'!$D$20,IF(J44=20,'Equivalencia BH-BMPT'!$D$21,IF(J44=21,'Equivalencia BH-BMPT'!$D$22,IF(J44=22,'Equivalencia BH-BMPT'!$D$23,IF(J44=23,'Equivalencia BH-BMPT'!#REF!,IF(J44=24,'Equivalencia BH-BMPT'!$D$25,IF(J44=25,'Equivalencia BH-BMPT'!$D$26,IF(J44=26,'Equivalencia BH-BMPT'!$D$27,IF(J44=27,'Equivalencia BH-BMPT'!$D$28,IF(J44=28,'Equivalencia BH-BMPT'!$D$29,IF(J44=29,'Equivalencia BH-BMPT'!$D$30,IF(J44=30,'Equivalencia BH-BMPT'!$D$31,IF(J44=31,'Equivalencia BH-BMPT'!$D$32,IF(J44=32,'Equivalencia BH-BMPT'!$D$33,IF(J44=33,'Equivalencia BH-BMPT'!$D$34,IF(J44=34,'Equivalencia BH-BMPT'!$D$35,IF(J44=35,'Equivalencia BH-BMPT'!$D$36,IF(J44=36,'Equivalencia BH-BMPT'!$D$37,IF(J44=37,'Equivalencia BH-BMPT'!$D$38,IF(J44=38,'Equivalencia BH-BMPT'!#REF!,IF(J44=39,'Equivalencia BH-BMPT'!$D$40,IF(J44=40,'Equivalencia BH-BMPT'!$D$41,IF(J44=41,'Equivalencia BH-BMPT'!$D$42,IF(J44=42,'Equivalencia BH-BMPT'!$D$43,IF(J44=43,'Equivalencia BH-BMPT'!$D$44,IF(J44=44,'Equivalencia BH-BMPT'!$D$45,IF(J44=45,'Equivalencia BH-BMPT'!$D$46,\"No ha seleccionado un número de programa\")))))))))))))))))))))))))))))))))))))))))))))","v":"Gobernanza e influencia local, regional e internacional"},1326,52109171,"SANDRA LILIANA OLAYA FORERO",15600000,null,null,1,1820000,17420000,15080000,"2017/03/13","2017/03/13","2017-11-12",240,0,null,null,"X",null,null,0.86567164179104472,null,false]
[32,2017,"17-12-6447825",5,{"$f":"IF(D45=1,'Tipo '!$B$2,IF(D45=2,'Tipo '!$B$3,IF(D45=3,'Tipo '!$B$4,IF(D45=4,'Tipo '!$B$5,IF(D45=5,'Tipo '!$B$6,IF(D45=6,'Tipo '!$B$7,IF(D45=7,'Tipo '!$B$8,IF(D45=8,'Tipo '!$B$9,IF(D45=9,'Tipo '!$B$10,IF(D45=10,'Tipo '!$B$11,IF(D45=11,'Tipo '!$B$12,IF(D45=12,'Tipo '!$B$13,IF(D45=13,'Tipo '!$B$14,IF(D45=14,'Tipo '!$B$15,IF(D45=15,'Tipo '!$B$16,IF(D45=16,'Tipo '!$B$17,IF(D45=17,'Tipo '!$B$18,IF(D45=18,'Tipo '!$B$19,IF(D45=19,'Tipo '!$B$20,\"No ha seleccionado un tipo de contrato válido\")))))))))))))))))))","v":"CONTRATOS DE PRESTACIÓN DE SERVICIOS PROFESIONALES Y DE APOYO A LA GESTIÓN"},"Contratación directa","Prestación de servicios profesionales y de apoyo a la gestión, o para la ejecución de trabajos artísticos que sólo puedan encomendarse a determinadas personas naturales;","PRESTAR SERVICIOS DE APOYO A LA GESTION EN EL SEGUIMIENTO ADMINISTRATIVO Y MONITOREO DEL FLUJO DOCUMENTAL EN EL FONDO DE DESARROLLO LOCAL DE SANTA FE","Inversión",45,{"$f":"IF(J45=1,'Equivalencia BH-BMPT'!$D$2,IF(J45=2,'Equivalencia BH-BMPT'!$D$3,IF(J45=3,'Equivalencia BH-BMPT'!$D$4,IF(J45=4,'Equivalencia BH-BMPT'!$D$5,IF(J45=5,'Equivalencia BH-BMPT'!$D$6,IF(J45=6,'Equivalencia BH-BMPT'!$D$7,IF(J45=7,'Equivalencia BH-BMPT'!$D$8,IF(J45=8,'Equivalencia BH-BMPT'!$D$9,IF(J45=9,'Equivalencia BH-BMPT'!$D$10,IF(J45=10,'Equivalencia BH-BMPT'!$D$11,IF(J45=11,'Equivalencia BH-BMPT'!$D$12,IF(J45=12,'Equivalencia BH-BMPT'!$D$13,IF(J45=13,'Equivalencia BH-BMPT'!$D$14,IF(J45=14,'Equivalencia BH-BMPT'!$D$15,IF(J45=15,'Equivalencia BH-BMPT'!$D$16,IF(J45=16,'Equivalencia BH-BMPT'!$D$17,IF(J45=17,'Equivalencia BH-BMPT'!$D$18,IF(J45=18,'Equivalencia BH-BMPT'!$D$19,IF(J45=19,'Equivalencia BH-BMPT'!$D$20,IF(J45=20,'Equivalencia BH-BMPT'!$D$21,IF(J45=21,'Equivalencia BH-BMPT'!$D$22,IF(J45=22,'Equivalencia BH-BMPT'!$D$23,IF(J45=23,'Equivalencia BH-BMPT'!#REF!,IF(J45=24,'Equivalencia BH-BMPT'!$D$25,IF(J45=25,'Equivalencia BH-BMPT'!$D$26,IF(J45=26,'Equivalencia BH-BMPT'!$D$27,IF(J45=27,'Equivalencia BH-BMPT'!$D$28,IF(J45=28,'Equivalencia BH-BMPT'!$D$29,IF(J45=29,'Equivalencia BH-BMPT'!$D$30,IF(J45=30,'Equivalencia BH-BMPT'!$D$31,IF(J45=31,'Equivalencia BH-BMPT'!$D$32,IF(J45=32,'Equivalencia BH-BMPT'!$D$33,IF(J45=33,'Equivalencia BH-BMPT'!$D$34,IF(J45=34,'Equivalencia BH-BMPT'!$D$35,IF(J45=35,'Equivalencia BH-BMPT'!$D$36,IF(J45=36,'Equivalencia BH-BMPT'!$D$37,IF(J45=37,'Equivalencia BH-BMPT'!$D$38,IF(J45=38,'Equivalencia BH-BMPT'!#REF!,IF(J45=39,'Equivalencia BH-BMPT'!$D$40,IF(J45=40,'Equivalencia BH-BMPT'!$D$41,IF(J45=41,'Equivalencia BH-BMPT'!$D$42,IF(J45=42,'Equivalencia BH-BMPT'!$D$43,IF(J45=43,'Equivalencia BH-BMPT'!$D$44,IF(J45=44,'Equivalencia BH-BMPT'!$D$45,IF(J45=45,'Equivalencia BH-BMPT'!$D$46,\"No ha seleccionado un número de programa\")))))))))))))))))))))))))))))))))))))))))))))","v":"Gobernanza e influencia local, regional e internacional"},1326,1026280219,"CINDY CATHERINE ROMERO MEDINA",15200000,null,null,1,3990000,19190000,16783333,"2017/03/14","2017/03/15","2018-01-15",240,62,null,null,"X",null,null,0.87458744137571653,null,false]
[33,2017,"17-12-6447988",5,{"$f":"IF(D46=1,'Tipo '!$B$2,IF(D46=2,'Tipo '!$B$3,IF(D46=3,'Tipo '!$B$4,IF(D46=4,'Tipo '!$B$5,IF(D46=5,'Tipo '!$B$6,IF(D46=6,'Tipo '!$B$7,IF(D46=7,'Tipo '!$B$8,IF(D46=8,'Tipo '!$B$9,IF(D46=9,'Tipo '!$B$10,IF(D46=10,'Tipo '!$B$11,IF(D46=11,'Tipo '!$B$12,IF(D46=12,'Tipo '!$B$13,IF(D46=13,'Tipo '!$B$14,IF(D46=14,'Tipo '!$B$15,IF(D46=15,'Tipo '!$B$16,IF(D46=16,'Tipo '!$B$17,IF(D46=17,'Tipo '!$B$18,IF(D46=18,'Tipo '!$B$19,IF(D46=19,'Tipo '!$B$20,\"No ha seleccionado un tipo de contrato válido\")))))))))))))))))))","v":"CONTRATOS DE PRESTACIÓN DE SERVICIOS PROFESIONALES Y DE APOYO A LA GESTIÓN"},"Contratación directa","Prestación de servicios profesionales y de apoyo a la gestión, o para la ejecución de trabajos artísticos que sólo puedan encomendarse a determinadas personas naturales;","PRESTAR LOS SERVICIOS PROFESIONALES PARA LA OPERACIÓN, PRESTACION, SEGUIMIENTO Y CUMPLIMIENTO DE LOS PROCEDIMIENTOS ADMINISTRATIVOS, OPERATIVOS Y PROGRAMATICOS DEL SERVICIO SOCIAL APOYO ECONOMICO TIPO C, QUE CONTRIBUYAN A LA GARANTIA DE LOS DERECHOS DE LA POBLACION MAYOR EN EL MARCO DE LA POLITICA PUBLICA SOCIAL PARA EL ENVEJECIMIENTO Y LA VEJEZ EN EL DISTRITO CAPITAL A CARGO DE LA ALCALDIA LOCAL","Inversión",3,{"$f":"IF(J46=1,'Equivalencia BH-BMPT'!$D$2,IF(J46=2,'Equivalencia BH-BMPT'!$D$3,IF(J46=3,'Equivalencia BH-BMPT'!$D$4,IF(J46=4,'Equivalencia BH-BMPT'!$D$5,IF(J46=5,'Equivalencia BH-BMPT'!$D$6,IF(J46=6,'Equivalencia BH-BMPT'!$D$7,IF(J46=7,'Equivalencia BH-BMPT'!$D$8,IF(J46=8,'Equivalencia BH-BMPT'!$D$9,IF(J46=9,'Equivalencia BH-BMPT'!$D$10,IF(J46=10,'Equivalencia BH-BMPT'!$D$11,IF(J46=11,'Equivalencia BH-BMPT'!$D$12,IF(J46=12,'Equivalencia BH-BMPT'!$D$13,IF(J46=13,'Equivalencia BH-BMPT'!$D$14,IF(J46=14,'Equivalencia BH-BMPT'!$D$15,IF(J46=15,'Equivalencia BH-BMPT'!$D$16,IF(J46=16,'Equivalencia BH-BMPT'!$D$17,IF(J46=17,'Equivalencia BH-BMPT'!$D$18,IF(J46=18,'Equivalencia BH-BMPT'!$D$19,IF(J46=19,'Equivalencia BH-BMPT'!$D$20,IF(J46=20,'Equivalencia BH-BMPT'!$D$21,IF(J46=21,'Equivalencia BH-BMPT'!$D$22,IF(J46=22,'Equivalencia BH-BMPT'!$D$23,IF(J46=23,'Equivalencia BH-BMPT'!#REF!,IF(J46=24,'Equivalencia BH-BMPT'!$D$25,IF(J46=25,'Equivalencia BH-BMPT'!$D$26,IF(J46=26,'Equivalencia BH-BMPT'!$D$27,IF(J46=27,'Equivalencia BH-BMPT'!$D$28,IF(J46=28,'Equivalencia BH-BMPT'!$D$29,IF(J46=29,'Equivalencia BH-BMPT'!$D$30,IF(J46=30,'Equivalencia BH-BMPT'!$D$31,IF(J46=31,'Equivalencia BH-BMPT'!$D$32,IF(J46=32,'Equivalencia BH-BMPT'!$D$33,IF(J46=33,'Equivalencia BH-BMPT'!$D$34,IF(J46=34,'Equivalencia BH-BMPT'!$D$35,IF(J46=35,'Equivalencia BH-BMPT'!$D$36,IF(J46=36,'Equivalencia BH-BMPT'!$D$37,IF(J46=37,'Equivalencia BH-BMPT'!$D$38,IF(J46=38,'Equivalencia BH-BMPT'!#REF!,IF(J46=39,'Equivalencia BH-BMPT'!$D$40,IF(J46=40,'Equivalencia BH-BMPT'!$D$41,IF(J46=41,'Equivalencia BH-BMPT'!$D$42,IF(J46=42,'Equivalencia BH-BMPT'!$D$43,IF(J46=43,'Equivalencia BH-BMPT'!$D$44,IF(J46=44,'Equivalencia BH-BMPT'!$D$45,IF(J46=45,'Equivalencia BH-BMPT'!$D$46,\"No ha seleccionado un número de programa\")))))))))))))))))))))))))))))))))))))))))))))","v":"Igualdad y autonomía para una Bogotá incluyente"},1315,1030530840,"DIEGO FELIPE RODRIGUEZ GÓMEZ",32480000,null,null,1,6090000,38570000,35728000,"2017/03/15","2017/03/16","2017-12-30",240,45,null,null," ","X",null,0.9263157894736842,null,false]
[34,2017,"17-12-6480526",5,{"$f":"IF(D47=1,'Tipo '!$B$2,IF(D47=2,'Tipo '!$B$3,IF(D47=3,'Tipo '!$B$4,IF(D47=4,'Tipo '!$B$5,IF(D47=5,'Tipo '!$B$6,IF(D47=6,'Tipo '!$B$7,IF(D47=7,'Tipo '!$B$8,IF(D47=8,'Tipo '!$B$9,IF(D47=9,'Tipo '!$B$10,IF(D47=10,'Tipo '!$B$11,IF(D47=11,'Tipo '!$B$12,IF(D47=12,'Tipo '!$B$13,IF(D47=13,'Tipo '!$B$14,IF(D47=14,'Tipo '!$B$15,IF(D47=15,'Tipo '!$B$16,IF(D47=16,'Tipo '!$B$17,IF(D47=17,'Tipo '!$B$18,IF(D47=18,'Tipo '!$B$19,IF(D47=19,'Tipo '!$B$20,\"No ha seleccionado un tipo de contrato válido\")))))))))))))))))))","v":"CONTRATOS DE PRESTACIÓN DE SERVICIOS PROFESIONALES Y DE APOYO A LA GESTIÓN"},"Contratación directa","Prestación de servicios profesionales y de apoyo a la gestión, o para la ejecución de trabajos artísticos que sólo puedan encomendarse a determinadas personas naturales;","PRESTAR SERVICIOS PROFESIONALES PARA ORIENTAR, REVISAR Y CONCEPTUALIZAR SOBRE LOS ASUNTOS JURIDICOS QUE SEAN ASIGNADOS AL DESPACHO, A LA OFICINA DEL FONDO DE DESARROLLO LOCAL Y AL AREA DE GESTION POLICIVA, JURIDICA DE LA ALCALDIA LOCAL DE SANTA FE","Inversión",45,{"$f":"IF(J47=1,'Equivalencia BH-BMPT'!$D$2,IF(J47=2,'Equivalencia BH-BMPT'!$D$3,IF(J47=3,'Equivalencia BH-BMPT'!$D$4,IF(J47=4,'Equivalencia BH-BMPT'!$D$5,IF(J47=5,'Equivalencia BH-BMPT'!$D$6,IF(J47=6,'Equivalencia BH-BMPT'!$D$7,IF(J47=7,'Equivalencia BH-BMPT'!$D$8,IF(J47=8,'Equivalencia BH-BMPT'!$D$9,IF(J47=9,'Equivalencia BH-BMPT'!$D$10,IF(J47=10,'Equivalencia BH-BMPT'!$D$11,IF(J47=11,'Equivalencia BH-BMPT'!$D$12,IF(J47=12,'Equivalencia BH-BMPT'!$D$13,IF(J47=13,'Equivalencia BH-BMPT'!$D$14,IF(J47=14,'Equivalencia BH-BMPT'!$D$15,IF(J47=15,'Equivalencia BH-BMPT'!$D$16,IF(J47=16,'Equivalencia BH-BMPT'!$D$17,IF(J47=17,'Equivalencia BH-BMPT'!$D$18,IF(J47=18,'Equivalencia BH-BMPT'!$D$19,IF(J47=19,'Equivalencia BH-BMPT'!$D$20,IF(J47=20,'Equivalencia BH-BMPT'!$D$21,IF(J47=21,'Equivalencia BH-BMPT'!$D$22,IF(J47=22,'Equivalencia BH-BMPT'!$D$23,IF(J47=23,'Equivalencia BH-BMPT'!#REF!,IF(J47=24,'Equivalencia BH-BMPT'!$D$25,IF(J47=25,'Equivalencia BH-BMPT'!$D$26,IF(J47=26,'Equivalencia BH-BMPT'!$D$27,IF(J47=27,'Equivalencia BH-BMPT'!$D$28,IF(J47=28,'Equivalencia BH-BMPT'!$D$29,IF(J47=29,'Equivalencia BH-BMPT'!$D$30,IF(J47=30,'Equivalencia BH-BMPT'!$D$31,IF(J47=31,'Equivalencia BH-BMPT'!$D$32,IF(J47=32,'Equivalencia BH-BMPT'!$D$33,IF(J47=33,'Equivalencia BH-BMPT'!$D$34,IF(J47=34,'Equivalencia BH-BMPT'!$D$35,IF(J47=35,'Equivalencia BH-BMPT'!$D$36,IF(J47=36,'Equivalencia BH-BMPT'!$D$37,IF(J47=37,'Equivalencia BH-BMPT'!$D$38,IF(J47=38,'Equivalencia BH-BMPT'!#REF!,IF(J47=39,'Equivalencia BH-BMPT'!$D$40,IF(J47=40,'Equivalencia BH-BMPT'!$D$41,IF(J47=41,'Equivalencia BH-BMPT'!$D$42,IF(J47=42,'Equivalencia BH-BMPT'!$D$43,IF(J47=43,'Equivalencia BH-BMPT'!$D$44,IF(J47=44,'Equivalencia BH-BMPT'!$D$45,IF(J47=45,'Equivalencia BH-BMPT'!$D$46,\"No ha seleccionado un número de programa\")))))))))))))))))))))))))))))))))))))))))))))","v":"Gobernanza e influencia local, regional e internacional"},1326,12131231,"JUAN CARLOS VARGAS BARREIRO",44000000,null,null,1,8250000,52250000,48400000,"2017/03/15","2017/03/16","2017-12-30",240,45,null,null," ","X",null,0.9263157894736842,null,false]
[35,2017,"17-12-6451775",5,{"$f":"IF(D48=1,'Tipo '!$B$2,IF(D48=2,'Tipo '!$B$3,IF(D48=3,'Tipo '!$B$4,IF(D48=4,'Tipo '!$B$5,IF(D48=5,'Tipo '!$B$6,IF(D48=6,'Tipo '!$B$7,IF(D48=7,'Tipo '!$B$8,IF(D48=8,'Tipo '!$B$9,IF(D48=9,'Tipo '!$B$10,IF(D48=10,'Tipo '!$B$11,IF(D48=11,'Tipo '!$B$12,IF(D48=12,'Tipo '!$B$13,IF(D48=13,'Tipo '!$B$14,IF(D48=14,'Tipo '!$B$15,IF(D48=15,'Tipo '!$B$16,IF(D48=16,'Tipo '!$B$17,IF(D48=17,'Tipo '!$B$18,IF(D48=18,'Tipo '!$B$19,IF(D48=19,'Tipo '!$B$20,\"No ha seleccionado un tipo de contrato válido\")))))))))))))))))))","v":"CONTRATOS DE PRESTACIÓN DE SERVICIOS PROFESIONALES Y DE APOYO A LA GESTIÓN"},"Contratación directa","Prestación de servicios profesionales y de apoyo a la gestión, o para la ejecución de trabajos artísticos que sólo puedan encomendarse a determinadas personas naturales;","CONTRATAR LOS SERVICIOS PROFESIONALES DE UN ABOGADO PARA APOYAR AL FONDO DE DESARROLLO LOCAL EN TODO LO RELACIONADO CON LA ACTIVIDAD CONTRACTUAL DE LA ALCALDIA LOCAL DE SANTA FE, EN EL MARCO DE LOS PLANES, PROGRAMAS Y PROYECTOS ENCAMINADOS AL FORTALECIMIENTO INSTITUCIONAL PARA EL MEJORAMIENTO DE LA GESTION DEL FONDO","Inversión",45,{"$f":"IF(J48=1,'Equivalencia BH-BMPT'!$D$2,IF(J48=2,'Equivalencia BH-BMPT'!$D$3,IF(J48=3,'Equivalencia BH-BMPT'!$D$4,IF(J48=4,'Equivalencia BH-BMPT'!$D$5,IF(J48=5,'Equivalencia BH-BMPT'!$D$6,IF(J48=6,'Equivalencia BH-BMPT'!$D$7,IF(J48=7,'Equivalencia BH-BMPT'!$D$8,IF(J48=8,'Equivalencia BH-BMPT'!$D$9,IF(J48=9,'Equivalencia BH-BMPT'!$D$10,IF(J48=10,'Equivalencia BH-BMPT'!$D$11,IF(J48=11,'Equivalencia BH-BMPT'!$D$12,IF(J48=12,'Equivalencia BH-BMPT'!$D$13,IF(J48=13,'Equivalencia BH-BMPT'!$D$14,IF(J48=14,'Equivalencia BH-BMPT'!$D$15,IF(J48=15,'Equivalencia BH-BMPT'!$D$16,IF(J48=16,'Equivalencia BH-BMPT'!$D$17,IF(J48=17,'Equivalencia BH-BMPT'!$D$18,IF(J48=18,'Equivalencia BH-BMPT'!$D$19,IF(J48=19,'Equivalencia BH-BMPT'!$D$20,IF(J48=20,'Equivalencia BH-BMPT'!$D$21,IF(J48=21,'Equivalencia BH-BMPT'!$D$22,IF(J48=22,'Equivalencia BH-BMPT'!$D$23,IF(J48=23,'Equivalencia BH-BMPT'!#REF!,IF(J48=24,'Equivalencia BH-BMPT'!$D$25,IF(J48=25,'Equivalencia BH-BMPT'!$D$26,IF(J48=26,'Equivalencia BH-BMPT'!$D$27,IF(J48=27,'Equivalencia BH-BMPT'!$D$28,IF(J48=28,'Equivalencia BH-BMPT'!$D$29,IF(J48=29,'Equivalencia BH-BMPT'!$D$30,IF(J48=30,'Equivalencia BH-BMPT'!$D$31,IF(J48=31,'Equivalencia BH-BMPT'!$D$32,IF(J48=32,'Equivalencia BH-BMPT'!$D$33,IF(J48=33,'Equivalencia BH-BMPT'!$D$34,IF(J48=34,'Equivalencia BH-BMPT'!$D$35,IF(J48=35,'Equivalencia BH-BMPT'!$D$36,IF(J48=36,'Equivalencia BH-BMPT'!$D$37,IF(J48=37,'Equivalencia BH-BMPT'!$D$38,IF(J48=38,'Equivalencia BH-BMPT'!#REF!,IF(J48=39,'Equivalencia BH-BMPT'!$D$40,IF(J48=40,'Equivalencia BH-BMPT'!$D$41,IF(J48=41,'Equivalencia BH-BMPT'!$D$42,IF(J48=42,'Equivalencia BH-BMPT'!$D$43,IF(J48=43,'Equivalencia BH-BMPT'!$D$44,IF(J48=44,'Equivalencia BH-BMPT'!$D$45,IF(J48=45,'Equivalencia BH-BMPT'!$D$46,\"No ha seleccionado un número de programa\")))))))))))))))))))))))))))))))))))))))))))))","v":"Gobernanza e influencia local, regional e internacional"},1326,1118815051,"ARINSON ARMANDO RUIZ UTRIA",40000000,null,null,1,10000000,50000000,44000000,"2017/03/15","2017/03/16","2018-01-15",240,60,null,null,"X",null,null,0.88,null,false]
[36,2017,"17-12-6480550",5,{"$f":"IF(D49=1,'Tipo '!$B$2,IF(D49=2,'Tipo '!$B$3,IF(D49=3,'Tipo '!$B$4,IF(D49=4,'Tipo '!$B$5,IF(D49=5,'Tipo '!$B$6,IF(D49=6,'Tipo '!$B$7,IF(D49=7,'Tipo '!$B$8,IF(D49=8,'Tipo '!$B$9,IF(D49=9,'Tipo '!$B$10,IF(D49=10,'Tipo '!$B$11,IF(D49=11,'Tipo '!$B$12,IF(D49=12,'Tipo '!$B$13,IF(D49=13,'Tipo '!$B$14,IF(D49=14,'Tipo '!$B$15,IF(D49=15,'Tipo '!$B$16,IF(D49=16,'Tipo '!$B$17,IF(D49=17,'Tipo '!$B$18,IF(D49=18,'Tipo '!$B$19,IF(D49=19,'Tipo '!$B$20,\"No ha seleccionado un tipo de contrato válido\")))))))))))))))))))","v":"CONTRATOS DE PRESTACIÓN DE SERVICIOS PROFESIONALES Y DE APOYO A LA GESTIÓN"},"Contratación directa","Prestación de servicios profesionales y de apoyo a la gestión, o para la ejecución de trabajos artísticos que sólo puedan encomendarse a determinadas personas naturales;","PRESTAR LOS SERVICIOS PROFESIONALES EN EL AREA DE GESTION DEL DESARROLLO LOCAL, PARA EL DISEÑO Y EJECUCIÓN DE MECANISMOS DE EVALUACION, SEGUIMIENTO Y FOMENTO DE LA CULTURA DE CALIDAD Y DE AUTOCONTROL EN LA ENTIDAD MEDIANTE LA APLICACIÓN DE METODOLOGIAS Y NORMATIVIDAD VIGENTE, CONTRUBUYENDO AL CUMPLIMIENTO DE LOS OBJETIVOS Y METAS INSTITUCIONALES SIENDO EL ENLACE ENTRE LA SECRETARIA DISTRITAL DE GOBIERNO Y LA ALCALDIA LOCAL","Inversión",45,{"$f":"IF(J49=1,'Equivalencia BH-BMPT'!$D$2,IF(J49=2,'Equivalencia BH-BMPT'!$D$3,IF(J49=3,'Equivalencia BH-BMPT'!$D$4,IF(J49=4,'Equivalencia BH-BMPT'!$D$5,IF(J49=5,'Equivalencia BH-BMPT'!$D$6,IF(J49=6,'Equivalencia BH-BMPT'!$D$7,IF(J49=7,'Equivalencia BH-BMPT'!$D$8,IF(J49=8,'Equivalencia BH-BMPT'!$D$9,IF(J49=9,'Equivalencia BH-BMPT'!$D$10,IF(J49=10,'Equivalencia BH-BMPT'!$D$11,IF(J49=11,'Equivalencia BH-BMPT'!$D$12,IF(J49=12,'Equivalencia BH-BMPT'!$D$13,IF(J49=13,'Equivalencia BH-BMPT'!$D$14,IF(J49=14,'Equivalencia BH-BMPT'!$D$15,IF(J49=15,'Equivalencia BH-BMPT'!$D$16,IF(J49=16,'Equivalencia BH-BMPT'!$D$17,IF(J49=17,'Equivalencia BH-BMPT'!$D$18,IF(J49=18,'Equivalencia BH-BMPT'!$D$19,IF(J49=19,'Equivalencia BH-BMPT'!$D$20,IF(J49=20,'Equivalencia BH-BMPT'!$D$21,IF(J49=21,'Equivalencia BH-BMPT'!$D$22,IF(J49=22,'Equivalencia BH-BMPT'!$D$23,IF(J49=23,'Equivalencia BH-BMPT'!#REF!,IF(J49=24,'Equivalencia BH-BMPT'!$D$25,IF(J49=25,'Equivalencia BH-BMPT'!$D$26,IF(J49=26,'Equivalencia BH-BMPT'!$D$27,IF(J49=27,'Equivalencia BH-BMPT'!$D$28,IF(J49=28,'Equivalencia BH-BMPT'!$D$29,IF(J49=29,'Equivalencia BH-BMPT'!$D$30,IF(J49=30,'Equivalencia BH-BMPT'!$D$31,IF(J49=31,'Equivalencia BH-BMPT'!$D$32,IF(J49=32,'Equivalencia BH-BMPT'!$D$33,IF(J49=33,'Equivalencia BH-BMPT'!$D$34,IF(J49=34,'Equivalencia BH-BMPT'!$D$35,IF(J49=35,'Equivalencia BH-BMPT'!$D$36,IF(J49=36,'Equivalencia BH-BMPT'!$D$37,IF(J49=37,'Equivalencia BH-BMPT'!$D$38,IF(J49=38,'Equivalencia BH-BMPT'!#REF!,IF(J49=39,'Equivalencia BH-BMPT'!$D$40,IF(J49=40,'Equivalencia BH-BMPT'!$D$41,IF(J49=41,'Equivalencia BH-BMPT'!$D$42,IF(J49=42,'Equivalencia BH-BMPT'!$D$43,IF(J49=43,'Equivalencia BH-BMPT'!$D$44,IF(J49=44,'Equivalencia BH-BMPT'!$D$45,IF(J49=45,'Equivalencia BH-BMPT'!$D$46,\"No ha seleccionado un número de programa\")))))))))))))))))))))))))))))))))))))))))))))","v":"Gobernanza e influencia local, regional e internacional"},1326,51738812,"REBECA GONZALEZ JAIMES",39200000,null,null,1,9800000,49000000,43120000,"2017/03/15","2017/03/16",43115,240,60,null,null,"X",null,null,0.88,null,false]
[37,2017,"17-12-6473861",5,{"$f":"IF(D50=1,'Tipo '!$B$2,IF(D50=2,'Tipo '!$B$3,IF(D50=3,'Tipo '!$B$4,IF(D50=4,'Tipo '!$B$5,IF(D50=5,'Tipo '!$B$6,IF(D50=6,'Tipo '!$B$7,IF(D50=7,'Tipo '!$B$8,IF(D50=8,'Tipo '!$B$9,IF(D50=9,'Tipo '!$B$10,IF(D50=10,'Tipo '!$B$11,IF(D50=11,'Tipo '!$B$12,IF(D50=12,'Tipo '!$B$13,IF(D50=13,'Tipo '!$B$14,IF(D50=14,'Tipo '!$B$15,IF(D50=15,'Tipo '!$B$16,IF(D50=16,'Tipo '!$B$17,IF(D50=17,'Tipo '!$B$18,IF(D50=18,'Tipo '!$B$19,IF(D50=19,'Tipo '!$B$20,\"No ha seleccionado un tipo de contrato válido\")))))))))))))))))))","v":"CONTRATOS DE PRESTACIÓN DE SERVICIOS PROFESIONALES Y DE APOYO A LA GESTIÓN"},"Contratación directa","Prestación de servicios profesionales y de apoyo a la gestión, o para la ejecución de trabajos artísticos que sólo puedan encomendarse a determinadas personas naturales;","PRESTAR APOYO AL AREA DE GESTION POLICIVA Y AREA DE GESTION DE DESARROLLO LOCAL EN LA CONDUCCION DEL PARQUE AUTOMOTOR DE PROPIEDAD DEL FDLSF QUE LE SEA ASIGNADO","Inversión",45,{"$f":"IF(J50=1,'Equivalencia BH-BMPT'!$D$2,IF(J50=2,'Equivalencia BH-BMPT'!$D$3,IF(J50=3,'Equivalencia BH-BMPT'!$D$4,IF(J50=4,'Equivalencia BH-BMPT'!$D$5,IF(J50=5,'Equivalencia BH-BMPT'!$D$6,IF(J50=6,'Equivalencia BH-BMPT'!$D$7,IF(J50=7,'Equivalencia BH-BMPT'!$D$8,IF(J50=8,'Equivalencia BH-BMPT'!$D$9,IF(J50=9,'Equivalencia BH-BMPT'!$D$10,IF(J50=10,'Equivalencia BH-BMPT'!$D$11,IF(J50=11,'Equivalencia BH-BMPT'!$D$12,IF(J50=12,'Equivalencia BH-BMPT'!$D$13,IF(J50=13,'Equivalencia BH-BMPT'!$D$14,IF(J50=14,'Equivalencia BH-BMPT'!$D$15,IF(J50=15,'Equivalencia BH-BMPT'!$D$16,IF(J50=16,'Equivalencia BH-BMPT'!$D$17,IF(J50=17,'Equivalencia BH-BMPT'!$D$18,IF(J50=18,'Equivalencia BH-BMPT'!$D$19,IF(J50=19,'Equivalencia BH-BMPT'!$D$20,IF(J50=20,'Equivalencia BH-BMPT'!$D$21,IF(J50=21,'Equivalencia BH-BMPT'!$D$22,IF(J50=22,'Equivalencia BH-BMPT'!$D$23,IF(J50=23,'Equivalencia BH-BMPT'!#REF!,IF(J50=24,'Equivalencia BH-BMPT'!$D$25,IF(J50=25,'Equivalencia BH-BMPT'!$D$26,IF(J50=26,'Equivalencia BH-BMPT'!$D$27,IF(J50=27,'Equivalencia BH-BMPT'!$D$28,IF(J50=28,'Equivalencia BH-BMPT'!$D$29,IF(J50=29,'Equivalencia BH-BMPT'!$D$30,IF(J50=30,'Equivalencia BH-BMPT'!$D$31,IF(J50=31,'Equivalencia BH-BMPT'!$D$32,IF(J50=32,'Equivalencia BH-BMPT'!$D$33,IF(J50=33,'Equivalencia BH-BMPT'!$D$34,IF(J50=34,'Equivalencia BH-BMPT'!$D$35,IF(J50=35,'Equivalencia BH-BMPT'!$D$36,IF(J50=36,'Equivalencia BH-BMPT'!$D$37,IF(J50=37,'Equivalencia BH-BMPT'!$D$38,IF(J50=38,'Equivalencia BH-BMPT'!#REF!,IF(J50=39,'Equivalencia BH-BMPT'!$D$40,IF(J50=40,'Equivalencia BH-BMPT'!$D$41,IF(J50=41,'Equivalencia BH-BMPT'!$D$42,IF(J50=42,'Equivalencia BH-BMPT'!$D$43,IF(J50=43,'Equivalencia BH-BMPT'!$D$44,IF(J50=44,'Equivalencia BH-BMPT'!$D$45,IF(J50=45,'Equivalencia BH-BMPT'!$D$46,\"No ha seleccionado un número de programa\")))))))))))))))))))))))))))))))))))))))))))))","v":"Gobernanza e influencia local, regional e internacional"},1326,79750912,"JHON ALEXANDER SANABRIA",17600000,null,null,1,4400000,22000000,19360000,"2017/03/15","2017/03/16","2018-01-15",240,60,null,null,"X",null,null,0.88,null,false]
[38,2017,"17-12-6474142",5,{"$f":"IF(D51=1,'Tipo '!$B$2,IF(D51=2,'Tipo '!$B$3,IF(D51=3,'Tipo '!$B$4,IF(D51=4,'Tipo '!$B$5,IF(D51=5,'Tipo '!$B$6,IF(D51=6,'Tipo '!$B$7,IF(D51=7,'Tipo '!$B$8,IF(D51=8,'Tipo '!$B$9,IF(D51=9,'Tipo '!$B$10,IF(D51=10,'Tipo '!$B$11,IF(D51=11,'Tipo '!$B$12,IF(D51=12,'Tipo '!$B$13,IF(D51=13,'Tipo '!$B$14,IF(D51=14,'Tipo '!$B$15,IF(D51=15,'Tipo '!$B$16,IF(D51=16,'Tipo '!$B$17,IF(D51=17,'Tipo '!$B$18,IF(D51=18,'Tipo '!$B$19,IF(D51=19,'Tipo '!$B$20,\"No ha seleccionado un tipo de contrato válido\")))))))))))))))))))","v":"CONTRATOS DE PRESTACIÓN DE SERVICIOS PROFESIONALES Y DE APOYO A LA GESTIÓN"},"Contratación directa","Prestación de servicios profesionales y de apoyo a la gestión, o para la ejecución de trabajos artísticos que sólo puedan encomendarse a determinadas personas naturales;","PRESTAR SERVICIOS PROFESIONALES AL DESPACHO, PARA LIDERAR LO REFERENTE A PRENSA Y COMUNICACIONES DE LA ALCALDIA LOCAL DE SANTA FE","Inversión",45,{"$f":"IF(J51=1,'Equivalencia BH-BMPT'!$D$2,IF(J51=2,'Equivalencia BH-BMPT'!$D$3,IF(J51=3,'Equivalencia BH-BMPT'!$D$4,IF(J51=4,'Equivalencia BH-BMPT'!$D$5,IF(J51=5,'Equivalencia BH-BMPT'!$D$6,IF(J51=6,'Equivalencia BH-BMPT'!$D$7,IF(J51=7,'Equivalencia BH-BMPT'!$D$8,IF(J51=8,'Equivalencia BH-BMPT'!$D$9,IF(J51=9,'Equivalencia BH-BMPT'!$D$10,IF(J51=10,'Equivalencia BH-BMPT'!$D$11,IF(J51=11,'Equivalencia BH-BMPT'!$D$12,IF(J51=12,'Equivalencia BH-BMPT'!$D$13,IF(J51=13,'Equivalencia BH-BMPT'!$D$14,IF(J51=14,'Equivalencia BH-BMPT'!$D$15,IF(J51=15,'Equivalencia BH-BMPT'!$D$16,IF(J51=16,'Equivalencia BH-BMPT'!$D$17,IF(J51=17,'Equivalencia BH-BMPT'!$D$18,IF(J51=18,'Equivalencia BH-BMPT'!$D$19,IF(J51=19,'Equivalencia BH-BMPT'!$D$20,IF(J51=20,'Equivalencia BH-BMPT'!$D$21,IF(J51=21,'Equivalencia BH-BMPT'!$D$22,IF(J51=22,'Equivalencia BH-BMPT'!$D$23,IF(J51=23,'Equivalencia BH-BMPT'!#REF!,IF(J51=24,'Equivalencia BH-BMPT'!$D$25,IF(J51=25,'Equivalencia BH-BMPT'!$D$26,IF(J51=26,'Equivalencia BH-BMPT'!$D$27,IF(J51=27,'Equivalencia BH-BMPT'!$D$28,IF(J51=28,'Equivalencia BH-BMPT'!$D$29,IF(J51=29,'Equivalencia BH-BMPT'!$D$30,IF(J51=30,'Equivalencia BH-BMPT'!$D$31,IF(J51=31,'Equivalencia BH-BMPT'!$D$32,IF(J51=32,'Equivalencia BH-BMPT'!$D$33,IF(J51=33,'Equivalencia BH-BMPT'!$D$34,IF(J51=34,'Equivalencia BH-BMPT'!$D$35,IF(J51=35,'Equivalencia BH-BMPT'!$D$36,IF(J51=36,'Equivalencia BH-BMPT'!$D$37,IF(J51=37,'Equivalencia BH-BMPT'!$D$38,IF(J51=38,'Equivalencia BH-BMPT'!#REF!,IF(J51=39,'Equivalencia BH-BMPT'!$D$40,IF(J51=40,'Equivalencia BH-BMPT'!$D$41,IF(J51=41,'Equivalencia BH-BMPT'!$D$42,IF(J51=42,'Equivalencia BH-BMPT'!$D$43,IF(J51=43,'Equivalencia BH-BMPT'!$D$44,IF(J51=44,'Equivalencia BH-BMPT'!$D$45,IF(J51=45,'Equivalencia BH-BMPT'!$D$46,\"No ha seleccionado un número de programa\")))))))))))))))))))))))))))))))))))))))))))))","v":"Gobernanza e influencia local, regional e internacional"},1326,1026267977,"CLAUDIA VICTORIA CASTAÑO MARTINEZ",44000000,null,null,1,11000000,55000000,48400000,"2017/03/15","2017/03/16","2018-01-15",240,60,null,null,"X",null,null,0.88,null,false]
[39,2017,"17-126480583",5,{"$f":"IF(D52=1,'Tipo '!$B$2,IF(D52=2,'Tipo '!$B$3,IF(D52=3,'Tipo '!$B$4,IF(D52=4,'Tipo '!$B$5,IF(D52=5,'Tipo '!$B$6,IF(D52=6,'Tipo '!$B$7,IF(D52=7,'Tipo '!$B$8,IF(D52=8,'Tipo '!$B$9,IF(D52=9,'Tipo '!$B$10,IF(D52=10,'Tipo '!$B$11,IF(D52=11,'Tipo '!$B$12,IF(D52=12,'Tipo '!$B$13,IF(D52=13,'Tipo '!$B$14,IF(D52=14,'Tipo '!$B$15,IF(D52=15,'Tipo '!$B$16,IF(D52=16,'Tipo '!$B$17,IF(D52=17,'Tipo '!$B$18,IF(D52=18,'Tipo '!$B$19,IF(D52=19,'Tipo '!$B$20,\"No ha seleccionado un tipo de contrato válido\")))))))))))))))))))","v":"CONTRATOS DE PRESTACIÓN DE SERVICIOS PROFESIONALES Y DE APOYO A LA GESTIÓN"},"Contratación directa","Prestación de servicios profesionales y de apoyo a la gestión, o para la ejecución de trabajos artísticos que sólo puedan encomendarse a determinadas personas naturales;","PRESTAR SERVICIOS DE APOYO AL AREA DE GESTIÓN DEL DESARROLLO LOCAL DE SANTA FE","Inversión",45,{"$f":"IF(J52=1,'Equivalencia BH-BMPT'!$D$2,IF(J52=2,'Equivalencia BH-BMPT'!$D$3,IF(J52=3,'Equivalencia BH-BMPT'!$D$4,IF(J52=4,'Equivalencia BH-BMPT'!$D$5,IF(J52=5,'Equivalencia BH-BMPT'!$D$6,IF(J52=6,'Equivalencia BH-BMPT'!$D$7,IF(J52=7,'Equivalencia BH-BMPT'!$D$8,IF(J52=8,'Equivalencia BH-BMPT'!$D$9,IF(J52=9,'Equivalencia BH-BMPT'!$D$10,IF(J52=10,'Equivalencia BH-BMPT'!$D$11,IF(J52=11,'Equivalencia BH-BMPT'!$D$12,IF(J52=12,'Equivalencia BH-BMPT'!$D$13,IF(J52=13,'Equivalencia BH-BMPT'!$D$14,IF(J52=14,'Equivalencia BH-BMPT'!$D$15,IF(J52=15,'Equivalencia BH-BMPT'!$D$16,IF(J52=16,'Equivalencia BH-BMPT'!$D$17,IF(J52=17,'Equivalencia BH-BMPT'!$D$18,IF(J52=18,'Equivalencia BH-BMPT'!$D$19,IF(J52=19,'Equivalencia BH-BMPT'!$D$20,IF(J52=20,'Equivalencia BH-BMPT'!$D$21,IF(J52=21,'Equivalencia BH-BMPT'!$D$22,IF(J52=22,'Equivalencia BH-BMPT'!$D$23,IF(J52=23,'Equivalencia BH-BMPT'!#REF!,IF(J52=24,'Equivalencia BH-BMPT'!$D$25,IF(J52=25,'Equivalencia BH-BMPT'!$D$26,IF(J52=26,'Equivalencia BH-BMPT'!$D$27,IF(J52=27,'Equivalencia BH-BMPT'!$D$28,IF(J52=28,'Equivalencia BH-BMPT'!$D$29,IF(J52=29,'Equivalencia BH-BMPT'!$D$30,IF(J52=30,'Equivalencia BH-BMPT'!$D$31,IF(J52=31,'Equivalencia BH-BMPT'!$D$32,IF(J52=32,'Equivalencia BH-BMPT'!$D$33,IF(J52=33,'Equivalencia BH-BMPT'!$D$34,IF(J52=34,'Equivalencia BH-BMPT'!$D$35,IF(J52=35,'Equivalencia BH-BMPT'!$D$36,IF(J52=36,'Equivalencia BH-BMPT'!$D$37,IF(J52=37,'Equivalencia BH-BMPT'!$D$38,IF(J52=38,'Equivalencia BH-BMPT'!#REF!,IF(J52=39,'Equivalencia BH-BMPT'!$D$40,IF(J52=40,'Equivalencia BH-BMPT'!$D$41,IF(J52=41,'Equivalencia BH-BMPT'!$D$42,IF(J52=42,'Equivalencia BH-BMPT'!$D$43,IF(J52=43,'Equivalencia BH-BMPT'!$D$44,IF(J52=44,'Equivalencia BH-BMPT'!$D$45,IF(J52=45,'Equivalencia BH-BMPT'!$D$46,\"No ha seleccionado un número de programa\")))))))))))))))))))))))))))))))))))))))))))))","v":"Gobernanza e influencia local, regional e internacional"},1326,1082879244,"RAFAEL BALAGUERA BONNITO",28800000,null,null,1,7200000,36000000,31680000,"2017/03/15","2017/03/15","2018-01-15",240,60,null,null,"X",null,null,0.88,null,false]
[40,2017,"17-12-6474218",5,{"$f":"IF(D53=1,'Tipo '!$B$2,IF(D53=2,'Tipo '!$B$3,IF(D53=3,'Tipo '!$B$4,IF(D53=4,'Tipo '!$B$5,IF(D53=5,'Tipo '!$B$6,IF(D53=6,'Tipo '!$B$7,IF(D53=7,'Tipo '!$B$8,IF(D53=8,'Tipo '!$B$9,IF(D53=9,'Tipo '!$B$10,IF(D53=10,'Tipo '!$B$11,IF(D53=11,'Tipo '!$B$12,IF(D53=12,'Tipo '!$B$13,IF(D53=13,'Tipo '!$B$14,IF(D53=14,'Tipo '!$B$15,IF(D53=15,'Tipo '!$B$16,IF(D53=16,'Tipo '!$B$17,IF(D53=17,'Tipo '!$B$18,IF(D53=18,'Tipo '!$B$19,IF(D53=19,'Tipo '!$B$20,\"No ha seleccionado un tipo de contrato válido\")))))))))))))))))))","v":"CONTRATOS DE PRESTACIÓN DE SERVICIOS PROFESIONALES Y DE APOYO A LA GESTIÓN"},"Contratación directa","Prestación de servicios profesionales y de apoyo a la gestión, o para la ejecución de trabajos artísticos que sólo puedan encomendarse a determinadas personas naturales;","PRESTAR SERVICIOS PROFESIONALES PARA FORTALECER LOS PROCESOS TENDIENTES A DESARROLLAR LOS PROYECTOS DEL PLAN DE DESARROLLO LOCAL PARA LA VIGENCIA 2017","Inversión",45,{"$f":"IF(J53=1,'Equivalencia BH-BMPT'!$D$2,IF(J53=2,'Equivalencia BH-BMPT'!$D$3,IF(J53=3,'Equivalencia BH-BMPT'!$D$4,IF(J53=4,'Equivalencia BH-BMPT'!$D$5,IF(J53=5,'Equivalencia BH-BMPT'!$D$6,IF(J53=6,'Equivalencia BH-BMPT'!$D$7,IF(J53=7,'Equivalencia BH-BMPT'!$D$8,IF(J53=8,'Equivalencia BH-BMPT'!$D$9,IF(J53=9,'Equivalencia BH-BMPT'!$D$10,IF(J53=10,'Equivalencia BH-BMPT'!$D$11,IF(J53=11,'Equivalencia BH-BMPT'!$D$12,IF(J53=12,'Equivalencia BH-BMPT'!$D$13,IF(J53=13,'Equivalencia BH-BMPT'!$D$14,IF(J53=14,'Equivalencia BH-BMPT'!$D$15,IF(J53=15,'Equivalencia BH-BMPT'!$D$16,IF(J53=16,'Equivalencia BH-BMPT'!$D$17,IF(J53=17,'Equivalencia BH-BMPT'!$D$18,IF(J53=18,'Equivalencia BH-BMPT'!$D$19,IF(J53=19,'Equivalencia BH-BMPT'!$D$20,IF(J53=20,'Equivalencia BH-BMPT'!$D$21,IF(J53=21,'Equivalencia BH-BMPT'!$D$22,IF(J53=22,'Equivalencia BH-BMPT'!$D$23,IF(J53=23,'Equivalencia BH-BMPT'!#REF!,IF(J53=24,'Equivalencia BH-BMPT'!$D$25,IF(J53=25,'Equivalencia BH-BMPT'!$D$26,IF(J53=26,'Equivalencia BH-BMPT'!$D$27,IF(J53=27,'Equivalencia BH-BMPT'!$D$28,IF(J53=28,'Equivalencia BH-BMPT'!$D$29,IF(J53=29,'Equivalencia BH-BMPT'!$D$30,IF(J53=30,'Equivalencia BH-BMPT'!$D$31,IF(J53=31,'Equivalencia BH-BMPT'!$D$32,IF(J53=32,'Equivalencia BH-BMPT'!$D$33,IF(J53=33,'Equivalencia BH-BMPT'!$D$34,IF(J53=34,'Equivalencia BH-BMPT'!$D$35,IF(J53=35,'Equivalencia BH-BMPT'!$D$36,IF(J53=36,'Equivalencia BH-BMPT'!$D$37,IF(J53=37,'Equivalencia BH-BMPT'!$D$38,IF(J53=38,'Equivalencia BH-BMPT'!#REF!,IF(J53=39,'Equivalencia BH-BMPT'!$D$40,IF(J53=40,'Equivalencia BH-BMPT'!$D$41,IF(J53=41,'Equivalencia BH-BMPT'!$D$42,IF(J53=42,'Equivalencia BH-BMPT'!$D$43,IF(J53=43,'Equivalencia BH-BMPT'!$D$44,IF(J53=44,'Equivalencia BH-BMPT'!$D$45,IF(J53=45,'Equivalencia BH-BMPT'!$D$46,\"No ha seleccionado un número de programa\")))))))))))))))))))))))))))))))))))))))))))))","v":"Gobernanza e influencia local, regional e internacional"},1326,53073076,"LEIDY JURANNY CRUZ MORENO",42400000,null,null,1,10600000,53000000,46640000,"2017/03/15","2017/03/16","2018-01-15",240,60,null,null,"X",null,null,0.88,null,false]
[41,2017,"17-12-6480630",5,{"$f":"IF(D54=1,'Tipo '!$B$2,IF(D54=2,'Tipo '!$B$3,IF(D54=3,'Tipo '!$B$4,IF(D54=4,'Tipo '!$B$5,IF(D54=5,'Tipo '!$B$6,IF(D54=6,'Tipo '!$B$7,IF(D54=7,'Tipo '!$B$8,IF(D54=8,'Tipo '!$B$9,IF(D54=9,'Tipo '!$B$10,IF(D54=10,'Tipo '!$B$11,IF(D54=11,'Tipo '!$B$12,IF(D54=12,'Tipo '!$B$13,IF(D54=13,'Tipo '!$B$14,IF(D54=14,'Tipo '!$B$15,IF(D54=15,'Tipo '!$B$16,IF(D54=16,'Tipo '!$B$17,IF(D54=17,'Tipo '!$B$18,IF(D54=18,'Tipo '!$B$19,IF(D54=19,'Tipo '!$B$20,\"No ha seleccionado un tipo de contrato válido\")))))))))))))))))))","v":"CONTRATOS DE PRESTACIÓN DE SERVICIOS PROFESIONALES Y DE APOYO A LA GESTIÓN"},"Contratación directa","Prestación de servicios profesionales y de apoyo a la gestión, o para la ejecución de trabajos artísticos que sólo puedan encomendarse a determinadas personas naturales;","PRESTAR SERVICIOS PROFESIONALES PARA FORTALECER LOS PROCESOS TENDIENTES A DESARROLLAR LOS PROYECTOS DEL PLAN DE DESARROLLO LOCAL PARA LA VIGENCIA 2017","Inversión",45,{"$f":"IF(J54=1,'Equivalencia BH-BMPT'!$D$2,IF(J54=2,'Equivalencia BH-BMPT'!$D$3,IF(J54=3,'Equivalencia BH-BMPT'!$D$4,IF(J54=4,'Equivalencia BH-BMPT'!$D$5,IF(J54=5,'Equivalencia BH-BMPT'!$D$6,IF(J54=6,'Equivalencia BH-BMPT'!$D$7,IF(J54=7,'Equivalencia BH-BMPT'!$D$8,IF(J54=8,'Equivalencia BH-BMPT'!$D$9,IF(J54=9,'Equivalencia BH-BMPT'!$D$10,IF(J54=10,'Equivalencia BH-BMPT'!$D$11,IF(J54=11,'Equivalencia BH-BMPT'!$D$12,IF(J54=12,'Equivalencia BH-BMPT'!$D$13,IF(J54=13,'Equivalencia BH-BMPT'!$D$14,IF(J54=14,'Equivalencia BH-BMPT'!$D$15,IF(J54=15,'Equivalencia BH-BMPT'!$D$16,IF(J54=16,'Equivalencia BH-BMPT'!$D$17,IF(J54=17,'Equivalencia BH-BMPT'!$D$18,IF(J54=18,'Equivalencia BH-BMPT'!$D$19,IF(J54=19,'Equivalencia BH-BMPT'!$D$20,IF(J54=20,'Equivalencia BH-BMPT'!$D$21,IF(J54=21,'Equivalencia BH-BMPT'!$D$22,IF(J54=22,'Equivalencia BH-BMPT'!$D$23,IF(J54=23,'Equivalencia BH-BMPT'!#REF!,IF(J54=24,'Equivalencia BH-BMPT'!$D$25,IF(J54=25,'Equivalencia BH-BMPT'!$D$26,IF(J54=26,'Equivalencia BH-BMPT'!$D$27,IF(J54=27,'Equivalencia BH-BMPT'!$D$28,IF(J54=28,'Equivalencia BH-BMPT'!$D$29,IF(J54=29,'Equivalencia BH-BMPT'!$D$30,IF(J54=30,'Equivalencia BH-BMPT'!$D$31,IF(J54=31,'Equivalencia BH-BMPT'!$D$32,IF(J54=32,'Equivalencia BH-BMPT'!$D$33,IF(J54=33,'Equivalencia BH-BMPT'!$D$34,IF(J54=34,'Equivalencia BH-BMPT'!$D$35,IF(J54=35,'Equivalencia BH-BMPT'!$D$36,IF(J54=36,'Equivalencia BH-BMPT'!$D$37,IF(J54=37,'Equivalencia BH-BMPT'!$D$38,IF(J54=38,'Equivalencia BH-BMPT'!#REF!,IF(J54=39,'Equivalencia BH-BMPT'!$D$40,IF(J54=40,'Equivalencia BH-BMPT'!$D$41,IF(J54=41,'Equivalencia BH-BMPT'!$D$42,IF(J54=42,'Equivalencia BH-BMPT'!$D$43,IF(J54=43,'Equivalencia BH-BMPT'!$D$44,IF(J54=44,'Equivalencia BH-BMPT'!$D$45,IF(J54=45,'Equivalencia BH-BMPT'!$D$46,\"No ha seleccionado un número de programa\")))))))))))))))))))))))))))))))))))))))))))))","v":"Gobernanza e influencia local, regional e internacional"},1326,53097642,"DIANA CAROLINA GIRALDO MAYORGA",42400000,null,null,1,10600000,53000000,46639999,"2017/03/15","2017/03/16","2018-01-15",240,60,null,null,"X",null,null,0.87999998113207545,null,false]
[42,2017,"17-12-6474221",5,{"$f":"IF(D55=1,'Tipo '!$B$2,IF(D55=2,'Tipo '!$B$3,IF(D55=3,'Tipo '!$B$4,IF(D55=4,'Tipo '!$B$5,IF(D55=5,'Tipo '!$B$6,IF(D55=6,'Tipo '!$B$7,IF(D55=7,'Tipo '!$B$8,IF(D55=8,'Tipo '!$B$9,IF(D55=9,'Tipo '!$B$10,IF(D55=10,'Tipo '!$B$11,IF(D55=11,'Tipo '!$B$12,IF(D55=12,'Tipo '!$B$13,IF(D55=13,'Tipo '!$B$14,IF(D55=14,'Tipo '!$B$15,IF(D55=15,'Tipo '!$B$16,IF(D55=16,'Tipo '!$B$17,IF(D55=17,'Tipo '!$B$18,IF(D55=18,'Tipo '!$B$19,IF(D55=19,'Tipo '!$B$20,\"No ha seleccionado un tipo de contrato válido\")))))))))))))))))))","v":"CONTRATOS DE PRESTACIÓN DE SERVICIOS PROFESIONALES Y DE APOYO A LA GESTIÓN"},"Contratación directa","Prestación de servicios profesionales y de apoyo a la gestión, o para la ejecución de trabajos artísticos que sólo puedan encomendarse a determinadas personas naturales;","PRESTAR SERVICIOS PROFESIONALES PARA LA ESTRUCTURACION, VIABILIZACION, EVALUACION Y SEGUIMIENTO DE LOS PROYECTOS DEL PRESUPESTO DEL FONDO DE DESARROLLO LOCAL DE SANTA FE QUE LE SEAN ASIGNADOS","Inversión",45,{"$f":"IF(J55=1,'Equivalencia BH-BMPT'!$D$2,IF(J55=2,'Equivalencia BH-BMPT'!$D$3,IF(J55=3,'Equivalencia BH-BMPT'!$D$4,IF(J55=4,'Equivalencia BH-BMPT'!$D$5,IF(J55=5,'Equivalencia BH-BMPT'!$D$6,IF(J55=6,'Equivalencia BH-BMPT'!$D$7,IF(J55=7,'Equivalencia BH-BMPT'!$D$8,IF(J55=8,'Equivalencia BH-BMPT'!$D$9,IF(J55=9,'Equivalencia BH-BMPT'!$D$10,IF(J55=10,'Equivalencia BH-BMPT'!$D$11,IF(J55=11,'Equivalencia BH-BMPT'!$D$12,IF(J55=12,'Equivalencia BH-BMPT'!$D$13,IF(J55=13,'Equivalencia BH-BMPT'!$D$14,IF(J55=14,'Equivalencia BH-BMPT'!$D$15,IF(J55=15,'Equivalencia BH-BMPT'!$D$16,IF(J55=16,'Equivalencia BH-BMPT'!$D$17,IF(J55=17,'Equivalencia BH-BMPT'!$D$18,IF(J55=18,'Equivalencia BH-BMPT'!$D$19,IF(J55=19,'Equivalencia BH-BMPT'!$D$20,IF(J55=20,'Equivalencia BH-BMPT'!$D$21,IF(J55=21,'Equivalencia BH-BMPT'!$D$22,IF(J55=22,'Equivalencia BH-BMPT'!$D$23,IF(J55=23,'Equivalencia BH-BMPT'!#REF!,IF(J55=24,'Equivalencia BH-BMPT'!$D$25,IF(J55=25,'Equivalencia BH-BMPT'!$D$26,IF(J55=26,'Equivalencia BH-BMPT'!$D$27,IF(J55=27,'Equivalencia BH-BMPT'!$D$28,IF(J55=28,'Equivalencia BH-BMPT'!$D$29,IF(J55=29,'Equivalencia BH-BMPT'!$D$30,IF(J55=30,'Equivalencia BH-BMPT'!$D$31,IF(J55=31,'Equivalencia BH-BMPT'!$D$32,IF(J55=32,'Equivalencia BH-BMPT'!$D$33,IF(J55=33,'Equivalencia BH-BMPT'!$D$34,IF(J55=34,'Equivalencia BH-BMPT'!$D$35,IF(J55=35,'Equivalencia BH-BMPT'!$D$36,IF(J55=36,'Equivalencia BH-BMPT'!$D$37,IF(J55=37,'Equivalencia BH-BMPT'!$D$38,IF(J55=38,'Equivalencia BH-BMPT'!#REF!,IF(J55=39,'Equivalencia BH-BMPT'!$D$40,IF(J55=40,'Equivalencia BH-BMPT'!$D$41,IF(J55=41,'Equivalencia BH-BMPT'!$D$42,IF(J55=42,'Equivalencia BH-BMPT'!$D$43,IF(J55=43,'Equivalencia BH-BMPT'!$D$44,IF(J55=44,'Equivalencia BH-BMPT'!$D$45,IF(J55=45,'Equivalencia BH-BMPT'!$D$46,\"No ha seleccionado un número de programa\")))))))))))))))))))))))))))))))))))))))))))))","v":"Gobernanza e influencia local, regional e internacional"},1326,1019039660,"JORGE ANDRES RIAÑO LEON",31800000,null,null,0,null,31800000,31800000,"2017/03/15","2017/03/16","2017-11-15",240,0,null,null,"X",null,null,1,null,false]
[43,2017,"17-12-6474222",5,{"$f":"IF(D56=1,'Tipo '!$B$2,IF(D56=2,'Tipo '!$B$3,IF(D56=3,'Tipo '!$B$4,IF(D56=4,'Tipo '!$B$5,IF(D56=5,'Tipo '!$B$6,IF(D56=6,'Tipo '!$B$7,IF(D56=7,'Tipo '!$B$8,IF(D56=8,'Tipo '!$B$9,IF(D56=9,'Tipo '!$B$10,IF(D56=10,'Tipo '!$B$11,IF(D56=11,'Tipo '!$B$12,IF(D56=12,'Tipo '!$B$13,IF(D56=13,'Tipo '!$B$14,IF(D56=14,'Tipo '!$B$15,IF(D56=15,'Tipo '!$B$16,IF(D56=16,'Tipo '!$B$17,IF(D56=17,'Tipo '!$B$18,IF(D56=18,'Tipo '!$B$19,IF(D56=19,'Tipo '!$B$20,\"No ha seleccionado un tipo de contrato válido\")))))))))))))))))))","v":"CONTRATOS DE PRESTACIÓN DE SERVICIOS PROFESIONALES Y DE APOYO A LA GESTIÓN"},"Contratación directa","Prestación de servicios profesionales y de apoyo a la gestión, o para la ejecución de trabajos artísticos que sólo puedan encomendarse a determinadas personas naturales;","PRESTAR SERVICIOS PROFESIONALES PARA LA ESTRUCTURACION, VIABILIZACION, EVALUACION Y SEGUIMIENTO DE LOS PROYECTOS DEL PRESUPESTO DEL FONDO DE DESARROLLO LOCAL DE SANTA FE QUE LE SEAN ASIGNADOS","Inversión",45,{"$f":"IF(J56=1,'Equivalencia BH-BMPT'!$D$2,IF(J56=2,'Equivalencia BH-BMPT'!$D$3,IF(J56=3,'Equivalencia BH-BMPT'!$D$4,IF(J56=4,'Equivalencia BH-BMPT'!$D$5,IF(J56=5,'Equivalencia BH-BMPT'!$D$6,IF(J56=6,'Equivalencia BH-BMPT'!$D$7,IF(J56=7,'Equivalencia BH-BMPT'!$D$8,IF(J56=8,'Equivalencia BH-BMPT'!$D$9,IF(J56=9,'Equivalencia BH-BMPT'!$D$10,IF(J56=10,'Equivalencia BH-BMPT'!$D$11,IF(J56=11,'Equivalencia BH-BMPT'!$D$12,IF(J56=12,'Equivalencia BH-BMPT'!$D$13,IF(J56=13,'Equivalencia BH-BMPT'!$D$14,IF(J56=14,'Equivalencia BH-BMPT'!$D$15,IF(J56=15,'Equivalencia BH-BMPT'!$D$16,IF(J56=16,'Equivalencia BH-BMPT'!$D$17,IF(J56=17,'Equivalencia BH-BMPT'!$D$18,IF(J56=18,'Equivalencia BH-BMPT'!$D$19,IF(J56=19,'Equivalencia BH-BMPT'!$D$20,IF(J56=20,'Equivalencia BH-BMPT'!$D$21,IF(J56=21,'Equivalencia BH-BMPT'!$D$22,IF(J56=22,'Equivalencia BH-BMPT'!$D$23,IF(J56=23,'Equivalencia BH-BMPT'!#REF!,IF(J56=24,'Equivalencia BH-BMPT'!$D$25,IF(J56=25,'Equivalencia BH-BMPT'!$D$26,IF(J56=26,'Equivalencia BH-BMPT'!$D$27,IF(J56=27,'Equivalencia BH-BMPT'!$D$28,IF(J56=28,'Equivalencia BH-BMPT'!$D$29,IF(J56=29,'Equivalencia BH-BMPT'!$D$30,IF(J56=30,'Equivalencia BH-BMPT'!$D$31,IF(J56=31,'Equivalencia BH-BMPT'!$D$32,IF(J56=32,'Equivalencia BH-BMPT'!$D$33,IF(J56=33,'Equivalencia BH-BMPT'!$D$34,IF(J56=34,'Equivalencia BH-BMPT'!$D$35,IF(J56=35,'Equivalencia BH-BMPT'!$D$36,IF(J56=36,'Equivalencia BH-BMPT'!$D$37,IF(J56=37,'Equivalencia BH-BMPT'!$D$38,IF(J56=38,'Equivalencia BH-BMPT'!#REF!,IF(J56=39,'Equivalencia BH-BMPT'!$D$40,IF(J56=40,'Equivalencia BH-BMPT'!$D$41,IF(J56=41,'Equivalencia BH-BMPT'!$D$42,IF(J56=42,'Equivalencia BH-BMPT'!$D$43,IF(J56=43,'Equivalencia BH-BMPT'!$D$44,IF(J56=44,'Equivalencia BH-BMPT'!$D$45,IF(J56=45,'Equivalencia BH-BMPT'!$D$46,\"No ha seleccionado un número de programa\")))))))))))))))))))))))))))))))))))))))))))))","v":"Gobernanza e influencia local, regional e internacional"},1326,1019028211,"LAURA CATALINA MARTINEZ CASTILLO",36000000,null,null,1,9000000,45000000,39600000,"2017/03/15","2017/03/16","2018-01-15",240,60,null,null,"X",null,null,0.88,null,false]
[44,2017,"17-12-6474226",5,{"$f":"IF(D57=1,'Tipo '!$B$2,IF(D57=2,'Tipo '!$B$3,IF(D57=3,'Tipo '!$B$4,IF(D57=4,'Tipo '!$B$5,IF(D57=5,'Tipo '!$B$6,IF(D57=6,'Tipo '!$B$7,IF(D57=7,'Tipo '!$B$8,IF(D57=8,'Tipo '!$B$9,IF(D57=9,'Tipo '!$B$10,IF(D57=10,'Tipo '!$B$11,IF(D57=11,'Tipo '!$B$12,IF(D57=12,'Tipo '!$B$13,IF(D57=13,'Tipo '!$B$14,IF(D57=14,'Tipo '!$B$15,IF(D57=15,'Tipo '!$B$16,IF(D57=16,'Tipo '!$B$17,IF(D57=17,'Tipo '!$B$18,IF(D57=18,'Tipo '!$B$19,IF(D57=19,'Tipo '!$B$20,\"No ha seleccionado un tipo de contrato válido\")))))))))))))))))))","v":"CONTRATOS DE PRESTACIÓN DE SERVICIOS PROFESIONALES Y DE APOYO A LA GESTIÓN"},"Contratación directa","Prestación de servicios profesionales y de apoyo a la gestión, o para la ejecución de trabajos artísticos que sólo puedan encomendarse a determinadas personas naturales;","PRESTAR SERVICIOS PROFESIONALES PARA EFECTUAR LA GESTION DE LAS RELACIONES INTERINSTITUCIONALES, COMUNITARIAS EN CAMPO Y SEDE ADMINISTRATIVA, ASIGNADAS POR EL AREA DE GESTION DEL DESARROLLO LOCAL DE LA ALCALDIA LOCAL DE SANTA FE, CON EL FIN DE PROMOVER LA INTEGRACION DE LOS DIFERENTES SECTORES HACIA LA ENTIDAD","Inversión",45,{"$f":"IF(J57=1,'Equivalencia BH-BMPT'!$D$2,IF(J57=2,'Equivalencia BH-BMPT'!$D$3,IF(J57=3,'Equivalencia BH-BMPT'!$D$4,IF(J57=4,'Equivalencia BH-BMPT'!$D$5,IF(J57=5,'Equivalencia BH-BMPT'!$D$6,IF(J57=6,'Equivalencia BH-BMPT'!$D$7,IF(J57=7,'Equivalencia BH-BMPT'!$D$8,IF(J57=8,'Equivalencia BH-BMPT'!$D$9,IF(J57=9,'Equivalencia BH-BMPT'!$D$10,IF(J57=10,'Equivalencia BH-BMPT'!$D$11,IF(J57=11,'Equivalencia BH-BMPT'!$D$12,IF(J57=12,'Equivalencia BH-BMPT'!$D$13,IF(J57=13,'Equivalencia BH-BMPT'!$D$14,IF(J57=14,'Equivalencia BH-BMPT'!$D$15,IF(J57=15,'Equivalencia BH-BMPT'!$D$16,IF(J57=16,'Equivalencia BH-BMPT'!$D$17,IF(J57=17,'Equivalencia BH-BMPT'!$D$18,IF(J57=18,'Equivalencia BH-BMPT'!$D$19,IF(J57=19,'Equivalencia BH-BMPT'!$D$20,IF(J57=20,'Equivalencia BH-BMPT'!$D$21,IF(J57=21,'Equivalencia BH-BMPT'!$D$22,IF(J57=22,'Equivalencia BH-BMPT'!$D$23,IF(J57=23,'Equivalencia BH-BMPT'!#REF!,IF(J57=24,'Equivalencia BH-BMPT'!$D$25,IF(J57=25,'Equivalencia BH-BMPT'!$D$26,IF(J57=26,'Equivalencia BH-BMPT'!$D$27,IF(J57=27,'Equivalencia BH-BMPT'!$D$28,IF(J57=28,'Equivalencia BH-BMPT'!$D$29,IF(J57=29,'Equivalencia BH-BMPT'!$D$30,IF(J57=30,'Equivalencia BH-BMPT'!$D$31,IF(J57=31,'Equivalencia BH-BMPT'!$D$32,IF(J57=32,'Equivalencia BH-BMPT'!$D$33,IF(J57=33,'Equivalencia BH-BMPT'!$D$34,IF(J57=34,'Equivalencia BH-BMPT'!$D$35,IF(J57=35,'Equivalencia BH-BMPT'!$D$36,IF(J57=36,'Equivalencia BH-BMPT'!$D$37,IF(J57=37,'Equivalencia BH-BMPT'!$D$38,IF(J57=38,'Equivalencia BH-BMPT'!#REF!,IF(J57=39,'Equivalencia BH-BMPT'!$D$40,IF(J57=40,'Equivalencia BH-BMPT'!$D$41,IF(J57=41,'Equivalencia BH-BMPT'!$D$42,IF(J57=42,'Equivalencia BH-BMPT'!$D$43,IF(J57=43,'Equivalencia BH-BMPT'!$D$44,IF(J57=44,'Equivalencia BH-BMPT'!$D$45,IF(J57=45,'Equivalencia BH-BMPT'!$D$46,\"No ha seleccionado un número de programa\")))))))))))))))))))))))))))))))))))))))))))))","v":"Gobernanza e influencia local, regional e internacional"},1326,1128470583,"JESUS AUGUSTO SANTOS FERREIRA",36000000,null,null,1,6750000,42750000,39600000,"2017/03/15","2017/03/16","2017-12-30",240,45,null,null," ","X",null,0.9263157894736842,null,false]
[45,2017,"17-12-6474228",5,{"$f":"IF(D58=1,'Tipo '!$B$2,IF(D58=2,'Tipo '!$B$3,IF(D58=3,'Tipo '!$B$4,IF(D58=4,'Tipo '!$B$5,IF(D58=5,'Tipo '!$B$6,IF(D58=6,'Tipo '!$B$7,IF(D58=7,'Tipo '!$B$8,IF(D58=8,'Tipo '!$B$9,IF(D58=9,'Tipo '!$B$10,IF(D58=10,'Tipo '!$B$11,IF(D58=11,'Tipo '!$B$12,IF(D58=12,'Tipo '!$B$13,IF(D58=13,'Tipo '!$B$14,IF(D58=14,'Tipo '!$B$15,IF(D58=15,'Tipo '!$B$16,IF(D58=16,'Tipo '!$B$17,IF(D58=17,'Tipo '!$B$18,IF(D58=18,'Tipo '!$B$19,IF(D58=19,'Tipo '!$B$20,\"No ha seleccionado un tipo de contrato válido\")))))))))))))))))))","v":"CONTRATOS DE PRESTACIÓN DE SERVICIOS PROFESIONALES Y DE APOYO A LA GESTIÓN"},"Contratación directa","Prestación de servicios profesionales y de apoyo a la gestión, o para la ejecución de trabajos artísticos que sólo puedan encomendarse a determinadas personas naturales;","PRESTAR SERVICIOS PROFESIONALES AL AREA DE GESTION DEL DESARROLLO LOCAL DE LA ALCALDIA LOCAL, PARA APOYAR LA ESTRUCTURACIÓN, EVALUACION Y SEGUIMIENTO DE LOS PROYECTOS, PLANES Y PROGRAMAS RELACIONADOS CON EL MANTENIMIENTO, MEJORAMIENTO Y CONSERVACION DE LA INFRAESTRUCTURA VIAL  Y ESPACIO PUBLICO DE LA LOCALIDAD DE SANTA FE","Inversión",45,{"$f":"IF(J58=1,'Equivalencia BH-BMPT'!$D$2,IF(J58=2,'Equivalencia BH-BMPT'!$D$3,IF(J58=3,'Equivalencia BH-BMPT'!$D$4,IF(J58=4,'Equivalencia BH-BMPT'!$D$5,IF(J58=5,'Equivalencia BH-BMPT'!$D$6,IF(J58=6,'Equivalencia BH-BMPT'!$D$7,IF(J58=7,'Equivalencia BH-BMPT'!$D$8,IF(J58=8,'Equivalencia BH-BMPT'!$D$9,IF(J58=9,'Equivalencia BH-BMPT'!$D$10,IF(J58=10,'Equivalencia BH-BMPT'!$D$11,IF(J58=11,'Equivalencia BH-BMPT'!$D$12,IF(J58=12,'Equivalencia BH-BMPT'!$D$13,IF(J58=13,'Equivalencia BH-BMPT'!$D$14,IF(J58=14,'Equivalencia BH-BMPT'!$D$15,IF(J58=15,'Equivalencia BH-BMPT'!$D$16,IF(J58=16,'Equivalencia BH-BMPT'!$D$17,IF(J58=17,'Equivalencia BH-BMPT'!$D$18,IF(J58=18,'Equivalencia BH-BMPT'!$D$19,IF(J58=19,'Equivalencia BH-BMPT'!$D$20,IF(J58=20,'Equivalencia BH-BMPT'!$D$21,IF(J58=21,'Equivalencia BH-BMPT'!$D$22,IF(J58=22,'Equivalencia BH-BMPT'!$D$23,IF(J58=23,'Equivalencia BH-BMPT'!#REF!,IF(J58=24,'Equivalencia BH-BMPT'!$D$25,IF(J58=25,'Equivalencia BH-BMPT'!$D$26,IF(J58=26,'Equivalencia BH-BMPT'!$D$27,IF(J58=27,'Equivalencia BH-BMPT'!$D$28,IF(J58=28,'Equivalencia BH-BMPT'!$D$29,IF(J58=29,'Equivalencia BH-BMPT'!$D$30,IF(J58=30,'Equivalencia BH-BMPT'!$D$31,IF(J58=31,'Equivalencia BH-BMPT'!$D$32,IF(J58=32,'Equivalencia BH-BMPT'!$D$33,IF(J58=33,'Equivalencia BH-BMPT'!$D$34,IF(J58=34,'Equivalencia BH-BMPT'!$D$35,IF(J58=35,'Equivalencia BH-BMPT'!$D$36,IF(J58=36,'Equivalencia BH-BMPT'!$D$37,IF(J58=37,'Equivalencia BH-BMPT'!$D$38,IF(J58=38,'Equivalencia BH-BMPT'!#REF!,IF(J58=39,'Equivalencia BH-BMPT'!$D$40,IF(J58=40,'Equivalencia BH-BMPT'!$D$41,IF(J58=41,'Equivalencia BH-BMPT'!$D$42,IF(J58=42,'Equivalencia BH-BMPT'!$D$43,IF(J58=43,'Equivalencia BH-BMPT'!$D$44,IF(J58=44,'Equivalencia BH-BMPT'!$D$45,IF(J58=45,'Equivalencia BH-BMPT'!$D$46,\"No ha seleccionado un número de programa\")))))))))))))))))))))))))))))))))))))))))))))","v":"Gobernanza e influencia local, regional e internacional"},1326,1026568535,"DORIS JULIETH MORA DAZA",36000000,null,null,1,9000000,45000000,39600000,"2017/03/15","2017/03/16","2017-12-30",240,45,null,null," ","X",null,0.88,null,false]
[46,2017,"17-12-6474230",5,{"$f":"IF(D59=1,'Tipo '!$B$2,IF(D59=2,'Tipo '!$B$3,IF(D59=3,'Tipo '!$B$4,IF(D59=4,'Tipo '!$B$5,IF(D59=5,'Tipo '!$B$6,IF(D59=6,'Tipo '!$B$7,IF(D59=7,'Tipo '!$B$8,IF(D59=8,'Tipo '!$B$9,IF(D59=9,'Tipo '!$B$10,IF(D59=10,'Tipo '!$B$11,IF(D59=11,'Tipo '!$B$12,IF(D59=12,'Tipo '!$B$13,IF(D59=13,'Tipo '!$B$14,IF(D59=14,'Tipo '!$B$15,IF(D59=15,'Tipo '!$B$16,IF(D59=16,'Tipo '!$B$17,IF(D59=17,'Tipo '!$B$18,IF(D59=18,'Tipo '!$B$19,IF(D59=19,'Tipo '!$B$20,\"No ha seleccionado un tipo de contrato válido\")))))))))))))))))))","v":"CONTRATOS DE PRESTACIÓN DE SERVICIOS PROFESIONALES Y DE APOYO A LA GESTIÓN"},"Contratación directa","Prestación de servicios profesionales y de apoyo a la gestión, o para la ejecución de trabajos artísticos que sólo puedan encomendarse a determinadas personas naturales;","PRESTAR SERVICIOS PROFESIONALES AL AREA DE GESTION DEL DESARROLLO LOCAL DE LA ALCALDIA LOCAL, PARA APOYAR LA IMPLEMENTACION, ESTRUCTURACIÓN, EVALUACION Y SEGUIMIENTO DE LOS PROYECTOS, PLANES Y PROGRAMAS DE MANTENIMIENTO, MEJORAMIENTO, REHABILITACION Y CONSTRUCCION DE LA INFRAESTRUCTURA VIAL  Y ESPACIO PUBLICO DE LA LOCALIDAD DE SANTA FE","Inversión",45,{"$f":"IF(J59=1,'Equivalencia BH-BMPT'!$D$2,IF(J59=2,'Equivalencia BH-BMPT'!$D$3,IF(J59=3,'Equivalencia BH-BMPT'!$D$4,IF(J59=4,'Equivalencia BH-BMPT'!$D$5,IF(J59=5,'Equivalencia BH-BMPT'!$D$6,IF(J59=6,'Equivalencia BH-BMPT'!$D$7,IF(J59=7,'Equivalencia BH-BMPT'!$D$8,IF(J59=8,'Equivalencia BH-BMPT'!$D$9,IF(J59=9,'Equivalencia BH-BMPT'!$D$10,IF(J59=10,'Equivalencia BH-BMPT'!$D$11,IF(J59=11,'Equivalencia BH-BMPT'!$D$12,IF(J59=12,'Equivalencia BH-BMPT'!$D$13,IF(J59=13,'Equivalencia BH-BMPT'!$D$14,IF(J59=14,'Equivalencia BH-BMPT'!$D$15,IF(J59=15,'Equivalencia BH-BMPT'!$D$16,IF(J59=16,'Equivalencia BH-BMPT'!$D$17,IF(J59=17,'Equivalencia BH-BMPT'!$D$18,IF(J59=18,'Equivalencia BH-BMPT'!$D$19,IF(J59=19,'Equivalencia BH-BMPT'!$D$20,IF(J59=20,'Equivalencia BH-BMPT'!$D$21,IF(J59=21,'Equivalencia BH-BMPT'!$D$22,IF(J59=22,'Equivalencia BH-BMPT'!$D$23,IF(J59=23,'Equivalencia BH-BMPT'!#REF!,IF(J59=24,'Equivalencia BH-BMPT'!$D$25,IF(J59=25,'Equivalencia BH-BMPT'!$D$26,IF(J59=26,'Equivalencia BH-BMPT'!$D$27,IF(J59=27,'Equivalencia BH-BMPT'!$D$28,IF(J59=28,'Equivalencia BH-BMPT'!$D$29,IF(J59=29,'Equivalencia BH-BMPT'!$D$30,IF(J59=30,'Equivalencia BH-BMPT'!$D$31,IF(J59=31,'Equivalencia BH-BMPT'!$D$32,IF(J59=32,'Equivalencia BH-BMPT'!$D$33,IF(J59=33,'Equivalencia BH-BMPT'!$D$34,IF(J59=34,'Equivalencia BH-BMPT'!$D$35,IF(J59=35,'Equivalencia BH-BMPT'!$D$36,IF(J59=36,'Equivalencia BH-BMPT'!$D$37,IF(J59=37,'Equivalencia BH-BMPT'!$D$38,IF(J59=38,'Equivalencia BH-BMPT'!#REF!,IF(J59=39,'Equivalencia BH-BMPT'!$D$40,IF(J59=40,'Equivalencia BH-BMPT'!$D$41,IF(J59=41,'Equivalencia BH-BMPT'!$D$42,IF(J59=42,'Equivalencia BH-BMPT'!$D$43,IF(J59=43,'Equivalencia BH-BMPT'!$D$44,IF(J59=44,'Equivalencia BH-BMPT'!$D$45,IF(J59=45,'Equivalencia BH-BMPT'!$D$46,\"No ha seleccionado un número de programa\")))))))))))))))))))))))))))))))))))))))))))))","v":"Gobernanza e influencia local, regional e internacional"},1326,74375345,"RUBEN DARIO DIAZ ARANGO",50400000,null,null,1,12600000,63000000,55230000,"2017/03/15","2017/03/17","2018-01-15",240,60,null,null,"X",null,null,0.87666666666666671,null,false]
[47,2017,"17-12-6474233",5,{"$f":"IF(D60=1,'Tipo '!$B$2,IF(D60=2,'Tipo '!$B$3,IF(D60=3,'Tipo '!$B$4,IF(D60=4,'Tipo '!$B$5,IF(D60=5,'Tipo '!$B$6,IF(D60=6,'Tipo '!$B$7,IF(D60=7,'Tipo '!$B$8,IF(D60=8,'Tipo '!$B$9,IF(D60=9,'Tipo '!$B$10,IF(D60=10,'Tipo '!$B$11,IF(D60=11,'Tipo '!$B$12,IF(D60=12,'Tipo '!$B$13,IF(D60=13,'Tipo '!$B$14,IF(D60=14,'Tipo '!$B$15,IF(D60=15,'Tipo '!$B$16,IF(D60=16,'Tipo '!$B$17,IF(D60=17,'Tipo '!$B$18,IF(D60=18,'Tipo '!$B$19,IF(D60=19,'Tipo '!$B$20,\"No ha seleccionado un tipo de contrato válido\")))))))))))))))))))","v":"CONTRATOS DE PRESTACIÓN DE SERVICIOS PROFESIONALES Y DE APOYO A LA GESTIÓN"},"Contratación directa","Prestación de servicios profesionales y de apoyo a la gestión, o para la ejecución de trabajos artísticos que sólo puedan encomendarse a determinadas personas naturales;","PRESTAR SERVICIOS DE APOYO A LA GESTION AL AREA DE GESTION POLICIVA DE LA ALCALDIA LOCAL DE SANTA FE, DANDO SOPORTE A LAS ACTUACIONES ADMINISTRATIVAS","Inversión",45,{"$f":"IF(J60=1,'Equivalencia BH-BMPT'!$D$2,IF(J60=2,'Equivalencia BH-BMPT'!$D$3,IF(J60=3,'Equivalencia BH-BMPT'!$D$4,IF(J60=4,'Equivalencia BH-BMPT'!$D$5,IF(J60=5,'Equivalencia BH-BMPT'!$D$6,IF(J60=6,'Equivalencia BH-BMPT'!$D$7,IF(J60=7,'Equivalencia BH-BMPT'!$D$8,IF(J60=8,'Equivalencia BH-BMPT'!$D$9,IF(J60=9,'Equivalencia BH-BMPT'!$D$10,IF(J60=10,'Equivalencia BH-BMPT'!$D$11,IF(J60=11,'Equivalencia BH-BMPT'!$D$12,IF(J60=12,'Equivalencia BH-BMPT'!$D$13,IF(J60=13,'Equivalencia BH-BMPT'!$D$14,IF(J60=14,'Equivalencia BH-BMPT'!$D$15,IF(J60=15,'Equivalencia BH-BMPT'!$D$16,IF(J60=16,'Equivalencia BH-BMPT'!$D$17,IF(J60=17,'Equivalencia BH-BMPT'!$D$18,IF(J60=18,'Equivalencia BH-BMPT'!$D$19,IF(J60=19,'Equivalencia BH-BMPT'!$D$20,IF(J60=20,'Equivalencia BH-BMPT'!$D$21,IF(J60=21,'Equivalencia BH-BMPT'!$D$22,IF(J60=22,'Equivalencia BH-BMPT'!$D$23,IF(J60=23,'Equivalencia BH-BMPT'!#REF!,IF(J60=24,'Equivalencia BH-BMPT'!$D$25,IF(J60=25,'Equivalencia BH-BMPT'!$D$26,IF(J60=26,'Equivalencia BH-BMPT'!$D$27,IF(J60=27,'Equivalencia BH-BMPT'!$D$28,IF(J60=28,'Equivalencia BH-BMPT'!$D$29,IF(J60=29,'Equivalencia BH-BMPT'!$D$30,IF(J60=30,'Equivalencia BH-BMPT'!$D$31,IF(J60=31,'Equivalencia BH-BMPT'!$D$32,IF(J60=32,'Equivalencia BH-BMPT'!$D$33,IF(J60=33,'Equivalencia BH-BMPT'!$D$34,IF(J60=34,'Equivalencia BH-BMPT'!$D$35,IF(J60=35,'Equivalencia BH-BMPT'!$D$36,IF(J60=36,'Equivalencia BH-BMPT'!$D$37,IF(J60=37,'Equivalencia BH-BMPT'!$D$38,IF(J60=38,'Equivalencia BH-BMPT'!#REF!,IF(J60=39,'Equivalencia BH-BMPT'!$D$40,IF(J60=40,'Equivalencia BH-BMPT'!$D$41,IF(J60=41,'Equivalencia BH-BMPT'!$D$42,IF(J60=42,'Equivalencia BH-BMPT'!$D$43,IF(J60=43,'Equivalencia BH-BMPT'!$D$44,IF(J60=44,'Equivalencia BH-BMPT'!$D$45,IF(J60=45,'Equivalencia BH-BMPT'!$D$46,\"No ha seleccionado un número de programa\")))))))))))))))))))))))))))))))))))))))))))))","v":"Gobernanza e influencia local, regional e internacional"},1326,1098664019,"SONIA JULIANA GOMEZ SERRANO",21200000,null,null,1,5300000,26500000,23320000,"2017/03/15","2017/03/16","2018-01-15",240,60,null,null,"X",null,null,0.88,null,false]
[48,2017,"17-12-6474239",5,{"$f":"IF(D61=1,'Tipo '!$B$2,IF(D61=2,'Tipo '!$B$3,IF(D61=3,'Tipo '!$B$4,IF(D61=4,'Tipo '!$B$5,IF(D61=5,'Tipo '!$B$6,IF(D61=6,'Tipo '!$B$7,IF(D61=7,'Tipo '!$B$8,IF(D61=8,'Tipo '!$B$9,IF(D61=9,'Tipo '!$B$10,IF(D61=10,'Tipo '!$B$11,IF(D61=11,'Tipo '!$B$12,IF(D61=12,'Tipo '!$B$13,IF(D61=13,'Tipo '!$B$14,IF(D61=14,'Tipo '!$B$15,IF(D61=15,'Tipo '!$B$16,IF(D61=16,'Tipo '!$B$17,IF(D61=17,'Tipo '!$B$18,IF(D61=18,'Tipo '!$B$19,IF(D61=19,'Tipo '!$B$20,\"No ha seleccionado un tipo de contrato válido\")))))))))))))))))))","v":"CONTRATOS DE PRESTACIÓN DE SERVICIOS PROFESIONALES Y DE APOYO A LA GESTIÓN"},"Contratación directa","Prestación de servicios profesionales y de apoyo a la gestión, o para la ejecución de trabajos artísticos que sólo puedan encomendarse a determinadas personas naturales;","PRESTAR SERVICIOS PROFESIONALES AL AREA DE GESTION DEL DESARROLLO LOCAL, REALIZANDO ACTIVIDADES INHERENTES AL CONSEJO LOCAL DE GESTION DEL RIESGO, DE LA LOCALIDAD DE SANTA FE","Inversión",45,{"$f":"IF(J61=1,'Equivalencia BH-BMPT'!$D$2,IF(J61=2,'Equivalencia BH-BMPT'!$D$3,IF(J61=3,'Equivalencia BH-BMPT'!$D$4,IF(J61=4,'Equivalencia BH-BMPT'!$D$5,IF(J61=5,'Equivalencia BH-BMPT'!$D$6,IF(J61=6,'Equivalencia BH-BMPT'!$D$7,IF(J61=7,'Equivalencia BH-BMPT'!$D$8,IF(J61=8,'Equivalencia BH-BMPT'!$D$9,IF(J61=9,'Equivalencia BH-BMPT'!$D$10,IF(J61=10,'Equivalencia BH-BMPT'!$D$11,IF(J61=11,'Equivalencia BH-BMPT'!$D$12,IF(J61=12,'Equivalencia BH-BMPT'!$D$13,IF(J61=13,'Equivalencia BH-BMPT'!$D$14,IF(J61=14,'Equivalencia BH-BMPT'!$D$15,IF(J61=15,'Equivalencia BH-BMPT'!$D$16,IF(J61=16,'Equivalencia BH-BMPT'!$D$17,IF(J61=17,'Equivalencia BH-BMPT'!$D$18,IF(J61=18,'Equivalencia BH-BMPT'!$D$19,IF(J61=19,'Equivalencia BH-BMPT'!$D$20,IF(J61=20,'Equivalencia BH-BMPT'!$D$21,IF(J61=21,'Equivalencia BH-BMPT'!$D$22,IF(J61=22,'Equivalencia BH-BMPT'!$D$23,IF(J61=23,'Equivalencia BH-BMPT'!#REF!,IF(J61=24,'Equivalencia BH-BMPT'!$D$25,IF(J61=25,'Equivalencia BH-BMPT'!$D$26,IF(J61=26,'Equivalencia BH-BMPT'!$D$27,IF(J61=27,'Equivalencia BH-BMPT'!$D$28,IF(J61=28,'Equivalencia BH-BMPT'!$D$29,IF(J61=29,'Equivalencia BH-BMPT'!$D$30,IF(J61=30,'Equivalencia BH-BMPT'!$D$31,IF(J61=31,'Equivalencia BH-BMPT'!$D$32,IF(J61=32,'Equivalencia BH-BMPT'!$D$33,IF(J61=33,'Equivalencia BH-BMPT'!$D$34,IF(J61=34,'Equivalencia BH-BMPT'!$D$35,IF(J61=35,'Equivalencia BH-BMPT'!$D$36,IF(J61=36,'Equivalencia BH-BMPT'!$D$37,IF(J61=37,'Equivalencia BH-BMPT'!$D$38,IF(J61=38,'Equivalencia BH-BMPT'!#REF!,IF(J61=39,'Equivalencia BH-BMPT'!$D$40,IF(J61=40,'Equivalencia BH-BMPT'!$D$41,IF(J61=41,'Equivalencia BH-BMPT'!$D$42,IF(J61=42,'Equivalencia BH-BMPT'!$D$43,IF(J61=43,'Equivalencia BH-BMPT'!$D$44,IF(J61=44,'Equivalencia BH-BMPT'!$D$45,IF(J61=45,'Equivalencia BH-BMPT'!$D$46,\"No ha seleccionado un número de programa\")))))))))))))))))))))))))))))))))))))))))))))","v":"Gobernanza e influencia local, regional e internacional"},1326,80189215,"GIOVANNY GABRIEL ORJUELA VARGAS",36000000,null,null,1,9000000,45000000,39600000,"2017/03/15","2017/03/16","2018-01-15",240,60,null,null,"X",null,null,0.88,null,false]
[49,2017,"17-12-6474242",5,{"$f":"IF(D62=1,'Tipo '!$B$2,IF(D62=2,'Tipo '!$B$3,IF(D62=3,'Tipo '!$B$4,IF(D62=4,'Tipo '!$B$5,IF(D62=5,'Tipo '!$B$6,IF(D62=6,'Tipo '!$B$7,IF(D62=7,'Tipo '!$B$8,IF(D62=8,'Tipo '!$B$9,IF(D62=9,'Tipo '!$B$10,IF(D62=10,'Tipo '!$B$11,IF(D62=11,'Tipo '!$B$12,IF(D62=12,'Tipo '!$B$13,IF(D62=13,'Tipo '!$B$14,IF(D62=14,'Tipo '!$B$15,IF(D62=15,'Tipo '!$B$16,IF(D62=16,'Tipo '!$B$17,IF(D62=17,'Tipo '!$B$18,IF(D62=18,'Tipo '!$B$19,IF(D62=19,'Tipo '!$B$20,\"No ha seleccionado un tipo de contrato válido\")))))))))))))))))))","v":"CONTRATOS DE PRESTACIÓN DE SERVICIOS PROFESIONALES Y DE APOYO A LA GESTIÓN"},"Contratación directa","Prestación de servicios profesionales y de apoyo a la gestión, o para la ejecución de trabajos artísticos que sólo puedan encomendarse a determinadas personas naturales;","PRESTAR SUS SERVICIOS PROFESIONALES DE ABOGADO EN EL AREA DE GESTION POLICIVA DE LA ALCALDIA LOCAL DE SANTA FE PARA CONCEPTUAR, ANALIZAR Y TRAMITAR LAS DIFERENTES ACTUACIONES PROPIAS DE LA DEPENDENCIA","Inversión",45,{"$f":"IF(J62=1,'Equivalencia BH-BMPT'!$D$2,IF(J62=2,'Equivalencia BH-BMPT'!$D$3,IF(J62=3,'Equivalencia BH-BMPT'!$D$4,IF(J62=4,'Equivalencia BH-BMPT'!$D$5,IF(J62=5,'Equivalencia BH-BMPT'!$D$6,IF(J62=6,'Equivalencia BH-BMPT'!$D$7,IF(J62=7,'Equivalencia BH-BMPT'!$D$8,IF(J62=8,'Equivalencia BH-BMPT'!$D$9,IF(J62=9,'Equivalencia BH-BMPT'!$D$10,IF(J62=10,'Equivalencia BH-BMPT'!$D$11,IF(J62=11,'Equivalencia BH-BMPT'!$D$12,IF(J62=12,'Equivalencia BH-BMPT'!$D$13,IF(J62=13,'Equivalencia BH-BMPT'!$D$14,IF(J62=14,'Equivalencia BH-BMPT'!$D$15,IF(J62=15,'Equivalencia BH-BMPT'!$D$16,IF(J62=16,'Equivalencia BH-BMPT'!$D$17,IF(J62=17,'Equivalencia BH-BMPT'!$D$18,IF(J62=18,'Equivalencia BH-BMPT'!$D$19,IF(J62=19,'Equivalencia BH-BMPT'!$D$20,IF(J62=20,'Equivalencia BH-BMPT'!$D$21,IF(J62=21,'Equivalencia BH-BMPT'!$D$22,IF(J62=22,'Equivalencia BH-BMPT'!$D$23,IF(J62=23,'Equivalencia BH-BMPT'!#REF!,IF(J62=24,'Equivalencia BH-BMPT'!$D$25,IF(J62=25,'Equivalencia BH-BMPT'!$D$26,IF(J62=26,'Equivalencia BH-BMPT'!$D$27,IF(J62=27,'Equivalencia BH-BMPT'!$D$28,IF(J62=28,'Equivalencia BH-BMPT'!$D$29,IF(J62=29,'Equivalencia BH-BMPT'!$D$30,IF(J62=30,'Equivalencia BH-BMPT'!$D$31,IF(J62=31,'Equivalencia BH-BMPT'!$D$32,IF(J62=32,'Equivalencia BH-BMPT'!$D$33,IF(J62=33,'Equivalencia BH-BMPT'!$D$34,IF(J62=34,'Equivalencia BH-BMPT'!$D$35,IF(J62=35,'Equivalencia BH-BMPT'!$D$36,IF(J62=36,'Equivalencia BH-BMPT'!$D$37,IF(J62=37,'Equivalencia BH-BMPT'!$D$38,IF(J62=38,'Equivalencia BH-BMPT'!#REF!,IF(J62=39,'Equivalencia BH-BMPT'!$D$40,IF(J62=40,'Equivalencia BH-BMPT'!$D$41,IF(J62=41,'Equivalencia BH-BMPT'!$D$42,IF(J62=42,'Equivalencia BH-BMPT'!$D$43,IF(J62=43,'Equivalencia BH-BMPT'!$D$44,IF(J62=44,'Equivalencia BH-BMPT'!$D$45,IF(J62=45,'Equivalencia BH-BMPT'!$D$46,\"No ha seleccionado un número de programa\")))))))))))))))))))))))))))))))))))))))))))))","v":"Gobernanza e influencia local, regional e internacional"},1326,1010165338,"YULY ANDREA FERNANDEZ",32480000,null,null,0,0,32480000,20570667,"2017/03/15","2017/03/16","2017-11-15",240,0,null,null,"X",null,null,0.63333334359605908,null,false]
[50,2017,"17-12-6474243",5,{"$f":"IF(D63=1,'Tipo '!$B$2,IF(D63=2,'Tipo '!$B$3,IF(D63=3,'Tipo '!$B$4,IF(D63=4,'Tipo '!$B$5,IF(D63=5,'Tipo '!$B$6,IF(D63=6,'Tipo '!$B$7,IF(D63=7,'Tipo '!$B$8,IF(D63=8,'Tipo '!$B$9,IF(D63=9,'Tipo '!$B$10,IF(D63=10,'Tipo '!$B$11,IF(D63=11,'Tipo '!$B$12,IF(D63=12,'Tipo '!$B$13,IF(D63=13,'Tipo '!$B$14,IF(D63=14,'Tipo '!$B$15,IF(D63=15,'Tipo '!$B$16,IF(D63=16,'Tipo '!$B$17,IF(D63=17,'Tipo '!$B$18,IF(D63=18,'Tipo '!$B$19,IF(D63=19,'Tipo '!$B$20,\"No ha seleccionado un tipo de contrato válido\")))))))))))))))))))","v":"CONTRATOS DE PRESTACIÓN DE SERVICIOS PROFESIONALES Y DE APOYO A LA GESTIÓN"},"Contratación directa","Prestación de servicios profesionales y de apoyo a la gestión, o para la ejecución de trabajos artísticos que sólo puedan encomendarse a determinadas personas naturales;","PRESTAR SERVICIOS PROFESIONALES EN EL AREA DE GESTION DEL DESARROLLO LOCAL EN LOS TEMAS RELACIONADOS CON PRESUPUESTO Y CONTABILIDAD DE LA ALCALDIA LOCAL DE SANTA FE","Inversión",45,{"$f":"IF(J63=1,'Equivalencia BH-BMPT'!$D$2,IF(J63=2,'Equivalencia BH-BMPT'!$D$3,IF(J63=3,'Equivalencia BH-BMPT'!$D$4,IF(J63=4,'Equivalencia BH-BMPT'!$D$5,IF(J63=5,'Equivalencia BH-BMPT'!$D$6,IF(J63=6,'Equivalencia BH-BMPT'!$D$7,IF(J63=7,'Equivalencia BH-BMPT'!$D$8,IF(J63=8,'Equivalencia BH-BMPT'!$D$9,IF(J63=9,'Equivalencia BH-BMPT'!$D$10,IF(J63=10,'Equivalencia BH-BMPT'!$D$11,IF(J63=11,'Equivalencia BH-BMPT'!$D$12,IF(J63=12,'Equivalencia BH-BMPT'!$D$13,IF(J63=13,'Equivalencia BH-BMPT'!$D$14,IF(J63=14,'Equivalencia BH-BMPT'!$D$15,IF(J63=15,'Equivalencia BH-BMPT'!$D$16,IF(J63=16,'Equivalencia BH-BMPT'!$D$17,IF(J63=17,'Equivalencia BH-BMPT'!$D$18,IF(J63=18,'Equivalencia BH-BMPT'!$D$19,IF(J63=19,'Equivalencia BH-BMPT'!$D$20,IF(J63=20,'Equivalencia BH-BMPT'!$D$21,IF(J63=21,'Equivalencia BH-BMPT'!$D$22,IF(J63=22,'Equivalencia BH-BMPT'!$D$23,IF(J63=23,'Equivalencia BH-BMPT'!#REF!,IF(J63=24,'Equivalencia BH-BMPT'!$D$25,IF(J63=25,'Equivalencia BH-BMPT'!$D$26,IF(J63=26,'Equivalencia BH-BMPT'!$D$27,IF(J63=27,'Equivalencia BH-BMPT'!$D$28,IF(J63=28,'Equivalencia BH-BMPT'!$D$29,IF(J63=29,'Equivalencia BH-BMPT'!$D$30,IF(J63=30,'Equivalencia BH-BMPT'!$D$31,IF(J63=31,'Equivalencia BH-BMPT'!$D$32,IF(J63=32,'Equivalencia BH-BMPT'!$D$33,IF(J63=33,'Equivalencia BH-BMPT'!$D$34,IF(J63=34,'Equivalencia BH-BMPT'!$D$35,IF(J63=35,'Equivalencia BH-BMPT'!$D$36,IF(J63=36,'Equivalencia BH-BMPT'!$D$37,IF(J63=37,'Equivalencia BH-BMPT'!$D$38,IF(J63=38,'Equivalencia BH-BMPT'!#REF!,IF(J63=39,'Equivalencia BH-BMPT'!$D$40,IF(J63=40,'Equivalencia BH-BMPT'!$D$41,IF(J63=41,'Equivalencia BH-BMPT'!$D$42,IF(J63=42,'Equivalencia BH-BMPT'!$D$43,IF(J63=43,'Equivalencia BH-BMPT'!$D$44,IF(J63=44,'Equivalencia BH-BMPT'!$D$45,IF(J63=45,'Equivalencia BH-BMPT'!$D$46,\"No ha seleccionado un número de programa\")))))))))))))))))))))))))))))))))))))))))))))","v":"Gobernanza e influencia local, regional e internacional"},1326,51574722,"ANA LUISA FERNANDA ESCANDON GARCIA",38400000,null,null,1,9600000,48000000,42240000,"2017/03/15","2017/03/16","2018-01-15",240,60,null,null,"X",null,null,0.88,null,false]
[51,2017,"17-12-6474244",5,{"$f":"IF(D64=1,'Tipo '!$B$2,IF(D64=2,'Tipo '!$B$3,IF(D64=3,'Tipo '!$B$4,IF(D64=4,'Tipo '!$B$5,IF(D64=5,'Tipo '!$B$6,IF(D64=6,'Tipo '!$B$7,IF(D64=7,'Tipo '!$B$8,IF(D64=8,'Tipo '!$B$9,IF(D64=9,'Tipo '!$B$10,IF(D64=10,'Tipo '!$B$11,IF(D64=11,'Tipo '!$B$12,IF(D64=12,'Tipo '!$B$13,IF(D64=13,'Tipo '!$B$14,IF(D64=14,'Tipo '!$B$15,IF(D64=15,'Tipo '!$B$16,IF(D64=16,'Tipo '!$B$17,IF(D64=17,'Tipo '!$B$18,IF(D64=18,'Tipo '!$B$19,IF(D64=19,'Tipo '!$B$20,\"No ha seleccionado un tipo de contrato válido\")))))))))))))))))))","v":"CONTRATOS DE PRESTACIÓN DE SERVICIOS PROFESIONALES Y DE APOYO A LA GESTIÓN"},"Contratación directa","Prestación de servicios profesionales y de apoyo a la gestión, o para la ejecución de trabajos artísticos que sólo puedan encomendarse a determinadas personas naturales;","PRESTAR SERVICIOS PROFESIONALES DE ABOGADO EN LA ALCALDIA LOCAL DE SANTA FE OARA LLEVAR A CABO TODAS LAS ACTUACIONES RELATIVAS AL AREA DE GESTION POLICIVA DE LA ENTIDAD","Inversión",45,{"$f":"IF(J64=1,'Equivalencia BH-BMPT'!$D$2,IF(J64=2,'Equivalencia BH-BMPT'!$D$3,IF(J64=3,'Equivalencia BH-BMPT'!$D$4,IF(J64=4,'Equivalencia BH-BMPT'!$D$5,IF(J64=5,'Equivalencia BH-BMPT'!$D$6,IF(J64=6,'Equivalencia BH-BMPT'!$D$7,IF(J64=7,'Equivalencia BH-BMPT'!$D$8,IF(J64=8,'Equivalencia BH-BMPT'!$D$9,IF(J64=9,'Equivalencia BH-BMPT'!$D$10,IF(J64=10,'Equivalencia BH-BMPT'!$D$11,IF(J64=11,'Equivalencia BH-BMPT'!$D$12,IF(J64=12,'Equivalencia BH-BMPT'!$D$13,IF(J64=13,'Equivalencia BH-BMPT'!$D$14,IF(J64=14,'Equivalencia BH-BMPT'!$D$15,IF(J64=15,'Equivalencia BH-BMPT'!$D$16,IF(J64=16,'Equivalencia BH-BMPT'!$D$17,IF(J64=17,'Equivalencia BH-BMPT'!$D$18,IF(J64=18,'Equivalencia BH-BMPT'!$D$19,IF(J64=19,'Equivalencia BH-BMPT'!$D$20,IF(J64=20,'Equivalencia BH-BMPT'!$D$21,IF(J64=21,'Equivalencia BH-BMPT'!$D$22,IF(J64=22,'Equivalencia BH-BMPT'!$D$23,IF(J64=23,'Equivalencia BH-BMPT'!#REF!,IF(J64=24,'Equivalencia BH-BMPT'!$D$25,IF(J64=25,'Equivalencia BH-BMPT'!$D$26,IF(J64=26,'Equivalencia BH-BMPT'!$D$27,IF(J64=27,'Equivalencia BH-BMPT'!$D$28,IF(J64=28,'Equivalencia BH-BMPT'!$D$29,IF(J64=29,'Equivalencia BH-BMPT'!$D$30,IF(J64=30,'Equivalencia BH-BMPT'!$D$31,IF(J64=31,'Equivalencia BH-BMPT'!$D$32,IF(J64=32,'Equivalencia BH-BMPT'!$D$33,IF(J64=33,'Equivalencia BH-BMPT'!$D$34,IF(J64=34,'Equivalencia BH-BMPT'!$D$35,IF(J64=35,'Equivalencia BH-BMPT'!$D$36,IF(J64=36,'Equivalencia BH-BMPT'!$D$37,IF(J64=37,'Equivalencia BH-BMPT'!$D$38,IF(J64=38,'Equivalencia BH-BMPT'!#REF!,IF(J64=39,'Equivalencia BH-BMPT'!$D$40,IF(J64=40,'Equivalencia BH-BMPT'!$D$41,IF(J64=41,'Equivalencia BH-BMPT'!$D$42,IF(J64=42,'Equivalencia BH-BMPT'!$D$43,IF(J64=43,'Equivalencia BH-BMPT'!$D$44,IF(J64=44,'Equivalencia BH-BMPT'!$D$45,IF(J64=45,'Equivalencia BH-BMPT'!$D$46,\"No ha seleccionado un número de programa\")))))))))))))))))))))))))))))))))))))))))))))","v":"Gobernanza e influencia local, regional e internacional"},1326,79851423,"DIEGO ALBERTO YARA PALENCIA",40000000,null,null,1,7500000,47500000,44000000,"2017/03/15","2017/03/16","2017-12-30",240,45,null,null," ","X",null,0.9263157894736842,null,false]
[52,2017,"17-12-6474246",5,{"$f":"IF(D65=1,'Tipo '!$B$2,IF(D65=2,'Tipo '!$B$3,IF(D65=3,'Tipo '!$B$4,IF(D65=4,'Tipo '!$B$5,IF(D65=5,'Tipo '!$B$6,IF(D65=6,'Tipo '!$B$7,IF(D65=7,'Tipo '!$B$8,IF(D65=8,'Tipo '!$B$9,IF(D65=9,'Tipo '!$B$10,IF(D65=10,'Tipo '!$B$11,IF(D65=11,'Tipo '!$B$12,IF(D65=12,'Tipo '!$B$13,IF(D65=13,'Tipo '!$B$14,IF(D65=14,'Tipo '!$B$15,IF(D65=15,'Tipo '!$B$16,IF(D65=16,'Tipo '!$B$17,IF(D65=17,'Tipo '!$B$18,IF(D65=18,'Tipo '!$B$19,IF(D65=19,'Tipo '!$B$20,\"No ha seleccionado un tipo de contrato válido\")))))))))))))))))))","v":"CONTRATOS DE PRESTACIÓN DE SERVICIOS PROFESIONALES Y DE APOYO A LA GESTIÓN"},"Contratación directa","Prestación de servicios profesionales y de apoyo a la gestión, o para la ejecución de trabajos artísticos que sólo puedan encomendarse a determinadas personas naturales;","PRESTAR LOS SERVICIOS PROFESIONALES PARA LA OPERACIÓN, PRESTACION, SEGUIMIENTO Y CUMPLIMIENTO DE LOS PROCEDIMIENTOS ADMINISTRATIVOS, OPERATIVOS Y PROGRAMATICOS DEL SERVICIO SOCIAL APOYO ECONOMICO TIPO C, QUE CONTRIBUYAN A LA GARANTIA DE LOS DERECHOS DE LA POBLACION MAYOR EN EL MARCO DE LA POLITICA PUBLICA SOCIAL PARA EL ENVEJECIMIENTO Y LA VEJEZ EN EL DISTRITO CAPITAL A CARGO DE LA ALCALDIA LOCAL","Inversión",3,{"$f":"IF(J65=1,'Equivalencia BH-BMPT'!$D$2,IF(J65=2,'Equivalencia BH-BMPT'!$D$3,IF(J65=3,'Equivalencia BH-BMPT'!$D$4,IF(J65=4,'Equivalencia BH-BMPT'!$D$5,IF(J65=5,'Equivalencia BH-BMPT'!$D$6,IF(J65=6,'Equivalencia BH-BMPT'!$D$7,IF(J65=7,'Equivalencia BH-BMPT'!$D$8,IF(J65=8,'Equivalencia BH-BMPT'!$D$9,IF(J65=9,'Equivalencia BH-BMPT'!$D$10,IF(J65=10,'Equivalencia BH-BMPT'!$D$11,IF(J65=11,'Equivalencia BH-BMPT'!$D$12,IF(J65=12,'Equivalencia BH-BMPT'!$D$13,IF(J65=13,'Equivalencia BH-BMPT'!$D$14,IF(J65=14,'Equivalencia BH-BMPT'!$D$15,IF(J65=15,'Equivalencia BH-BMPT'!$D$16,IF(J65=16,'Equivalencia BH-BMPT'!$D$17,IF(J65=17,'Equivalencia BH-BMPT'!$D$18,IF(J65=18,'Equivalencia BH-BMPT'!$D$19,IF(J65=19,'Equivalencia BH-BMPT'!$D$20,IF(J65=20,'Equivalencia BH-BMPT'!$D$21,IF(J65=21,'Equivalencia BH-BMPT'!$D$22,IF(J65=22,'Equivalencia BH-BMPT'!$D$23,IF(J65=23,'Equivalencia BH-BMPT'!#REF!,IF(J65=24,'Equivalencia BH-BMPT'!$D$25,IF(J65=25,'Equivalencia BH-BMPT'!$D$26,IF(J65=26,'Equivalencia BH-BMPT'!$D$27,IF(J65=27,'Equivalencia BH-BMPT'!$D$28,IF(J65=28,'Equivalencia BH-BMPT'!$D$29,IF(J65=29,'Equivalencia BH-BMPT'!$D$30,IF(J65=30,'Equivalencia BH-BMPT'!$D$31,IF(J65=31,'Equivalencia BH-BMPT'!$D$32,IF(J65=32,'Equivalencia BH-BMPT'!$D$33,IF(J65=33,'Equivalencia BH-BMPT'!$D$34,IF(J65=34,'Equivalencia BH-BMPT'!$D$35,IF(J65=35,'Equivalencia BH-BMPT'!$D$36,IF(J65=36,'Equivalencia BH-BMPT'!$D$37,IF(J65=37,'Equivalencia BH-BMPT'!$D$38,IF(J65=38,'Equivalencia BH-BMPT'!#REF!,IF(J65=39,'Equivalencia BH-BMPT'!$D$40,IF(J65=40,'Equivalencia BH-BMPT'!$D$41,IF(J65=41,'Equivalencia BH-BMPT'!$D$42,IF(J65=42,'Equivalencia BH-BMPT'!$D$43,IF(J65=43,'Equivalencia BH-BMPT'!$D$44,IF(J65=44,'Equivalencia BH-BMPT'!$D$45,IF(J65=45,'Equivalencia BH-BMPT'!$D$46,\"No ha seleccionado un número de programa\")))))))))))))))))))))))))))))))))))))))))))))","v":"Igualdad y autonomía para una Bogotá incluyente"},1315,1026250398,"JOHANNA MORALES RIZO",32480000,null,null,1,6090000,38570000,35728000,"2017/03/15","2017/03/16","2017-12-30",240,45,null,null," ","X",null,0.9263157894736842,null,false]
[532,2017,"17-12-6474248",5,{"$f":"IF(D66=1,'Tipo '!$B$2,IF(D66=2,'Tipo '!$B$3,IF(D66=3,'Tipo '!$B$4,IF(D66=4,'Tipo '!$B$5,IF(D66=5,'Tipo '!$B$6,IF(D66=6,'Tipo '!$B$7,IF(D66=7,'Tipo '!$B$8,IF(D66=8,'Tipo '!$B$9,IF(D66=9,'Tipo '!$B$10,IF(D66=10,'Tipo '!$B$11,IF(D66=11,'Tipo '!$B$12,IF(D66=12,'Tipo '!$B$13,IF(D66=13,'Tipo '!$B$14,IF(D66=14,'Tipo '!$B$15,IF(D66=15,'Tipo '!$B$16,IF(D66=16,'Tipo '!$B$17,IF(D66=17,'Tipo '!$B$18,IF(D66=18,'Tipo '!$B$19,IF(D66=19,'Tipo '!$B$20,\"No ha seleccionado un tipo de contrato válido\")))))))))))))))))))","v":"CONTRATOS DE PRESTACIÓN DE SERVICIOS PROFESIONALES Y DE APOYO A LA GESTIÓN"},"Contratación directa","Prestación de servicios profesionales y de apoyo a la gestión, o para la ejecución de trabajos artísticos que sólo puedan encomendarse a determinadas personas naturales;","PRESTAR SERVICIOS DE APOYO AL AREA DE GESTION POLICIVA COMO AUXILIAR ADMINISTRATIO DE LA ALCALDIA LOCAL DE SANTA FE","Inversión",45,{"$f":"IF(J66=1,'Equivalencia BH-BMPT'!$D$2,IF(J66=2,'Equivalencia BH-BMPT'!$D$3,IF(J66=3,'Equivalencia BH-BMPT'!$D$4,IF(J66=4,'Equivalencia BH-BMPT'!$D$5,IF(J66=5,'Equivalencia BH-BMPT'!$D$6,IF(J66=6,'Equivalencia BH-BMPT'!$D$7,IF(J66=7,'Equivalencia BH-BMPT'!$D$8,IF(J66=8,'Equivalencia BH-BMPT'!$D$9,IF(J66=9,'Equivalencia BH-BMPT'!$D$10,IF(J66=10,'Equivalencia BH-BMPT'!$D$11,IF(J66=11,'Equivalencia BH-BMPT'!$D$12,IF(J66=12,'Equivalencia BH-BMPT'!$D$13,IF(J66=13,'Equivalencia BH-BMPT'!$D$14,IF(J66=14,'Equivalencia BH-BMPT'!$D$15,IF(J66=15,'Equivalencia BH-BMPT'!$D$16,IF(J66=16,'Equivalencia BH-BMPT'!$D$17,IF(J66=17,'Equivalencia BH-BMPT'!$D$18,IF(J66=18,'Equivalencia BH-BMPT'!$D$19,IF(J66=19,'Equivalencia BH-BMPT'!$D$20,IF(J66=20,'Equivalencia BH-BMPT'!$D$21,IF(J66=21,'Equivalencia BH-BMPT'!$D$22,IF(J66=22,'Equivalencia BH-BMPT'!$D$23,IF(J66=23,'Equivalencia BH-BMPT'!#REF!,IF(J66=24,'Equivalencia BH-BMPT'!$D$25,IF(J66=25,'Equivalencia BH-BMPT'!$D$26,IF(J66=26,'Equivalencia BH-BMPT'!$D$27,IF(J66=27,'Equivalencia BH-BMPT'!$D$28,IF(J66=28,'Equivalencia BH-BMPT'!$D$29,IF(J66=29,'Equivalencia BH-BMPT'!$D$30,IF(J66=30,'Equivalencia BH-BMPT'!$D$31,IF(J66=31,'Equivalencia BH-BMPT'!$D$32,IF(J66=32,'Equivalencia BH-BMPT'!$D$33,IF(J66=33,'Equivalencia BH-BMPT'!$D$34,IF(J66=34,'Equivalencia BH-BMPT'!$D$35,IF(J66=35,'Equivalencia BH-BMPT'!$D$36,IF(J66=36,'Equivalencia BH-BMPT'!$D$37,IF(J66=37,'Equivalencia BH-BMPT'!$D$38,IF(J66=38,'Equivalencia BH-BMPT'!#REF!,IF(J66=39,'Equivalencia BH-BMPT'!$D$40,IF(J66=40,'Equivalencia BH-BMPT'!$D$41,IF(J66=41,'Equivalencia BH-BMPT'!$D$42,IF(J66=42,'Equivalencia BH-BMPT'!$D$43,IF(J66=43,'Equivalencia BH-BMPT'!$D$44,IF(J66=44,'Equivalencia BH-BMPT'!$D$45,IF(J66=45,'Equivalencia BH-BMPT'!$D$46,\"No ha seleccionado un número de programa\")))))))))))))))))))))))))))))))))))))))))))))","v":"Gobernanza e influencia local, regional e internacional"},1326,51964000,"YANETH PRADA TORRES",21200000,null,null,1,3975000,25175000,23320000,"2017/03/15","2017/03/16","2017-12-30",240,45,null,null," ","X",null,0.9263157894736842,null,false]
[53,2017,null,5,{"$f":"IF(D67=1,'Tipo '!$B$2,IF(D67=2,'Tipo '!$B$3,IF(D67=3,'Tipo '!$B$4,IF(D67=4,'Tipo '!$B$5,IF(D67=5,'Tipo '!$B$6,IF(D67=6,'Tipo '!$B$7,IF(D67=7,'Tipo '!$B$8,IF(D67=8,'Tipo '!$B$9,IF(D67=9,'Tipo '!$B$10,IF(D67=10,'Tipo '!$B$11,IF(D67=11,'Tipo '!$B$12,IF(D67=12,'Tipo '!$B$13,IF(D67=13,'Tipo '!$B$14,IF(D67=14,'Tipo '!$B$15,IF(D67=15,'Tipo '!$B$16,IF(D67=16,'Tipo '!$B$17,IF(D67=17,'Tipo '!$B$18,IF(D67=18,'Tipo '!$B$19,IF(D67=19,'Tipo '!$B$20,\"No ha seleccionado un tipo de contrato válido\")))))))))))))))))))","v":"CONTRATOS DE PRESTACIÓN DE SERVICIOS PROFESIONALES Y DE APOYO A LA GESTIÓN"},"Contratación directa","Prestación de servicios profesionales y de apoyo a la gestión, o para la ejecución de trabajos artísticos que sólo puedan encomendarse a determinadas personas naturales;","PRESTAR LOS SERVICIOS DE APOYO EN LA DISTRIBUCIÓN DE CORRESPONDENCIA PRODUCIDA EN LAS DIFERENTES ÁREAS DE LA ALCALDÍA LOCAL DE SANTA FE","Inversión",45,{"$f":"IF(J67=1,'Equivalencia BH-BMPT'!$D$2,IF(J67=2,'Equivalencia BH-BMPT'!$D$3,IF(J67=3,'Equivalencia BH-BMPT'!$D$4,IF(J67=4,'Equivalencia BH-BMPT'!$D$5,IF(J67=5,'Equivalencia BH-BMPT'!$D$6,IF(J67=6,'Equivalencia BH-BMPT'!$D$7,IF(J67=7,'Equivalencia BH-BMPT'!$D$8,IF(J67=8,'Equivalencia BH-BMPT'!$D$9,IF(J67=9,'Equivalencia BH-BMPT'!$D$10,IF(J67=10,'Equivalencia BH-BMPT'!$D$11,IF(J67=11,'Equivalencia BH-BMPT'!$D$12,IF(J67=12,'Equivalencia BH-BMPT'!$D$13,IF(J67=13,'Equivalencia BH-BMPT'!$D$14,IF(J67=14,'Equivalencia BH-BMPT'!$D$15,IF(J67=15,'Equivalencia BH-BMPT'!$D$16,IF(J67=16,'Equivalencia BH-BMPT'!$D$17,IF(J67=17,'Equivalencia BH-BMPT'!$D$18,IF(J67=18,'Equivalencia BH-BMPT'!$D$19,IF(J67=19,'Equivalencia BH-BMPT'!$D$20,IF(J67=20,'Equivalencia BH-BMPT'!$D$21,IF(J67=21,'Equivalencia BH-BMPT'!$D$22,IF(J67=22,'Equivalencia BH-BMPT'!$D$23,IF(J67=23,'Equivalencia BH-BMPT'!#REF!,IF(J67=24,'Equivalencia BH-BMPT'!$D$25,IF(J67=25,'Equivalencia BH-BMPT'!$D$26,IF(J67=26,'Equivalencia BH-BMPT'!$D$27,IF(J67=27,'Equivalencia BH-BMPT'!$D$28,IF(J67=28,'Equivalencia BH-BMPT'!$D$29,IF(J67=29,'Equivalencia BH-BMPT'!$D$30,IF(J67=30,'Equivalencia BH-BMPT'!$D$31,IF(J67=31,'Equivalencia BH-BMPT'!$D$32,IF(J67=32,'Equivalencia BH-BMPT'!$D$33,IF(J67=33,'Equivalencia BH-BMPT'!$D$34,IF(J67=34,'Equivalencia BH-BMPT'!$D$35,IF(J67=35,'Equivalencia BH-BMPT'!$D$36,IF(J67=36,'Equivalencia BH-BMPT'!$D$37,IF(J67=37,'Equivalencia BH-BMPT'!$D$38,IF(J67=38,'Equivalencia BH-BMPT'!#REF!,IF(J67=39,'Equivalencia BH-BMPT'!$D$40,IF(J67=40,'Equivalencia BH-BMPT'!$D$41,IF(J67=41,'Equivalencia BH-BMPT'!$D$42,IF(J67=42,'Equivalencia BH-BMPT'!$D$43,IF(J67=43,'Equivalencia BH-BMPT'!$D$44,IF(J67=44,'Equivalencia BH-BMPT'!$D$45,IF(J67=45,'Equivalencia BH-BMPT'!$D$46,\"No ha seleccionado un número de programa\")))))))))))))))))))))))))))))))))))))))))))))","v":"Gobernanza e influencia local, regional e internacional"},1326,82360623,"EUNIR ANTONIO PALACIOS CAICEDO",16800000,null,null,1,4200000,21000000,18480000,"2017/03/15","2017-03-15","2018-01-15",240,46,null,null,"X",null,null,0.88,null,false]
[54,2017,"17-12-6474249",5,{"$f":"IF(D68=1,'Tipo '!$B$2,IF(D68=2,'Tipo '!$B$3,IF(D68=3,'Tipo '!$B$4,IF(D68=4,'Tipo '!$B$5,IF(D68=5,'Tipo '!$B$6,IF(D68=6,'Tipo '!$B$7,IF(D68=7,'Tipo '!$B$8,IF(D68=8,'Tipo '!$B$9,IF(D68=9,'Tipo '!$B$10,IF(D68=10,'Tipo '!$B$11,IF(D68=11,'Tipo '!$B$12,IF(D68=12,'Tipo '!$B$13,IF(D68=13,'Tipo '!$B$14,IF(D68=14,'Tipo '!$B$15,IF(D68=15,'Tipo '!$B$16,IF(D68=16,'Tipo '!$B$17,IF(D68=17,'Tipo '!$B$18,IF(D68=18,'Tipo '!$B$19,IF(D68=19,'Tipo '!$B$20,\"No ha seleccionado un tipo de contrato válido\")))))))))))))))))))","v":"CONTRATOS DE PRESTACIÓN DE SERVICIOS PROFESIONALES Y DE APOYO A LA GESTIÓN"},"Contratación directa","Prestación de servicios profesionales y de apoyo a la gestión, o para la ejecución de trabajos artísticos que sólo puedan encomendarse a determinadas personas naturales;","PRESTAR LOS SERVICIOS DE APOYO A LA DESCONGESTION DE LOS ASUNTOS Y TRAMITES RELACIONADOS CON EL DESPACHO DE LA ALCALDIA LOCAL DE SANTA FE","Inversión",45,{"$f":"IF(J68=1,'Equivalencia BH-BMPT'!$D$2,IF(J68=2,'Equivalencia BH-BMPT'!$D$3,IF(J68=3,'Equivalencia BH-BMPT'!$D$4,IF(J68=4,'Equivalencia BH-BMPT'!$D$5,IF(J68=5,'Equivalencia BH-BMPT'!$D$6,IF(J68=6,'Equivalencia BH-BMPT'!$D$7,IF(J68=7,'Equivalencia BH-BMPT'!$D$8,IF(J68=8,'Equivalencia BH-BMPT'!$D$9,IF(J68=9,'Equivalencia BH-BMPT'!$D$10,IF(J68=10,'Equivalencia BH-BMPT'!$D$11,IF(J68=11,'Equivalencia BH-BMPT'!$D$12,IF(J68=12,'Equivalencia BH-BMPT'!$D$13,IF(J68=13,'Equivalencia BH-BMPT'!$D$14,IF(J68=14,'Equivalencia BH-BMPT'!$D$15,IF(J68=15,'Equivalencia BH-BMPT'!$D$16,IF(J68=16,'Equivalencia BH-BMPT'!$D$17,IF(J68=17,'Equivalencia BH-BMPT'!$D$18,IF(J68=18,'Equivalencia BH-BMPT'!$D$19,IF(J68=19,'Equivalencia BH-BMPT'!$D$20,IF(J68=20,'Equivalencia BH-BMPT'!$D$21,IF(J68=21,'Equivalencia BH-BMPT'!$D$22,IF(J68=22,'Equivalencia BH-BMPT'!$D$23,IF(J68=23,'Equivalencia BH-BMPT'!#REF!,IF(J68=24,'Equivalencia BH-BMPT'!$D$25,IF(J68=25,'Equivalencia BH-BMPT'!$D$26,IF(J68=26,'Equivalencia BH-BMPT'!$D$27,IF(J68=27,'Equivalencia BH-BMPT'!$D$28,IF(J68=28,'Equivalencia BH-BMPT'!$D$29,IF(J68=29,'Equivalencia BH-BMPT'!$D$30,IF(J68=30,'Equivalencia BH-BMPT'!$D$31,IF(J68=31,'Equivalencia BH-BMPT'!$D$32,IF(J68=32,'Equivalencia BH-BMPT'!$D$33,IF(J68=33,'Equivalencia BH-BMPT'!$D$34,IF(J68=34,'Equivalencia BH-BMPT'!$D$35,IF(J68=35,'Equivalencia BH-BMPT'!$D$36,IF(J68=36,'Equivalencia BH-BMPT'!$D$37,IF(J68=37,'Equivalencia BH-BMPT'!$D$38,IF(J68=38,'Equivalencia BH-BMPT'!#REF!,IF(J68=39,'Equivalencia BH-BMPT'!$D$40,IF(J68=40,'Equivalencia BH-BMPT'!$D$41,IF(J68=41,'Equivalencia BH-BMPT'!$D$42,IF(J68=42,'Equivalencia BH-BMPT'!$D$43,IF(J68=43,'Equivalencia BH-BMPT'!$D$44,IF(J68=44,'Equivalencia BH-BMPT'!$D$45,IF(J68=45,'Equivalencia BH-BMPT'!$D$46,\"No ha seleccionado un número de programa\")))))))))))))))))))))))))))))))))))))))))))))","v":"Gobernanza e influencia local, regional e internacional"},1326,41441151,"CONSUELO SUAREZ DE PALACIOS",21200000,null,null,1,5300000,26500000,23320000,"2017/03/15","2017/03/16","2018-01-15",240,47,null,null,"X",null,null,0.88,null,false]
[55,2017,"17-12-6474251",5,{"$f":"IF(D69=1,'Tipo '!$B$2,IF(D69=2,'Tipo '!$B$3,IF(D69=3,'Tipo '!$B$4,IF(D69=4,'Tipo '!$B$5,IF(D69=5,'Tipo '!$B$6,IF(D69=6,'Tipo '!$B$7,IF(D69=7,'Tipo '!$B$8,IF(D69=8,'Tipo '!$B$9,IF(D69=9,'Tipo '!$B$10,IF(D69=10,'Tipo '!$B$11,IF(D69=11,'Tipo '!$B$12,IF(D69=12,'Tipo '!$B$13,IF(D69=13,'Tipo '!$B$14,IF(D69=14,'Tipo '!$B$15,IF(D69=15,'Tipo '!$B$16,IF(D69=16,'Tipo '!$B$17,IF(D69=17,'Tipo '!$B$18,IF(D69=18,'Tipo '!$B$19,IF(D69=19,'Tipo '!$B$20,\"No ha seleccionado un tipo de contrato válido\")))))))))))))))))))","v":"CONTRATOS DE PRESTACIÓN DE SERVICIOS PROFESIONALES Y DE APOYO A LA GESTIÓN"},"Contratación directa","Prestación de servicios profesionales y de apoyo a la gestión, o para la ejecución de trabajos artísticos que sólo puedan encomendarse a determinadas personas naturales;","PRESTAR LOS SERVICIOS PROFESIONALES ESPECIALIZADOS EN EL DESPACHO DE LA ALCALDIA LOCAL DE SANTA FE EN EL CURSO DE LA GESTION ADMINISTRATIVA Y FINANCIERA PARA EL DESARROLLO LOCAL","Inversión",45,{"$f":"IF(J69=1,'Equivalencia BH-BMPT'!$D$2,IF(J69=2,'Equivalencia BH-BMPT'!$D$3,IF(J69=3,'Equivalencia BH-BMPT'!$D$4,IF(J69=4,'Equivalencia BH-BMPT'!$D$5,IF(J69=5,'Equivalencia BH-BMPT'!$D$6,IF(J69=6,'Equivalencia BH-BMPT'!$D$7,IF(J69=7,'Equivalencia BH-BMPT'!$D$8,IF(J69=8,'Equivalencia BH-BMPT'!$D$9,IF(J69=9,'Equivalencia BH-BMPT'!$D$10,IF(J69=10,'Equivalencia BH-BMPT'!$D$11,IF(J69=11,'Equivalencia BH-BMPT'!$D$12,IF(J69=12,'Equivalencia BH-BMPT'!$D$13,IF(J69=13,'Equivalencia BH-BMPT'!$D$14,IF(J69=14,'Equivalencia BH-BMPT'!$D$15,IF(J69=15,'Equivalencia BH-BMPT'!$D$16,IF(J69=16,'Equivalencia BH-BMPT'!$D$17,IF(J69=17,'Equivalencia BH-BMPT'!$D$18,IF(J69=18,'Equivalencia BH-BMPT'!$D$19,IF(J69=19,'Equivalencia BH-BMPT'!$D$20,IF(J69=20,'Equivalencia BH-BMPT'!$D$21,IF(J69=21,'Equivalencia BH-BMPT'!$D$22,IF(J69=22,'Equivalencia BH-BMPT'!$D$23,IF(J69=23,'Equivalencia BH-BMPT'!#REF!,IF(J69=24,'Equivalencia BH-BMPT'!$D$25,IF(J69=25,'Equivalencia BH-BMPT'!$D$26,IF(J69=26,'Equivalencia BH-BMPT'!$D$27,IF(J69=27,'Equivalencia BH-BMPT'!$D$28,IF(J69=28,'Equivalencia BH-BMPT'!$D$29,IF(J69=29,'Equivalencia BH-BMPT'!$D$30,IF(J69=30,'Equivalencia BH-BMPT'!$D$31,IF(J69=31,'Equivalencia BH-BMPT'!$D$32,IF(J69=32,'Equivalencia BH-BMPT'!$D$33,IF(J69=33,'Equivalencia BH-BMPT'!$D$34,IF(J69=34,'Equivalencia BH-BMPT'!$D$35,IF(J69=35,'Equivalencia BH-BMPT'!$D$36,IF(J69=36,'Equivalencia BH-BMPT'!$D$37,IF(J69=37,'Equivalencia BH-BMPT'!$D$38,IF(J69=38,'Equivalencia BH-BMPT'!#REF!,IF(J69=39,'Equivalencia BH-BMPT'!$D$40,IF(J69=40,'Equivalencia BH-BMPT'!$D$41,IF(J69=41,'Equivalencia BH-BMPT'!$D$42,IF(J69=42,'Equivalencia BH-BMPT'!$D$43,IF(J69=43,'Equivalencia BH-BMPT'!$D$44,IF(J69=44,'Equivalencia BH-BMPT'!$D$45,IF(J69=45,'Equivalencia BH-BMPT'!$D$46,\"No ha seleccionado un número de programa\")))))))))))))))))))))))))))))))))))))))))))))","v":"Gobernanza e influencia local, regional e internacional"},1326,79876655,"RENE MAURICIO QUIMBAY BARRERA",58000000,null,null,1,14500000,72500000,63800000,"2017/03/15","2017/03/16","2018-01-15",240,48,null,null,"X",null,null,0.88,null,false]
[56,2017,"17-12-6474254",5,{"$f":"IF(D70=1,'Tipo '!$B$2,IF(D70=2,'Tipo '!$B$3,IF(D70=3,'Tipo '!$B$4,IF(D70=4,'Tipo '!$B$5,IF(D70=5,'Tipo '!$B$6,IF(D70=6,'Tipo '!$B$7,IF(D70=7,'Tipo '!$B$8,IF(D70=8,'Tipo '!$B$9,IF(D70=9,'Tipo '!$B$10,IF(D70=10,'Tipo '!$B$11,IF(D70=11,'Tipo '!$B$12,IF(D70=12,'Tipo '!$B$13,IF(D70=13,'Tipo '!$B$14,IF(D70=14,'Tipo '!$B$15,IF(D70=15,'Tipo '!$B$16,IF(D70=16,'Tipo '!$B$17,IF(D70=17,'Tipo '!$B$18,IF(D70=18,'Tipo '!$B$19,IF(D70=19,'Tipo '!$B$20,\"No ha seleccionado un tipo de contrato válido\")))))))))))))))))))","v":"CONTRATOS DE PRESTACIÓN DE SERVICIOS PROFESIONALES Y DE APOYO A LA GESTIÓN"},"Contratación directa","Prestación de servicios profesionales y de apoyo a la gestión, o para la ejecución de trabajos artísticos que sólo puedan encomendarse a determinadas personas naturales;","PRESTAR SERVICIOS PROFESIONALES PARA EFECTUAR LA GESTION DE LAS RELACIONES INTERINSTITUCIONALES, COMUNITARIAS EN CAMPO Y SEDE ADMINISTRATIVA, DESIGNADAS POR EL DESPACHO DE LA LACALDIA LOCAL DE SANTA FE, CON EL FIN DE PROMOVER LA INTEGRACION DE LOS DIFERENTES SECTORES HACIA LA ENTIDAD","Inversión",45,{"$f":"IF(J70=1,'Equivalencia BH-BMPT'!$D$2,IF(J70=2,'Equivalencia BH-BMPT'!$D$3,IF(J70=3,'Equivalencia BH-BMPT'!$D$4,IF(J70=4,'Equivalencia BH-BMPT'!$D$5,IF(J70=5,'Equivalencia BH-BMPT'!$D$6,IF(J70=6,'Equivalencia BH-BMPT'!$D$7,IF(J70=7,'Equivalencia BH-BMPT'!$D$8,IF(J70=8,'Equivalencia BH-BMPT'!$D$9,IF(J70=9,'Equivalencia BH-BMPT'!$D$10,IF(J70=10,'Equivalencia BH-BMPT'!$D$11,IF(J70=11,'Equivalencia BH-BMPT'!$D$12,IF(J70=12,'Equivalencia BH-BMPT'!$D$13,IF(J70=13,'Equivalencia BH-BMPT'!$D$14,IF(J70=14,'Equivalencia BH-BMPT'!$D$15,IF(J70=15,'Equivalencia BH-BMPT'!$D$16,IF(J70=16,'Equivalencia BH-BMPT'!$D$17,IF(J70=17,'Equivalencia BH-BMPT'!$D$18,IF(J70=18,'Equivalencia BH-BMPT'!$D$19,IF(J70=19,'Equivalencia BH-BMPT'!$D$20,IF(J70=20,'Equivalencia BH-BMPT'!$D$21,IF(J70=21,'Equivalencia BH-BMPT'!$D$22,IF(J70=22,'Equivalencia BH-BMPT'!$D$23,IF(J70=23,'Equivalencia BH-BMPT'!#REF!,IF(J70=24,'Equivalencia BH-BMPT'!$D$25,IF(J70=25,'Equivalencia BH-BMPT'!$D$26,IF(J70=26,'Equivalencia BH-BMPT'!$D$27,IF(J70=27,'Equivalencia BH-BMPT'!$D$28,IF(J70=28,'Equivalencia BH-BMPT'!$D$29,IF(J70=29,'Equivalencia BH-BMPT'!$D$30,IF(J70=30,'Equivalencia BH-BMPT'!$D$31,IF(J70=31,'Equivalencia BH-BMPT'!$D$32,IF(J70=32,'Equivalencia BH-BMPT'!$D$33,IF(J70=33,'Equivalencia BH-BMPT'!$D$34,IF(J70=34,'Equivalencia BH-BMPT'!$D$35,IF(J70=35,'Equivalencia BH-BMPT'!$D$36,IF(J70=36,'Equivalencia BH-BMPT'!$D$37,IF(J70=37,'Equivalencia BH-BMPT'!$D$38,IF(J70=38,'Equivalencia BH-BMPT'!#REF!,IF(J70=39,'Equivalencia BH-BMPT'!$D$40,IF(J70=40,'Equivalencia BH-BMPT'!$D$41,IF(J70=41,'Equivalencia BH-BMPT'!$D$42,IF(J70=42,'Equivalencia BH-BMPT'!$D$43,IF(J70=43,'Equivalencia BH-BMPT'!$D$44,IF(J70=44,'Equivalencia BH-BMPT'!$D$45,IF(J70=45,'Equivalencia BH-BMPT'!$D$46,\"No ha seleccionado un número de programa\")))))))))))))))))))))))))))))))))))))))))))))","v":"Gobernanza e influencia local, regional e internacional"},1326,1022329582,"RAFAEL PEÑA HERRERA",50400000,null,null,1,12600000,63000000,55440000,"2017/03/15","2017/03/16","2018-01-15",240,49,null,null,"X",null,null,0.88,null,false]
[57,2017,"17-12-6474256",5,{"$f":"IF(D71=1,'Tipo '!$B$2,IF(D71=2,'Tipo '!$B$3,IF(D71=3,'Tipo '!$B$4,IF(D71=4,'Tipo '!$B$5,IF(D71=5,'Tipo '!$B$6,IF(D71=6,'Tipo '!$B$7,IF(D71=7,'Tipo '!$B$8,IF(D71=8,'Tipo '!$B$9,IF(D71=9,'Tipo '!$B$10,IF(D71=10,'Tipo '!$B$11,IF(D71=11,'Tipo '!$B$12,IF(D71=12,'Tipo '!$B$13,IF(D71=13,'Tipo '!$B$14,IF(D71=14,'Tipo '!$B$15,IF(D71=15,'Tipo '!$B$16,IF(D71=16,'Tipo '!$B$17,IF(D71=17,'Tipo '!$B$18,IF(D71=18,'Tipo '!$B$19,IF(D71=19,'Tipo '!$B$20,\"No ha seleccionado un tipo de contrato válido\")))))))))))))))))))","v":"CONTRATOS DE PRESTACIÓN DE SERVICIOS PROFESIONALES Y DE APOYO A LA GESTIÓN"},"Contratación directa","Prestación de servicios profesionales y de apoyo a la gestión, o para la ejecución de trabajos artísticos que sólo puedan encomendarse a determinadas personas naturales;","PRESTAR LOS SERVICIOS PROFESIONALES ESPECIALIZADOS JURIDICOS EN EL DESPACHO DE LA ALCALDIA LOCAL DE SANTA FE EN EL CURSO DE LA GESTION ADMINISTRATIVA, POLICIVA Y CONTRACTUAL","Inversión",45,{"$f":"IF(J71=1,'Equivalencia BH-BMPT'!$D$2,IF(J71=2,'Equivalencia BH-BMPT'!$D$3,IF(J71=3,'Equivalencia BH-BMPT'!$D$4,IF(J71=4,'Equivalencia BH-BMPT'!$D$5,IF(J71=5,'Equivalencia BH-BMPT'!$D$6,IF(J71=6,'Equivalencia BH-BMPT'!$D$7,IF(J71=7,'Equivalencia BH-BMPT'!$D$8,IF(J71=8,'Equivalencia BH-BMPT'!$D$9,IF(J71=9,'Equivalencia BH-BMPT'!$D$10,IF(J71=10,'Equivalencia BH-BMPT'!$D$11,IF(J71=11,'Equivalencia BH-BMPT'!$D$12,IF(J71=12,'Equivalencia BH-BMPT'!$D$13,IF(J71=13,'Equivalencia BH-BMPT'!$D$14,IF(J71=14,'Equivalencia BH-BMPT'!$D$15,IF(J71=15,'Equivalencia BH-BMPT'!$D$16,IF(J71=16,'Equivalencia BH-BMPT'!$D$17,IF(J71=17,'Equivalencia BH-BMPT'!$D$18,IF(J71=18,'Equivalencia BH-BMPT'!$D$19,IF(J71=19,'Equivalencia BH-BMPT'!$D$20,IF(J71=20,'Equivalencia BH-BMPT'!$D$21,IF(J71=21,'Equivalencia BH-BMPT'!$D$22,IF(J71=22,'Equivalencia BH-BMPT'!$D$23,IF(J71=23,'Equivalencia BH-BMPT'!#REF!,IF(J71=24,'Equivalencia BH-BMPT'!$D$25,IF(J71=25,'Equivalencia BH-BMPT'!$D$26,IF(J71=26,'Equivalencia BH-BMPT'!$D$27,IF(J71=27,'Equivalencia BH-BMPT'!$D$28,IF(J71=28,'Equivalencia BH-BMPT'!$D$29,IF(J71=29,'Equivalencia BH-BMPT'!$D$30,IF(J71=30,'Equivalencia BH-BMPT'!$D$31,IF(J71=31,'Equivalencia BH-BMPT'!$D$32,IF(J71=32,'Equivalencia BH-BMPT'!$D$33,IF(J71=33,'Equivalencia BH-BMPT'!$D$34,IF(J71=34,'Equivalencia BH-BMPT'!$D$35,IF(J71=35,'Equivalencia BH-BMPT'!$D$36,IF(J71=36,'Equivalencia BH-BMPT'!$D$37,IF(J71=37,'Equivalencia BH-BMPT'!$D$38,IF(J71=38,'Equivalencia BH-BMPT'!#REF!,IF(J71=39,'Equivalencia BH-BMPT'!$D$40,IF(J71=40,'Equivalencia BH-BMPT'!$D$41,IF(J71=41,'Equivalencia BH-BMPT'!$D$42,IF(J71=42,'Equivalencia BH-BMPT'!$D$43,IF(J71=43,'Equivalencia BH-BMPT'!$D$44,IF(J71=44,'Equivalencia BH-BMPT'!$D$45,IF(J71=45,'Equivalencia BH-BMPT'!$D$46,\"No ha seleccionado un número de programa\")))))))))))))))))))))))))))))))))))))))))))))","v":"Gobernanza e influencia local, regional e internacional"},1326,1121297814,"MARGITH VANESSA MURGAS RODRIGUEZ",58000000,null,null,1,14500000,72500000,63800000,"2017/03/15","2017/03/16","2018-01-15",240,50,null,null,"X",null,null,0.88,null,false]
[58,2017,"17-12-6474257",5,{"$f":"IF(D72=1,'Tipo '!$B$2,IF(D72=2,'Tipo '!$B$3,IF(D72=3,'Tipo '!$B$4,IF(D72=4,'Tipo '!$B$5,IF(D72=5,'Tipo '!$B$6,IF(D72=6,'Tipo '!$B$7,IF(D72=7,'Tipo '!$B$8,IF(D72=8,'Tipo '!$B$9,IF(D72=9,'Tipo '!$B$10,IF(D72=10,'Tipo '!$B$11,IF(D72=11,'Tipo '!$B$12,IF(D72=12,'Tipo '!$B$13,IF(D72=13,'Tipo '!$B$14,IF(D72=14,'Tipo '!$B$15,IF(D72=15,'Tipo '!$B$16,IF(D72=16,'Tipo '!$B$17,IF(D72=17,'Tipo '!$B$18,IF(D72=18,'Tipo '!$B$19,IF(D72=19,'Tipo '!$B$20,\"No ha seleccionado un tipo de contrato válido\")))))))))))))))))))","v":"CONTRATOS DE PRESTACIÓN DE SERVICIOS PROFESIONALES Y DE APOYO A LA GESTIÓN"},"Contratación directa","Prestación de servicios profesionales y de apoyo a la gestión, o para la ejecución de trabajos artísticos que sólo puedan encomendarse a determinadas personas naturales;","PRESTAR LOS SERVICIOS PROFESIONALES DE ABOGADO EN LA ALCALDIA LOCAL DE SANTA FE EN EL AREA DE GESTION POLICIVA ESPECIALMENTE EN LAS ACTUACIONES ENCAMINADAS A LA PROTECCION Y CONSERVACION DE LOS CERROS ORIENTALES, EN CUMPLIMIENTO DE LA ACCION POPULAR N° 25000232500020050066203","Inversión",45,{"$f":"IF(J72=1,'Equivalencia BH-BMPT'!$D$2,IF(J72=2,'Equivalencia BH-BMPT'!$D$3,IF(J72=3,'Equivalencia BH-BMPT'!$D$4,IF(J72=4,'Equivalencia BH-BMPT'!$D$5,IF(J72=5,'Equivalencia BH-BMPT'!$D$6,IF(J72=6,'Equivalencia BH-BMPT'!$D$7,IF(J72=7,'Equivalencia BH-BMPT'!$D$8,IF(J72=8,'Equivalencia BH-BMPT'!$D$9,IF(J72=9,'Equivalencia BH-BMPT'!$D$10,IF(J72=10,'Equivalencia BH-BMPT'!$D$11,IF(J72=11,'Equivalencia BH-BMPT'!$D$12,IF(J72=12,'Equivalencia BH-BMPT'!$D$13,IF(J72=13,'Equivalencia BH-BMPT'!$D$14,IF(J72=14,'Equivalencia BH-BMPT'!$D$15,IF(J72=15,'Equivalencia BH-BMPT'!$D$16,IF(J72=16,'Equivalencia BH-BMPT'!$D$17,IF(J72=17,'Equivalencia BH-BMPT'!$D$18,IF(J72=18,'Equivalencia BH-BMPT'!$D$19,IF(J72=19,'Equivalencia BH-BMPT'!$D$20,IF(J72=20,'Equivalencia BH-BMPT'!$D$21,IF(J72=21,'Equivalencia BH-BMPT'!$D$22,IF(J72=22,'Equivalencia BH-BMPT'!$D$23,IF(J72=23,'Equivalencia BH-BMPT'!#REF!,IF(J72=24,'Equivalencia BH-BMPT'!$D$25,IF(J72=25,'Equivalencia BH-BMPT'!$D$26,IF(J72=26,'Equivalencia BH-BMPT'!$D$27,IF(J72=27,'Equivalencia BH-BMPT'!$D$28,IF(J72=28,'Equivalencia BH-BMPT'!$D$29,IF(J72=29,'Equivalencia BH-BMPT'!$D$30,IF(J72=30,'Equivalencia BH-BMPT'!$D$31,IF(J72=31,'Equivalencia BH-BMPT'!$D$32,IF(J72=32,'Equivalencia BH-BMPT'!$D$33,IF(J72=33,'Equivalencia BH-BMPT'!$D$34,IF(J72=34,'Equivalencia BH-BMPT'!$D$35,IF(J72=35,'Equivalencia BH-BMPT'!$D$36,IF(J72=36,'Equivalencia BH-BMPT'!$D$37,IF(J72=37,'Equivalencia BH-BMPT'!$D$38,IF(J72=38,'Equivalencia BH-BMPT'!#REF!,IF(J72=39,'Equivalencia BH-BMPT'!$D$40,IF(J72=40,'Equivalencia BH-BMPT'!$D$41,IF(J72=41,'Equivalencia BH-BMPT'!$D$42,IF(J72=42,'Equivalencia BH-BMPT'!$D$43,IF(J72=43,'Equivalencia BH-BMPT'!$D$44,IF(J72=44,'Equivalencia BH-BMPT'!$D$45,IF(J72=45,'Equivalencia BH-BMPT'!$D$46,\"No ha seleccionado un número de programa\")))))))))))))))))))))))))))))))))))))))))))))","v":"Gobernanza e influencia local, regional e internacional"},1326,52731958,"MERLY JOHANNA GARCIA LOPEZ",32480000,null,null,1,2436000,34916000,31938667,"2017/03/15","2017/03/16","2017-12-30",240,51,null,null," ","X",null,0.91472869171726434,null,false]
[59,2017,"17-12-6474259",5,{"$f":"IF(D73=1,'Tipo '!$B$2,IF(D73=2,'Tipo '!$B$3,IF(D73=3,'Tipo '!$B$4,IF(D73=4,'Tipo '!$B$5,IF(D73=5,'Tipo '!$B$6,IF(D73=6,'Tipo '!$B$7,IF(D73=7,'Tipo '!$B$8,IF(D73=8,'Tipo '!$B$9,IF(D73=9,'Tipo '!$B$10,IF(D73=10,'Tipo '!$B$11,IF(D73=11,'Tipo '!$B$12,IF(D73=12,'Tipo '!$B$13,IF(D73=13,'Tipo '!$B$14,IF(D73=14,'Tipo '!$B$15,IF(D73=15,'Tipo '!$B$16,IF(D73=16,'Tipo '!$B$17,IF(D73=17,'Tipo '!$B$18,IF(D73=18,'Tipo '!$B$19,IF(D73=19,'Tipo '!$B$20,\"No ha seleccionado un tipo de contrato válido\")))))))))))))))))))","v":"CONTRATOS DE PRESTACIÓN DE SERVICIOS PROFESIONALES Y DE APOYO A LA GESTIÓN"},"Contratación directa","Prestación de servicios profesionales y de apoyo a la gestión, o para la ejecución de trabajos artísticos que sólo puedan encomendarse a determinadas personas naturales;","PRESTAR SERVICIOS DE APOYO EN LAS LABORES ADMINISTRATIVAS Y DE GESTION DE LA JUNTA ADMINISTRADORA LOCAL DE LA LOCALIDAD DE SANTA FE","Inversión",45,{"$f":"IF(J73=1,'Equivalencia BH-BMPT'!$D$2,IF(J73=2,'Equivalencia BH-BMPT'!$D$3,IF(J73=3,'Equivalencia BH-BMPT'!$D$4,IF(J73=4,'Equivalencia BH-BMPT'!$D$5,IF(J73=5,'Equivalencia BH-BMPT'!$D$6,IF(J73=6,'Equivalencia BH-BMPT'!$D$7,IF(J73=7,'Equivalencia BH-BMPT'!$D$8,IF(J73=8,'Equivalencia BH-BMPT'!$D$9,IF(J73=9,'Equivalencia BH-BMPT'!$D$10,IF(J73=10,'Equivalencia BH-BMPT'!$D$11,IF(J73=11,'Equivalencia BH-BMPT'!$D$12,IF(J73=12,'Equivalencia BH-BMPT'!$D$13,IF(J73=13,'Equivalencia BH-BMPT'!$D$14,IF(J73=14,'Equivalencia BH-BMPT'!$D$15,IF(J73=15,'Equivalencia BH-BMPT'!$D$16,IF(J73=16,'Equivalencia BH-BMPT'!$D$17,IF(J73=17,'Equivalencia BH-BMPT'!$D$18,IF(J73=18,'Equivalencia BH-BMPT'!$D$19,IF(J73=19,'Equivalencia BH-BMPT'!$D$20,IF(J73=20,'Equivalencia BH-BMPT'!$D$21,IF(J73=21,'Equivalencia BH-BMPT'!$D$22,IF(J73=22,'Equivalencia BH-BMPT'!$D$23,IF(J73=23,'Equivalencia BH-BMPT'!#REF!,IF(J73=24,'Equivalencia BH-BMPT'!$D$25,IF(J73=25,'Equivalencia BH-BMPT'!$D$26,IF(J73=26,'Equivalencia BH-BMPT'!$D$27,IF(J73=27,'Equivalencia BH-BMPT'!$D$28,IF(J73=28,'Equivalencia BH-BMPT'!$D$29,IF(J73=29,'Equivalencia BH-BMPT'!$D$30,IF(J73=30,'Equivalencia BH-BMPT'!$D$31,IF(J73=31,'Equivalencia BH-BMPT'!$D$32,IF(J73=32,'Equivalencia BH-BMPT'!$D$33,IF(J73=33,'Equivalencia BH-BMPT'!$D$34,IF(J73=34,'Equivalencia BH-BMPT'!$D$35,IF(J73=35,'Equivalencia BH-BMPT'!$D$36,IF(J73=36,'Equivalencia BH-BMPT'!$D$37,IF(J73=37,'Equivalencia BH-BMPT'!$D$38,IF(J73=38,'Equivalencia BH-BMPT'!#REF!,IF(J73=39,'Equivalencia BH-BMPT'!$D$40,IF(J73=40,'Equivalencia BH-BMPT'!$D$41,IF(J73=41,'Equivalencia BH-BMPT'!$D$42,IF(J73=42,'Equivalencia BH-BMPT'!$D$43,IF(J73=43,'Equivalencia BH-BMPT'!$D$44,IF(J73=44,'Equivalencia BH-BMPT'!$D$45,IF(J73=45,'Equivalencia BH-BMPT'!$D$46,\"No ha seleccionado un número de programa\")))))))))))))))))))))))))))))))))))))))))))))","v":"Gobernanza e influencia local, regional e internacional"},1326,33704283,"DERLY ESPERANZA FAJARDO RODRIGUEZ",21200000,null,null,1,3975000,25175000,23319999,"2017/03/15","2017/03/16","2017-12-30",240,52,null,null," ","X",null,0.9263157497517378,null,false]
[60,2017,"17-12-6474263",5,{"$f":"IF(D74=1,'Tipo '!$B$2,IF(D74=2,'Tipo '!$B$3,IF(D74=3,'Tipo '!$B$4,IF(D74=4,'Tipo '!$B$5,IF(D74=5,'Tipo '!$B$6,IF(D74=6,'Tipo '!$B$7,IF(D74=7,'Tipo '!$B$8,IF(D74=8,'Tipo '!$B$9,IF(D74=9,'Tipo '!$B$10,IF(D74=10,'Tipo '!$B$11,IF(D74=11,'Tipo '!$B$12,IF(D74=12,'Tipo '!$B$13,IF(D74=13,'Tipo '!$B$14,IF(D74=14,'Tipo '!$B$15,IF(D74=15,'Tipo '!$B$16,IF(D74=16,'Tipo '!$B$17,IF(D74=17,'Tipo '!$B$18,IF(D74=18,'Tipo '!$B$19,IF(D74=19,'Tipo '!$B$20,\"No ha seleccionado un tipo de contrato válido\")))))))))))))))))))","v":"CONTRATOS DE PRESTACIÓN DE SERVICIOS PROFESIONALES Y DE APOYO A LA GESTIÓN"},"Contratación directa","Prestación de servicios profesionales y de apoyo a la gestión, o para la ejecución de trabajos artísticos que sólo puedan encomendarse a determinadas personas naturales;","PRESTAR SERVICIOS PROFESIONALES EN EL AREA DE GESTION POLICIVA DE LA ALCALDIA LOCAL DE SANTA FE, PARA APOYAR LOS TEMAS DE SEGURIDAD Y CONVIVENCIA DE LA LOCALIDAD","Inversión",45,{"$f":"IF(J74=1,'Equivalencia BH-BMPT'!$D$2,IF(J74=2,'Equivalencia BH-BMPT'!$D$3,IF(J74=3,'Equivalencia BH-BMPT'!$D$4,IF(J74=4,'Equivalencia BH-BMPT'!$D$5,IF(J74=5,'Equivalencia BH-BMPT'!$D$6,IF(J74=6,'Equivalencia BH-BMPT'!$D$7,IF(J74=7,'Equivalencia BH-BMPT'!$D$8,IF(J74=8,'Equivalencia BH-BMPT'!$D$9,IF(J74=9,'Equivalencia BH-BMPT'!$D$10,IF(J74=10,'Equivalencia BH-BMPT'!$D$11,IF(J74=11,'Equivalencia BH-BMPT'!$D$12,IF(J74=12,'Equivalencia BH-BMPT'!$D$13,IF(J74=13,'Equivalencia BH-BMPT'!$D$14,IF(J74=14,'Equivalencia BH-BMPT'!$D$15,IF(J74=15,'Equivalencia BH-BMPT'!$D$16,IF(J74=16,'Equivalencia BH-BMPT'!$D$17,IF(J74=17,'Equivalencia BH-BMPT'!$D$18,IF(J74=18,'Equivalencia BH-BMPT'!$D$19,IF(J74=19,'Equivalencia BH-BMPT'!$D$20,IF(J74=20,'Equivalencia BH-BMPT'!$D$21,IF(J74=21,'Equivalencia BH-BMPT'!$D$22,IF(J74=22,'Equivalencia BH-BMPT'!$D$23,IF(J74=23,'Equivalencia BH-BMPT'!#REF!,IF(J74=24,'Equivalencia BH-BMPT'!$D$25,IF(J74=25,'Equivalencia BH-BMPT'!$D$26,IF(J74=26,'Equivalencia BH-BMPT'!$D$27,IF(J74=27,'Equivalencia BH-BMPT'!$D$28,IF(J74=28,'Equivalencia BH-BMPT'!$D$29,IF(J74=29,'Equivalencia BH-BMPT'!$D$30,IF(J74=30,'Equivalencia BH-BMPT'!$D$31,IF(J74=31,'Equivalencia BH-BMPT'!$D$32,IF(J74=32,'Equivalencia BH-BMPT'!$D$33,IF(J74=33,'Equivalencia BH-BMPT'!$D$34,IF(J74=34,'Equivalencia BH-BMPT'!$D$35,IF(J74=35,'Equivalencia BH-BMPT'!$D$36,IF(J74=36,'Equivalencia BH-BMPT'!$D$37,IF(J74=37,'Equivalencia BH-BMPT'!$D$38,IF(J74=38,'Equivalencia BH-BMPT'!#REF!,IF(J74=39,'Equivalencia BH-BMPT'!$D$40,IF(J74=40,'Equivalencia BH-BMPT'!$D$41,IF(J74=41,'Equivalencia BH-BMPT'!$D$42,IF(J74=42,'Equivalencia BH-BMPT'!$D$43,IF(J74=43,'Equivalencia BH-BMPT'!$D$44,IF(J74=44,'Equivalencia BH-BMPT'!$D$45,IF(J74=45,'Equivalencia BH-BMPT'!$D$46,\"No ha seleccionado un número de programa\")))))))))))))))))))))))))))))))))))))))))))))","v":"Gobernanza e influencia local, regional e internacional"},1326,79989489,"SERGIO ANDRES CALDERON GARZÓN",38400000,null,null,1,9600000,48000000,42240000,"2017/03/16","2017/03/16","2018-01-15",240,53,null,null,"X",null,null,0.88,null,false]
[61,2017,"17-12-6474265",5,{"$f":"IF(D75=1,'Tipo '!$B$2,IF(D75=2,'Tipo '!$B$3,IF(D75=3,'Tipo '!$B$4,IF(D75=4,'Tipo '!$B$5,IF(D75=5,'Tipo '!$B$6,IF(D75=6,'Tipo '!$B$7,IF(D75=7,'Tipo '!$B$8,IF(D75=8,'Tipo '!$B$9,IF(D75=9,'Tipo '!$B$10,IF(D75=10,'Tipo '!$B$11,IF(D75=11,'Tipo '!$B$12,IF(D75=12,'Tipo '!$B$13,IF(D75=13,'Tipo '!$B$14,IF(D75=14,'Tipo '!$B$15,IF(D75=15,'Tipo '!$B$16,IF(D75=16,'Tipo '!$B$17,IF(D75=17,'Tipo '!$B$18,IF(D75=18,'Tipo '!$B$19,IF(D75=19,'Tipo '!$B$20,\"No ha seleccionado un tipo de contrato válido\")))))))))))))))))))","v":"CONTRATOS DE PRESTACIÓN DE SERVICIOS PROFESIONALES Y DE APOYO A LA GESTIÓN"},"Contratación directa","Prestación de servicios profesionales y de apoyo a la gestión, o para la ejecución de trabajos artísticos que sólo puedan encomendarse a determinadas personas naturales;","PRESTAR SERVICIOS PROFESIONALES DE UN ABOGADO PARA APOYAR AL FONDO DE DESARROLLO LOCAL EN TODO LO RELACIONADO CON LA ACTIVIDAD CONTRACTUAL DE LA ALCALDIA LOCAL DE SANTA FE, EN EL MARCO DE LOS PLANES, PROGRAMAS Y PROYECTOS ENCAMINADOS AL FORTALECIMIENTO INSTITUCIONAL PARA EL MEJORAMIENTO DE LA GESTION DEL FONDO","Inversión",45,{"$f":"IF(J75=1,'Equivalencia BH-BMPT'!$D$2,IF(J75=2,'Equivalencia BH-BMPT'!$D$3,IF(J75=3,'Equivalencia BH-BMPT'!$D$4,IF(J75=4,'Equivalencia BH-BMPT'!$D$5,IF(J75=5,'Equivalencia BH-BMPT'!$D$6,IF(J75=6,'Equivalencia BH-BMPT'!$D$7,IF(J75=7,'Equivalencia BH-BMPT'!$D$8,IF(J75=8,'Equivalencia BH-BMPT'!$D$9,IF(J75=9,'Equivalencia BH-BMPT'!$D$10,IF(J75=10,'Equivalencia BH-BMPT'!$D$11,IF(J75=11,'Equivalencia BH-BMPT'!$D$12,IF(J75=12,'Equivalencia BH-BMPT'!$D$13,IF(J75=13,'Equivalencia BH-BMPT'!$D$14,IF(J75=14,'Equivalencia BH-BMPT'!$D$15,IF(J75=15,'Equivalencia BH-BMPT'!$D$16,IF(J75=16,'Equivalencia BH-BMPT'!$D$17,IF(J75=17,'Equivalencia BH-BMPT'!$D$18,IF(J75=18,'Equivalencia BH-BMPT'!$D$19,IF(J75=19,'Equivalencia BH-BMPT'!$D$20,IF(J75=20,'Equivalencia BH-BMPT'!$D$21,IF(J75=21,'Equivalencia BH-BMPT'!$D$22,IF(J75=22,'Equivalencia BH-BMPT'!$D$23,IF(J75=23,'Equivalencia BH-BMPT'!#REF!,IF(J75=24,'Equivalencia BH-BMPT'!$D$25,IF(J75=25,'Equivalencia BH-BMPT'!$D$26,IF(J75=26,'Equivalencia BH-BMPT'!$D$27,IF(J75=27,'Equivalencia BH-BMPT'!$D$28,IF(J75=28,'Equivalencia BH-BMPT'!$D$29,IF(J75=29,'Equivalencia BH-BMPT'!$D$30,IF(J75=30,'Equivalencia BH-BMPT'!$D$31,IF(J75=31,'Equivalencia BH-BMPT'!$D$32,IF(J75=32,'Equivalencia BH-BMPT'!$D$33,IF(J75=33,'Equivalencia BH-BMPT'!$D$34,IF(J75=34,'Equivalencia BH-BMPT'!$D$35,IF(J75=35,'Equivalencia BH-BMPT'!$D$36,IF(J75=36,'Equivalencia BH-BMPT'!$D$37,IF(J75=37,'Equivalencia BH-BMPT'!$D$38,IF(J75=38,'Equivalencia BH-BMPT'!#REF!,IF(J75=39,'Equivalencia BH-BMPT'!$D$40,IF(J75=40,'Equivalencia BH-BMPT'!$D$41,IF(J75=41,'Equivalencia BH-BMPT'!$D$42,IF(J75=42,'Equivalencia BH-BMPT'!$D$43,IF(J75=43,'Equivalencia BH-BMPT'!$D$44,IF(J75=44,'Equivalencia BH-BMPT'!$D$45,IF(J75=45,'Equivalencia BH-BMPT'!$D$46,\"No ha seleccionado un número de programa\")))))))))))))))))))))))))))))))))))))))))))))","v":"Gobernanza e influencia local, regional e internacional"},1326,80111338,"SEBASTIAN GARCES RESTREPO",36000000,null,null,1,9000000,45000000,39600000,"2017/03/16","2017/03/16","2018-01-15",240,54,null,null,"X",null,null,0.88,null,false]
[62,2017,"17-12-6474277",5,{"$f":"IF(D76=1,'Tipo '!$B$2,IF(D76=2,'Tipo '!$B$3,IF(D76=3,'Tipo '!$B$4,IF(D76=4,'Tipo '!$B$5,IF(D76=5,'Tipo '!$B$6,IF(D76=6,'Tipo '!$B$7,IF(D76=7,'Tipo '!$B$8,IF(D76=8,'Tipo '!$B$9,IF(D76=9,'Tipo '!$B$10,IF(D76=10,'Tipo '!$B$11,IF(D76=11,'Tipo '!$B$12,IF(D76=12,'Tipo '!$B$13,IF(D76=13,'Tipo '!$B$14,IF(D76=14,'Tipo '!$B$15,IF(D76=15,'Tipo '!$B$16,IF(D76=16,'Tipo '!$B$17,IF(D76=17,'Tipo '!$B$18,IF(D76=18,'Tipo '!$B$19,IF(D76=19,'Tipo '!$B$20,\"No ha seleccionado un tipo de contrato válido\")))))))))))))))))))","v":"CONTRATOS DE PRESTACIÓN DE SERVICIOS PROFESIONALES Y DE APOYO A LA GESTIÓN"},"Contratación directa","Prestación de servicios profesionales y de apoyo a la gestión, o para la ejecución de trabajos artísticos que sólo puedan encomendarse a determinadas personas naturales;","PRESTAR SERVICIOS PROFESIONALES AL AREA DE GESTION DEL DESARROLLO LOCAL EN LO ATINENTE A LAS ETAPAS PRECONTRACTUALES, CONTRACTUALES, Y POSTCONTRACTUALES, EN EL MARCO DE LOS PLANES, PROGRAMAS Y PROYECTOS ENCAMINADOS A LA ADQUISICION DE BIENES Y SERVCIOS PARA EL FORTALECIMIENTO DE LA GESTION LOCAL","Inversión",45,{"$f":"IF(J76=1,'Equivalencia BH-BMPT'!$D$2,IF(J76=2,'Equivalencia BH-BMPT'!$D$3,IF(J76=3,'Equivalencia BH-BMPT'!$D$4,IF(J76=4,'Equivalencia BH-BMPT'!$D$5,IF(J76=5,'Equivalencia BH-BMPT'!$D$6,IF(J76=6,'Equivalencia BH-BMPT'!$D$7,IF(J76=7,'Equivalencia BH-BMPT'!$D$8,IF(J76=8,'Equivalencia BH-BMPT'!$D$9,IF(J76=9,'Equivalencia BH-BMPT'!$D$10,IF(J76=10,'Equivalencia BH-BMPT'!$D$11,IF(J76=11,'Equivalencia BH-BMPT'!$D$12,IF(J76=12,'Equivalencia BH-BMPT'!$D$13,IF(J76=13,'Equivalencia BH-BMPT'!$D$14,IF(J76=14,'Equivalencia BH-BMPT'!$D$15,IF(J76=15,'Equivalencia BH-BMPT'!$D$16,IF(J76=16,'Equivalencia BH-BMPT'!$D$17,IF(J76=17,'Equivalencia BH-BMPT'!$D$18,IF(J76=18,'Equivalencia BH-BMPT'!$D$19,IF(J76=19,'Equivalencia BH-BMPT'!$D$20,IF(J76=20,'Equivalencia BH-BMPT'!$D$21,IF(J76=21,'Equivalencia BH-BMPT'!$D$22,IF(J76=22,'Equivalencia BH-BMPT'!$D$23,IF(J76=23,'Equivalencia BH-BMPT'!#REF!,IF(J76=24,'Equivalencia BH-BMPT'!$D$25,IF(J76=25,'Equivalencia BH-BMPT'!$D$26,IF(J76=26,'Equivalencia BH-BMPT'!$D$27,IF(J76=27,'Equivalencia BH-BMPT'!$D$28,IF(J76=28,'Equivalencia BH-BMPT'!$D$29,IF(J76=29,'Equivalencia BH-BMPT'!$D$30,IF(J76=30,'Equivalencia BH-BMPT'!$D$31,IF(J76=31,'Equivalencia BH-BMPT'!$D$32,IF(J76=32,'Equivalencia BH-BMPT'!$D$33,IF(J76=33,'Equivalencia BH-BMPT'!$D$34,IF(J76=34,'Equivalencia BH-BMPT'!$D$35,IF(J76=35,'Equivalencia BH-BMPT'!$D$36,IF(J76=36,'Equivalencia BH-BMPT'!$D$37,IF(J76=37,'Equivalencia BH-BMPT'!$D$38,IF(J76=38,'Equivalencia BH-BMPT'!#REF!,IF(J76=39,'Equivalencia BH-BMPT'!$D$40,IF(J76=40,'Equivalencia BH-BMPT'!$D$41,IF(J76=41,'Equivalencia BH-BMPT'!$D$42,IF(J76=42,'Equivalencia BH-BMPT'!$D$43,IF(J76=43,'Equivalencia BH-BMPT'!$D$44,IF(J76=44,'Equivalencia BH-BMPT'!$D$45,IF(J76=45,'Equivalencia BH-BMPT'!$D$46,\"No ha seleccionado un número de programa\")))))))))))))))))))))))))))))))))))))))))))))","v":"Gobernanza e influencia local, regional e internacional"},1326,53039712,"DIANA CATHERINE CLAVIJO ORTIZ",44000000,null,null,1,11000000,55000000,48400000,"2017/03/16","2017/03/16","2018-01-15",240,55,null,null,"X",null,null,0.88,null,false]
[63,2017,"17-12-6474279",5,{"$f":"IF(D77=1,'Tipo '!$B$2,IF(D77=2,'Tipo '!$B$3,IF(D77=3,'Tipo '!$B$4,IF(D77=4,'Tipo '!$B$5,IF(D77=5,'Tipo '!$B$6,IF(D77=6,'Tipo '!$B$7,IF(D77=7,'Tipo '!$B$8,IF(D77=8,'Tipo '!$B$9,IF(D77=9,'Tipo '!$B$10,IF(D77=10,'Tipo '!$B$11,IF(D77=11,'Tipo '!$B$12,IF(D77=12,'Tipo '!$B$13,IF(D77=13,'Tipo '!$B$14,IF(D77=14,'Tipo '!$B$15,IF(D77=15,'Tipo '!$B$16,IF(D77=16,'Tipo '!$B$17,IF(D77=17,'Tipo '!$B$18,IF(D77=18,'Tipo '!$B$19,IF(D77=19,'Tipo '!$B$20,\"No ha seleccionado un tipo de contrato válido\")))))))))))))))))))","v":"CONTRATOS DE PRESTACIÓN DE SERVICIOS PROFESIONALES Y DE APOYO A LA GESTIÓN"},"Contratación directa","Prestación de servicios profesionales y de apoyo a la gestión, o para la ejecución de trabajos artísticos que sólo puedan encomendarse a determinadas personas naturales;","PRESTAR SUS SERVICIO COMO APORYO AL AREA DE GESTION DE DESARROLLO LOCAL - CONTABILIDAD DE LA ALCALDIA LOCAL DE SANTA FE EN LOS TRAMITES, PROCEDIMIENTOS Y APLICATIVOS DESIGANDOS AL AREA EN GESTION","Inversión",45,{"$f":"IF(J77=1,'Equivalencia BH-BMPT'!$D$2,IF(J77=2,'Equivalencia BH-BMPT'!$D$3,IF(J77=3,'Equivalencia BH-BMPT'!$D$4,IF(J77=4,'Equivalencia BH-BMPT'!$D$5,IF(J77=5,'Equivalencia BH-BMPT'!$D$6,IF(J77=6,'Equivalencia BH-BMPT'!$D$7,IF(J77=7,'Equivalencia BH-BMPT'!$D$8,IF(J77=8,'Equivalencia BH-BMPT'!$D$9,IF(J77=9,'Equivalencia BH-BMPT'!$D$10,IF(J77=10,'Equivalencia BH-BMPT'!$D$11,IF(J77=11,'Equivalencia BH-BMPT'!$D$12,IF(J77=12,'Equivalencia BH-BMPT'!$D$13,IF(J77=13,'Equivalencia BH-BMPT'!$D$14,IF(J77=14,'Equivalencia BH-BMPT'!$D$15,IF(J77=15,'Equivalencia BH-BMPT'!$D$16,IF(J77=16,'Equivalencia BH-BMPT'!$D$17,IF(J77=17,'Equivalencia BH-BMPT'!$D$18,IF(J77=18,'Equivalencia BH-BMPT'!$D$19,IF(J77=19,'Equivalencia BH-BMPT'!$D$20,IF(J77=20,'Equivalencia BH-BMPT'!$D$21,IF(J77=21,'Equivalencia BH-BMPT'!$D$22,IF(J77=22,'Equivalencia BH-BMPT'!$D$23,IF(J77=23,'Equivalencia BH-BMPT'!#REF!,IF(J77=24,'Equivalencia BH-BMPT'!$D$25,IF(J77=25,'Equivalencia BH-BMPT'!$D$26,IF(J77=26,'Equivalencia BH-BMPT'!$D$27,IF(J77=27,'Equivalencia BH-BMPT'!$D$28,IF(J77=28,'Equivalencia BH-BMPT'!$D$29,IF(J77=29,'Equivalencia BH-BMPT'!$D$30,IF(J77=30,'Equivalencia BH-BMPT'!$D$31,IF(J77=31,'Equivalencia BH-BMPT'!$D$32,IF(J77=32,'Equivalencia BH-BMPT'!$D$33,IF(J77=33,'Equivalencia BH-BMPT'!$D$34,IF(J77=34,'Equivalencia BH-BMPT'!$D$35,IF(J77=35,'Equivalencia BH-BMPT'!$D$36,IF(J77=36,'Equivalencia BH-BMPT'!$D$37,IF(J77=37,'Equivalencia BH-BMPT'!$D$38,IF(J77=38,'Equivalencia BH-BMPT'!#REF!,IF(J77=39,'Equivalencia BH-BMPT'!$D$40,IF(J77=40,'Equivalencia BH-BMPT'!$D$41,IF(J77=41,'Equivalencia BH-BMPT'!$D$42,IF(J77=42,'Equivalencia BH-BMPT'!$D$43,IF(J77=43,'Equivalencia BH-BMPT'!$D$44,IF(J77=44,'Equivalencia BH-BMPT'!$D$45,IF(J77=45,'Equivalencia BH-BMPT'!$D$46,\"No ha seleccionado un número de programa\")))))))))))))))))))))))))))))))))))))))))))))","v":"Gobernanza e influencia local, regional e internacional"},1326,52581670,"CLAUDIA PATRICIA GOMEZ GUTIERREZ",29600000,null,null,1,7400000,37000000,32560000,"2017/03/16","2017/03/16","2018-01-15",240,56,null,null,"X",null,null,0.88,null,false]
[64,2017,"17-12-6474280",5,{"$f":"IF(D78=1,'Tipo '!$B$2,IF(D78=2,'Tipo '!$B$3,IF(D78=3,'Tipo '!$B$4,IF(D78=4,'Tipo '!$B$5,IF(D78=5,'Tipo '!$B$6,IF(D78=6,'Tipo '!$B$7,IF(D78=7,'Tipo '!$B$8,IF(D78=8,'Tipo '!$B$9,IF(D78=9,'Tipo '!$B$10,IF(D78=10,'Tipo '!$B$11,IF(D78=11,'Tipo '!$B$12,IF(D78=12,'Tipo '!$B$13,IF(D78=13,'Tipo '!$B$14,IF(D78=14,'Tipo '!$B$15,IF(D78=15,'Tipo '!$B$16,IF(D78=16,'Tipo '!$B$17,IF(D78=17,'Tipo '!$B$18,IF(D78=18,'Tipo '!$B$19,IF(D78=19,'Tipo '!$B$20,\"No ha seleccionado un tipo de contrato válido\")))))))))))))))))))","v":"CONTRATOS DE PRESTACIÓN DE SERVICIOS PROFESIONALES Y DE APOYO A LA GESTIÓN"},"Contratación directa","Prestación de servicios profesionales y de apoyo a la gestión, o para la ejecución de trabajos artísticos que sólo puedan encomendarse a determinadas personas naturales;","PRESTAR LOS SERVICIOS PROFESIONALES EN LA ALCALDIA LOCAL DE SANTA FE, PARA PLANEAR, ORIENTAR, ESTRUCTURAR Y COORDINAR LAS ACTIVIDADES DE GESTION AMBIENTAL AL INTERIOR DE LA ENTIDAD, IDENTIFICANDO Y CONTROLANDO LOS ASPECTOS AMBIENTALES CON LA NORMATIVIDAD AMBIENTAL VIGENTE Y ASI FORTALECER EL PROGRAMA AMBIENTAL DE LA ALCALDIA LOCAL","Inversión",45,{"$f":"IF(J78=1,'Equivalencia BH-BMPT'!$D$2,IF(J78=2,'Equivalencia BH-BMPT'!$D$3,IF(J78=3,'Equivalencia BH-BMPT'!$D$4,IF(J78=4,'Equivalencia BH-BMPT'!$D$5,IF(J78=5,'Equivalencia BH-BMPT'!$D$6,IF(J78=6,'Equivalencia BH-BMPT'!$D$7,IF(J78=7,'Equivalencia BH-BMPT'!$D$8,IF(J78=8,'Equivalencia BH-BMPT'!$D$9,IF(J78=9,'Equivalencia BH-BMPT'!$D$10,IF(J78=10,'Equivalencia BH-BMPT'!$D$11,IF(J78=11,'Equivalencia BH-BMPT'!$D$12,IF(J78=12,'Equivalencia BH-BMPT'!$D$13,IF(J78=13,'Equivalencia BH-BMPT'!$D$14,IF(J78=14,'Equivalencia BH-BMPT'!$D$15,IF(J78=15,'Equivalencia BH-BMPT'!$D$16,IF(J78=16,'Equivalencia BH-BMPT'!$D$17,IF(J78=17,'Equivalencia BH-BMPT'!$D$18,IF(J78=18,'Equivalencia BH-BMPT'!$D$19,IF(J78=19,'Equivalencia BH-BMPT'!$D$20,IF(J78=20,'Equivalencia BH-BMPT'!$D$21,IF(J78=21,'Equivalencia BH-BMPT'!$D$22,IF(J78=22,'Equivalencia BH-BMPT'!$D$23,IF(J78=23,'Equivalencia BH-BMPT'!#REF!,IF(J78=24,'Equivalencia BH-BMPT'!$D$25,IF(J78=25,'Equivalencia BH-BMPT'!$D$26,IF(J78=26,'Equivalencia BH-BMPT'!$D$27,IF(J78=27,'Equivalencia BH-BMPT'!$D$28,IF(J78=28,'Equivalencia BH-BMPT'!$D$29,IF(J78=29,'Equivalencia BH-BMPT'!$D$30,IF(J78=30,'Equivalencia BH-BMPT'!$D$31,IF(J78=31,'Equivalencia BH-BMPT'!$D$32,IF(J78=32,'Equivalencia BH-BMPT'!$D$33,IF(J78=33,'Equivalencia BH-BMPT'!$D$34,IF(J78=34,'Equivalencia BH-BMPT'!$D$35,IF(J78=35,'Equivalencia BH-BMPT'!$D$36,IF(J78=36,'Equivalencia BH-BMPT'!$D$37,IF(J78=37,'Equivalencia BH-BMPT'!$D$38,IF(J78=38,'Equivalencia BH-BMPT'!#REF!,IF(J78=39,'Equivalencia BH-BMPT'!$D$40,IF(J78=40,'Equivalencia BH-BMPT'!$D$41,IF(J78=41,'Equivalencia BH-BMPT'!$D$42,IF(J78=42,'Equivalencia BH-BMPT'!$D$43,IF(J78=43,'Equivalencia BH-BMPT'!$D$44,IF(J78=44,'Equivalencia BH-BMPT'!$D$45,IF(J78=45,'Equivalencia BH-BMPT'!$D$46,\"No ha seleccionado un número de programa\")))))))))))))))))))))))))))))))))))))))))))))","v":"Gobernanza e influencia local, regional e internacional"},1326,80735860,"JAIRO ALONSO PAEZ RUALES",37760000,null,null,1,9440000,47200000,41536000,"2017/03/16","2017/03/16","2018-01-15",240,57,null,null,"X",null,null,0.88,null,false]
[65,2017,"17-12-6474283",5,{"$f":"IF(D79=1,'Tipo '!$B$2,IF(D79=2,'Tipo '!$B$3,IF(D79=3,'Tipo '!$B$4,IF(D79=4,'Tipo '!$B$5,IF(D79=5,'Tipo '!$B$6,IF(D79=6,'Tipo '!$B$7,IF(D79=7,'Tipo '!$B$8,IF(D79=8,'Tipo '!$B$9,IF(D79=9,'Tipo '!$B$10,IF(D79=10,'Tipo '!$B$11,IF(D79=11,'Tipo '!$B$12,IF(D79=12,'Tipo '!$B$13,IF(D79=13,'Tipo '!$B$14,IF(D79=14,'Tipo '!$B$15,IF(D79=15,'Tipo '!$B$16,IF(D79=16,'Tipo '!$B$17,IF(D79=17,'Tipo '!$B$18,IF(D79=18,'Tipo '!$B$19,IF(D79=19,'Tipo '!$B$20,\"No ha seleccionado un tipo de contrato válido\")))))))))))))))))))","v":"CONTRATOS DE PRESTACIÓN DE SERVICIOS PROFESIONALES Y DE APOYO A LA GESTIÓN"},"Contratación directa","Prestación de servicios profesionales y de apoyo a la gestión, o para la ejecución de trabajos artísticos que sólo puedan encomendarse a determinadas personas naturales;","PRESTAR SERVICIOS DE APOYO AL AREA DE GESTION DE DESARROLLO LOCAL EN EL SEGUIMIENTO ADMINISTRATIVO, ACTUALIZACION Y CONSOLIDACION DE LA BASE DE DATOS Y SISTEMA ELCETRONICO, ADEMAS DEL MONITOREO DE TODO EL FLUJO DOCUMENTAL.","Inversión",45,{"$f":"IF(J79=1,'Equivalencia BH-BMPT'!$D$2,IF(J79=2,'Equivalencia BH-BMPT'!$D$3,IF(J79=3,'Equivalencia BH-BMPT'!$D$4,IF(J79=4,'Equivalencia BH-BMPT'!$D$5,IF(J79=5,'Equivalencia BH-BMPT'!$D$6,IF(J79=6,'Equivalencia BH-BMPT'!$D$7,IF(J79=7,'Equivalencia BH-BMPT'!$D$8,IF(J79=8,'Equivalencia BH-BMPT'!$D$9,IF(J79=9,'Equivalencia BH-BMPT'!$D$10,IF(J79=10,'Equivalencia BH-BMPT'!$D$11,IF(J79=11,'Equivalencia BH-BMPT'!$D$12,IF(J79=12,'Equivalencia BH-BMPT'!$D$13,IF(J79=13,'Equivalencia BH-BMPT'!$D$14,IF(J79=14,'Equivalencia BH-BMPT'!$D$15,IF(J79=15,'Equivalencia BH-BMPT'!$D$16,IF(J79=16,'Equivalencia BH-BMPT'!$D$17,IF(J79=17,'Equivalencia BH-BMPT'!$D$18,IF(J79=18,'Equivalencia BH-BMPT'!$D$19,IF(J79=19,'Equivalencia BH-BMPT'!$D$20,IF(J79=20,'Equivalencia BH-BMPT'!$D$21,IF(J79=21,'Equivalencia BH-BMPT'!$D$22,IF(J79=22,'Equivalencia BH-BMPT'!$D$23,IF(J79=23,'Equivalencia BH-BMPT'!#REF!,IF(J79=24,'Equivalencia BH-BMPT'!$D$25,IF(J79=25,'Equivalencia BH-BMPT'!$D$26,IF(J79=26,'Equivalencia BH-BMPT'!$D$27,IF(J79=27,'Equivalencia BH-BMPT'!$D$28,IF(J79=28,'Equivalencia BH-BMPT'!$D$29,IF(J79=29,'Equivalencia BH-BMPT'!$D$30,IF(J79=30,'Equivalencia BH-BMPT'!$D$31,IF(J79=31,'Equivalencia BH-BMPT'!$D$32,IF(J79=32,'Equivalencia BH-BMPT'!$D$33,IF(J79=33,'Equivalencia BH-BMPT'!$D$34,IF(J79=34,'Equivalencia BH-BMPT'!$D$35,IF(J79=35,'Equivalencia BH-BMPT'!$D$36,IF(J79=36,'Equivalencia BH-BMPT'!$D$37,IF(J79=37,'Equivalencia BH-BMPT'!$D$38,IF(J79=38,'Equivalencia BH-BMPT'!#REF!,IF(J79=39,'Equivalencia BH-BMPT'!$D$40,IF(J79=40,'Equivalencia BH-BMPT'!$D$41,IF(J79=41,'Equivalencia BH-BMPT'!$D$42,IF(J79=42,'Equivalencia BH-BMPT'!$D$43,IF(J79=43,'Equivalencia BH-BMPT'!$D$44,IF(J79=44,'Equivalencia BH-BMPT'!$D$45,IF(J79=45,'Equivalencia BH-BMPT'!$D$46,\"No ha seleccionado un número de programa\")))))))))))))))))))))))))))))))))))))))))))))","v":"Gobernanza e influencia local, regional e internacional"},1326,1023902688,"LINDA ESTEFANIA ARIAS BAQUERO",21200000,null,null,1,5300000,26500000,23320000,"2017/03/16","2017/03/16","2018-01-15",240,58,null,null,"X",null,null,0.88,null,false]
[66,2017,"17-12-6479956",5,{"$f":"IF(D80=1,'Tipo '!$B$2,IF(D80=2,'Tipo '!$B$3,IF(D80=3,'Tipo '!$B$4,IF(D80=4,'Tipo '!$B$5,IF(D80=5,'Tipo '!$B$6,IF(D80=6,'Tipo '!$B$7,IF(D80=7,'Tipo '!$B$8,IF(D80=8,'Tipo '!$B$9,IF(D80=9,'Tipo '!$B$10,IF(D80=10,'Tipo '!$B$11,IF(D80=11,'Tipo '!$B$12,IF(D80=12,'Tipo '!$B$13,IF(D80=13,'Tipo '!$B$14,IF(D80=14,'Tipo '!$B$15,IF(D80=15,'Tipo '!$B$16,IF(D80=16,'Tipo '!$B$17,IF(D80=17,'Tipo '!$B$18,IF(D80=18,'Tipo '!$B$19,IF(D80=19,'Tipo '!$B$20,\"No ha seleccionado un tipo de contrato válido\")))))))))))))))))))","v":"CONTRATOS DE PRESTACIÓN DE SERVICIOS PROFESIONALES Y DE APOYO A LA GESTIÓN"},"Contratación directa","Prestación de servicios profesionales y de apoyo a la gestión, o para la ejecución de trabajos artísticos que sólo puedan encomendarse a determinadas personas naturales;","PRESTAR APOYO AL AREA DE GESTION POLICIVA Y AREA DE GESTION DE DESARROLLO LOCAL EN LA CONDUCCION DEL PARQUE AUTOMOTOR DE PROPIEDAD DEL FDLSF QUE LE SEA ASIGNADO","Inversión",45,{"$f":"IF(J80=1,'Equivalencia BH-BMPT'!$D$2,IF(J80=2,'Equivalencia BH-BMPT'!$D$3,IF(J80=3,'Equivalencia BH-BMPT'!$D$4,IF(J80=4,'Equivalencia BH-BMPT'!$D$5,IF(J80=5,'Equivalencia BH-BMPT'!$D$6,IF(J80=6,'Equivalencia BH-BMPT'!$D$7,IF(J80=7,'Equivalencia BH-BMPT'!$D$8,IF(J80=8,'Equivalencia BH-BMPT'!$D$9,IF(J80=9,'Equivalencia BH-BMPT'!$D$10,IF(J80=10,'Equivalencia BH-BMPT'!$D$11,IF(J80=11,'Equivalencia BH-BMPT'!$D$12,IF(J80=12,'Equivalencia BH-BMPT'!$D$13,IF(J80=13,'Equivalencia BH-BMPT'!$D$14,IF(J80=14,'Equivalencia BH-BMPT'!$D$15,IF(J80=15,'Equivalencia BH-BMPT'!$D$16,IF(J80=16,'Equivalencia BH-BMPT'!$D$17,IF(J80=17,'Equivalencia BH-BMPT'!$D$18,IF(J80=18,'Equivalencia BH-BMPT'!$D$19,IF(J80=19,'Equivalencia BH-BMPT'!$D$20,IF(J80=20,'Equivalencia BH-BMPT'!$D$21,IF(J80=21,'Equivalencia BH-BMPT'!$D$22,IF(J80=22,'Equivalencia BH-BMPT'!$D$23,IF(J80=23,'Equivalencia BH-BMPT'!#REF!,IF(J80=24,'Equivalencia BH-BMPT'!$D$25,IF(J80=25,'Equivalencia BH-BMPT'!$D$26,IF(J80=26,'Equivalencia BH-BMPT'!$D$27,IF(J80=27,'Equivalencia BH-BMPT'!$D$28,IF(J80=28,'Equivalencia BH-BMPT'!$D$29,IF(J80=29,'Equivalencia BH-BMPT'!$D$30,IF(J80=30,'Equivalencia BH-BMPT'!$D$31,IF(J80=31,'Equivalencia BH-BMPT'!$D$32,IF(J80=32,'Equivalencia BH-BMPT'!$D$33,IF(J80=33,'Equivalencia BH-BMPT'!$D$34,IF(J80=34,'Equivalencia BH-BMPT'!$D$35,IF(J80=35,'Equivalencia BH-BMPT'!$D$36,IF(J80=36,'Equivalencia BH-BMPT'!$D$37,IF(J80=37,'Equivalencia BH-BMPT'!$D$38,IF(J80=38,'Equivalencia BH-BMPT'!#REF!,IF(J80=39,'Equivalencia BH-BMPT'!$D$40,IF(J80=40,'Equivalencia BH-BMPT'!$D$41,IF(J80=41,'Equivalencia BH-BMPT'!$D$42,IF(J80=42,'Equivalencia BH-BMPT'!$D$43,IF(J80=43,'Equivalencia BH-BMPT'!$D$44,IF(J80=44,'Equivalencia BH-BMPT'!$D$45,IF(J80=45,'Equivalencia BH-BMPT'!$D$46,\"No ha seleccionado un número de programa\")))))))))))))))))))))))))))))))))))))))))))))","v":"Gobernanza e influencia local, regional e internacional"},1326,80231510,"JOSE MIGUEL GIRALDO GARCIA",16800000,null,null,1,4200000,21000000,18480000,"2017/03/16","2017/03/16","2018-01-15",240,59,null,null,"X",null,null,0.88,null,false]
[67,2017,"17-13-6318729",5,{"$f":"IF(D81=1,'Tipo '!$B$2,IF(D81=2,'Tipo '!$B$3,IF(D81=3,'Tipo '!$B$4,IF(D81=4,'Tipo '!$B$5,IF(D81=5,'Tipo '!$B$6,IF(D81=6,'Tipo '!$B$7,IF(D81=7,'Tipo '!$B$8,IF(D81=8,'Tipo '!$B$9,IF(D81=9,'Tipo '!$B$10,IF(D81=10,'Tipo '!$B$11,IF(D81=11,'Tipo '!$B$12,IF(D81=12,'Tipo '!$B$13,IF(D81=13,'Tipo '!$B$14,IF(D81=14,'Tipo '!$B$15,IF(D81=15,'Tipo '!$B$16,IF(D81=16,'Tipo '!$B$17,IF(D81=17,'Tipo '!$B$18,IF(D81=18,'Tipo '!$B$19,IF(D81=19,'Tipo '!$B$20,\"No ha seleccionado un tipo de contrato válido\")))))))))))))))))))","v":"CONTRATOS DE PRESTACIÓN DE SERVICIOS PROFESIONALES Y DE APOYO A LA GESTIÓN"},"Contratación directa","Prestación de servicios profesionales y de apoyo a la gestión, o para la ejecución de trabajos artísticos que sólo puedan encomendarse a determinadas personas naturales;","CONTRATAR EL SERVICIO DE IMPRESION, PRODUCCION, POSTPRODUCCION, CORRECCIÓN DE ESTILO Y DIAGRAMACIÓN DEL PLAN DE DESARROLLO LOCAL DE SANTA FE PARA DIFUNDIR EL PLAN DE DESARROLLO ECONOMICO, SOCIAL, AMBIENTAL Y DE OBRAS PÚBLICAS PARA LA LOCALIDAD DE SANTA FE 20172020 \"SANTA FE MEJOR PARA TODOS\", EN EL MARCO DEL PROYECTO 1327 \"VOZ PARA TODOS\"","Inversión",45,{"$f":"IF(J81=1,'Equivalencia BH-BMPT'!$D$2,IF(J81=2,'Equivalencia BH-BMPT'!$D$3,IF(J81=3,'Equivalencia BH-BMPT'!$D$4,IF(J81=4,'Equivalencia BH-BMPT'!$D$5,IF(J81=5,'Equivalencia BH-BMPT'!$D$6,IF(J81=6,'Equivalencia BH-BMPT'!$D$7,IF(J81=7,'Equivalencia BH-BMPT'!$D$8,IF(J81=8,'Equivalencia BH-BMPT'!$D$9,IF(J81=9,'Equivalencia BH-BMPT'!$D$10,IF(J81=10,'Equivalencia BH-BMPT'!$D$11,IF(J81=11,'Equivalencia BH-BMPT'!$D$12,IF(J81=12,'Equivalencia BH-BMPT'!$D$13,IF(J81=13,'Equivalencia BH-BMPT'!$D$14,IF(J81=14,'Equivalencia BH-BMPT'!$D$15,IF(J81=15,'Equivalencia BH-BMPT'!$D$16,IF(J81=16,'Equivalencia BH-BMPT'!$D$17,IF(J81=17,'Equivalencia BH-BMPT'!$D$18,IF(J81=18,'Equivalencia BH-BMPT'!$D$19,IF(J81=19,'Equivalencia BH-BMPT'!$D$20,IF(J81=20,'Equivalencia BH-BMPT'!$D$21,IF(J81=21,'Equivalencia BH-BMPT'!$D$22,IF(J81=22,'Equivalencia BH-BMPT'!$D$23,IF(J81=23,'Equivalencia BH-BMPT'!#REF!,IF(J81=24,'Equivalencia BH-BMPT'!$D$25,IF(J81=25,'Equivalencia BH-BMPT'!$D$26,IF(J81=26,'Equivalencia BH-BMPT'!$D$27,IF(J81=27,'Equivalencia BH-BMPT'!$D$28,IF(J81=28,'Equivalencia BH-BMPT'!$D$29,IF(J81=29,'Equivalencia BH-BMPT'!$D$30,IF(J81=30,'Equivalencia BH-BMPT'!$D$31,IF(J81=31,'Equivalencia BH-BMPT'!$D$32,IF(J81=32,'Equivalencia BH-BMPT'!$D$33,IF(J81=33,'Equivalencia BH-BMPT'!$D$34,IF(J81=34,'Equivalencia BH-BMPT'!$D$35,IF(J81=35,'Equivalencia BH-BMPT'!$D$36,IF(J81=36,'Equivalencia BH-BMPT'!$D$37,IF(J81=37,'Equivalencia BH-BMPT'!$D$38,IF(J81=38,'Equivalencia BH-BMPT'!#REF!,IF(J81=39,'Equivalencia BH-BMPT'!$D$40,IF(J81=40,'Equivalencia BH-BMPT'!$D$41,IF(J81=41,'Equivalencia BH-BMPT'!$D$42,IF(J81=42,'Equivalencia BH-BMPT'!$D$43,IF(J81=43,'Equivalencia BH-BMPT'!$D$44,IF(J81=44,'Equivalencia BH-BMPT'!$D$45,IF(J81=45,'Equivalencia BH-BMPT'!$D$46,\"No ha seleccionado un número de programa\")))))))))))))))))))))))))))))))))))))))))))))","v":"Gobernanza e influencia local, regional e internacional"},1327,900898721,"MAGNO PUBLICIDAD SAS",16325253,null,null,0,0,16325253,16325253,"2017/03/16","2017/03/16","2017-05-15",60,60,null,null,"X",null,null,1,null,false]
[68,2017,"17-12-6508423",5,{"$f":"IF(D82=1,'Tipo '!$B$2,IF(D82=2,'Tipo '!$B$3,IF(D82=3,'Tipo '!$B$4,IF(D82=4,'Tipo '!$B$5,IF(D82=5,'Tipo '!$B$6,IF(D82=6,'Tipo '!$B$7,IF(D82=7,'Tipo '!$B$8,IF(D82=8,'Tipo '!$B$9,IF(D82=9,'Tipo '!$B$10,IF(D82=10,'Tipo '!$B$11,IF(D82=11,'Tipo '!$B$12,IF(D82=12,'Tipo '!$B$13,IF(D82=13,'Tipo '!$B$14,IF(D82=14,'Tipo '!$B$15,IF(D82=15,'Tipo '!$B$16,IF(D82=16,'Tipo '!$B$17,IF(D82=17,'Tipo '!$B$18,IF(D82=18,'Tipo '!$B$19,IF(D82=19,'Tipo '!$B$20,\"No ha seleccionado un tipo de contrato válido\")))))))))))))))))))","v":"CONTRATOS DE PRESTACIÓN DE SERVICIOS PROFESIONALES Y DE APOYO A LA GESTIÓN"},"Contratación directa","Prestación de servicios profesionales y de apoyo a la gestión, o para la ejecución de trabajos artísticos que sólo puedan encomendarse a determinadas personas naturales;","PRESTAR LOS SERVICIOS PROFESIONALES PARA LA OPERACIÓN, PRESTACION, SEGUIMIENTO Y CUMPLIMIENTO DE LOS PROCEDIMIENTOS ADMINISTRATIVOS, OPERATIVOS Y PROGRAMATICOS DEL SERVICIO SOCIAL APOYO ECONOMICO TIPO C, QUE CONTRIBUYAN A LA GARANTIA DE LOS DERECHOS DE LA POBLACION MAYOR EN EL MARCO DE LA POLITICA PUBLICA SOCIAL PARA EL ENVEJECIMIENTO Y LA VEJEZ EN EL DISTRITO CAPITAL A CARGO DE LA ALCALDIA LOCAL","Inversión",3,{"$f":"IF(J82=1,'Equivalencia BH-BMPT'!$D$2,IF(J82=2,'Equivalencia BH-BMPT'!$D$3,IF(J82=3,'Equivalencia BH-BMPT'!$D$4,IF(J82=4,'Equivalencia BH-BMPT'!$D$5,IF(J82=5,'Equivalencia BH-BMPT'!$D$6,IF(J82=6,'Equivalencia BH-BMPT'!$D$7,IF(J82=7,'Equivalencia BH-BMPT'!$D$8,IF(J82=8,'Equivalencia BH-BMPT'!$D$9,IF(J82=9,'Equivalencia BH-BMPT'!$D$10,IF(J82=10,'Equivalencia BH-BMPT'!$D$11,IF(J82=11,'Equivalencia BH-BMPT'!$D$12,IF(J82=12,'Equivalencia BH-BMPT'!$D$13,IF(J82=13,'Equivalencia BH-BMPT'!$D$14,IF(J82=14,'Equivalencia BH-BMPT'!$D$15,IF(J82=15,'Equivalencia BH-BMPT'!$D$16,IF(J82=16,'Equivalencia BH-BMPT'!$D$17,IF(J82=17,'Equivalencia BH-BMPT'!$D$18,IF(J82=18,'Equivalencia BH-BMPT'!$D$19,IF(J82=19,'Equivalencia BH-BMPT'!$D$20,IF(J82=20,'Equivalencia BH-BMPT'!$D$21,IF(J82=21,'Equivalencia BH-BMPT'!$D$22,IF(J82=22,'Equivalencia BH-BMPT'!$D$23,IF(J82=23,'Equivalencia BH-BMPT'!#REF!,IF(J82=24,'Equivalencia BH-BMPT'!$D$25,IF(J82=25,'Equivalencia BH-BMPT'!$D$26,IF(J82=26,'Equivalencia BH-BMPT'!$D$27,IF(J82=27,'Equivalencia BH-BMPT'!$D$28,IF(J82=28,'Equivalencia BH-BMPT'!$D$29,IF(J82=29,'Equivalencia BH-BMPT'!$D$30,IF(J82=30,'Equivalencia BH-BMPT'!$D$31,IF(J82=31,'Equivalencia BH-BMPT'!$D$32,IF(J82=32,'Equivalencia BH-BMPT'!$D$33,IF(J82=33,'Equivalencia BH-BMPT'!$D$34,IF(J82=34,'Equivalencia BH-BMPT'!$D$35,IF(J82=35,'Equivalencia BH-BMPT'!$D$36,IF(J82=36,'Equivalencia BH-BMPT'!$D$37,IF(J82=37,'Equivalencia BH-BMPT'!$D$38,IF(J82=38,'Equivalencia BH-BMPT'!#REF!,IF(J82=39,'Equivalencia BH-BMPT'!$D$40,IF(J82=40,'Equivalencia BH-BMPT'!$D$41,IF(J82=41,'Equivalencia BH-BMPT'!$D$42,IF(J82=42,'Equivalencia BH-BMPT'!$D$43,IF(J82=43,'Equivalencia BH-BMPT'!$D$44,IF(J82=44,'Equivalencia BH-BMPT'!$D$45,IF(J82=45,'Equivalencia BH-BMPT'!$D$46,\"No ha seleccionado un número de programa\")))))))))))))))))))))))))))))))))))))))))))))","v":"Igualdad y autonomía para una Bogotá incluyente"},1315,1022356559,"JULIAN EDUARDO MELO ALARCÓN",32480000,null,null,1,3518667,35998667,33156666,"2017/04/03","2017/04/05","2017-12-30",240,61,null,null," ","X",null,{"$f":"SUM(U82/T82)","v":0.92105260453116222},null,{"$f":"IF(I82=\"Funcionamiento\",J82=0,J82=\"\")","v":false}]
[69,2017,"17-12-6508497",4,{"$f":"IF(D83=1,'Tipo '!$B$2,IF(D83=2,'Tipo '!$B$3,IF(D83=3,'Tipo '!$B$4,IF(D83=4,'Tipo '!$B$5,IF(D83=5,'Tipo '!$B$6,IF(D83=6,'Tipo '!$B$7,IF(D83=7,'Tipo '!$B$8,IF(D83=8,'Tipo '!$B$9,IF(D83=9,'Tipo '!$B$10,IF(D83=10,'Tipo '!$B$11,IF(D83=11,'Tipo '!$B$12,IF(D83=12,'Tipo '!$B$13,IF(D83=13,'Tipo '!$B$14,IF(D83=14,'Tipo '!$B$15,IF(D83=15,'Tipo '!$B$16,IF(D83=16,'Tipo '!$B$17,IF(D83=17,'Tipo '!$B$18,IF(D83=18,'Tipo '!$B$19,IF(D83=19,'Tipo '!$B$20,\"No ha seleccionado un tipo de contrato válido\")))))))))))))))))))","v":"CONTRATOS DE PRESTACIÓN DE SERVICIOS"},"Contratación mínima cuantia ","No aplica","PRESTAR LOS SERVICIOS PROFESIONALES PARA LA OPERACIÓN, PRESTACION, SEGUIMIENTO Y CUMPLIMIENTO DE LOS PROCEDIMIENTOS ADMINISTRATIVOS, OPERATIVOS Y PROGRAMATICOS DEL SERVICIO SOCIAL APOYO ECONOMICO TIPO C, QUE CONTRIBUYAN A LA GARANTIA DE LOS DERECHOS DE LA POBLACION MAYOR EN EL MARCO DE LA POLITICA PUBLICA SOCIAL PARA EL ENVEJECIMIENTO Y LA VEJEZ EN EL DISTRITO CAPITAL A CARGO DE LA ALCALDIA LOCAL","Inversión",3,{"$f":"IF(J83=1,'Equivalencia BH-BMPT'!$D$2,IF(J83=2,'Equivalencia BH-BMPT'!$D$3,IF(J83=3,'Equivalencia BH-BMPT'!$D$4,IF(J83=4,'Equivalencia BH-BMPT'!$D$5,IF(J83=5,'Equivalencia BH-BMPT'!$D$6,IF(J83=6,'Equivalencia BH-BMPT'!$D$7,IF(J83=7,'Equivalencia BH-BMPT'!$D$8,IF(J83=8,'Equivalencia BH-BMPT'!$D$9,IF(J83=9,'Equivalencia BH-BMPT'!$D$10,IF(J83=10,'Equivalencia BH-BMPT'!$D$11,IF(J83=11,'Equivalencia BH-BMPT'!$D$12,IF(J83=12,'Equivalencia BH-BMPT'!$D$13,IF(J83=13,'Equivalencia BH-BMPT'!$D$14,IF(J83=14,'Equivalencia BH-BMPT'!$D$15,IF(J83=15,'Equivalencia BH-BMPT'!$D$16,IF(J83=16,'Equivalencia BH-BMPT'!$D$17,IF(J83=17,'Equivalencia BH-BMPT'!$D$18,IF(J83=18,'Equivalencia BH-BMPT'!$D$19,IF(J83=19,'Equivalencia BH-BMPT'!$D$20,IF(J83=20,'Equivalencia BH-BMPT'!$D$21,IF(J83=21,'Equivalencia BH-BMPT'!$D$22,IF(J83=22,'Equivalencia BH-BMPT'!$D$23,IF(J83=23,'Equivalencia BH-BMPT'!#REF!,IF(J83=24,'Equivalencia BH-BMPT'!$D$25,IF(J83=25,'Equivalencia BH-BMPT'!$D$26,IF(J83=26,'Equivalencia BH-BMPT'!$D$27,IF(J83=27,'Equivalencia BH-BMPT'!$D$28,IF(J83=28,'Equivalencia BH-BMPT'!$D$29,IF(J83=29,'Equivalencia BH-BMPT'!$D$30,IF(J83=30,'Equivalencia BH-BMPT'!$D$31,IF(J83=31,'Equivalencia BH-BMPT'!$D$32,IF(J83=32,'Equivalencia BH-BMPT'!$D$33,IF(J83=33,'Equivalencia BH-BMPT'!$D$34,IF(J83=34,'Equivalencia BH-BMPT'!$D$35,IF(J83=35,'Equivalencia BH-BMPT'!$D$36,IF(J83=36,'Equivalencia BH-BMPT'!$D$37,IF(J83=37,'Equivalencia BH-BMPT'!$D$38,IF(J83=38,'Equivalencia BH-BMPT'!#REF!,IF(J83=39,'Equivalencia BH-BMPT'!$D$40,IF(J83=40,'Equivalencia BH-BMPT'!$D$41,IF(J83=41,'Equivalencia BH-BMPT'!$D$42,IF(J83=42,'Equivalencia BH-BMPT'!$D$43,IF(J83=43,'Equivalencia BH-BMPT'!$D$44,IF(J83=44,'Equivalencia BH-BMPT'!$D$45,IF(J83=45,'Equivalencia BH-BMPT'!$D$46,\"No ha seleccionado un número de programa\")))))))))))))))))))))))))))))))))))))))))))))","v":"Igualdad y autonomía para una Bogotá incluyente"},1315,1014177621,"GINA ANDREA CAMINO REYES",32480000,null,null,2,5954667,38434667,32886000,"2017/04/03","2017/04/07","2017-12-30",240,62,null,null," ","X",null,0.85563379539622397,null,false]
[70,2017,"17-13-6375463",5,{"$f":"IF(D84=1,'Tipo '!$B$2,IF(D84=2,'Tipo '!$B$3,IF(D84=3,'Tipo '!$B$4,IF(D84=4,'Tipo '!$B$5,IF(D84=5,'Tipo '!$B$6,IF(D84=6,'Tipo '!$B$7,IF(D84=7,'Tipo '!$B$8,IF(D84=8,'Tipo '!$B$9,IF(D84=9,'Tipo '!$B$10,IF(D84=10,'Tipo '!$B$11,IF(D84=11,'Tipo '!$B$12,IF(D84=12,'Tipo '!$B$13,IF(D84=13,'Tipo '!$B$14,IF(D84=14,'Tipo '!$B$15,IF(D84=15,'Tipo '!$B$16,IF(D84=16,'Tipo '!$B$17,IF(D84=17,'Tipo '!$B$18,IF(D84=18,'Tipo '!$B$19,IF(D84=19,'Tipo '!$B$20,\"No ha seleccionado un tipo de contrato válido\")))))))))))))))))))","v":"CONTRATOS DE PRESTACIÓN DE SERVICIOS PROFESIONALES Y DE APOYO A LA GESTIÓN"},"Contratación directa","Prestación de servicios profesionales y de apoyo a la gestión, o para la ejecución de trabajos artísticos que sólo puedan encomendarse a determinadas personas naturales;","CONTRATAR UNA PÓLIZA COLECTIVA DE SEGURO DE VIDA PARA LOS EDILES DE LA JUNTA ADMINISTRADORA LOCAL","Funcionamiento",4,{"$f":"IF(J84=1,'Equivalencia BH-BMPT'!$D$2,IF(J84=2,'Equivalencia BH-BMPT'!$D$3,IF(J84=3,'Equivalencia BH-BMPT'!$D$4,IF(J84=4,'Equivalencia BH-BMPT'!$D$5,IF(J84=5,'Equivalencia BH-BMPT'!$D$6,IF(J84=6,'Equivalencia BH-BMPT'!$D$7,IF(J84=7,'Equivalencia BH-BMPT'!$D$8,IF(J84=8,'Equivalencia BH-BMPT'!$D$9,IF(J84=9,'Equivalencia BH-BMPT'!$D$10,IF(J84=10,'Equivalencia BH-BMPT'!$D$11,IF(J84=11,'Equivalencia BH-BMPT'!$D$12,IF(J84=12,'Equivalencia BH-BMPT'!$D$13,IF(J84=13,'Equivalencia BH-BMPT'!$D$14,IF(J84=14,'Equivalencia BH-BMPT'!$D$15,IF(J84=15,'Equivalencia BH-BMPT'!$D$16,IF(J84=16,'Equivalencia BH-BMPT'!$D$17,IF(J84=17,'Equivalencia BH-BMPT'!$D$18,IF(J84=18,'Equivalencia BH-BMPT'!$D$19,IF(J84=19,'Equivalencia BH-BMPT'!$D$20,IF(J84=20,'Equivalencia BH-BMPT'!$D$21,IF(J84=21,'Equivalencia BH-BMPT'!$D$22,IF(J84=22,'Equivalencia BH-BMPT'!$D$23,IF(J84=23,'Equivalencia BH-BMPT'!#REF!,IF(J84=24,'Equivalencia BH-BMPT'!$D$25,IF(J84=25,'Equivalencia BH-BMPT'!$D$26,IF(J84=26,'Equivalencia BH-BMPT'!$D$27,IF(J84=27,'Equivalencia BH-BMPT'!$D$28,IF(J84=28,'Equivalencia BH-BMPT'!$D$29,IF(J84=29,'Equivalencia BH-BMPT'!$D$30,IF(J84=30,'Equivalencia BH-BMPT'!$D$31,IF(J84=31,'Equivalencia BH-BMPT'!$D$32,IF(J84=32,'Equivalencia BH-BMPT'!$D$33,IF(J84=33,'Equivalencia BH-BMPT'!$D$34,IF(J84=34,'Equivalencia BH-BMPT'!$D$35,IF(J84=35,'Equivalencia BH-BMPT'!$D$36,IF(J84=36,'Equivalencia BH-BMPT'!$D$37,IF(J84=37,'Equivalencia BH-BMPT'!$D$38,IF(J84=38,'Equivalencia BH-BMPT'!#REF!,IF(J84=39,'Equivalencia BH-BMPT'!$D$40,IF(J84=40,'Equivalencia BH-BMPT'!$D$41,IF(J84=41,'Equivalencia BH-BMPT'!$D$42,IF(J84=42,'Equivalencia BH-BMPT'!$D$43,IF(J84=43,'Equivalencia BH-BMPT'!$D$44,IF(J84=44,'Equivalencia BH-BMPT'!$D$45,IF(J84=45,'Equivalencia BH-BMPT'!$D$46,\"No ha seleccionado un número de programa\")))))))))))))))))))))))))))))))))))))))))))))","v":"Familias protegidas y adaptadas al cambio climático"},0,860002400,"LA PREVISORA S.A COMPAÑÍA DE SEGUROS",8188719,null,null,0,0,8188719,8188719,"2017/04/05","2017/04/18","2018-04-17",16350,63,null,null,"X",null,null,1,null,false]
[71,2017,"17-12-6508542",5,{"$f":"IF(D85=1,'Tipo '!$B$2,IF(D85=2,'Tipo '!$B$3,IF(D85=3,'Tipo '!$B$4,IF(D85=4,'Tipo '!$B$5,IF(D85=5,'Tipo '!$B$6,IF(D85=6,'Tipo '!$B$7,IF(D85=7,'Tipo '!$B$8,IF(D85=8,'Tipo '!$B$9,IF(D85=9,'Tipo '!$B$10,IF(D85=10,'Tipo '!$B$11,IF(D85=11,'Tipo '!$B$12,IF(D85=12,'Tipo '!$B$13,IF(D85=13,'Tipo '!$B$14,IF(D85=14,'Tipo '!$B$15,IF(D85=15,'Tipo '!$B$16,IF(D85=16,'Tipo '!$B$17,IF(D85=17,'Tipo '!$B$18,IF(D85=18,'Tipo '!$B$19,IF(D85=19,'Tipo '!$B$20,\"No ha seleccionado un tipo de contrato válido\")))))))))))))))))))","v":"CONTRATOS DE PRESTACIÓN DE SERVICIOS PROFESIONALES Y DE APOYO A LA GESTIÓN"},"Contratación directa","Prestación de servicios profesionales y de apoyo a la gestión, o para la ejecución de trabajos artísticos que sólo puedan encomendarse a determinadas personas naturales;","PRESTAR LOS SERVICIOS EN EL PUNTO VIVE DIGITAL UBICADO EN EL PAS (PUNTO DE ARTICULACIÓN SOCIAL) DE LOURDES DE LA LOCALIDAD DE SANTA FE UBICADO EN LA CRA 2 N° 4-10, PARA DESARROLLAR TODAS LAS ACTIVIDADES DE ADMINISTRACION QUE PERMITAN PRESTAR UN EXCELENTE FUNCIONAMIENTO PARA LA COMUNIDAD","Inversión",45,{"$f":"IF(J85=1,'Equivalencia BH-BMPT'!$D$2,IF(J85=2,'Equivalencia BH-BMPT'!$D$3,IF(J85=3,'Equivalencia BH-BMPT'!$D$4,IF(J85=4,'Equivalencia BH-BMPT'!$D$5,IF(J85=5,'Equivalencia BH-BMPT'!$D$6,IF(J85=6,'Equivalencia BH-BMPT'!$D$7,IF(J85=7,'Equivalencia BH-BMPT'!$D$8,IF(J85=8,'Equivalencia BH-BMPT'!$D$9,IF(J85=9,'Equivalencia BH-BMPT'!$D$10,IF(J85=10,'Equivalencia BH-BMPT'!$D$11,IF(J85=11,'Equivalencia BH-BMPT'!$D$12,IF(J85=12,'Equivalencia BH-BMPT'!$D$13,IF(J85=13,'Equivalencia BH-BMPT'!$D$14,IF(J85=14,'Equivalencia BH-BMPT'!$D$15,IF(J85=15,'Equivalencia BH-BMPT'!$D$16,IF(J85=16,'Equivalencia BH-BMPT'!$D$17,IF(J85=17,'Equivalencia BH-BMPT'!$D$18,IF(J85=18,'Equivalencia BH-BMPT'!$D$19,IF(J85=19,'Equivalencia BH-BMPT'!$D$20,IF(J85=20,'Equivalencia BH-BMPT'!$D$21,IF(J85=21,'Equivalencia BH-BMPT'!$D$22,IF(J85=22,'Equivalencia BH-BMPT'!$D$23,IF(J85=23,'Equivalencia BH-BMPT'!#REF!,IF(J85=24,'Equivalencia BH-BMPT'!$D$25,IF(J85=25,'Equivalencia BH-BMPT'!$D$26,IF(J85=26,'Equivalencia BH-BMPT'!$D$27,IF(J85=27,'Equivalencia BH-BMPT'!$D$28,IF(J85=28,'Equivalencia BH-BMPT'!$D$29,IF(J85=29,'Equivalencia BH-BMPT'!$D$30,IF(J85=30,'Equivalencia BH-BMPT'!$D$31,IF(J85=31,'Equivalencia BH-BMPT'!$D$32,IF(J85=32,'Equivalencia BH-BMPT'!$D$33,IF(J85=33,'Equivalencia BH-BMPT'!$D$34,IF(J85=34,'Equivalencia BH-BMPT'!$D$35,IF(J85=35,'Equivalencia BH-BMPT'!$D$36,IF(J85=36,'Equivalencia BH-BMPT'!$D$37,IF(J85=37,'Equivalencia BH-BMPT'!$D$38,IF(J85=38,'Equivalencia BH-BMPT'!#REF!,IF(J85=39,'Equivalencia BH-BMPT'!$D$40,IF(J85=40,'Equivalencia BH-BMPT'!$D$41,IF(J85=41,'Equivalencia BH-BMPT'!$D$42,IF(J85=42,'Equivalencia BH-BMPT'!$D$43,IF(J85=43,'Equivalencia BH-BMPT'!$D$44,IF(J85=44,'Equivalencia BH-BMPT'!$D$45,IF(J85=45,'Equivalencia BH-BMPT'!$D$46,\"No ha seleccionado un número de programa\")))))))))))))))))))))))))))))))))))))))))))))","v":"Gobernanza e influencia local, regional e internacional"},1326,22657691,"ANGELA MILENA ARIZA ALTAMAR",25600000,null,null,1,2560000,28160000,26026667,"2017/04/05","2017/04/06","2017-12-30",240,64,null,null," ","X",null,0.92424243607954548,null,false]
[72,2017,"17-12-6516935",10,{"$f":"IF(D86=1,'Tipo '!$B$2,IF(D86=2,'Tipo '!$B$3,IF(D86=3,'Tipo '!$B$4,IF(D86=4,'Tipo '!$B$5,IF(D86=5,'Tipo '!$B$6,IF(D86=6,'Tipo '!$B$7,IF(D86=7,'Tipo '!$B$8,IF(D86=8,'Tipo '!$B$9,IF(D86=9,'Tipo '!$B$10,IF(D86=10,'Tipo '!$B$11,IF(D86=11,'Tipo '!$B$12,IF(D86=12,'Tipo '!$B$13,IF(D86=13,'Tipo '!$B$14,IF(D86=14,'Tipo '!$B$15,IF(D86=15,'Tipo '!$B$16,IF(D86=16,'Tipo '!$B$17,IF(D86=17,'Tipo '!$B$18,IF(D86=18,'Tipo '!$B$19,IF(D86=19,'Tipo '!$B$20,\"No ha seleccionado un tipo de contrato válido\")))))))))))))))))))","v":"SEGUROS"},"Contratación mínima cuantia ","No aplica","EL ARRENDAMIENTO DEL INMUEBLE (BODEGA) UBICADO EN LA CALLE 20 # 17-24 DE LA CIUDAD DE BOGOTÁ D.C, LA CUAL SERÁ UTILIZADA PARA ALMACENAR BIENES MUEBLES Y ELEMENTOS INCAUTADOS EN LOS OPERATIVOS REALIZADOS POR LA ALCALDIA LOCAL DE SANTA FE Y/O COMANDO DE LA ESTACIÓN TERCERA DE POLICIA, CON OCASION DE LA RECUPERACIÓN DEL ESPACIO PUBLICO DE LA LOCALIDAD DE SANTA FE","Funcionamiento",0,{"$f":"IF(J86=1,'Equivalencia BH-BMPT'!$D$2,IF(J86=2,'Equivalencia BH-BMPT'!$D$3,IF(J86=3,'Equivalencia BH-BMPT'!$D$4,IF(J86=4,'Equivalencia BH-BMPT'!$D$5,IF(J86=5,'Equivalencia BH-BMPT'!$D$6,IF(J86=6,'Equivalencia BH-BMPT'!$D$7,IF(J86=7,'Equivalencia BH-BMPT'!$D$8,IF(J86=8,'Equivalencia BH-BMPT'!$D$9,IF(J86=9,'Equivalencia BH-BMPT'!$D$10,IF(J86=10,'Equivalencia BH-BMPT'!$D$11,IF(J86=11,'Equivalencia BH-BMPT'!$D$12,IF(J86=12,'Equivalencia BH-BMPT'!$D$13,IF(J86=13,'Equivalencia BH-BMPT'!$D$14,IF(J86=14,'Equivalencia BH-BMPT'!$D$15,IF(J86=15,'Equivalencia BH-BMPT'!$D$16,IF(J86=16,'Equivalencia BH-BMPT'!$D$17,IF(J86=17,'Equivalencia BH-BMPT'!$D$18,IF(J86=18,'Equivalencia BH-BMPT'!$D$19,IF(J86=19,'Equivalencia BH-BMPT'!$D$20,IF(J86=20,'Equivalencia BH-BMPT'!$D$21,IF(J86=21,'Equivalencia BH-BMPT'!$D$22,IF(J86=22,'Equivalencia BH-BMPT'!$D$23,IF(J86=23,'Equivalencia BH-BMPT'!#REF!,IF(J86=24,'Equivalencia BH-BMPT'!$D$25,IF(J86=25,'Equivalencia BH-BMPT'!$D$26,IF(J86=26,'Equivalencia BH-BMPT'!$D$27,IF(J86=27,'Equivalencia BH-BMPT'!$D$28,IF(J86=28,'Equivalencia BH-BMPT'!$D$29,IF(J86=29,'Equivalencia BH-BMPT'!$D$30,IF(J86=30,'Equivalencia BH-BMPT'!$D$31,IF(J86=31,'Equivalencia BH-BMPT'!$D$32,IF(J86=32,'Equivalencia BH-BMPT'!$D$33,IF(J86=33,'Equivalencia BH-BMPT'!$D$34,IF(J86=34,'Equivalencia BH-BMPT'!$D$35,IF(J86=35,'Equivalencia BH-BMPT'!$D$36,IF(J86=36,'Equivalencia BH-BMPT'!$D$37,IF(J86=37,'Equivalencia BH-BMPT'!$D$38,IF(J86=38,'Equivalencia BH-BMPT'!#REF!,IF(J86=39,'Equivalencia BH-BMPT'!$D$40,IF(J86=40,'Equivalencia BH-BMPT'!$D$41,IF(J86=41,'Equivalencia BH-BMPT'!$D$42,IF(J86=42,'Equivalencia BH-BMPT'!$D$43,IF(J86=43,'Equivalencia BH-BMPT'!$D$44,IF(J86=44,'Equivalencia BH-BMPT'!$D$45,IF(J86=45,'Equivalencia BH-BMPT'!$D$46,\"No ha seleccionado un número de programa\")))))))))))))))))))))))))))))))))))))))))))))","v":"No ha seleccionado un número de programa"},0,900381561,"GARCIA & MEJIA M I S EN C",47765529,null,null,0,0,47765529,42458248,"2017/04/05","2017/04/08","2018-01-07",270,65,null,null,"X",null,null,0.88888888888888884,null,true]
[73,2017,"17-12-6508621",5,{"$f":"IF(D87=1,'Tipo '!$B$2,IF(D87=2,'Tipo '!$B$3,IF(D87=3,'Tipo '!$B$4,IF(D87=4,'Tipo '!$B$5,IF(D87=5,'Tipo '!$B$6,IF(D87=6,'Tipo '!$B$7,IF(D87=7,'Tipo '!$B$8,IF(D87=8,'Tipo '!$B$9,IF(D87=9,'Tipo '!$B$10,IF(D87=10,'Tipo '!$B$11,IF(D87=11,'Tipo '!$B$12,IF(D87=12,'Tipo '!$B$13,IF(D87=13,'Tipo '!$B$14,IF(D87=14,'Tipo '!$B$15,IF(D87=15,'Tipo '!$B$16,IF(D87=16,'Tipo '!$B$17,IF(D87=17,'Tipo '!$B$18,IF(D87=18,'Tipo '!$B$19,IF(D87=19,'Tipo '!$B$20,\"No ha seleccionado un tipo de contrato válido\")))))))))))))))))))","v":"CONTRATOS DE PRESTACIÓN DE SERVICIOS PROFESIONALES Y DE APOYO A LA GESTIÓN"},"Contratación directa","Prestación de servicios profesionales y de apoyo a la gestión, o para la ejecución de trabajos artísticos que sólo puedan encomendarse a determinadas personas naturales;","PRESTAR SERVICIOS DE APOYO AL AREA DE GESTION DEL DESARROLLO LOCAL EN LO ATINENTE A LA ATENCION AL CIUDADANO DE LA ALCALDIA LOCAL DE SANTA FE","Inversión",45,{"$f":"IF(J87=1,'Equivalencia BH-BMPT'!$D$2,IF(J87=2,'Equivalencia BH-BMPT'!$D$3,IF(J87=3,'Equivalencia BH-BMPT'!$D$4,IF(J87=4,'Equivalencia BH-BMPT'!$D$5,IF(J87=5,'Equivalencia BH-BMPT'!$D$6,IF(J87=6,'Equivalencia BH-BMPT'!$D$7,IF(J87=7,'Equivalencia BH-BMPT'!$D$8,IF(J87=8,'Equivalencia BH-BMPT'!$D$9,IF(J87=9,'Equivalencia BH-BMPT'!$D$10,IF(J87=10,'Equivalencia BH-BMPT'!$D$11,IF(J87=11,'Equivalencia BH-BMPT'!$D$12,IF(J87=12,'Equivalencia BH-BMPT'!$D$13,IF(J87=13,'Equivalencia BH-BMPT'!$D$14,IF(J87=14,'Equivalencia BH-BMPT'!$D$15,IF(J87=15,'Equivalencia BH-BMPT'!$D$16,IF(J87=16,'Equivalencia BH-BMPT'!$D$17,IF(J87=17,'Equivalencia BH-BMPT'!$D$18,IF(J87=18,'Equivalencia BH-BMPT'!$D$19,IF(J87=19,'Equivalencia BH-BMPT'!$D$20,IF(J87=20,'Equivalencia BH-BMPT'!$D$21,IF(J87=21,'Equivalencia BH-BMPT'!$D$22,IF(J87=22,'Equivalencia BH-BMPT'!$D$23,IF(J87=23,'Equivalencia BH-BMPT'!#REF!,IF(J87=24,'Equivalencia BH-BMPT'!$D$25,IF(J87=25,'Equivalencia BH-BMPT'!$D$26,IF(J87=26,'Equivalencia BH-BMPT'!$D$27,IF(J87=27,'Equivalencia BH-BMPT'!$D$28,IF(J87=28,'Equivalencia BH-BMPT'!$D$29,IF(J87=29,'Equivalencia BH-BMPT'!$D$30,IF(J87=30,'Equivalencia BH-BMPT'!$D$31,IF(J87=31,'Equivalencia BH-BMPT'!$D$32,IF(J87=32,'Equivalencia BH-BMPT'!$D$33,IF(J87=33,'Equivalencia BH-BMPT'!$D$34,IF(J87=34,'Equivalencia BH-BMPT'!$D$35,IF(J87=35,'Equivalencia BH-BMPT'!$D$36,IF(J87=36,'Equivalencia BH-BMPT'!$D$37,IF(J87=37,'Equivalencia BH-BMPT'!$D$38,IF(J87=38,'Equivalencia BH-BMPT'!#REF!,IF(J87=39,'Equivalencia BH-BMPT'!$D$40,IF(J87=40,'Equivalencia BH-BMPT'!$D$41,IF(J87=41,'Equivalencia BH-BMPT'!$D$42,IF(J87=42,'Equivalencia BH-BMPT'!$D$43,IF(J87=43,'Equivalencia BH-BMPT'!$D$44,IF(J87=44,'Equivalencia BH-BMPT'!$D$45,IF(J87=45,'Equivalencia BH-BMPT'!$D$46,\"No ha seleccionado un número de programa\")))))))))))))))))))))))))))))))))))))))))))))","v":"Gobernanza e influencia local, regional e internacional"},1326,51963646,"ODILIA MARGARITA VALERO HEREDIA",15600000,null,null,1,2535000,18135000,15795000,"2017/04/05","2017/04/07","2018-01-15",240,66,null,null,"X",null,null,0.87096774193548387,null,false]
[74,2017,"17-12-6569288",9,{"$f":"IF(D88=1,'Tipo '!$B$2,IF(D88=2,'Tipo '!$B$3,IF(D88=3,'Tipo '!$B$4,IF(D88=4,'Tipo '!$B$5,IF(D88=5,'Tipo '!$B$6,IF(D88=6,'Tipo '!$B$7,IF(D88=7,'Tipo '!$B$8,IF(D88=8,'Tipo '!$B$9,IF(D88=9,'Tipo '!$B$10,IF(D88=10,'Tipo '!$B$11,IF(D88=11,'Tipo '!$B$12,IF(D88=12,'Tipo '!$B$13,IF(D88=13,'Tipo '!$B$14,IF(D88=14,'Tipo '!$B$15,IF(D88=15,'Tipo '!$B$16,IF(D88=16,'Tipo '!$B$17,IF(D88=17,'Tipo '!$B$18,IF(D88=18,'Tipo '!$B$19,IF(D88=19,'Tipo '!$B$20,\"No ha seleccionado un tipo de contrato válido\")))))))))))))))))))","v":"ARRENDAMIENTO DE BIENES INMUEBLES"},"Contratación directa","El arrendamiento o adquisición de inmuebles","PRESTAR LOS SERVICIOS DE APOYO EN LA DISTRIBUCION DE CORRESPONDENCIA PRODUCIDA EN LAS DIFERENTES AREAS DE LA ALCALDIA LOCAL DE SANTA FE","Inversión",45,{"$f":"IF(J88=1,'Equivalencia BH-BMPT'!$D$2,IF(J88=2,'Equivalencia BH-BMPT'!$D$3,IF(J88=3,'Equivalencia BH-BMPT'!$D$4,IF(J88=4,'Equivalencia BH-BMPT'!$D$5,IF(J88=5,'Equivalencia BH-BMPT'!$D$6,IF(J88=6,'Equivalencia BH-BMPT'!$D$7,IF(J88=7,'Equivalencia BH-BMPT'!$D$8,IF(J88=8,'Equivalencia BH-BMPT'!$D$9,IF(J88=9,'Equivalencia BH-BMPT'!$D$10,IF(J88=10,'Equivalencia BH-BMPT'!$D$11,IF(J88=11,'Equivalencia BH-BMPT'!$D$12,IF(J88=12,'Equivalencia BH-BMPT'!$D$13,IF(J88=13,'Equivalencia BH-BMPT'!$D$14,IF(J88=14,'Equivalencia BH-BMPT'!$D$15,IF(J88=15,'Equivalencia BH-BMPT'!$D$16,IF(J88=16,'Equivalencia BH-BMPT'!$D$17,IF(J88=17,'Equivalencia BH-BMPT'!$D$18,IF(J88=18,'Equivalencia BH-BMPT'!$D$19,IF(J88=19,'Equivalencia BH-BMPT'!$D$20,IF(J88=20,'Equivalencia BH-BMPT'!$D$21,IF(J88=21,'Equivalencia BH-BMPT'!$D$22,IF(J88=22,'Equivalencia BH-BMPT'!$D$23,IF(J88=23,'Equivalencia BH-BMPT'!#REF!,IF(J88=24,'Equivalencia BH-BMPT'!$D$25,IF(J88=25,'Equivalencia BH-BMPT'!$D$26,IF(J88=26,'Equivalencia BH-BMPT'!$D$27,IF(J88=27,'Equivalencia BH-BMPT'!$D$28,IF(J88=28,'Equivalencia BH-BMPT'!$D$29,IF(J88=29,'Equivalencia BH-BMPT'!$D$30,IF(J88=30,'Equivalencia BH-BMPT'!$D$31,IF(J88=31,'Equivalencia BH-BMPT'!$D$32,IF(J88=32,'Equivalencia BH-BMPT'!$D$33,IF(J88=33,'Equivalencia BH-BMPT'!$D$34,IF(J88=34,'Equivalencia BH-BMPT'!$D$35,IF(J88=35,'Equivalencia BH-BMPT'!$D$36,IF(J88=36,'Equivalencia BH-BMPT'!$D$37,IF(J88=37,'Equivalencia BH-BMPT'!$D$38,IF(J88=38,'Equivalencia BH-BMPT'!#REF!,IF(J88=39,'Equivalencia BH-BMPT'!$D$40,IF(J88=40,'Equivalencia BH-BMPT'!$D$41,IF(J88=41,'Equivalencia BH-BMPT'!$D$42,IF(J88=42,'Equivalencia BH-BMPT'!$D$43,IF(J88=43,'Equivalencia BH-BMPT'!$D$44,IF(J88=44,'Equivalencia BH-BMPT'!$D$45,IF(J88=45,'Equivalencia BH-BMPT'!$D$46,\"No ha seleccionado un número de programa\")))))))))))))))))))))))))))))))))))))))))))))","v":"Gobernanza e influencia local, regional e internacional"},1326,79772071,"ELKIN JOSE SIERRA BRACHO",15600000,null,null,1,1560000,17160000,15795000,"2017/04/07","2017/04/07","2017-12-30",240,67,null,null," ","X",null,0.92045454545454541,null,false]
[75,2017,"17-13-6451552",5,{"$f":"IF(D89=1,'Tipo '!$B$2,IF(D89=2,'Tipo '!$B$3,IF(D89=3,'Tipo '!$B$4,IF(D89=4,'Tipo '!$B$5,IF(D89=5,'Tipo '!$B$6,IF(D89=6,'Tipo '!$B$7,IF(D89=7,'Tipo '!$B$8,IF(D89=8,'Tipo '!$B$9,IF(D89=9,'Tipo '!$B$10,IF(D89=10,'Tipo '!$B$11,IF(D89=11,'Tipo '!$B$12,IF(D89=12,'Tipo '!$B$13,IF(D89=13,'Tipo '!$B$14,IF(D89=14,'Tipo '!$B$15,IF(D89=15,'Tipo '!$B$16,IF(D89=16,'Tipo '!$B$17,IF(D89=17,'Tipo '!$B$18,IF(D89=18,'Tipo '!$B$19,IF(D89=19,'Tipo '!$B$20,\"No ha seleccionado un tipo de contrato válido\")))))))))))))))))))","v":"CONTRATOS DE PRESTACIÓN DE SERVICIOS PROFESIONALES Y DE APOYO A LA GESTIÓN"},"Contratación directa","Prestación de servicios profesionales y de apoyo a la gestión, o para la ejecución de trabajos artísticos que sólo puedan encomendarse a determinadas personas naturales;","EL CONTRATISTA SE OBLIGA CON EL FONDO DE DESARROLLO LOCAL DE SANTA FE A PRESTAR LOS SERVICIOS LOGISTICOS, FACILITANDO EQUIPOS, ELEMENTOS, RECURSO HUMANO REQUERIDO POR LA ENTIDAD, PARA LLEVAR A CABO EL EVENTO DE RENDICION DE CUENTAS 2016 EN EL MARCO DEL PROYECTO 1327 VOZ PARA TODOS","Inversión",45,{"$f":"IF(J89=1,'Equivalencia BH-BMPT'!$D$2,IF(J89=2,'Equivalencia BH-BMPT'!$D$3,IF(J89=3,'Equivalencia BH-BMPT'!$D$4,IF(J89=4,'Equivalencia BH-BMPT'!$D$5,IF(J89=5,'Equivalencia BH-BMPT'!$D$6,IF(J89=6,'Equivalencia BH-BMPT'!$D$7,IF(J89=7,'Equivalencia BH-BMPT'!$D$8,IF(J89=8,'Equivalencia BH-BMPT'!$D$9,IF(J89=9,'Equivalencia BH-BMPT'!$D$10,IF(J89=10,'Equivalencia BH-BMPT'!$D$11,IF(J89=11,'Equivalencia BH-BMPT'!$D$12,IF(J89=12,'Equivalencia BH-BMPT'!$D$13,IF(J89=13,'Equivalencia BH-BMPT'!$D$14,IF(J89=14,'Equivalencia BH-BMPT'!$D$15,IF(J89=15,'Equivalencia BH-BMPT'!$D$16,IF(J89=16,'Equivalencia BH-BMPT'!$D$17,IF(J89=17,'Equivalencia BH-BMPT'!$D$18,IF(J89=18,'Equivalencia BH-BMPT'!$D$19,IF(J89=19,'Equivalencia BH-BMPT'!$D$20,IF(J89=20,'Equivalencia BH-BMPT'!$D$21,IF(J89=21,'Equivalencia BH-BMPT'!$D$22,IF(J89=22,'Equivalencia BH-BMPT'!$D$23,IF(J89=23,'Equivalencia BH-BMPT'!#REF!,IF(J89=24,'Equivalencia BH-BMPT'!$D$25,IF(J89=25,'Equivalencia BH-BMPT'!$D$26,IF(J89=26,'Equivalencia BH-BMPT'!$D$27,IF(J89=27,'Equivalencia BH-BMPT'!$D$28,IF(J89=28,'Equivalencia BH-BMPT'!$D$29,IF(J89=29,'Equivalencia BH-BMPT'!$D$30,IF(J89=30,'Equivalencia BH-BMPT'!$D$31,IF(J89=31,'Equivalencia BH-BMPT'!$D$32,IF(J89=32,'Equivalencia BH-BMPT'!$D$33,IF(J89=33,'Equivalencia BH-BMPT'!$D$34,IF(J89=34,'Equivalencia BH-BMPT'!$D$35,IF(J89=35,'Equivalencia BH-BMPT'!$D$36,IF(J89=36,'Equivalencia BH-BMPT'!$D$37,IF(J89=37,'Equivalencia BH-BMPT'!$D$38,IF(J89=38,'Equivalencia BH-BMPT'!#REF!,IF(J89=39,'Equivalencia BH-BMPT'!$D$40,IF(J89=40,'Equivalencia BH-BMPT'!$D$41,IF(J89=41,'Equivalencia BH-BMPT'!$D$42,IF(J89=42,'Equivalencia BH-BMPT'!$D$43,IF(J89=43,'Equivalencia BH-BMPT'!$D$44,IF(J89=44,'Equivalencia BH-BMPT'!$D$45,IF(J89=45,'Equivalencia BH-BMPT'!$D$46,\"No ha seleccionado un número de programa\")))))))))))))))))))))))))))))))))))))))))))))","v":"Gobernanza e influencia local, regional e internacional"},1327,900838862,"GLOBAL GROUP SAE",10280100,null,null,0,0,10280100,10280100,"2017/04/12","2017/04/17","2017-05-16",30,68,null,null,null,null,"X",1,null,false]
[76,2017,"17-12-6570845",5,{"$f":"IF(D90=1,'Tipo '!$B$2,IF(D90=2,'Tipo '!$B$3,IF(D90=3,'Tipo '!$B$4,IF(D90=4,'Tipo '!$B$5,IF(D90=5,'Tipo '!$B$6,IF(D90=6,'Tipo '!$B$7,IF(D90=7,'Tipo '!$B$8,IF(D90=8,'Tipo '!$B$9,IF(D90=9,'Tipo '!$B$10,IF(D90=10,'Tipo '!$B$11,IF(D90=11,'Tipo '!$B$12,IF(D90=12,'Tipo '!$B$13,IF(D90=13,'Tipo '!$B$14,IF(D90=14,'Tipo '!$B$15,IF(D90=15,'Tipo '!$B$16,IF(D90=16,'Tipo '!$B$17,IF(D90=17,'Tipo '!$B$18,IF(D90=18,'Tipo '!$B$19,IF(D90=19,'Tipo '!$B$20,\"No ha seleccionado un tipo de contrato válido\")))))))))))))))))))","v":"CONTRATOS DE PRESTACIÓN DE SERVICIOS PROFESIONALES Y DE APOYO A LA GESTIÓN"},"Contratación directa","Prestación de servicios profesionales y de apoyo a la gestión, o para la ejecución de trabajos artísticos que sólo puedan encomendarse a determinadas personas naturales;","PRESTAR SERVICIOS PROFESIONALES PARA LA ESTRUCTURACIÓN, EVALUACIÓN Y SEGUIMIENTO DE LOS PROGRAMAS Y PROYECTOS DE LA ALCALDIA LOCAL DE SANTA FE, ASI COMO BRINDAR APOYO AL DESPACHO.","Inversión",45,{"$f":"IF(J90=1,'Equivalencia BH-BMPT'!$D$2,IF(J90=2,'Equivalencia BH-BMPT'!$D$3,IF(J90=3,'Equivalencia BH-BMPT'!$D$4,IF(J90=4,'Equivalencia BH-BMPT'!$D$5,IF(J90=5,'Equivalencia BH-BMPT'!$D$6,IF(J90=6,'Equivalencia BH-BMPT'!$D$7,IF(J90=7,'Equivalencia BH-BMPT'!$D$8,IF(J90=8,'Equivalencia BH-BMPT'!$D$9,IF(J90=9,'Equivalencia BH-BMPT'!$D$10,IF(J90=10,'Equivalencia BH-BMPT'!$D$11,IF(J90=11,'Equivalencia BH-BMPT'!$D$12,IF(J90=12,'Equivalencia BH-BMPT'!$D$13,IF(J90=13,'Equivalencia BH-BMPT'!$D$14,IF(J90=14,'Equivalencia BH-BMPT'!$D$15,IF(J90=15,'Equivalencia BH-BMPT'!$D$16,IF(J90=16,'Equivalencia BH-BMPT'!$D$17,IF(J90=17,'Equivalencia BH-BMPT'!$D$18,IF(J90=18,'Equivalencia BH-BMPT'!$D$19,IF(J90=19,'Equivalencia BH-BMPT'!$D$20,IF(J90=20,'Equivalencia BH-BMPT'!$D$21,IF(J90=21,'Equivalencia BH-BMPT'!$D$22,IF(J90=22,'Equivalencia BH-BMPT'!$D$23,IF(J90=23,'Equivalencia BH-BMPT'!#REF!,IF(J90=24,'Equivalencia BH-BMPT'!$D$25,IF(J90=25,'Equivalencia BH-BMPT'!$D$26,IF(J90=26,'Equivalencia BH-BMPT'!$D$27,IF(J90=27,'Equivalencia BH-BMPT'!$D$28,IF(J90=28,'Equivalencia BH-BMPT'!$D$29,IF(J90=29,'Equivalencia BH-BMPT'!$D$30,IF(J90=30,'Equivalencia BH-BMPT'!$D$31,IF(J90=31,'Equivalencia BH-BMPT'!$D$32,IF(J90=32,'Equivalencia BH-BMPT'!$D$33,IF(J90=33,'Equivalencia BH-BMPT'!$D$34,IF(J90=34,'Equivalencia BH-BMPT'!$D$35,IF(J90=35,'Equivalencia BH-BMPT'!$D$36,IF(J90=36,'Equivalencia BH-BMPT'!$D$37,IF(J90=37,'Equivalencia BH-BMPT'!$D$38,IF(J90=38,'Equivalencia BH-BMPT'!#REF!,IF(J90=39,'Equivalencia BH-BMPT'!$D$40,IF(J90=40,'Equivalencia BH-BMPT'!$D$41,IF(J90=41,'Equivalencia BH-BMPT'!$D$42,IF(J90=42,'Equivalencia BH-BMPT'!$D$43,IF(J90=43,'Equivalencia BH-BMPT'!$D$44,IF(J90=44,'Equivalencia BH-BMPT'!$D$45,IF(J90=45,'Equivalencia BH-BMPT'!$D$46,\"No ha seleccionado un número de programa\")))))))))))))))))))))))))))))))))))))))))))))","v":"Gobernanza e influencia local, regional e internacional"},1326,1098719583,"RUBBY MARCELA FLECHAS MORALES",33600000,null,null,1,4200000,37800000,32480000,"2017/04/18","2017/04/18","2018-01-15",240,69,null,null,"X",null,null,0.85925925925925928,null,false]
[77,2017,"17-12-6571206",4,{"$f":"IF(D91=1,'Tipo '!$B$2,IF(D91=2,'Tipo '!$B$3,IF(D91=3,'Tipo '!$B$4,IF(D91=4,'Tipo '!$B$5,IF(D91=5,'Tipo '!$B$6,IF(D91=6,'Tipo '!$B$7,IF(D91=7,'Tipo '!$B$8,IF(D91=8,'Tipo '!$B$9,IF(D91=9,'Tipo '!$B$10,IF(D91=10,'Tipo '!$B$11,IF(D91=11,'Tipo '!$B$12,IF(D91=12,'Tipo '!$B$13,IF(D91=13,'Tipo '!$B$14,IF(D91=14,'Tipo '!$B$15,IF(D91=15,'Tipo '!$B$16,IF(D91=16,'Tipo '!$B$17,IF(D91=17,'Tipo '!$B$18,IF(D91=18,'Tipo '!$B$19,IF(D91=19,'Tipo '!$B$20,\"No ha seleccionado un tipo de contrato válido\")))))))))))))))))))","v":"CONTRATOS DE PRESTACIÓN DE SERVICIOS"},"Contratación mínima cuantia ","No aplica","PRESTAR APOYO AL AREA DE GESTION POLICIVA Y AREA DE GESTION DE DESARROLLO LOCAL EN LA CONDUCCION DEL PARQUE AUTOMOTOR DE PROPIEDAD DEL FDLSF QUE LE SEA ASIGNADO","Inversión",45,{"$f":"IF(J91=1,'Equivalencia BH-BMPT'!$D$2,IF(J91=2,'Equivalencia BH-BMPT'!$D$3,IF(J91=3,'Equivalencia BH-BMPT'!$D$4,IF(J91=4,'Equivalencia BH-BMPT'!$D$5,IF(J91=5,'Equivalencia BH-BMPT'!$D$6,IF(J91=6,'Equivalencia BH-BMPT'!$D$7,IF(J91=7,'Equivalencia BH-BMPT'!$D$8,IF(J91=8,'Equivalencia BH-BMPT'!$D$9,IF(J91=9,'Equivalencia BH-BMPT'!$D$10,IF(J91=10,'Equivalencia BH-BMPT'!$D$11,IF(J91=11,'Equivalencia BH-BMPT'!$D$12,IF(J91=12,'Equivalencia BH-BMPT'!$D$13,IF(J91=13,'Equivalencia BH-BMPT'!$D$14,IF(J91=14,'Equivalencia BH-BMPT'!$D$15,IF(J91=15,'Equivalencia BH-BMPT'!$D$16,IF(J91=16,'Equivalencia BH-BMPT'!$D$17,IF(J91=17,'Equivalencia BH-BMPT'!$D$18,IF(J91=18,'Equivalencia BH-BMPT'!$D$19,IF(J91=19,'Equivalencia BH-BMPT'!$D$20,IF(J91=20,'Equivalencia BH-BMPT'!$D$21,IF(J91=21,'Equivalencia BH-BMPT'!$D$22,IF(J91=22,'Equivalencia BH-BMPT'!$D$23,IF(J91=23,'Equivalencia BH-BMPT'!#REF!,IF(J91=24,'Equivalencia BH-BMPT'!$D$25,IF(J91=25,'Equivalencia BH-BMPT'!$D$26,IF(J91=26,'Equivalencia BH-BMPT'!$D$27,IF(J91=27,'Equivalencia BH-BMPT'!$D$28,IF(J91=28,'Equivalencia BH-BMPT'!$D$29,IF(J91=29,'Equivalencia BH-BMPT'!$D$30,IF(J91=30,'Equivalencia BH-BMPT'!$D$31,IF(J91=31,'Equivalencia BH-BMPT'!$D$32,IF(J91=32,'Equivalencia BH-BMPT'!$D$33,IF(J91=33,'Equivalencia BH-BMPT'!$D$34,IF(J91=34,'Equivalencia BH-BMPT'!$D$35,IF(J91=35,'Equivalencia BH-BMPT'!$D$36,IF(J91=36,'Equivalencia BH-BMPT'!$D$37,IF(J91=37,'Equivalencia BH-BMPT'!$D$38,IF(J91=38,'Equivalencia BH-BMPT'!#REF!,IF(J91=39,'Equivalencia BH-BMPT'!$D$40,IF(J91=40,'Equivalencia BH-BMPT'!$D$41,IF(J91=41,'Equivalencia BH-BMPT'!$D$42,IF(J91=42,'Equivalencia BH-BMPT'!$D$43,IF(J91=43,'Equivalencia BH-BMPT'!$D$44,IF(J91=44,'Equivalencia BH-BMPT'!$D$45,IF(J91=45,'Equivalencia BH-BMPT'!$D$46,\"No ha seleccionado un número de programa\")))))))))))))))))))))))))))))))))))))))))))))","v":"Gobernanza e influencia local, regional e internacional"},1326,91361451,"EDGAR CEPEDA SANCHEZ",16800000,null,null,1,1890000,18690000,16100000,"2017/04/19","2017/04/20","2018-01-15",240,70,null,null,"X",null,"x",0.86142322097378277,null,false]
[78,2017,"17-12-6571009",5,{"$f":"IF(D92=1,'Tipo '!$B$2,IF(D92=2,'Tipo '!$B$3,IF(D92=3,'Tipo '!$B$4,IF(D92=4,'Tipo '!$B$5,IF(D92=5,'Tipo '!$B$6,IF(D92=6,'Tipo '!$B$7,IF(D92=7,'Tipo '!$B$8,IF(D92=8,'Tipo '!$B$9,IF(D92=9,'Tipo '!$B$10,IF(D92=10,'Tipo '!$B$11,IF(D92=11,'Tipo '!$B$12,IF(D92=12,'Tipo '!$B$13,IF(D92=13,'Tipo '!$B$14,IF(D92=14,'Tipo '!$B$15,IF(D92=15,'Tipo '!$B$16,IF(D92=16,'Tipo '!$B$17,IF(D92=17,'Tipo '!$B$18,IF(D92=18,'Tipo '!$B$19,IF(D92=19,'Tipo '!$B$20,\"No ha seleccionado un tipo de contrato válido\")))))))))))))))))))","v":"CONTRATOS DE PRESTACIÓN DE SERVICIOS PROFESIONALES Y DE APOYO A LA GESTIÓN"},"Contratación directa","Prestación de servicios profesionales y de apoyo a la gestión, o para la ejecución de trabajos artísticos que sólo puedan encomendarse a determinadas personas naturales;","PRESTAR SERVICIOS DE APOYO AL AREA DE GESTION DEL DESARROLLO LOCAL EN LO ATINENTE A LA ATENCION AL CIUDADANO DE LA ALCALDIA LOCAL DE SANTA FE","Inversión",45,{"$f":"IF(J92=1,'Equivalencia BH-BMPT'!$D$2,IF(J92=2,'Equivalencia BH-BMPT'!$D$3,IF(J92=3,'Equivalencia BH-BMPT'!$D$4,IF(J92=4,'Equivalencia BH-BMPT'!$D$5,IF(J92=5,'Equivalencia BH-BMPT'!$D$6,IF(J92=6,'Equivalencia BH-BMPT'!$D$7,IF(J92=7,'Equivalencia BH-BMPT'!$D$8,IF(J92=8,'Equivalencia BH-BMPT'!$D$9,IF(J92=9,'Equivalencia BH-BMPT'!$D$10,IF(J92=10,'Equivalencia BH-BMPT'!$D$11,IF(J92=11,'Equivalencia BH-BMPT'!$D$12,IF(J92=12,'Equivalencia BH-BMPT'!$D$13,IF(J92=13,'Equivalencia BH-BMPT'!$D$14,IF(J92=14,'Equivalencia BH-BMPT'!$D$15,IF(J92=15,'Equivalencia BH-BMPT'!$D$16,IF(J92=16,'Equivalencia BH-BMPT'!$D$17,IF(J92=17,'Equivalencia BH-BMPT'!$D$18,IF(J92=18,'Equivalencia BH-BMPT'!$D$19,IF(J92=19,'Equivalencia BH-BMPT'!$D$20,IF(J92=20,'Equivalencia BH-BMPT'!$D$21,IF(J92=21,'Equivalencia BH-BMPT'!$D$22,IF(J92=22,'Equivalencia BH-BMPT'!$D$23,IF(J92=23,'Equivalencia BH-BMPT'!#REF!,IF(J92=24,'Equivalencia BH-BMPT'!$D$25,IF(J92=25,'Equivalencia BH-BMPT'!$D$26,IF(J92=26,'Equivalencia BH-BMPT'!$D$27,IF(J92=27,'Equivalencia BH-BMPT'!$D$28,IF(J92=28,'Equivalencia BH-BMPT'!$D$29,IF(J92=29,'Equivalencia BH-BMPT'!$D$30,IF(J92=30,'Equivalencia BH-BMPT'!$D$31,IF(J92=31,'Equivalencia BH-BMPT'!$D$32,IF(J92=32,'Equivalencia BH-BMPT'!$D$33,IF(J92=33,'Equivalencia BH-BMPT'!$D$34,IF(J92=34,'Equivalencia BH-BMPT'!$D$35,IF(J92=35,'Equivalencia BH-BMPT'!$D$36,IF(J92=36,'Equivalencia BH-BMPT'!$D$37,IF(J92=37,'Equivalencia BH-BMPT'!$D$38,IF(J92=38,'Equivalencia BH-BMPT'!#REF!,IF(J92=39,'Equivalencia BH-BMPT'!$D$40,IF(J92=40,'Equivalencia BH-BMPT'!$D$41,IF(J92=41,'Equivalencia BH-BMPT'!$D$42,IF(J92=42,'Equivalencia BH-BMPT'!$D$43,IF(J92=43,'Equivalencia BH-BMPT'!$D$44,IF(J92=44,'Equivalencia BH-BMPT'!$D$45,IF(J92=45,'Equivalencia BH-BMPT'!$D$46,\"No ha seleccionado un número de programa\")))))))))))))))))))))))))))))))))))))))))))))","v":"Gobernanza e influencia local, regional e internacional"},1326,53072790,"ANGIE LOHE DIAZ MENDOZA",5850000,null,null,1,2925000,8775000,8775000,"2017-04-20","2017-04-20","2017-07-19",90,71,null,null,"X",null,null,1,null,false]
[79,2017,"17-12-6611758",5,{"$f":"IF(D93=1,'Tipo '!$B$2,IF(D93=2,'Tipo '!$B$3,IF(D93=3,'Tipo '!$B$4,IF(D93=4,'Tipo '!$B$5,IF(D93=5,'Tipo '!$B$6,IF(D93=6,'Tipo '!$B$7,IF(D93=7,'Tipo '!$B$8,IF(D93=8,'Tipo '!$B$9,IF(D93=9,'Tipo '!$B$10,IF(D93=10,'Tipo '!$B$11,IF(D93=11,'Tipo '!$B$12,IF(D93=12,'Tipo '!$B$13,IF(D93=13,'Tipo '!$B$14,IF(D93=14,'Tipo '!$B$15,IF(D93=15,'Tipo '!$B$16,IF(D93=16,'Tipo '!$B$17,IF(D93=17,'Tipo '!$B$18,IF(D93=18,'Tipo '!$B$19,IF(D93=19,'Tipo '!$B$20,\"No ha seleccionado un tipo de contrato válido\")))))))))))))))))))","v":"CONTRATOS DE PRESTACIÓN DE SERVICIOS PROFESIONALES Y DE APOYO A LA GESTIÓN"},"Contratación directa","Prestación de servicios profesionales y de apoyo a la gestión, o para la ejecución de trabajos artísticos que sólo puedan encomendarse a determinadas personas naturales;","PRESTAR SUS SERVICIOS PROFESIONALES DE ABOGADO (A) EN LA ALCALDIA LOCAL DE SANTA FE PARA EL DESARROLLO DEL AREA DE GESTION POLICIVA A CARGO DE LA ENTIDAD","Inversión",45,{"$f":"IF(J93=1,'Equivalencia BH-BMPT'!$D$2,IF(J93=2,'Equivalencia BH-BMPT'!$D$3,IF(J93=3,'Equivalencia BH-BMPT'!$D$4,IF(J93=4,'Equivalencia BH-BMPT'!$D$5,IF(J93=5,'Equivalencia BH-BMPT'!$D$6,IF(J93=6,'Equivalencia BH-BMPT'!$D$7,IF(J93=7,'Equivalencia BH-BMPT'!$D$8,IF(J93=8,'Equivalencia BH-BMPT'!$D$9,IF(J93=9,'Equivalencia BH-BMPT'!$D$10,IF(J93=10,'Equivalencia BH-BMPT'!$D$11,IF(J93=11,'Equivalencia BH-BMPT'!$D$12,IF(J93=12,'Equivalencia BH-BMPT'!$D$13,IF(J93=13,'Equivalencia BH-BMPT'!$D$14,IF(J93=14,'Equivalencia BH-BMPT'!$D$15,IF(J93=15,'Equivalencia BH-BMPT'!$D$16,IF(J93=16,'Equivalencia BH-BMPT'!$D$17,IF(J93=17,'Equivalencia BH-BMPT'!$D$18,IF(J93=18,'Equivalencia BH-BMPT'!$D$19,IF(J93=19,'Equivalencia BH-BMPT'!$D$20,IF(J93=20,'Equivalencia BH-BMPT'!$D$21,IF(J93=21,'Equivalencia BH-BMPT'!$D$22,IF(J93=22,'Equivalencia BH-BMPT'!$D$23,IF(J93=23,'Equivalencia BH-BMPT'!#REF!,IF(J93=24,'Equivalencia BH-BMPT'!$D$25,IF(J93=25,'Equivalencia BH-BMPT'!$D$26,IF(J93=26,'Equivalencia BH-BMPT'!$D$27,IF(J93=27,'Equivalencia BH-BMPT'!$D$28,IF(J93=28,'Equivalencia BH-BMPT'!$D$29,IF(J93=29,'Equivalencia BH-BMPT'!$D$30,IF(J93=30,'Equivalencia BH-BMPT'!$D$31,IF(J93=31,'Equivalencia BH-BMPT'!$D$32,IF(J93=32,'Equivalencia BH-BMPT'!$D$33,IF(J93=33,'Equivalencia BH-BMPT'!$D$34,IF(J93=34,'Equivalencia BH-BMPT'!$D$35,IF(J93=35,'Equivalencia BH-BMPT'!$D$36,IF(J93=36,'Equivalencia BH-BMPT'!$D$37,IF(J93=37,'Equivalencia BH-BMPT'!$D$38,IF(J93=38,'Equivalencia BH-BMPT'!#REF!,IF(J93=39,'Equivalencia BH-BMPT'!$D$40,IF(J93=40,'Equivalencia BH-BMPT'!$D$41,IF(J93=41,'Equivalencia BH-BMPT'!$D$42,IF(J93=42,'Equivalencia BH-BMPT'!$D$43,IF(J93=43,'Equivalencia BH-BMPT'!$D$44,IF(J93=44,'Equivalencia BH-BMPT'!$D$45,IF(J93=45,'Equivalencia BH-BMPT'!$D$46,\"No ha seleccionado un número de programa\")))))))))))))))))))))))))))))))))))))))))))))","v":"Gobernanza e influencia local, regional e internacional"},1326,"80084321","ANDRES BARRETO GONZALEZ",40000000,null,null,0,0,40000000,34666667,"2017-05-11","2017-05-12","2018-01-11",240,72,null,null,"X",null,null,0.86666667500000005,null,false]
[80,2017,"17-12-6611869",5,{"$f":"IF(D94=1,'Tipo '!$B$2,IF(D94=2,'Tipo '!$B$3,IF(D94=3,'Tipo '!$B$4,IF(D94=4,'Tipo '!$B$5,IF(D94=5,'Tipo '!$B$6,IF(D94=6,'Tipo '!$B$7,IF(D94=7,'Tipo '!$B$8,IF(D94=8,'Tipo '!$B$9,IF(D94=9,'Tipo '!$B$10,IF(D94=10,'Tipo '!$B$11,IF(D94=11,'Tipo '!$B$12,IF(D94=12,'Tipo '!$B$13,IF(D94=13,'Tipo '!$B$14,IF(D94=14,'Tipo '!$B$15,IF(D94=15,'Tipo '!$B$16,IF(D94=16,'Tipo '!$B$17,IF(D94=17,'Tipo '!$B$18,IF(D94=18,'Tipo '!$B$19,IF(D94=19,'Tipo '!$B$20,\"No ha seleccionado un tipo de contrato válido\")))))))))))))))))))","v":"CONTRATOS DE PRESTACIÓN DE SERVICIOS PROFESIONALES Y DE APOYO A LA GESTIÓN"},"Contratación directa","Prestación de servicios profesionales y de apoyo a la gestión, o para la ejecución de trabajos artísticos que sólo puedan encomendarse a determinadas personas naturales;","CONTRATAR EL SERVICIO DE MENSAJERIA Y CORREO CERTIFICADO, PARA EL DESARROLLO DE LAS ACTIVIDADES ADMINISTRATIVAS Y DE FUNCIONAMIENTO","Funcionamiento",0,{"$f":"IF(J94=1,'Equivalencia BH-BMPT'!$D$2,IF(J94=2,'Equivalencia BH-BMPT'!$D$3,IF(J94=3,'Equivalencia BH-BMPT'!$D$4,IF(J94=4,'Equivalencia BH-BMPT'!$D$5,IF(J94=5,'Equivalencia BH-BMPT'!$D$6,IF(J94=6,'Equivalencia BH-BMPT'!$D$7,IF(J94=7,'Equivalencia BH-BMPT'!$D$8,IF(J94=8,'Equivalencia BH-BMPT'!$D$9,IF(J94=9,'Equivalencia BH-BMPT'!$D$10,IF(J94=10,'Equivalencia BH-BMPT'!$D$11,IF(J94=11,'Equivalencia BH-BMPT'!$D$12,IF(J94=12,'Equivalencia BH-BMPT'!$D$13,IF(J94=13,'Equivalencia BH-BMPT'!$D$14,IF(J94=14,'Equivalencia BH-BMPT'!$D$15,IF(J94=15,'Equivalencia BH-BMPT'!$D$16,IF(J94=16,'Equivalencia BH-BMPT'!$D$17,IF(J94=17,'Equivalencia BH-BMPT'!$D$18,IF(J94=18,'Equivalencia BH-BMPT'!$D$19,IF(J94=19,'Equivalencia BH-BMPT'!$D$20,IF(J94=20,'Equivalencia BH-BMPT'!$D$21,IF(J94=21,'Equivalencia BH-BMPT'!$D$22,IF(J94=22,'Equivalencia BH-BMPT'!$D$23,IF(J94=23,'Equivalencia BH-BMPT'!#REF!,IF(J94=24,'Equivalencia BH-BMPT'!$D$25,IF(J94=25,'Equivalencia BH-BMPT'!$D$26,IF(J94=26,'Equivalencia BH-BMPT'!$D$27,IF(J94=27,'Equivalencia BH-BMPT'!$D$28,IF(J94=28,'Equivalencia BH-BMPT'!$D$29,IF(J94=29,'Equivalencia BH-BMPT'!$D$30,IF(J94=30,'Equivalencia BH-BMPT'!$D$31,IF(J94=31,'Equivalencia BH-BMPT'!$D$32,IF(J94=32,'Equivalencia BH-BMPT'!$D$33,IF(J94=33,'Equivalencia BH-BMPT'!$D$34,IF(J94=34,'Equivalencia BH-BMPT'!$D$35,IF(J94=35,'Equivalencia BH-BMPT'!$D$36,IF(J94=36,'Equivalencia BH-BMPT'!$D$37,IF(J94=37,'Equivalencia BH-BMPT'!$D$38,IF(J94=38,'Equivalencia BH-BMPT'!#REF!,IF(J94=39,'Equivalencia BH-BMPT'!$D$40,IF(J94=40,'Equivalencia BH-BMPT'!$D$41,IF(J94=41,'Equivalencia BH-BMPT'!$D$42,IF(J94=42,'Equivalencia BH-BMPT'!$D$43,IF(J94=43,'Equivalencia BH-BMPT'!$D$44,IF(J94=44,'Equivalencia BH-BMPT'!$D$45,IF(J94=45,'Equivalencia BH-BMPT'!$D$46,\"No ha seleccionado un número de programa\")))))))))))))))))))))))))))))))))))))))))))))","v":"No ha seleccionado un número de programa"},0,900062917,"SERVICIOS POSTALES NACIONALES S.A",2500000,null,null,0,0,2500000,31900,"2017-05-12","2017-06-23","2017-12-31",5640,73,null,null," ","X",null,1.2760000000000001E-2,null,true]
[81,2017,"17-12-6638485",5,{"$f":"IF(D95=1,'Tipo '!$B$2,IF(D95=2,'Tipo '!$B$3,IF(D95=3,'Tipo '!$B$4,IF(D95=4,'Tipo '!$B$5,IF(D95=5,'Tipo '!$B$6,IF(D95=6,'Tipo '!$B$7,IF(D95=7,'Tipo '!$B$8,IF(D95=8,'Tipo '!$B$9,IF(D95=9,'Tipo '!$B$10,IF(D95=10,'Tipo '!$B$11,IF(D95=11,'Tipo '!$B$12,IF(D95=12,'Tipo '!$B$13,IF(D95=13,'Tipo '!$B$14,IF(D95=14,'Tipo '!$B$15,IF(D95=15,'Tipo '!$B$16,IF(D95=16,'Tipo '!$B$17,IF(D95=17,'Tipo '!$B$18,IF(D95=18,'Tipo '!$B$19,IF(D95=19,'Tipo '!$B$20,\"No ha seleccionado un tipo de contrato válido\")))))))))))))))))))","v":"CONTRATOS DE PRESTACIÓN DE SERVICIOS PROFESIONALES Y DE APOYO A LA GESTIÓN"},"Contratación directa","Prestación de servicios profesionales y de apoyo a la gestión, o para la ejecución de trabajos artísticos que sólo puedan encomendarse a determinadas personas naturales;","PRESTAR LOS SERVICIOS PROFESIONALES COMO ABOGADO PARA APOYAR EL USO DE LOS APLICATIVOS DE CONTRATACIÓN, ASI COMO LAS RESPUESTAS A LOS ORGANOS DE CONTROL Y TODO LO RELACIONADO CON LA ACTIVIDAD PRECONTRACTUAL, CONTRACTUAL Y POSTCONTRACTUAL DE LA EJECUCION DE LOS RECURSOS DEL FDLSF","Inversión",45,{"$f":"IF(J95=1,'Equivalencia BH-BMPT'!$D$2,IF(J95=2,'Equivalencia BH-BMPT'!$D$3,IF(J95=3,'Equivalencia BH-BMPT'!$D$4,IF(J95=4,'Equivalencia BH-BMPT'!$D$5,IF(J95=5,'Equivalencia BH-BMPT'!$D$6,IF(J95=6,'Equivalencia BH-BMPT'!$D$7,IF(J95=7,'Equivalencia BH-BMPT'!$D$8,IF(J95=8,'Equivalencia BH-BMPT'!$D$9,IF(J95=9,'Equivalencia BH-BMPT'!$D$10,IF(J95=10,'Equivalencia BH-BMPT'!$D$11,IF(J95=11,'Equivalencia BH-BMPT'!$D$12,IF(J95=12,'Equivalencia BH-BMPT'!$D$13,IF(J95=13,'Equivalencia BH-BMPT'!$D$14,IF(J95=14,'Equivalencia BH-BMPT'!$D$15,IF(J95=15,'Equivalencia BH-BMPT'!$D$16,IF(J95=16,'Equivalencia BH-BMPT'!$D$17,IF(J95=17,'Equivalencia BH-BMPT'!$D$18,IF(J95=18,'Equivalencia BH-BMPT'!$D$19,IF(J95=19,'Equivalencia BH-BMPT'!$D$20,IF(J95=20,'Equivalencia BH-BMPT'!$D$21,IF(J95=21,'Equivalencia BH-BMPT'!$D$22,IF(J95=22,'Equivalencia BH-BMPT'!$D$23,IF(J95=23,'Equivalencia BH-BMPT'!#REF!,IF(J95=24,'Equivalencia BH-BMPT'!$D$25,IF(J95=25,'Equivalencia BH-BMPT'!$D$26,IF(J95=26,'Equivalencia BH-BMPT'!$D$27,IF(J95=27,'Equivalencia BH-BMPT'!$D$28,IF(J95=28,'Equivalencia BH-BMPT'!$D$29,IF(J95=29,'Equivalencia BH-BMPT'!$D$30,IF(J95=30,'Equivalencia BH-BMPT'!$D$31,IF(J95=31,'Equivalencia BH-BMPT'!$D$32,IF(J95=32,'Equivalencia BH-BMPT'!$D$33,IF(J95=33,'Equivalencia BH-BMPT'!$D$34,IF(J95=34,'Equivalencia BH-BMPT'!$D$35,IF(J95=35,'Equivalencia BH-BMPT'!$D$36,IF(J95=36,'Equivalencia BH-BMPT'!$D$37,IF(J95=37,'Equivalencia BH-BMPT'!$D$38,IF(J95=38,'Equivalencia BH-BMPT'!#REF!,IF(J95=39,'Equivalencia BH-BMPT'!$D$40,IF(J95=40,'Equivalencia BH-BMPT'!$D$41,IF(J95=41,'Equivalencia BH-BMPT'!$D$42,IF(J95=42,'Equivalencia BH-BMPT'!$D$43,IF(J95=43,'Equivalencia BH-BMPT'!$D$44,IF(J95=44,'Equivalencia BH-BMPT'!$D$45,IF(J95=45,'Equivalencia BH-BMPT'!$D$46,\"No ha seleccionado un número de programa\")))))))))))))))))))))))))))))))))))))))))))))","v":"Gobernanza e influencia local, regional e internacional"},1326,"53178369","JEIMY VIVIANA TERREROS FRANCO",28373333,null,null,1,1900000,30273333,25713333,"2017-05-17","2017-05-17","2018-01-15",6720,74,null,null,"X",null,null,0.84937238327870934,null,false]
[82,2017,"17-12-6623336",4,{"$f":"IF(D96=1,'Tipo '!$B$2,IF(D96=2,'Tipo '!$B$3,IF(D96=3,'Tipo '!$B$4,IF(D96=4,'Tipo '!$B$5,IF(D96=5,'Tipo '!$B$6,IF(D96=6,'Tipo '!$B$7,IF(D96=7,'Tipo '!$B$8,IF(D96=8,'Tipo '!$B$9,IF(D96=9,'Tipo '!$B$10,IF(D96=10,'Tipo '!$B$11,IF(D96=11,'Tipo '!$B$12,IF(D96=12,'Tipo '!$B$13,IF(D96=13,'Tipo '!$B$14,IF(D96=14,'Tipo '!$B$15,IF(D96=15,'Tipo '!$B$16,IF(D96=16,'Tipo '!$B$17,IF(D96=17,'Tipo '!$B$18,IF(D96=18,'Tipo '!$B$19,IF(D96=19,'Tipo '!$B$20,\"No ha seleccionado un tipo de contrato válido\")))))))))))))))))))","v":"CONTRATOS DE PRESTACIÓN DE SERVICIOS"},"Contratación directa","Prestación de servicios profesionales y de apoyo a la gestión, o para la ejecución de trabajos artísticos que sólo puedan encomendarse a determinadas personas naturales;","PRESTAR LOS SERVICIOS PROFESIONALES COMO ABOGADO PARA APOYAR EL USO DE LOS APLICATIVOS DE CONTRATACIÓN, ASI COMO LAS RESPUESTAS A LOS ORGANOS DE CONTROL Y TODO LO RELACIONADO CON LA ACTIVIDAD PRECONTRACTUAL, CONTRACTUAL Y POSTCONTRACTUAL DE LA EJECUCION DE LOS RECURSOS DEL FDLSF","Inversión",45,{"$f":"IF(J96=1,'Equivalencia BH-BMPT'!$D$2,IF(J96=2,'Equivalencia BH-BMPT'!$D$3,IF(J96=3,'Equivalencia BH-BMPT'!$D$4,IF(J96=4,'Equivalencia BH-BMPT'!$D$5,IF(J96=5,'Equivalencia BH-BMPT'!$D$6,IF(J96=6,'Equivalencia BH-BMPT'!$D$7,IF(J96=7,'Equivalencia BH-BMPT'!$D$8,IF(J96=8,'Equivalencia BH-BMPT'!$D$9,IF(J96=9,'Equivalencia BH-BMPT'!$D$10,IF(J96=10,'Equivalencia BH-BMPT'!$D$11,IF(J96=11,'Equivalencia BH-BMPT'!$D$12,IF(J96=12,'Equivalencia BH-BMPT'!$D$13,IF(J96=13,'Equivalencia BH-BMPT'!$D$14,IF(J96=14,'Equivalencia BH-BMPT'!$D$15,IF(J96=15,'Equivalencia BH-BMPT'!$D$16,IF(J96=16,'Equivalencia BH-BMPT'!$D$17,IF(J96=17,'Equivalencia BH-BMPT'!$D$18,IF(J96=18,'Equivalencia BH-BMPT'!$D$19,IF(J96=19,'Equivalencia BH-BMPT'!$D$20,IF(J96=20,'Equivalencia BH-BMPT'!$D$21,IF(J96=21,'Equivalencia BH-BMPT'!$D$22,IF(J96=22,'Equivalencia BH-BMPT'!$D$23,IF(J96=23,'Equivalencia BH-BMPT'!#REF!,IF(J96=24,'Equivalencia BH-BMPT'!$D$25,IF(J96=25,'Equivalencia BH-BMPT'!$D$26,IF(J96=26,'Equivalencia BH-BMPT'!$D$27,IF(J96=27,'Equivalencia BH-BMPT'!$D$28,IF(J96=28,'Equivalencia BH-BMPT'!$D$29,IF(J96=29,'Equivalencia BH-BMPT'!$D$30,IF(J96=30,'Equivalencia BH-BMPT'!$D$31,IF(J96=31,'Equivalencia BH-BMPT'!$D$32,IF(J96=32,'Equivalencia BH-BMPT'!$D$33,IF(J96=33,'Equivalencia BH-BMPT'!$D$34,IF(J96=34,'Equivalencia BH-BMPT'!$D$35,IF(J96=35,'Equivalencia BH-BMPT'!$D$36,IF(J96=36,'Equivalencia BH-BMPT'!$D$37,IF(J96=37,'Equivalencia BH-BMPT'!$D$38,IF(J96=38,'Equivalencia BH-BMPT'!#REF!,IF(J96=39,'Equivalencia BH-BMPT'!$D$40,IF(J96=40,'Equivalencia BH-BMPT'!$D$41,IF(J96=41,'Equivalencia BH-BMPT'!$D$42,IF(J96=42,'Equivalencia BH-BMPT'!$D$43,IF(J96=43,'Equivalencia BH-BMPT'!$D$44,IF(J96=44,'Equivalencia BH-BMPT'!$D$45,IF(J96=45,'Equivalencia BH-BMPT'!$D$46,\"No ha seleccionado un número de programa\")))))))))))))))))))))))))))))))))))))))))))))","v":"Gobernanza e influencia local, regional e internacional"},1326,"1065614274","LAURA VANESA PAREDES RODRIGUEZ",28373333,null,null,1,1900000,30273333,25713333,"2017-05-17","2017-05-17","2018-01-15",6720,75,null,null,"X",null,null,0.84937238327870934,null,false]
[83,2017,"17-12-6643036",5,{"$f":"IF(D97=1,'Tipo '!$B$2,IF(D97=2,'Tipo '!$B$3,IF(D97=3,'Tipo '!$B$4,IF(D97=4,'Tipo '!$B$5,IF(D97=5,'Tipo '!$B$6,IF(D97=6,'Tipo '!$B$7,IF(D97=7,'Tipo '!$B$8,IF(D97=8,'Tipo '!$B$9,IF(D97=9,'Tipo '!$B$10,IF(D97=10,'Tipo '!$B$11,IF(D97=11,'Tipo '!$B$12,IF(D97=12,'Tipo '!$B$13,IF(D97=13,'Tipo '!$B$14,IF(D97=14,'Tipo '!$B$15,IF(D97=15,'Tipo '!$B$16,IF(D97=16,'Tipo '!$B$17,IF(D97=17,'Tipo '!$B$18,IF(D97=18,'Tipo '!$B$19,IF(D97=19,'Tipo '!$B$20,\"No ha seleccionado un tipo de contrato válido\")))))))))))))))))))","v":"CONTRATOS DE PRESTACIÓN DE SERVICIOS PROFESIONALES Y DE APOYO A LA GESTIÓN"},"Contratación directa","Prestación de servicios profesionales y de apoyo a la gestión, o para la ejecución de trabajos artísticos que sólo puedan encomendarse a determinadas personas naturales;","PRESTAR LOS SERVICIOS COMO SUPERVISOR DE APOYO A LOS CONTRATOS CEÑEBRADOS CON LA SUBRED INTEGRADA DE SERVICIOS CENTRO ORIENTE, LOS CUALES TIENEN COMO OBJETIVO LA EJECUCION DE ACTIVIDADES ENCAMINADAS A LA PROMOCION Y REVENCION EN SALUD, ASI COMO LA ENTREGA DE AYUDAS TECNICAS PARA PERSONAS CON DISCAPACIDAD","Inversión",3,{"$f":"IF(J97=1,'Equivalencia BH-BMPT'!$D$2,IF(J97=2,'Equivalencia BH-BMPT'!$D$3,IF(J97=3,'Equivalencia BH-BMPT'!$D$4,IF(J97=4,'Equivalencia BH-BMPT'!$D$5,IF(J97=5,'Equivalencia BH-BMPT'!$D$6,IF(J97=6,'Equivalencia BH-BMPT'!$D$7,IF(J97=7,'Equivalencia BH-BMPT'!$D$8,IF(J97=8,'Equivalencia BH-BMPT'!$D$9,IF(J97=9,'Equivalencia BH-BMPT'!$D$10,IF(J97=10,'Equivalencia BH-BMPT'!$D$11,IF(J97=11,'Equivalencia BH-BMPT'!$D$12,IF(J97=12,'Equivalencia BH-BMPT'!$D$13,IF(J97=13,'Equivalencia BH-BMPT'!$D$14,IF(J97=14,'Equivalencia BH-BMPT'!$D$15,IF(J97=15,'Equivalencia BH-BMPT'!$D$16,IF(J97=16,'Equivalencia BH-BMPT'!$D$17,IF(J97=17,'Equivalencia BH-BMPT'!$D$18,IF(J97=18,'Equivalencia BH-BMPT'!$D$19,IF(J97=19,'Equivalencia BH-BMPT'!$D$20,IF(J97=20,'Equivalencia BH-BMPT'!$D$21,IF(J97=21,'Equivalencia BH-BMPT'!$D$22,IF(J97=22,'Equivalencia BH-BMPT'!$D$23,IF(J97=23,'Equivalencia BH-BMPT'!#REF!,IF(J97=24,'Equivalencia BH-BMPT'!$D$25,IF(J97=25,'Equivalencia BH-BMPT'!$D$26,IF(J97=26,'Equivalencia BH-BMPT'!$D$27,IF(J97=27,'Equivalencia BH-BMPT'!$D$28,IF(J97=28,'Equivalencia BH-BMPT'!$D$29,IF(J97=29,'Equivalencia BH-BMPT'!$D$30,IF(J97=30,'Equivalencia BH-BMPT'!$D$31,IF(J97=31,'Equivalencia BH-BMPT'!$D$32,IF(J97=32,'Equivalencia BH-BMPT'!$D$33,IF(J97=33,'Equivalencia BH-BMPT'!$D$34,IF(J97=34,'Equivalencia BH-BMPT'!$D$35,IF(J97=35,'Equivalencia BH-BMPT'!$D$36,IF(J97=36,'Equivalencia BH-BMPT'!$D$37,IF(J97=37,'Equivalencia BH-BMPT'!$D$38,IF(J97=38,'Equivalencia BH-BMPT'!#REF!,IF(J97=39,'Equivalencia BH-BMPT'!$D$40,IF(J97=40,'Equivalencia BH-BMPT'!$D$41,IF(J97=41,'Equivalencia BH-BMPT'!$D$42,IF(J97=42,'Equivalencia BH-BMPT'!$D$43,IF(J97=43,'Equivalencia BH-BMPT'!$D$44,IF(J97=44,'Equivalencia BH-BMPT'!$D$45,IF(J97=45,'Equivalencia BH-BMPT'!$D$46,\"No ha seleccionado un número de programa\")))))))))))))))))))))))))))))))))))))))))))))","v":"Igualdad y autonomía para una Bogotá incluyente"},1316,1032452136,"CRISTY PAULINA ENSUNCHO CARABALLO",27552000,null,null,1,1845000,29397000,24969000,"2017-05-17","2017-05-17","2017-12-30",225,76,null,null," ","X",null,0.84937238493723854,null,false]
[84,2017,"17-12-6379110",5,{"$f":"IF(D98=1,'Tipo '!$B$2,IF(D98=2,'Tipo '!$B$3,IF(D98=3,'Tipo '!$B$4,IF(D98=4,'Tipo '!$B$5,IF(D98=5,'Tipo '!$B$6,IF(D98=6,'Tipo '!$B$7,IF(D98=7,'Tipo '!$B$8,IF(D98=8,'Tipo '!$B$9,IF(D98=9,'Tipo '!$B$10,IF(D98=10,'Tipo '!$B$11,IF(D98=11,'Tipo '!$B$12,IF(D98=12,'Tipo '!$B$13,IF(D98=13,'Tipo '!$B$14,IF(D98=14,'Tipo '!$B$15,IF(D98=15,'Tipo '!$B$16,IF(D98=16,'Tipo '!$B$17,IF(D98=17,'Tipo '!$B$18,IF(D98=18,'Tipo '!$B$19,IF(D98=19,'Tipo '!$B$20,\"No ha seleccionado un tipo de contrato válido\")))))))))))))))))))","v":"CONTRATOS DE PRESTACIÓN DE SERVICIOS PROFESIONALES Y DE APOYO A LA GESTIÓN"},"Contratación directa","Prestación de servicios profesionales y de apoyo a la gestión, o para la ejecución de trabajos artísticos que sólo puedan encomendarse a determinadas personas naturales;","CONTRATAR LOS SEGUROS QUE AMPAREN LOS INTERESES PATRIMONIALES ACTUALES Y FUTUROS. ASI COMO LOS BIENES DE PROPIEDAD DEL FONDO DE DESARROLLO LOCAL DE SANTA FE, QUE ESTEN BAJO SU RESPONSABILIDAD Y CUSTODIA Y AQUELLOS QUE SEAN ADQUIRIDOS PARA DESARROLLAR LAS FUNCIONES INHERENTES A SU ACTIVIDAD, ASI COMO LA EXPEDICION DE CUALQUIER OTRA POLIZA DE SEGUROS QUE REQUIERA LA ENTIDAD EN EL DESARROLLO DE SU ACTIVIDAD","Funcionamiento",1,{"$f":"IF(J98=1,'Equivalencia BH-BMPT'!$D$2,IF(J98=2,'Equivalencia BH-BMPT'!$D$3,IF(J98=3,'Equivalencia BH-BMPT'!$D$4,IF(J98=4,'Equivalencia BH-BMPT'!$D$5,IF(J98=5,'Equivalencia BH-BMPT'!$D$6,IF(J98=6,'Equivalencia BH-BMPT'!$D$7,IF(J98=7,'Equivalencia BH-BMPT'!$D$8,IF(J98=8,'Equivalencia BH-BMPT'!$D$9,IF(J98=9,'Equivalencia BH-BMPT'!$D$10,IF(J98=10,'Equivalencia BH-BMPT'!$D$11,IF(J98=11,'Equivalencia BH-BMPT'!$D$12,IF(J98=12,'Equivalencia BH-BMPT'!$D$13,IF(J98=13,'Equivalencia BH-BMPT'!$D$14,IF(J98=14,'Equivalencia BH-BMPT'!$D$15,IF(J98=15,'Equivalencia BH-BMPT'!$D$16,IF(J98=16,'Equivalencia BH-BMPT'!$D$17,IF(J98=17,'Equivalencia BH-BMPT'!$D$18,IF(J98=18,'Equivalencia BH-BMPT'!$D$19,IF(J98=19,'Equivalencia BH-BMPT'!$D$20,IF(J98=20,'Equivalencia BH-BMPT'!$D$21,IF(J98=21,'Equivalencia BH-BMPT'!$D$22,IF(J98=22,'Equivalencia BH-BMPT'!$D$23,IF(J98=23,'Equivalencia BH-BMPT'!#REF!,IF(J98=24,'Equivalencia BH-BMPT'!$D$25,IF(J98=25,'Equivalencia BH-BMPT'!$D$26,IF(J98=26,'Equivalencia BH-BMPT'!$D$27,IF(J98=27,'Equivalencia BH-BMPT'!$D$28,IF(J98=28,'Equivalencia BH-BMPT'!$D$29,IF(J98=29,'Equivalencia BH-BMPT'!$D$30,IF(J98=30,'Equivalencia BH-BMPT'!$D$31,IF(J98=31,'Equivalencia BH-BMPT'!$D$32,IF(J98=32,'Equivalencia BH-BMPT'!$D$33,IF(J98=33,'Equivalencia BH-BMPT'!$D$34,IF(J98=34,'Equivalencia BH-BMPT'!$D$35,IF(J98=35,'Equivalencia BH-BMPT'!$D$36,IF(J98=36,'Equivalencia BH-BMPT'!$D$37,IF(J98=37,'Equivalencia BH-BMPT'!$D$38,IF(J98=38,'Equivalencia BH-BMPT'!#REF!,IF(J98=39,'Equivalencia BH-BMPT'!$D$40,IF(J98=40,'Equivalencia BH-BMPT'!$D$41,IF(J98=41,'Equivalencia BH-BMPT'!$D$42,IF(J98=42,'Equivalencia BH-BMPT'!$D$43,IF(J98=43,'Equivalencia BH-BMPT'!$D$44,IF(J98=44,'Equivalencia BH-BMPT'!$D$45,IF(J98=45,'Equivalencia BH-BMPT'!$D$46,\"No ha seleccionado un número de programa\")))))))))))))))))))))))))))))))))))))))))))))","v":"Prevención y atención de la maternidad y la paternidad tempranas"},0,860002184,"AXA COLPATRIA SEGUROS S.A",46698523,null,null,0,0,46698523,46605321,"2017-05-24","2017-06-03","2018-05-24",360,77,null,null,"X",null,null,0.99800417670597419,null,false]
[85,2017,"CO1.PCCNTR.163207",5,{"$f":"IF(D99=1,'Tipo '!$B$2,IF(D99=2,'Tipo '!$B$3,IF(D99=3,'Tipo '!$B$4,IF(D99=4,'Tipo '!$B$5,IF(D99=5,'Tipo '!$B$6,IF(D99=6,'Tipo '!$B$7,IF(D99=7,'Tipo '!$B$8,IF(D99=8,'Tipo '!$B$9,IF(D99=9,'Tipo '!$B$10,IF(D99=10,'Tipo '!$B$11,IF(D99=11,'Tipo '!$B$12,IF(D99=12,'Tipo '!$B$13,IF(D99=13,'Tipo '!$B$14,IF(D99=14,'Tipo '!$B$15,IF(D99=15,'Tipo '!$B$16,IF(D99=16,'Tipo '!$B$17,IF(D99=17,'Tipo '!$B$18,IF(D99=18,'Tipo '!$B$19,IF(D99=19,'Tipo '!$B$20,\"No ha seleccionado un tipo de contrato válido\")))))))))))))))))))","v":"CONTRATOS DE PRESTACIÓN DE SERVICIOS PROFESIONALES Y DE APOYO A LA GESTIÓN"},"Contratación directa","Prestación de servicios profesionales y de apoyo a la gestión, o para la ejecución de trabajos artísticos que sólo puedan encomendarse a determinadas personas naturales;","PRESTAR SERVICIOS DE APOYO ADMINISTRATIVO Y ASISTENCIAL A LAS INSPECCIONES DE POLICÍA DE LA ALCALDÍA LOCAL DE SANTA FE.","Inversión",45,{"$f":"IF(J99=1,'Equivalencia BH-BMPT'!$D$2,IF(J99=2,'Equivalencia BH-BMPT'!$D$3,IF(J99=3,'Equivalencia BH-BMPT'!$D$4,IF(J99=4,'Equivalencia BH-BMPT'!$D$5,IF(J99=5,'Equivalencia BH-BMPT'!$D$6,IF(J99=6,'Equivalencia BH-BMPT'!$D$7,IF(J99=7,'Equivalencia BH-BMPT'!$D$8,IF(J99=8,'Equivalencia BH-BMPT'!$D$9,IF(J99=9,'Equivalencia BH-BMPT'!$D$10,IF(J99=10,'Equivalencia BH-BMPT'!$D$11,IF(J99=11,'Equivalencia BH-BMPT'!$D$12,IF(J99=12,'Equivalencia BH-BMPT'!$D$13,IF(J99=13,'Equivalencia BH-BMPT'!$D$14,IF(J99=14,'Equivalencia BH-BMPT'!$D$15,IF(J99=15,'Equivalencia BH-BMPT'!$D$16,IF(J99=16,'Equivalencia BH-BMPT'!$D$17,IF(J99=17,'Equivalencia BH-BMPT'!$D$18,IF(J99=18,'Equivalencia BH-BMPT'!$D$19,IF(J99=19,'Equivalencia BH-BMPT'!$D$20,IF(J99=20,'Equivalencia BH-BMPT'!$D$21,IF(J99=21,'Equivalencia BH-BMPT'!$D$22,IF(J99=22,'Equivalencia BH-BMPT'!$D$23,IF(J99=23,'Equivalencia BH-BMPT'!#REF!,IF(J99=24,'Equivalencia BH-BMPT'!$D$25,IF(J99=25,'Equivalencia BH-BMPT'!$D$26,IF(J99=26,'Equivalencia BH-BMPT'!$D$27,IF(J99=27,'Equivalencia BH-BMPT'!$D$28,IF(J99=28,'Equivalencia BH-BMPT'!$D$29,IF(J99=29,'Equivalencia BH-BMPT'!$D$30,IF(J99=30,'Equivalencia BH-BMPT'!$D$31,IF(J99=31,'Equivalencia BH-BMPT'!$D$32,IF(J99=32,'Equivalencia BH-BMPT'!$D$33,IF(J99=33,'Equivalencia BH-BMPT'!$D$34,IF(J99=34,'Equivalencia BH-BMPT'!$D$35,IF(J99=35,'Equivalencia BH-BMPT'!$D$36,IF(J99=36,'Equivalencia BH-BMPT'!$D$37,IF(J99=37,'Equivalencia BH-BMPT'!$D$38,IF(J99=38,'Equivalencia BH-BMPT'!#REF!,IF(J99=39,'Equivalencia BH-BMPT'!$D$40,IF(J99=40,'Equivalencia BH-BMPT'!$D$41,IF(J99=41,'Equivalencia BH-BMPT'!$D$42,IF(J99=42,'Equivalencia BH-BMPT'!$D$43,IF(J99=43,'Equivalencia BH-BMPT'!$D$44,IF(J99=44,'Equivalencia BH-BMPT'!$D$45,IF(J99=45,'Equivalencia BH-BMPT'!$D$46,\"No ha seleccionado un número de programa\")))))))))))))))))))))))))))))))))))))))))))))","v":"Gobernanza e influencia local, regional e internacional"},1326,"1022361645","DIANA PATRICIA  NAVARRO GIL",11700000,null,null,1,1040000,12740000,11375000,"2017-06-14","2017-06-14","2017-12-30",180,78,null,null," ","X",null,0.8928571428571429,null,false]
[86,2017,"CO1.PCCNTR.170312",10,{"$f":"IF(D100=1,'Tipo '!$B$2,IF(D100=2,'Tipo '!$B$3,IF(D100=3,'Tipo '!$B$4,IF(D100=4,'Tipo '!$B$5,IF(D100=5,'Tipo '!$B$6,IF(D100=6,'Tipo '!$B$7,IF(D100=7,'Tipo '!$B$8,IF(D100=8,'Tipo '!$B$9,IF(D100=9,'Tipo '!$B$10,IF(D100=10,'Tipo '!$B$11,IF(D100=11,'Tipo '!$B$12,IF(D100=12,'Tipo '!$B$13,IF(D100=13,'Tipo '!$B$14,IF(D100=14,'Tipo '!$B$15,IF(D100=15,'Tipo '!$B$16,IF(D100=16,'Tipo '!$B$17,IF(D100=17,'Tipo '!$B$18,IF(D100=18,'Tipo '!$B$19,IF(D100=19,'Tipo '!$B$20,\"No ha seleccionado un tipo de contrato válido\")))))))))))))))))))","v":"SEGUROS"},"Selección abreviada ","Selección abreviada por menor cuantía ","REALIZAR LA TOMA FÍSICA Y EL AVALUÓ TÉCNICO Y COMERCIAL DE LOS BIENES MUEBLES, PROPIEDAD PLANTA Y EQUIPO DEL FONDO DE DESARROLLO LOCAL DE SANTA FE, DE ACUERDO A LA REGLAMENTACION VIGENTE","Inversión",45,{"$f":"IF(J100=1,'Equivalencia BH-BMPT'!$D$2,IF(J100=2,'Equivalencia BH-BMPT'!$D$3,IF(J100=3,'Equivalencia BH-BMPT'!$D$4,IF(J100=4,'Equivalencia BH-BMPT'!$D$5,IF(J100=5,'Equivalencia BH-BMPT'!$D$6,IF(J100=6,'Equivalencia BH-BMPT'!$D$7,IF(J100=7,'Equivalencia BH-BMPT'!$D$8,IF(J100=8,'Equivalencia BH-BMPT'!$D$9,IF(J100=9,'Equivalencia BH-BMPT'!$D$10,IF(J100=10,'Equivalencia BH-BMPT'!$D$11,IF(J100=11,'Equivalencia BH-BMPT'!$D$12,IF(J100=12,'Equivalencia BH-BMPT'!$D$13,IF(J100=13,'Equivalencia BH-BMPT'!$D$14,IF(J100=14,'Equivalencia BH-BMPT'!$D$15,IF(J100=15,'Equivalencia BH-BMPT'!$D$16,IF(J100=16,'Equivalencia BH-BMPT'!$D$17,IF(J100=17,'Equivalencia BH-BMPT'!$D$18,IF(J100=18,'Equivalencia BH-BMPT'!$D$19,IF(J100=19,'Equivalencia BH-BMPT'!$D$20,IF(J100=20,'Equivalencia BH-BMPT'!$D$21,IF(J100=21,'Equivalencia BH-BMPT'!$D$22,IF(J100=22,'Equivalencia BH-BMPT'!$D$23,IF(J100=23,'Equivalencia BH-BMPT'!#REF!,IF(J100=24,'Equivalencia BH-BMPT'!$D$25,IF(J100=25,'Equivalencia BH-BMPT'!$D$26,IF(J100=26,'Equivalencia BH-BMPT'!$D$27,IF(J100=27,'Equivalencia BH-BMPT'!$D$28,IF(J100=28,'Equivalencia BH-BMPT'!$D$29,IF(J100=29,'Equivalencia BH-BMPT'!$D$30,IF(J100=30,'Equivalencia BH-BMPT'!$D$31,IF(J100=31,'Equivalencia BH-BMPT'!$D$32,IF(J100=32,'Equivalencia BH-BMPT'!$D$33,IF(J100=33,'Equivalencia BH-BMPT'!$D$34,IF(J100=34,'Equivalencia BH-BMPT'!$D$35,IF(J100=35,'Equivalencia BH-BMPT'!$D$36,IF(J100=36,'Equivalencia BH-BMPT'!$D$37,IF(J100=37,'Equivalencia BH-BMPT'!$D$38,IF(J100=38,'Equivalencia BH-BMPT'!#REF!,IF(J100=39,'Equivalencia BH-BMPT'!$D$40,IF(J100=40,'Equivalencia BH-BMPT'!$D$41,IF(J100=41,'Equivalencia BH-BMPT'!$D$42,IF(J100=42,'Equivalencia BH-BMPT'!$D$43,IF(J100=43,'Equivalencia BH-BMPT'!$D$44,IF(J100=44,'Equivalencia BH-BMPT'!$D$45,IF(J100=45,'Equivalencia BH-BMPT'!$D$46,\"No ha seleccionado un número de programa\")))))))))))))))))))))))))))))))))))))))))))))","v":"Gobernanza e influencia local, regional e internacional"},1326,900094086,"FILFER SOCIEDAD DE INVERSIONES SAS",7004340,null,null,1,2610860,9615200,0,"2017-07-10","2017-07-14","2017-09-13",60,79,null,null,"X",null,null,0,null,false]
[87,2017,"CO1.PCCNTR.170812",5,{"$f":"IF(D101=1,'Tipo '!$B$2,IF(D101=2,'Tipo '!$B$3,IF(D101=3,'Tipo '!$B$4,IF(D101=4,'Tipo '!$B$5,IF(D101=5,'Tipo '!$B$6,IF(D101=6,'Tipo '!$B$7,IF(D101=7,'Tipo '!$B$8,IF(D101=8,'Tipo '!$B$9,IF(D101=9,'Tipo '!$B$10,IF(D101=10,'Tipo '!$B$11,IF(D101=11,'Tipo '!$B$12,IF(D101=12,'Tipo '!$B$13,IF(D101=13,'Tipo '!$B$14,IF(D101=14,'Tipo '!$B$15,IF(D101=15,'Tipo '!$B$16,IF(D101=16,'Tipo '!$B$17,IF(D101=17,'Tipo '!$B$18,IF(D101=18,'Tipo '!$B$19,IF(D101=19,'Tipo '!$B$20,\"No ha seleccionado un tipo de contrato válido\")))))))))))))))))))","v":"CONTRATOS DE PRESTACIÓN DE SERVICIOS PROFESIONALES Y DE APOYO A LA GESTIÓN"},"Contratación directa","selección abreviada de menor cuantía","Prestar el servicio de Outsourcing de equipos de impresión multifuncionales con sus respectivos suministros de acuerdo al anexo técnico adjunto","Funcionamiento",0,{"$f":"IF(J101=1,'Equivalencia BH-BMPT'!$D$2,IF(J101=2,'Equivalencia BH-BMPT'!$D$3,IF(J101=3,'Equivalencia BH-BMPT'!$D$4,IF(J101=4,'Equivalencia BH-BMPT'!$D$5,IF(J101=5,'Equivalencia BH-BMPT'!$D$6,IF(J101=6,'Equivalencia BH-BMPT'!$D$7,IF(J101=7,'Equivalencia BH-BMPT'!$D$8,IF(J101=8,'Equivalencia BH-BMPT'!$D$9,IF(J101=9,'Equivalencia BH-BMPT'!$D$10,IF(J101=10,'Equivalencia BH-BMPT'!$D$11,IF(J101=11,'Equivalencia BH-BMPT'!$D$12,IF(J101=12,'Equivalencia BH-BMPT'!$D$13,IF(J101=13,'Equivalencia BH-BMPT'!$D$14,IF(J101=14,'Equivalencia BH-BMPT'!$D$15,IF(J101=15,'Equivalencia BH-BMPT'!$D$16,IF(J101=16,'Equivalencia BH-BMPT'!$D$17,IF(J101=17,'Equivalencia BH-BMPT'!$D$18,IF(J101=18,'Equivalencia BH-BMPT'!$D$19,IF(J101=19,'Equivalencia BH-BMPT'!$D$20,IF(J101=20,'Equivalencia BH-BMPT'!$D$21,IF(J101=21,'Equivalencia BH-BMPT'!$D$22,IF(J101=22,'Equivalencia BH-BMPT'!$D$23,IF(J101=23,'Equivalencia BH-BMPT'!#REF!,IF(J101=24,'Equivalencia BH-BMPT'!$D$25,IF(J101=25,'Equivalencia BH-BMPT'!$D$26,IF(J101=26,'Equivalencia BH-BMPT'!$D$27,IF(J101=27,'Equivalencia BH-BMPT'!$D$28,IF(J101=28,'Equivalencia BH-BMPT'!$D$29,IF(J101=29,'Equivalencia BH-BMPT'!$D$30,IF(J101=30,'Equivalencia BH-BMPT'!$D$31,IF(J101=31,'Equivalencia BH-BMPT'!$D$32,IF(J101=32,'Equivalencia BH-BMPT'!$D$33,IF(J101=33,'Equivalencia BH-BMPT'!$D$34,IF(J101=34,'Equivalencia BH-BMPT'!$D$35,IF(J101=35,'Equivalencia BH-BMPT'!$D$36,IF(J101=36,'Equivalencia BH-BMPT'!$D$37,IF(J101=37,'Equivalencia BH-BMPT'!$D$38,IF(J101=38,'Equivalencia BH-BMPT'!#REF!,IF(J101=39,'Equivalencia BH-BMPT'!$D$40,IF(J101=40,'Equivalencia BH-BMPT'!$D$41,IF(J101=41,'Equivalencia BH-BMPT'!$D$42,IF(J101=42,'Equivalencia BH-BMPT'!$D$43,IF(J101=43,'Equivalencia BH-BMPT'!$D$44,IF(J101=44,'Equivalencia BH-BMPT'!$D$45,IF(J101=45,'Equivalencia BH-BMPT'!$D$46,\"No ha seleccionado un número de programa\")))))))))))))))))))))))))))))))))))))))))))))","v":"No ha seleccionado un número de programa"},0,830031976,"COPIERS MARKET EU",6426000,null,null,0,0,6426000,1939050,"2017-07-10","2017-07-18","2018-03-17",240,80,null,null,"X",null,null,0.30175070028011203,null,true]
[88,2017,"CO1.PCCNTR.171115",3,{"$f":"IF(D102=1,'Tipo '!$B$2,IF(D102=2,'Tipo '!$B$3,IF(D102=3,'Tipo '!$B$4,IF(D102=4,'Tipo '!$B$5,IF(D102=5,'Tipo '!$B$6,IF(D102=6,'Tipo '!$B$7,IF(D102=7,'Tipo '!$B$8,IF(D102=8,'Tipo '!$B$9,IF(D102=9,'Tipo '!$B$10,IF(D102=10,'Tipo '!$B$11,IF(D102=11,'Tipo '!$B$12,IF(D102=12,'Tipo '!$B$13,IF(D102=13,'Tipo '!$B$14,IF(D102=14,'Tipo '!$B$15,IF(D102=15,'Tipo '!$B$16,IF(D102=16,'Tipo '!$B$17,IF(D102=17,'Tipo '!$B$18,IF(D102=18,'Tipo '!$B$19,IF(D102=19,'Tipo '!$B$20,\"No ha seleccionado un tipo de contrato válido\")))))))))))))))))))","v":"INTERVENTORÍA"},"Contratación mínima cuantia ","No aplica","CONTRATAR A MONTO AGOTABLE EL SUMINISTRO DE ELEMENTOS DE PAPELERÍA, ÚTILES DE ESCRITORIO Y OFICINA REQUERIDOS PARA LA EJECUCIÓN DEL PROYECTO DE ENTREGA DEL BONO SUBSIDIO TIPO C EN LA LOCALIDAD DE SANTA FE.","Inversión",3,{"$f":"IF(J102=1,'Equivalencia BH-BMPT'!$D$2,IF(J102=2,'Equivalencia BH-BMPT'!$D$3,IF(J102=3,'Equivalencia BH-BMPT'!$D$4,IF(J102=4,'Equivalencia BH-BMPT'!$D$5,IF(J102=5,'Equivalencia BH-BMPT'!$D$6,IF(J102=6,'Equivalencia BH-BMPT'!$D$7,IF(J102=7,'Equivalencia BH-BMPT'!$D$8,IF(J102=8,'Equivalencia BH-BMPT'!$D$9,IF(J102=9,'Equivalencia BH-BMPT'!$D$10,IF(J102=10,'Equivalencia BH-BMPT'!$D$11,IF(J102=11,'Equivalencia BH-BMPT'!$D$12,IF(J102=12,'Equivalencia BH-BMPT'!$D$13,IF(J102=13,'Equivalencia BH-BMPT'!$D$14,IF(J102=14,'Equivalencia BH-BMPT'!$D$15,IF(J102=15,'Equivalencia BH-BMPT'!$D$16,IF(J102=16,'Equivalencia BH-BMPT'!$D$17,IF(J102=17,'Equivalencia BH-BMPT'!$D$18,IF(J102=18,'Equivalencia BH-BMPT'!$D$19,IF(J102=19,'Equivalencia BH-BMPT'!$D$20,IF(J102=20,'Equivalencia BH-BMPT'!$D$21,IF(J102=21,'Equivalencia BH-BMPT'!$D$22,IF(J102=22,'Equivalencia BH-BMPT'!$D$23,IF(J102=23,'Equivalencia BH-BMPT'!#REF!,IF(J102=24,'Equivalencia BH-BMPT'!$D$25,IF(J102=25,'Equivalencia BH-BMPT'!$D$26,IF(J102=26,'Equivalencia BH-BMPT'!$D$27,IF(J102=27,'Equivalencia BH-BMPT'!$D$28,IF(J102=28,'Equivalencia BH-BMPT'!$D$29,IF(J102=29,'Equivalencia BH-BMPT'!$D$30,IF(J102=30,'Equivalencia BH-BMPT'!$D$31,IF(J102=31,'Equivalencia BH-BMPT'!$D$32,IF(J102=32,'Equivalencia BH-BMPT'!$D$33,IF(J102=33,'Equivalencia BH-BMPT'!$D$34,IF(J102=34,'Equivalencia BH-BMPT'!$D$35,IF(J102=35,'Equivalencia BH-BMPT'!$D$36,IF(J102=36,'Equivalencia BH-BMPT'!$D$37,IF(J102=37,'Equivalencia BH-BMPT'!$D$38,IF(J102=38,'Equivalencia BH-BMPT'!#REF!,IF(J102=39,'Equivalencia BH-BMPT'!$D$40,IF(J102=40,'Equivalencia BH-BMPT'!$D$41,IF(J102=41,'Equivalencia BH-BMPT'!$D$42,IF(J102=42,'Equivalencia BH-BMPT'!$D$43,IF(J102=43,'Equivalencia BH-BMPT'!$D$44,IF(J102=44,'Equivalencia BH-BMPT'!$D$45,IF(J102=45,'Equivalencia BH-BMPT'!$D$46,\"No ha seleccionado un número de programa\")))))))))))))))))))))))))))))))))))))))))))))","v":"Igualdad y autonomía para una Bogotá incluyente"},1315,860053274,"GRUPO LOS LAGOS SAS",10915386,null,null,0,0,10915386,1653062,"2017-07-10","2017-07-18","2018-03-17",240,81,null,null,"X",null,null,0.15144329298111858,null,false]
[89,2017,"CO1.PCCNTR.171723",4,{"$f":"IF(D103=1,'Tipo '!$B$2,IF(D103=2,'Tipo '!$B$3,IF(D103=3,'Tipo '!$B$4,IF(D103=4,'Tipo '!$B$5,IF(D103=5,'Tipo '!$B$6,IF(D103=6,'Tipo '!$B$7,IF(D103=7,'Tipo '!$B$8,IF(D103=8,'Tipo '!$B$9,IF(D103=9,'Tipo '!$B$10,IF(D103=10,'Tipo '!$B$11,IF(D103=11,'Tipo '!$B$12,IF(D103=12,'Tipo '!$B$13,IF(D103=13,'Tipo '!$B$14,IF(D103=14,'Tipo '!$B$15,IF(D103=15,'Tipo '!$B$16,IF(D103=16,'Tipo '!$B$17,IF(D103=17,'Tipo '!$B$18,IF(D103=18,'Tipo '!$B$19,IF(D103=19,'Tipo '!$B$20,\"No ha seleccionado un tipo de contrato válido\")))))))))))))))))))","v":"CONTRATOS DE PRESTACIÓN DE SERVICIOS"},"Contratación mínima cuantia ","No aplica","PRESTAR SERVICIOS PROFESIONALES COMO APOYO JURÍDICO EN LA EJECUCIÓN DE LAS ACCIONES REQUERIDAS PARA EL TRÁMITE E IMPULSO PROCESAL DE LAS ACTUACIONES CONTRAVENCIONALES Y/O QUERELLAS QUE CURSEN EN LAS INSPECCIONES DE POLICÍA DE LA ALCALDÍA LOCAL","Inversión",45,{"$f":"IF(J103=1,'Equivalencia BH-BMPT'!$D$2,IF(J103=2,'Equivalencia BH-BMPT'!$D$3,IF(J103=3,'Equivalencia BH-BMPT'!$D$4,IF(J103=4,'Equivalencia BH-BMPT'!$D$5,IF(J103=5,'Equivalencia BH-BMPT'!$D$6,IF(J103=6,'Equivalencia BH-BMPT'!$D$7,IF(J103=7,'Equivalencia BH-BMPT'!$D$8,IF(J103=8,'Equivalencia BH-BMPT'!$D$9,IF(J103=9,'Equivalencia BH-BMPT'!$D$10,IF(J103=10,'Equivalencia BH-BMPT'!$D$11,IF(J103=11,'Equivalencia BH-BMPT'!$D$12,IF(J103=12,'Equivalencia BH-BMPT'!$D$13,IF(J103=13,'Equivalencia BH-BMPT'!$D$14,IF(J103=14,'Equivalencia BH-BMPT'!$D$15,IF(J103=15,'Equivalencia BH-BMPT'!$D$16,IF(J103=16,'Equivalencia BH-BMPT'!$D$17,IF(J103=17,'Equivalencia BH-BMPT'!$D$18,IF(J103=18,'Equivalencia BH-BMPT'!$D$19,IF(J103=19,'Equivalencia BH-BMPT'!$D$20,IF(J103=20,'Equivalencia BH-BMPT'!$D$21,IF(J103=21,'Equivalencia BH-BMPT'!$D$22,IF(J103=22,'Equivalencia BH-BMPT'!$D$23,IF(J103=23,'Equivalencia BH-BMPT'!#REF!,IF(J103=24,'Equivalencia BH-BMPT'!$D$25,IF(J103=25,'Equivalencia BH-BMPT'!$D$26,IF(J103=26,'Equivalencia BH-BMPT'!$D$27,IF(J103=27,'Equivalencia BH-BMPT'!$D$28,IF(J103=28,'Equivalencia BH-BMPT'!$D$29,IF(J103=29,'Equivalencia BH-BMPT'!$D$30,IF(J103=30,'Equivalencia BH-BMPT'!$D$31,IF(J103=31,'Equivalencia BH-BMPT'!$D$32,IF(J103=32,'Equivalencia BH-BMPT'!$D$33,IF(J103=33,'Equivalencia BH-BMPT'!$D$34,IF(J103=34,'Equivalencia BH-BMPT'!$D$35,IF(J103=35,'Equivalencia BH-BMPT'!$D$36,IF(J103=36,'Equivalencia BH-BMPT'!$D$37,IF(J103=37,'Equivalencia BH-BMPT'!$D$38,IF(J103=38,'Equivalencia BH-BMPT'!#REF!,IF(J103=39,'Equivalencia BH-BMPT'!$D$40,IF(J103=40,'Equivalencia BH-BMPT'!$D$41,IF(J103=41,'Equivalencia BH-BMPT'!$D$42,IF(J103=42,'Equivalencia BH-BMPT'!$D$43,IF(J103=43,'Equivalencia BH-BMPT'!$D$44,IF(J103=44,'Equivalencia BH-BMPT'!$D$45,IF(J103=45,'Equivalencia BH-BMPT'!$D$46,\"No ha seleccionado un número de programa\")))))))))))))))))))))))))))))))))))))))))))))","v":"Gobernanza e influencia local, regional e internacional"},1326,80769750,"JOSEPH FELIPE PULIDO",25650000,null,null,0,0,25650000,21450000,"2017-07-13","2017-07-17","2018-01-03",180,82,null,null,"X",null,null,0.83625730994152048,null,false]
[90,2017,"CO1.PCCNTR.181825",11,{"$f":"IF(D104=1,'Tipo '!$B$2,IF(D104=2,'Tipo '!$B$3,IF(D104=3,'Tipo '!$B$4,IF(D104=4,'Tipo '!$B$5,IF(D104=5,'Tipo '!$B$6,IF(D104=6,'Tipo '!$B$7,IF(D104=7,'Tipo '!$B$8,IF(D104=8,'Tipo '!$B$9,IF(D104=9,'Tipo '!$B$10,IF(D104=10,'Tipo '!$B$11,IF(D104=11,'Tipo '!$B$12,IF(D104=12,'Tipo '!$B$13,IF(D104=13,'Tipo '!$B$14,IF(D104=14,'Tipo '!$B$15,IF(D104=15,'Tipo '!$B$16,IF(D104=16,'Tipo '!$B$17,IF(D104=17,'Tipo '!$B$18,IF(D104=18,'Tipo '!$B$19,IF(D104=19,'Tipo '!$B$20,\"No ha seleccionado un tipo de contrato válido\")))))))))))))))))))","v":"SUMINISTRO"},"Contratación mínima cuantia ","No aplica","PRESTAR SERVICIOS DE APOYO ADMINISTRATIVO Y ASISTENCIAL A LAS INSPECCIONES DE POLICÍA DE LA ALCALDÍA LOCAL DE SANTA FE.","Inversión",45,{"$f":"IF(J104=1,'Equivalencia BH-BMPT'!$D$2,IF(J104=2,'Equivalencia BH-BMPT'!$D$3,IF(J104=3,'Equivalencia BH-BMPT'!$D$4,IF(J104=4,'Equivalencia BH-BMPT'!$D$5,IF(J104=5,'Equivalencia BH-BMPT'!$D$6,IF(J104=6,'Equivalencia BH-BMPT'!$D$7,IF(J104=7,'Equivalencia BH-BMPT'!$D$8,IF(J104=8,'Equivalencia BH-BMPT'!$D$9,IF(J104=9,'Equivalencia BH-BMPT'!$D$10,IF(J104=10,'Equivalencia BH-BMPT'!$D$11,IF(J104=11,'Equivalencia BH-BMPT'!$D$12,IF(J104=12,'Equivalencia BH-BMPT'!$D$13,IF(J104=13,'Equivalencia BH-BMPT'!$D$14,IF(J104=14,'Equivalencia BH-BMPT'!$D$15,IF(J104=15,'Equivalencia BH-BMPT'!$D$16,IF(J104=16,'Equivalencia BH-BMPT'!$D$17,IF(J104=17,'Equivalencia BH-BMPT'!$D$18,IF(J104=18,'Equivalencia BH-BMPT'!$D$19,IF(J104=19,'Equivalencia BH-BMPT'!$D$20,IF(J104=20,'Equivalencia BH-BMPT'!$D$21,IF(J104=21,'Equivalencia BH-BMPT'!$D$22,IF(J104=22,'Equivalencia BH-BMPT'!$D$23,IF(J104=23,'Equivalencia BH-BMPT'!#REF!,IF(J104=24,'Equivalencia BH-BMPT'!$D$25,IF(J104=25,'Equivalencia BH-BMPT'!$D$26,IF(J104=26,'Equivalencia BH-BMPT'!$D$27,IF(J104=27,'Equivalencia BH-BMPT'!$D$28,IF(J104=28,'Equivalencia BH-BMPT'!$D$29,IF(J104=29,'Equivalencia BH-BMPT'!$D$30,IF(J104=30,'Equivalencia BH-BMPT'!$D$31,IF(J104=31,'Equivalencia BH-BMPT'!$D$32,IF(J104=32,'Equivalencia BH-BMPT'!$D$33,IF(J104=33,'Equivalencia BH-BMPT'!$D$34,IF(J104=34,'Equivalencia BH-BMPT'!$D$35,IF(J104=35,'Equivalencia BH-BMPT'!$D$36,IF(J104=36,'Equivalencia BH-BMPT'!$D$37,IF(J104=37,'Equivalencia BH-BMPT'!$D$38,IF(J104=38,'Equivalencia BH-BMPT'!#REF!,IF(J104=39,'Equivalencia BH-BMPT'!$D$40,IF(J104=40,'Equivalencia BH-BMPT'!$D$41,IF(J104=41,'Equivalencia BH-BMPT'!$D$42,IF(J104=42,'Equivalencia BH-BMPT'!$D$43,IF(J104=43,'Equivalencia BH-BMPT'!$D$44,IF(J104=44,'Equivalencia BH-BMPT'!$D$45,IF(J104=45,'Equivalencia BH-BMPT'!$D$46,\"No ha seleccionado un número de programa\")))))))))))))))))))))))))))))))))))))))))))))","v":"Gobernanza e influencia local, regional e internacional"},1326,80903496,"JULIAN LEONARDO RIVERA DUCON",8500000,null,null,0,0,8500000,7253333,"2017-07-31","2017-08-02","2017-12-30",120,83,null,null," ","X",null,0.85333329411764702,null,false]
[91,2017,"17-4-7044320",5,{"$f":"IF(D105=1,'Tipo '!$B$2,IF(D105=2,'Tipo '!$B$3,IF(D105=3,'Tipo '!$B$4,IF(D105=4,'Tipo '!$B$5,IF(D105=5,'Tipo '!$B$6,IF(D105=6,'Tipo '!$B$7,IF(D105=7,'Tipo '!$B$8,IF(D105=8,'Tipo '!$B$9,IF(D105=9,'Tipo '!$B$10,IF(D105=10,'Tipo '!$B$11,IF(D105=11,'Tipo '!$B$12,IF(D105=12,'Tipo '!$B$13,IF(D105=13,'Tipo '!$B$14,IF(D105=14,'Tipo '!$B$15,IF(D105=15,'Tipo '!$B$16,IF(D105=16,'Tipo '!$B$17,IF(D105=17,'Tipo '!$B$18,IF(D105=18,'Tipo '!$B$19,IF(D105=19,'Tipo '!$B$20,\"No ha seleccionado un tipo de contrato válido\")))))))))))))))))))","v":"CONTRATOS DE PRESTACIÓN DE SERVICIOS PROFESIONALES Y DE APOYO A LA GESTIÓN"},"Contratación directa","Bolsas de productos","ADQUIRIR A TRAVES DE BOLSA MERCANTIL DE COLOMBIA S.A EL SUMINISTRO DE MATERIALES, ELEMENTOS Y CONSUMIBLES, CON EL ANIMO DE REALIZAR ACCIONES DE EMBELLECIMIENTO DE ESPACIO PUBLICO EN LA LOCALIDAD DE SANTA FE","Inversión",18,{"$f":"IF(J105=1,'Equivalencia BH-BMPT'!$D$2,IF(J105=2,'Equivalencia BH-BMPT'!$D$3,IF(J105=3,'Equivalencia BH-BMPT'!$D$4,IF(J105=4,'Equivalencia BH-BMPT'!$D$5,IF(J105=5,'Equivalencia BH-BMPT'!$D$6,IF(J105=6,'Equivalencia BH-BMPT'!$D$7,IF(J105=7,'Equivalencia BH-BMPT'!$D$8,IF(J105=8,'Equivalencia BH-BMPT'!$D$9,IF(J105=9,'Equivalencia BH-BMPT'!$D$10,IF(J105=10,'Equivalencia BH-BMPT'!$D$11,IF(J105=11,'Equivalencia BH-BMPT'!$D$12,IF(J105=12,'Equivalencia BH-BMPT'!$D$13,IF(J105=13,'Equivalencia BH-BMPT'!$D$14,IF(J105=14,'Equivalencia BH-BMPT'!$D$15,IF(J105=15,'Equivalencia BH-BMPT'!$D$16,IF(J105=16,'Equivalencia BH-BMPT'!$D$17,IF(J105=17,'Equivalencia BH-BMPT'!$D$18,IF(J105=18,'Equivalencia BH-BMPT'!$D$19,IF(J105=19,'Equivalencia BH-BMPT'!$D$20,IF(J105=20,'Equivalencia BH-BMPT'!$D$21,IF(J105=21,'Equivalencia BH-BMPT'!$D$22,IF(J105=22,'Equivalencia BH-BMPT'!$D$23,IF(J105=23,'Equivalencia BH-BMPT'!#REF!,IF(J105=24,'Equivalencia BH-BMPT'!$D$25,IF(J105=25,'Equivalencia BH-BMPT'!$D$26,IF(J105=26,'Equivalencia BH-BMPT'!$D$27,IF(J105=27,'Equivalencia BH-BMPT'!$D$28,IF(J105=28,'Equivalencia BH-BMPT'!$D$29,IF(J105=29,'Equivalencia BH-BMPT'!$D$30,IF(J105=30,'Equivalencia BH-BMPT'!$D$31,IF(J105=31,'Equivalencia BH-BMPT'!$D$32,IF(J105=32,'Equivalencia BH-BMPT'!$D$33,IF(J105=33,'Equivalencia BH-BMPT'!$D$34,IF(J105=34,'Equivalencia BH-BMPT'!$D$35,IF(J105=35,'Equivalencia BH-BMPT'!$D$36,IF(J105=36,'Equivalencia BH-BMPT'!$D$37,IF(J105=37,'Equivalencia BH-BMPT'!$D$38,IF(J105=38,'Equivalencia BH-BMPT'!#REF!,IF(J105=39,'Equivalencia BH-BMPT'!$D$40,IF(J105=40,'Equivalencia BH-BMPT'!$D$41,IF(J105=41,'Equivalencia BH-BMPT'!$D$42,IF(J105=42,'Equivalencia BH-BMPT'!$D$43,IF(J105=43,'Equivalencia BH-BMPT'!$D$44,IF(J105=44,'Equivalencia BH-BMPT'!$D$45,IF(J105=45,'Equivalencia BH-BMPT'!$D$46,\"No ha seleccionado un número de programa\")))))))))))))))))))))))))))))))))))))))))))))","v":"Mejor movilidad para todos"},1322,830103828,"AGOBOLSA S.A",148221006,null,null,2,null,148221006,148221006,"2017/08/15","2017/08/15","2017-11-14",90,84,null,null,"X",null,null,1,null,false]
[93,2017,"CO1.PCCNTR.190910",5,{"$f":"IF(D106=1,'Tipo '!$B$2,IF(D106=2,'Tipo '!$B$3,IF(D106=3,'Tipo '!$B$4,IF(D106=4,'Tipo '!$B$5,IF(D106=5,'Tipo '!$B$6,IF(D106=6,'Tipo '!$B$7,IF(D106=7,'Tipo '!$B$8,IF(D106=8,'Tipo '!$B$9,IF(D106=9,'Tipo '!$B$10,IF(D106=10,'Tipo '!$B$11,IF(D106=11,'Tipo '!$B$12,IF(D106=12,'Tipo '!$B$13,IF(D106=13,'Tipo '!$B$14,IF(D106=14,'Tipo '!$B$15,IF(D106=15,'Tipo '!$B$16,IF(D106=16,'Tipo '!$B$17,IF(D106=17,'Tipo '!$B$18,IF(D106=18,'Tipo '!$B$19,IF(D106=19,'Tipo '!$B$20,\"No ha seleccionado un tipo de contrato válido\")))))))))))))))))))","v":"CONTRATOS DE PRESTACIÓN DE SERVICIOS PROFESIONALES Y DE APOYO A LA GESTIÓN"},"Contratación directa","Prestación de servicios profesionales y de apoyo a la gestión, o para la ejecución de trabajos artísticos que sólo puedan encomendarse a determinadas personas naturales;","PRESTAR SERVICIOS PROFESIONALES COMO APOYO JURÍDICO EN LA EJECUCIÓN DE LAS ACCIONES REQUERIDAS PARA EL TRÁMITE E IMPULSO PROCESAL DE LAS ACTUACIONES CONTRAVENCIONALES Y/O QUERELLAS QUE CURSEN EN LAS INSPECCIONES DE POLICÍA DE LA ALCALDÍA LOCAL","Inversión",45,{"$f":"IF(J106=1,'Equivalencia BH-BMPT'!$D$2,IF(J106=2,'Equivalencia BH-BMPT'!$D$3,IF(J106=3,'Equivalencia BH-BMPT'!$D$4,IF(J106=4,'Equivalencia BH-BMPT'!$D$5,IF(J106=5,'Equivalencia BH-BMPT'!$D$6,IF(J106=6,'Equivalencia BH-BMPT'!$D$7,IF(J106=7,'Equivalencia BH-BMPT'!$D$8,IF(J106=8,'Equivalencia BH-BMPT'!$D$9,IF(J106=9,'Equivalencia BH-BMPT'!$D$10,IF(J106=10,'Equivalencia BH-BMPT'!$D$11,IF(J106=11,'Equivalencia BH-BMPT'!$D$12,IF(J106=12,'Equivalencia BH-BMPT'!$D$13,IF(J106=13,'Equivalencia BH-BMPT'!$D$14,IF(J106=14,'Equivalencia BH-BMPT'!$D$15,IF(J106=15,'Equivalencia BH-BMPT'!$D$16,IF(J106=16,'Equivalencia BH-BMPT'!$D$17,IF(J106=17,'Equivalencia BH-BMPT'!$D$18,IF(J106=18,'Equivalencia BH-BMPT'!$D$19,IF(J106=19,'Equivalencia BH-BMPT'!$D$20,IF(J106=20,'Equivalencia BH-BMPT'!$D$21,IF(J106=21,'Equivalencia BH-BMPT'!$D$22,IF(J106=22,'Equivalencia BH-BMPT'!$D$23,IF(J106=23,'Equivalencia BH-BMPT'!#REF!,IF(J106=24,'Equivalencia BH-BMPT'!$D$25,IF(J106=25,'Equivalencia BH-BMPT'!$D$26,IF(J106=26,'Equivalencia BH-BMPT'!$D$27,IF(J106=27,'Equivalencia BH-BMPT'!$D$28,IF(J106=28,'Equivalencia BH-BMPT'!$D$29,IF(J106=29,'Equivalencia BH-BMPT'!$D$30,IF(J106=30,'Equivalencia BH-BMPT'!$D$31,IF(J106=31,'Equivalencia BH-BMPT'!$D$32,IF(J106=32,'Equivalencia BH-BMPT'!$D$33,IF(J106=33,'Equivalencia BH-BMPT'!$D$34,IF(J106=34,'Equivalencia BH-BMPT'!$D$35,IF(J106=35,'Equivalencia BH-BMPT'!$D$36,IF(J106=36,'Equivalencia BH-BMPT'!$D$37,IF(J106=37,'Equivalencia BH-BMPT'!$D$38,IF(J106=38,'Equivalencia BH-BMPT'!#REF!,IF(J106=39,'Equivalencia BH-BMPT'!$D$40,IF(J106=40,'Equivalencia BH-BMPT'!$D$41,IF(J106=41,'Equivalencia BH-BMPT'!$D$42,IF(J106=42,'Equivalencia BH-BMPT'!$D$43,IF(J106=43,'Equivalencia BH-BMPT'!$D$44,IF(J106=44,'Equivalencia BH-BMPT'!$D$45,IF(J106=45,'Equivalencia BH-BMPT'!$D$46,\"No ha seleccionado un número de programa\")))))))))))))))))))))))))))))))))))))))))))))","v":"Gobernanza e influencia local, regional e internacional"},1326,26257660,"YASMINE PARRA MURILLO",19950000,null,null,0,0,19950000,15300000,"2017/08/23","2017/08/28",43100,133,85,null,null,"X",null,null,0.76691729323308266,null,false]
[94,2017,"17-12-6994062",4,{"$f":"IF(D107=1,'Tipo '!$B$2,IF(D107=2,'Tipo '!$B$3,IF(D107=3,'Tipo '!$B$4,IF(D107=4,'Tipo '!$B$5,IF(D107=5,'Tipo '!$B$6,IF(D107=6,'Tipo '!$B$7,IF(D107=7,'Tipo '!$B$8,IF(D107=8,'Tipo '!$B$9,IF(D107=9,'Tipo '!$B$10,IF(D107=10,'Tipo '!$B$11,IF(D107=11,'Tipo '!$B$12,IF(D107=12,'Tipo '!$B$13,IF(D107=13,'Tipo '!$B$14,IF(D107=14,'Tipo '!$B$15,IF(D107=15,'Tipo '!$B$16,IF(D107=16,'Tipo '!$B$17,IF(D107=17,'Tipo '!$B$18,IF(D107=18,'Tipo '!$B$19,IF(D107=19,'Tipo '!$B$20,\"No ha seleccionado un tipo de contrato válido\")))))))))))))))))))","v":"CONTRATOS DE PRESTACIÓN DE SERVICIOS"},"Selección abreviada ","Subasta inversa","“Prestar el servicio de mantenimiento preventivo y correctivo con bolsa de repuestos al ascensor marca Schindler de propiedad del Fondo de Desarrollo Local Santa Fe”.","Funcionamiento",1,{"$f":"IF(J107=1,'Equivalencia BH-BMPT'!$D$2,IF(J107=2,'Equivalencia BH-BMPT'!$D$3,IF(J107=3,'Equivalencia BH-BMPT'!$D$4,IF(J107=4,'Equivalencia BH-BMPT'!$D$5,IF(J107=5,'Equivalencia BH-BMPT'!$D$6,IF(J107=6,'Equivalencia BH-BMPT'!$D$7,IF(J107=7,'Equivalencia BH-BMPT'!$D$8,IF(J107=8,'Equivalencia BH-BMPT'!$D$9,IF(J107=9,'Equivalencia BH-BMPT'!$D$10,IF(J107=10,'Equivalencia BH-BMPT'!$D$11,IF(J107=11,'Equivalencia BH-BMPT'!$D$12,IF(J107=12,'Equivalencia BH-BMPT'!$D$13,IF(J107=13,'Equivalencia BH-BMPT'!$D$14,IF(J107=14,'Equivalencia BH-BMPT'!$D$15,IF(J107=15,'Equivalencia BH-BMPT'!$D$16,IF(J107=16,'Equivalencia BH-BMPT'!$D$17,IF(J107=17,'Equivalencia BH-BMPT'!$D$18,IF(J107=18,'Equivalencia BH-BMPT'!$D$19,IF(J107=19,'Equivalencia BH-BMPT'!$D$20,IF(J107=20,'Equivalencia BH-BMPT'!$D$21,IF(J107=21,'Equivalencia BH-BMPT'!$D$22,IF(J107=22,'Equivalencia BH-BMPT'!$D$23,IF(J107=23,'Equivalencia BH-BMPT'!#REF!,IF(J107=24,'Equivalencia BH-BMPT'!$D$25,IF(J107=25,'Equivalencia BH-BMPT'!$D$26,IF(J107=26,'Equivalencia BH-BMPT'!$D$27,IF(J107=27,'Equivalencia BH-BMPT'!$D$28,IF(J107=28,'Equivalencia BH-BMPT'!$D$29,IF(J107=29,'Equivalencia BH-BMPT'!$D$30,IF(J107=30,'Equivalencia BH-BMPT'!$D$31,IF(J107=31,'Equivalencia BH-BMPT'!$D$32,IF(J107=32,'Equivalencia BH-BMPT'!$D$33,IF(J107=33,'Equivalencia BH-BMPT'!$D$34,IF(J107=34,'Equivalencia BH-BMPT'!$D$35,IF(J107=35,'Equivalencia BH-BMPT'!$D$36,IF(J107=36,'Equivalencia BH-BMPT'!$D$37,IF(J107=37,'Equivalencia BH-BMPT'!$D$38,IF(J107=38,'Equivalencia BH-BMPT'!#REF!,IF(J107=39,'Equivalencia BH-BMPT'!$D$40,IF(J107=40,'Equivalencia BH-BMPT'!$D$41,IF(J107=41,'Equivalencia BH-BMPT'!$D$42,IF(J107=42,'Equivalencia BH-BMPT'!$D$43,IF(J107=43,'Equivalencia BH-BMPT'!$D$44,IF(J107=44,'Equivalencia BH-BMPT'!$D$45,IF(J107=45,'Equivalencia BH-BMPT'!$D$46,\"No ha seleccionado un número de programa\")))))))))))))))))))))))))))))))))))))))))))))","v":"Prevención y atención de la maternidad y la paternidad tempranas"},0,860005289,"ASCENSORES SCHINDLER DE COLOMBIA SAS",13022000,null,null,0,0,13022000,0,"2017/08/25","2017/08/25",43397,420,86,null,null,"X",null,null,0,null,false]
[95,2017,"CO1.PCCNTR.192119",5,{"$f":"IF(D108=1,'Tipo '!$B$2,IF(D108=2,'Tipo '!$B$3,IF(D108=3,'Tipo '!$B$4,IF(D108=4,'Tipo '!$B$5,IF(D108=5,'Tipo '!$B$6,IF(D108=6,'Tipo '!$B$7,IF(D108=7,'Tipo '!$B$8,IF(D108=8,'Tipo '!$B$9,IF(D108=9,'Tipo '!$B$10,IF(D108=10,'Tipo '!$B$11,IF(D108=11,'Tipo '!$B$12,IF(D108=12,'Tipo '!$B$13,IF(D108=13,'Tipo '!$B$14,IF(D108=14,'Tipo '!$B$15,IF(D108=15,'Tipo '!$B$16,IF(D108=16,'Tipo '!$B$17,IF(D108=17,'Tipo '!$B$18,IF(D108=18,'Tipo '!$B$19,IF(D108=19,'Tipo '!$B$20,\"No ha seleccionado un tipo de contrato válido\")))))))))))))))))))","v":"CONTRATOS DE PRESTACIÓN DE SERVICIOS PROFESIONALES Y DE APOYO A LA GESTIÓN"},"Contratación directa","Bolsas de productos","Prestar servicios de apoyo administrativo y asistencial a las inspecciones de Policía de la Alcaldía Local de santa Fe.","Inversión",45,{"$f":"IF(J108=1,'Equivalencia BH-BMPT'!$D$2,IF(J108=2,'Equivalencia BH-BMPT'!$D$3,IF(J108=3,'Equivalencia BH-BMPT'!$D$4,IF(J108=4,'Equivalencia BH-BMPT'!$D$5,IF(J108=5,'Equivalencia BH-BMPT'!$D$6,IF(J108=6,'Equivalencia BH-BMPT'!$D$7,IF(J108=7,'Equivalencia BH-BMPT'!$D$8,IF(J108=8,'Equivalencia BH-BMPT'!$D$9,IF(J108=9,'Equivalencia BH-BMPT'!$D$10,IF(J108=10,'Equivalencia BH-BMPT'!$D$11,IF(J108=11,'Equivalencia BH-BMPT'!$D$12,IF(J108=12,'Equivalencia BH-BMPT'!$D$13,IF(J108=13,'Equivalencia BH-BMPT'!$D$14,IF(J108=14,'Equivalencia BH-BMPT'!$D$15,IF(J108=15,'Equivalencia BH-BMPT'!$D$16,IF(J108=16,'Equivalencia BH-BMPT'!$D$17,IF(J108=17,'Equivalencia BH-BMPT'!$D$18,IF(J108=18,'Equivalencia BH-BMPT'!$D$19,IF(J108=19,'Equivalencia BH-BMPT'!$D$20,IF(J108=20,'Equivalencia BH-BMPT'!$D$21,IF(J108=21,'Equivalencia BH-BMPT'!$D$22,IF(J108=22,'Equivalencia BH-BMPT'!$D$23,IF(J108=23,'Equivalencia BH-BMPT'!#REF!,IF(J108=24,'Equivalencia BH-BMPT'!$D$25,IF(J108=25,'Equivalencia BH-BMPT'!$D$26,IF(J108=26,'Equivalencia BH-BMPT'!$D$27,IF(J108=27,'Equivalencia BH-BMPT'!$D$28,IF(J108=28,'Equivalencia BH-BMPT'!$D$29,IF(J108=29,'Equivalencia BH-BMPT'!$D$30,IF(J108=30,'Equivalencia BH-BMPT'!$D$31,IF(J108=31,'Equivalencia BH-BMPT'!$D$32,IF(J108=32,'Equivalencia BH-BMPT'!$D$33,IF(J108=33,'Equivalencia BH-BMPT'!$D$34,IF(J108=34,'Equivalencia BH-BMPT'!$D$35,IF(J108=35,'Equivalencia BH-BMPT'!$D$36,IF(J108=36,'Equivalencia BH-BMPT'!$D$37,IF(J108=37,'Equivalencia BH-BMPT'!$D$38,IF(J108=38,'Equivalencia BH-BMPT'!#REF!,IF(J108=39,'Equivalencia BH-BMPT'!$D$40,IF(J108=40,'Equivalencia BH-BMPT'!$D$41,IF(J108=41,'Equivalencia BH-BMPT'!$D$42,IF(J108=42,'Equivalencia BH-BMPT'!$D$43,IF(J108=43,'Equivalencia BH-BMPT'!$D$44,IF(J108=44,'Equivalencia BH-BMPT'!$D$45,IF(J108=45,'Equivalencia BH-BMPT'!$D$46,\"No ha seleccionado un número de programa\")))))))))))))))))))))))))))))))))))))))))))))","v":"Gobernanza e influencia local, regional e internacional"},1326,80726081,"DIEGO ANDRES PUERTAS NIÑO",7536667,null,null,0,0,7536667,5836666,"2017/08/28","2017/08/30",43100,133,87,null,null,"X",null,null,0.77443596751720623,null,false]
[96,2017,"17-1-175608",4,{"$f":"IF(D109=1,'Tipo '!$B$2,IF(D109=2,'Tipo '!$B$3,IF(D109=3,'Tipo '!$B$4,IF(D109=4,'Tipo '!$B$5,IF(D109=5,'Tipo '!$B$6,IF(D109=6,'Tipo '!$B$7,IF(D109=7,'Tipo '!$B$8,IF(D109=8,'Tipo '!$B$9,IF(D109=9,'Tipo '!$B$10,IF(D109=10,'Tipo '!$B$11,IF(D109=11,'Tipo '!$B$12,IF(D109=12,'Tipo '!$B$13,IF(D109=13,'Tipo '!$B$14,IF(D109=14,'Tipo '!$B$15,IF(D109=15,'Tipo '!$B$16,IF(D109=16,'Tipo '!$B$17,IF(D109=17,'Tipo '!$B$18,IF(D109=18,'Tipo '!$B$19,IF(D109=19,'Tipo '!$B$20,\"No ha seleccionado un tipo de contrato válido\")))))))))))))))))))","v":"CONTRATOS DE PRESTACIÓN DE SERVICIOS"},"Contratación directa","Prestación de servicios profesionales y de apoyo a la gestión, o para la ejecución de trabajos artísticos que sólo puedan encomendarse a determinadas personas naturales;","PRESTAR LOS SERVICIOS PARA EJECUTAR LAS ACTIVIDADES DE ACONDICIONAMIENTO FÍSICO DIRIGIDO A LA POBLACIÓN PERSONA MAYOR RESIDENTES EN LA LOCALIDAD DE SANTA FE,  EN MARCO DEL PROYECTO 1318 ¨UNA LOCALIDAD ARTÍSTICA, DEPORTIVA, CULTURAL Y VITAL  PARA TODOS”.","Inversión",11,{"$f":"IF(J109=1,'Equivalencia BH-BMPT'!$D$2,IF(J109=2,'Equivalencia BH-BMPT'!$D$3,IF(J109=3,'Equivalencia BH-BMPT'!$D$4,IF(J109=4,'Equivalencia BH-BMPT'!$D$5,IF(J109=5,'Equivalencia BH-BMPT'!$D$6,IF(J109=6,'Equivalencia BH-BMPT'!$D$7,IF(J109=7,'Equivalencia BH-BMPT'!$D$8,IF(J109=8,'Equivalencia BH-BMPT'!$D$9,IF(J109=9,'Equivalencia BH-BMPT'!$D$10,IF(J109=10,'Equivalencia BH-BMPT'!$D$11,IF(J109=11,'Equivalencia BH-BMPT'!$D$12,IF(J109=12,'Equivalencia BH-BMPT'!$D$13,IF(J109=13,'Equivalencia BH-BMPT'!$D$14,IF(J109=14,'Equivalencia BH-BMPT'!$D$15,IF(J109=15,'Equivalencia BH-BMPT'!$D$16,IF(J109=16,'Equivalencia BH-BMPT'!$D$17,IF(J109=17,'Equivalencia BH-BMPT'!$D$18,IF(J109=18,'Equivalencia BH-BMPT'!$D$19,IF(J109=19,'Equivalencia BH-BMPT'!$D$20,IF(J109=20,'Equivalencia BH-BMPT'!$D$21,IF(J109=21,'Equivalencia BH-BMPT'!$D$22,IF(J109=22,'Equivalencia BH-BMPT'!$D$23,IF(J109=23,'Equivalencia BH-BMPT'!#REF!,IF(J109=24,'Equivalencia BH-BMPT'!$D$25,IF(J109=25,'Equivalencia BH-BMPT'!$D$26,IF(J109=26,'Equivalencia BH-BMPT'!$D$27,IF(J109=27,'Equivalencia BH-BMPT'!$D$28,IF(J109=28,'Equivalencia BH-BMPT'!$D$29,IF(J109=29,'Equivalencia BH-BMPT'!$D$30,IF(J109=30,'Equivalencia BH-BMPT'!$D$31,IF(J109=31,'Equivalencia BH-BMPT'!$D$32,IF(J109=32,'Equivalencia BH-BMPT'!$D$33,IF(J109=33,'Equivalencia BH-BMPT'!$D$34,IF(J109=34,'Equivalencia BH-BMPT'!$D$35,IF(J109=35,'Equivalencia BH-BMPT'!$D$36,IF(J109=36,'Equivalencia BH-BMPT'!$D$37,IF(J109=37,'Equivalencia BH-BMPT'!$D$38,IF(J109=38,'Equivalencia BH-BMPT'!#REF!,IF(J109=39,'Equivalencia BH-BMPT'!$D$40,IF(J109=40,'Equivalencia BH-BMPT'!$D$41,IF(J109=41,'Equivalencia BH-BMPT'!$D$42,IF(J109=42,'Equivalencia BH-BMPT'!$D$43,IF(J109=43,'Equivalencia BH-BMPT'!$D$44,IF(J109=44,'Equivalencia BH-BMPT'!$D$45,IF(J109=45,'Equivalencia BH-BMPT'!$D$46,\"No ha seleccionado un número de programa\")))))))))))))))))))))))))))))))))))))))))))))","v":"Mejores oportunidades para el desarrollo a través de la cultura, la recreación y el deporte"},1318,900175374,"ASOCIACION DE HOGARES SI A LA VIDA",345373700,null,null,0,0,345373700,0,"2017/08/31","2017/08/31",43159,180,88,null,null,"X",null,null,0,null,false]
[97,2017,"17-12-7004999",5,{"$f":"IF(D110=1,'Tipo '!$B$2,IF(D110=2,'Tipo '!$B$3,IF(D110=3,'Tipo '!$B$4,IF(D110=4,'Tipo '!$B$5,IF(D110=5,'Tipo '!$B$6,IF(D110=6,'Tipo '!$B$7,IF(D110=7,'Tipo '!$B$8,IF(D110=8,'Tipo '!$B$9,IF(D110=9,'Tipo '!$B$10,IF(D110=10,'Tipo '!$B$11,IF(D110=11,'Tipo '!$B$12,IF(D110=12,'Tipo '!$B$13,IF(D110=13,'Tipo '!$B$14,IF(D110=14,'Tipo '!$B$15,IF(D110=15,'Tipo '!$B$16,IF(D110=16,'Tipo '!$B$17,IF(D110=17,'Tipo '!$B$18,IF(D110=18,'Tipo '!$B$19,IF(D110=19,'Tipo '!$B$20,\"No ha seleccionado un tipo de contrato válido\")))))))))))))))))))","v":"CONTRATOS DE PRESTACIÓN DE SERVICIOS PROFESIONALES Y DE APOYO A LA GESTIÓN"},"Contratación directa","Prestación de servicios profesionales y de apoyo a la gestión, o para la ejecución de trabajos artísticos que sólo puedan encomendarse a determinadas personas naturales;","PRESTACION DE SERVICIOS DE APOYO DE LOGISTICA QUE SE REQUIERAN EN EL DESARROLLO DE LAS ACTIVIDADES RELATIVAS A RECUPERACION Y EMBELLECIMIENTO DEL ESPACIO PUBLICO QUE TENGA A CARGO DEL FONDO DE DEARROLLO LOCAL DE SANTA FE","Inversión",18,{"$f":"IF(J110=1,'Equivalencia BH-BMPT'!$D$2,IF(J110=2,'Equivalencia BH-BMPT'!$D$3,IF(J110=3,'Equivalencia BH-BMPT'!$D$4,IF(J110=4,'Equivalencia BH-BMPT'!$D$5,IF(J110=5,'Equivalencia BH-BMPT'!$D$6,IF(J110=6,'Equivalencia BH-BMPT'!$D$7,IF(J110=7,'Equivalencia BH-BMPT'!$D$8,IF(J110=8,'Equivalencia BH-BMPT'!$D$9,IF(J110=9,'Equivalencia BH-BMPT'!$D$10,IF(J110=10,'Equivalencia BH-BMPT'!$D$11,IF(J110=11,'Equivalencia BH-BMPT'!$D$12,IF(J110=12,'Equivalencia BH-BMPT'!$D$13,IF(J110=13,'Equivalencia BH-BMPT'!$D$14,IF(J110=14,'Equivalencia BH-BMPT'!$D$15,IF(J110=15,'Equivalencia BH-BMPT'!$D$16,IF(J110=16,'Equivalencia BH-BMPT'!$D$17,IF(J110=17,'Equivalencia BH-BMPT'!$D$18,IF(J110=18,'Equivalencia BH-BMPT'!$D$19,IF(J110=19,'Equivalencia BH-BMPT'!$D$20,IF(J110=20,'Equivalencia BH-BMPT'!$D$21,IF(J110=21,'Equivalencia BH-BMPT'!$D$22,IF(J110=22,'Equivalencia BH-BMPT'!$D$23,IF(J110=23,'Equivalencia BH-BMPT'!#REF!,IF(J110=24,'Equivalencia BH-BMPT'!$D$25,IF(J110=25,'Equivalencia BH-BMPT'!$D$26,IF(J110=26,'Equivalencia BH-BMPT'!$D$27,IF(J110=27,'Equivalencia BH-BMPT'!$D$28,IF(J110=28,'Equivalencia BH-BMPT'!$D$29,IF(J110=29,'Equivalencia BH-BMPT'!$D$30,IF(J110=30,'Equivalencia BH-BMPT'!$D$31,IF(J110=31,'Equivalencia BH-BMPT'!$D$32,IF(J110=32,'Equivalencia BH-BMPT'!$D$33,IF(J110=33,'Equivalencia BH-BMPT'!$D$34,IF(J110=34,'Equivalencia BH-BMPT'!$D$35,IF(J110=35,'Equivalencia BH-BMPT'!$D$36,IF(J110=36,'Equivalencia BH-BMPT'!$D$37,IF(J110=37,'Equivalencia BH-BMPT'!$D$38,IF(J110=38,'Equivalencia BH-BMPT'!#REF!,IF(J110=39,'Equivalencia BH-BMPT'!$D$40,IF(J110=40,'Equivalencia BH-BMPT'!$D$41,IF(J110=41,'Equivalencia BH-BMPT'!$D$42,IF(J110=42,'Equivalencia BH-BMPT'!$D$43,IF(J110=43,'Equivalencia BH-BMPT'!$D$44,IF(J110=44,'Equivalencia BH-BMPT'!$D$45,IF(J110=45,'Equivalencia BH-BMPT'!$D$46,\"No ha seleccionado un número de programa\")))))))))))))))))))))))))))))))))))))))))))))","v":"Mejor movilidad para todos"},1322,13891107,"FABIO BASTIDAS FERREIRA",6344366,null,null,0,0,6344366,5045265,"2017/08/25","2017/08/28",43100,122,89,null,null,"X",null,null,0.7952354892514083,null,false]
[98,2017,"17-12-7002939",4,{"$f":"IF(D111=1,'Tipo '!$B$2,IF(D111=2,'Tipo '!$B$3,IF(D111=3,'Tipo '!$B$4,IF(D111=4,'Tipo '!$B$5,IF(D111=5,'Tipo '!$B$6,IF(D111=6,'Tipo '!$B$7,IF(D111=7,'Tipo '!$B$8,IF(D111=8,'Tipo '!$B$9,IF(D111=9,'Tipo '!$B$10,IF(D111=10,'Tipo '!$B$11,IF(D111=11,'Tipo '!$B$12,IF(D111=12,'Tipo '!$B$13,IF(D111=13,'Tipo '!$B$14,IF(D111=14,'Tipo '!$B$15,IF(D111=15,'Tipo '!$B$16,IF(D111=16,'Tipo '!$B$17,IF(D111=17,'Tipo '!$B$18,IF(D111=18,'Tipo '!$B$19,IF(D111=19,'Tipo '!$B$20,\"No ha seleccionado un tipo de contrato válido\")))))))))))))))))))","v":"CONTRATOS DE PRESTACIÓN DE SERVICIOS"},"Licitación pública","No aplica","PRESTACION DE SERVICIOS DE APOYO DE LOGISTICA QUE SE REQUIERAN EN EL DESARROLLO DE LAS ACTIVIDADES RELATIVAS A RECUPERACION Y EMBELLECIMIENTO DEL ESPACIO PUBLICO QUE TENGA A CARGO DEL FONDO DE DEARROLLO LOCAL DE SANTA FE","Inversión",18,{"$f":"IF(J111=1,'Equivalencia BH-BMPT'!$D$2,IF(J111=2,'Equivalencia BH-BMPT'!$D$3,IF(J111=3,'Equivalencia BH-BMPT'!$D$4,IF(J111=4,'Equivalencia BH-BMPT'!$D$5,IF(J111=5,'Equivalencia BH-BMPT'!$D$6,IF(J111=6,'Equivalencia BH-BMPT'!$D$7,IF(J111=7,'Equivalencia BH-BMPT'!$D$8,IF(J111=8,'Equivalencia BH-BMPT'!$D$9,IF(J111=9,'Equivalencia BH-BMPT'!$D$10,IF(J111=10,'Equivalencia BH-BMPT'!$D$11,IF(J111=11,'Equivalencia BH-BMPT'!$D$12,IF(J111=12,'Equivalencia BH-BMPT'!$D$13,IF(J111=13,'Equivalencia BH-BMPT'!$D$14,IF(J111=14,'Equivalencia BH-BMPT'!$D$15,IF(J111=15,'Equivalencia BH-BMPT'!$D$16,IF(J111=16,'Equivalencia BH-BMPT'!$D$17,IF(J111=17,'Equivalencia BH-BMPT'!$D$18,IF(J111=18,'Equivalencia BH-BMPT'!$D$19,IF(J111=19,'Equivalencia BH-BMPT'!$D$20,IF(J111=20,'Equivalencia BH-BMPT'!$D$21,IF(J111=21,'Equivalencia BH-BMPT'!$D$22,IF(J111=22,'Equivalencia BH-BMPT'!$D$23,IF(J111=23,'Equivalencia BH-BMPT'!#REF!,IF(J111=24,'Equivalencia BH-BMPT'!$D$25,IF(J111=25,'Equivalencia BH-BMPT'!$D$26,IF(J111=26,'Equivalencia BH-BMPT'!$D$27,IF(J111=27,'Equivalencia BH-BMPT'!$D$28,IF(J111=28,'Equivalencia BH-BMPT'!$D$29,IF(J111=29,'Equivalencia BH-BMPT'!$D$30,IF(J111=30,'Equivalencia BH-BMPT'!$D$31,IF(J111=31,'Equivalencia BH-BMPT'!$D$32,IF(J111=32,'Equivalencia BH-BMPT'!$D$33,IF(J111=33,'Equivalencia BH-BMPT'!$D$34,IF(J111=34,'Equivalencia BH-BMPT'!$D$35,IF(J111=35,'Equivalencia BH-BMPT'!$D$36,IF(J111=36,'Equivalencia BH-BMPT'!$D$37,IF(J111=37,'Equivalencia BH-BMPT'!$D$38,IF(J111=38,'Equivalencia BH-BMPT'!#REF!,IF(J111=39,'Equivalencia BH-BMPT'!$D$40,IF(J111=40,'Equivalencia BH-BMPT'!$D$41,IF(J111=41,'Equivalencia BH-BMPT'!$D$42,IF(J111=42,'Equivalencia BH-BMPT'!$D$43,IF(J111=43,'Equivalencia BH-BMPT'!$D$44,IF(J111=44,'Equivalencia BH-BMPT'!$D$45,IF(J111=45,'Equivalencia BH-BMPT'!$D$46,\"No ha seleccionado un número de programa\")))))))))))))))))))))))))))))))))))))))))))))","v":"Mejor movilidad para todos"},1322,79816153,"OSCAR AMEZQUITA RUIZ",6344366,null,null,0,0,6344366,4918113,"2017/08/28","2017/08/30",43098,120,90,null,null,"X",null,null,0.77519377034679271,null,false]
[99,2017,"17-12-7005030",5,{"$f":"IF(D112=1,'Tipo '!$B$2,IF(D112=2,'Tipo '!$B$3,IF(D112=3,'Tipo '!$B$4,IF(D112=4,'Tipo '!$B$5,IF(D112=5,'Tipo '!$B$6,IF(D112=6,'Tipo '!$B$7,IF(D112=7,'Tipo '!$B$8,IF(D112=8,'Tipo '!$B$9,IF(D112=9,'Tipo '!$B$10,IF(D112=10,'Tipo '!$B$11,IF(D112=11,'Tipo '!$B$12,IF(D112=12,'Tipo '!$B$13,IF(D112=13,'Tipo '!$B$14,IF(D112=14,'Tipo '!$B$15,IF(D112=15,'Tipo '!$B$16,IF(D112=16,'Tipo '!$B$17,IF(D112=17,'Tipo '!$B$18,IF(D112=18,'Tipo '!$B$19,IF(D112=19,'Tipo '!$B$20,\"No ha seleccionado un tipo de contrato válido\")))))))))))))))))))","v":"CONTRATOS DE PRESTACIÓN DE SERVICIOS PROFESIONALES Y DE APOYO A LA GESTIÓN"},"Contratación directa","Prestación de servicios profesionales y de apoyo a la gestión, o para la ejecución de trabajos artísticos que sólo puedan encomendarse a determinadas personas naturales;","PRESTACION DE SERVICIOS DE APOYO DE LOGISTICA PARA COORDINAR LAS ACCIONES QUE SE REQUIERAN EN EL DESARROLLO DE LAS ACTIVIDADES RELATIVAS A RECUPERACION Y EMBELLECIMIENTO DEL ESPACIO PUBLICO QUE TENGA A CARGO DEL FONDO DE DEARROLLO LOCAL DE SANTA FE","Inversión",18,{"$f":"IF(J112=1,'Equivalencia BH-BMPT'!$D$2,IF(J112=2,'Equivalencia BH-BMPT'!$D$3,IF(J112=3,'Equivalencia BH-BMPT'!$D$4,IF(J112=4,'Equivalencia BH-BMPT'!$D$5,IF(J112=5,'Equivalencia BH-BMPT'!$D$6,IF(J112=6,'Equivalencia BH-BMPT'!$D$7,IF(J112=7,'Equivalencia BH-BMPT'!$D$8,IF(J112=8,'Equivalencia BH-BMPT'!$D$9,IF(J112=9,'Equivalencia BH-BMPT'!$D$10,IF(J112=10,'Equivalencia BH-BMPT'!$D$11,IF(J112=11,'Equivalencia BH-BMPT'!$D$12,IF(J112=12,'Equivalencia BH-BMPT'!$D$13,IF(J112=13,'Equivalencia BH-BMPT'!$D$14,IF(J112=14,'Equivalencia BH-BMPT'!$D$15,IF(J112=15,'Equivalencia BH-BMPT'!$D$16,IF(J112=16,'Equivalencia BH-BMPT'!$D$17,IF(J112=17,'Equivalencia BH-BMPT'!$D$18,IF(J112=18,'Equivalencia BH-BMPT'!$D$19,IF(J112=19,'Equivalencia BH-BMPT'!$D$20,IF(J112=20,'Equivalencia BH-BMPT'!$D$21,IF(J112=21,'Equivalencia BH-BMPT'!$D$22,IF(J112=22,'Equivalencia BH-BMPT'!$D$23,IF(J112=23,'Equivalencia BH-BMPT'!#REF!,IF(J112=24,'Equivalencia BH-BMPT'!$D$25,IF(J112=25,'Equivalencia BH-BMPT'!$D$26,IF(J112=26,'Equivalencia BH-BMPT'!$D$27,IF(J112=27,'Equivalencia BH-BMPT'!$D$28,IF(J112=28,'Equivalencia BH-BMPT'!$D$29,IF(J112=29,'Equivalencia BH-BMPT'!$D$30,IF(J112=30,'Equivalencia BH-BMPT'!$D$31,IF(J112=31,'Equivalencia BH-BMPT'!$D$32,IF(J112=32,'Equivalencia BH-BMPT'!$D$33,IF(J112=33,'Equivalencia BH-BMPT'!$D$34,IF(J112=34,'Equivalencia BH-BMPT'!$D$35,IF(J112=35,'Equivalencia BH-BMPT'!$D$36,IF(J112=36,'Equivalencia BH-BMPT'!$D$37,IF(J112=37,'Equivalencia BH-BMPT'!$D$38,IF(J112=38,'Equivalencia BH-BMPT'!#REF!,IF(J112=39,'Equivalencia BH-BMPT'!$D$40,IF(J112=40,'Equivalencia BH-BMPT'!$D$41,IF(J112=41,'Equivalencia BH-BMPT'!$D$42,IF(J112=42,'Equivalencia BH-BMPT'!$D$43,IF(J112=43,'Equivalencia BH-BMPT'!$D$44,IF(J112=44,'Equivalencia BH-BMPT'!$D$45,IF(J112=45,'Equivalencia BH-BMPT'!$D$46,\"No ha seleccionado un número de programa\")))))))))))))))))))))))))))))))))))))))))))))","v":"Mejor movilidad para todos"},1322,80161977,"WILBER FERLEY OBANDO MARIN",8698600,null,null,0,0,8698600,7130000,"2017/08/29","2017/08/30",43098,120,91,null,null,"X",null,null,0.81967213114754101,null,false]
[101,2017,"17-12-7039555",5,{"$f":"IF(D113=1,'Tipo '!$B$2,IF(D113=2,'Tipo '!$B$3,IF(D113=3,'Tipo '!$B$4,IF(D113=4,'Tipo '!$B$5,IF(D113=5,'Tipo '!$B$6,IF(D113=6,'Tipo '!$B$7,IF(D113=7,'Tipo '!$B$8,IF(D113=8,'Tipo '!$B$9,IF(D113=9,'Tipo '!$B$10,IF(D113=10,'Tipo '!$B$11,IF(D113=11,'Tipo '!$B$12,IF(D113=12,'Tipo '!$B$13,IF(D113=13,'Tipo '!$B$14,IF(D113=14,'Tipo '!$B$15,IF(D113=15,'Tipo '!$B$16,IF(D113=16,'Tipo '!$B$17,IF(D113=17,'Tipo '!$B$18,IF(D113=18,'Tipo '!$B$19,IF(D113=19,'Tipo '!$B$20,\"No ha seleccionado un tipo de contrato válido\")))))))))))))))))))","v":"CONTRATOS DE PRESTACIÓN DE SERVICIOS PROFESIONALES Y DE APOYO A LA GESTIÓN"},"Contratación directa","Prestación de servicios profesionales y de apoyo a la gestión, o para la ejecución de trabajos artísticos que sólo puedan encomendarse a determinadas personas naturales;","PRESTACION DE SERVICIOS DE APOYO DE LOGISTICA QUE SE REQUIERAN EN EL DESARROLLO DE LAS ACTIVIDADES RELATIVAS A RECUPERACION Y EMBELLECIMIENTO DEL ESPACIO PUBLICO QUE TENGA A CARGO DEL FONDO DE DEARROLLO LOCAL DE SANTA FE","Inversión",18,{"$f":"IF(J113=1,'Equivalencia BH-BMPT'!$D$2,IF(J113=2,'Equivalencia BH-BMPT'!$D$3,IF(J113=3,'Equivalencia BH-BMPT'!$D$4,IF(J113=4,'Equivalencia BH-BMPT'!$D$5,IF(J113=5,'Equivalencia BH-BMPT'!$D$6,IF(J113=6,'Equivalencia BH-BMPT'!$D$7,IF(J113=7,'Equivalencia BH-BMPT'!$D$8,IF(J113=8,'Equivalencia BH-BMPT'!$D$9,IF(J113=9,'Equivalencia BH-BMPT'!$D$10,IF(J113=10,'Equivalencia BH-BMPT'!$D$11,IF(J113=11,'Equivalencia BH-BMPT'!$D$12,IF(J113=12,'Equivalencia BH-BMPT'!$D$13,IF(J113=13,'Equivalencia BH-BMPT'!$D$14,IF(J113=14,'Equivalencia BH-BMPT'!$D$15,IF(J113=15,'Equivalencia BH-BMPT'!$D$16,IF(J113=16,'Equivalencia BH-BMPT'!$D$17,IF(J113=17,'Equivalencia BH-BMPT'!$D$18,IF(J113=18,'Equivalencia BH-BMPT'!$D$19,IF(J113=19,'Equivalencia BH-BMPT'!$D$20,IF(J113=20,'Equivalencia BH-BMPT'!$D$21,IF(J113=21,'Equivalencia BH-BMPT'!$D$22,IF(J113=22,'Equivalencia BH-BMPT'!$D$23,IF(J113=23,'Equivalencia BH-BMPT'!#REF!,IF(J113=24,'Equivalencia BH-BMPT'!$D$25,IF(J113=25,'Equivalencia BH-BMPT'!$D$26,IF(J113=26,'Equivalencia BH-BMPT'!$D$27,IF(J113=27,'Equivalencia BH-BMPT'!$D$28,IF(J113=28,'Equivalencia BH-BMPT'!$D$29,IF(J113=29,'Equivalencia BH-BMPT'!$D$30,IF(J113=30,'Equivalencia BH-BMPT'!$D$31,IF(J113=31,'Equivalencia BH-BMPT'!$D$32,IF(J113=32,'Equivalencia BH-BMPT'!$D$33,IF(J113=33,'Equivalencia BH-BMPT'!$D$34,IF(J113=34,'Equivalencia BH-BMPT'!$D$35,IF(J113=35,'Equivalencia BH-BMPT'!$D$36,IF(J113=36,'Equivalencia BH-BMPT'!$D$37,IF(J113=37,'Equivalencia BH-BMPT'!$D$38,IF(J113=38,'Equivalencia BH-BMPT'!#REF!,IF(J113=39,'Equivalencia BH-BMPT'!$D$40,IF(J113=40,'Equivalencia BH-BMPT'!$D$41,IF(J113=41,'Equivalencia BH-BMPT'!$D$42,IF(J113=42,'Equivalencia BH-BMPT'!$D$43,IF(J113=43,'Equivalencia BH-BMPT'!$D$44,IF(J113=44,'Equivalencia BH-BMPT'!$D$45,IF(J113=45,'Equivalencia BH-BMPT'!$D$46,\"No ha seleccionado un número de programa\")))))))))))))))))))))))))))))))))))))))))))))","v":"Mejor movilidad para todos"},1322,80765647,"JAIRO ANDRES RODRIGUEZ MARTINEZ",5901736,null,null,0,0,5901736,4680687,"2017/09/04","2017/09/05",43100,118,92,null,null,"X",null,null,0.79310341906178117,null,false]
[102,2017,"CO1.PCCNTR.198603",5,{"$f":"IF(D114=1,'Tipo '!$B$2,IF(D114=2,'Tipo '!$B$3,IF(D114=3,'Tipo '!$B$4,IF(D114=4,'Tipo '!$B$5,IF(D114=5,'Tipo '!$B$6,IF(D114=6,'Tipo '!$B$7,IF(D114=7,'Tipo '!$B$8,IF(D114=8,'Tipo '!$B$9,IF(D114=9,'Tipo '!$B$10,IF(D114=10,'Tipo '!$B$11,IF(D114=11,'Tipo '!$B$12,IF(D114=12,'Tipo '!$B$13,IF(D114=13,'Tipo '!$B$14,IF(D114=14,'Tipo '!$B$15,IF(D114=15,'Tipo '!$B$16,IF(D114=16,'Tipo '!$B$17,IF(D114=17,'Tipo '!$B$18,IF(D114=18,'Tipo '!$B$19,IF(D114=19,'Tipo '!$B$20,\"No ha seleccionado un tipo de contrato válido\")))))))))))))))))))","v":"CONTRATOS DE PRESTACIÓN DE SERVICIOS PROFESIONALES Y DE APOYO A LA GESTIÓN"},"Contratación directa","Prestación de servicios profesionales y de apoyo a la gestión, o para la ejecución de trabajos artísticos que sólo puedan encomendarse a determinadas personas naturales;","Prestar servicios de apoyo administrativo y asistencial a las inspecciones de Policía de la Alcaldía Local de Santa Fe","Inversión",45,{"$f":"IF(J114=1,'Equivalencia BH-BMPT'!$D$2,IF(J114=2,'Equivalencia BH-BMPT'!$D$3,IF(J114=3,'Equivalencia BH-BMPT'!$D$4,IF(J114=4,'Equivalencia BH-BMPT'!$D$5,IF(J114=5,'Equivalencia BH-BMPT'!$D$6,IF(J114=6,'Equivalencia BH-BMPT'!$D$7,IF(J114=7,'Equivalencia BH-BMPT'!$D$8,IF(J114=8,'Equivalencia BH-BMPT'!$D$9,IF(J114=9,'Equivalencia BH-BMPT'!$D$10,IF(J114=10,'Equivalencia BH-BMPT'!$D$11,IF(J114=11,'Equivalencia BH-BMPT'!$D$12,IF(J114=12,'Equivalencia BH-BMPT'!$D$13,IF(J114=13,'Equivalencia BH-BMPT'!$D$14,IF(J114=14,'Equivalencia BH-BMPT'!$D$15,IF(J114=15,'Equivalencia BH-BMPT'!$D$16,IF(J114=16,'Equivalencia BH-BMPT'!$D$17,IF(J114=17,'Equivalencia BH-BMPT'!$D$18,IF(J114=18,'Equivalencia BH-BMPT'!$D$19,IF(J114=19,'Equivalencia BH-BMPT'!$D$20,IF(J114=20,'Equivalencia BH-BMPT'!$D$21,IF(J114=21,'Equivalencia BH-BMPT'!$D$22,IF(J114=22,'Equivalencia BH-BMPT'!$D$23,IF(J114=23,'Equivalencia BH-BMPT'!#REF!,IF(J114=24,'Equivalencia BH-BMPT'!$D$25,IF(J114=25,'Equivalencia BH-BMPT'!$D$26,IF(J114=26,'Equivalencia BH-BMPT'!$D$27,IF(J114=27,'Equivalencia BH-BMPT'!$D$28,IF(J114=28,'Equivalencia BH-BMPT'!$D$29,IF(J114=29,'Equivalencia BH-BMPT'!$D$30,IF(J114=30,'Equivalencia BH-BMPT'!$D$31,IF(J114=31,'Equivalencia BH-BMPT'!$D$32,IF(J114=32,'Equivalencia BH-BMPT'!$D$33,IF(J114=33,'Equivalencia BH-BMPT'!$D$34,IF(J114=34,'Equivalencia BH-BMPT'!$D$35,IF(J114=35,'Equivalencia BH-BMPT'!$D$36,IF(J114=36,'Equivalencia BH-BMPT'!$D$37,IF(J114=37,'Equivalencia BH-BMPT'!$D$38,IF(J114=38,'Equivalencia BH-BMPT'!#REF!,IF(J114=39,'Equivalencia BH-BMPT'!$D$40,IF(J114=40,'Equivalencia BH-BMPT'!$D$41,IF(J114=41,'Equivalencia BH-BMPT'!$D$42,IF(J114=42,'Equivalencia BH-BMPT'!$D$43,IF(J114=43,'Equivalencia BH-BMPT'!$D$44,IF(J114=44,'Equivalencia BH-BMPT'!$D$45,IF(J114=45,'Equivalencia BH-BMPT'!$D$46,\"No ha seleccionado un número de programa\")))))))))))))))))))))))))))))))))))))))))))))","v":"Gobernanza e influencia local, regional e internacional"},1326,1010236046,"GERMAN FELIPE HERNANDEZ CARDONA",6573342,null,null,0,0,6573342,4986667,"2017/09/06","2017/09/12",43100,116,93,null,null,"X",null,null,0.75861974015652922,null,false]
[103,2017,"CO1.PCCNTR.200508",5,{"$f":"IF(D115=1,'Tipo '!$B$2,IF(D115=2,'Tipo '!$B$3,IF(D115=3,'Tipo '!$B$4,IF(D115=4,'Tipo '!$B$5,IF(D115=5,'Tipo '!$B$6,IF(D115=6,'Tipo '!$B$7,IF(D115=7,'Tipo '!$B$8,IF(D115=8,'Tipo '!$B$9,IF(D115=9,'Tipo '!$B$10,IF(D115=10,'Tipo '!$B$11,IF(D115=11,'Tipo '!$B$12,IF(D115=12,'Tipo '!$B$13,IF(D115=13,'Tipo '!$B$14,IF(D115=14,'Tipo '!$B$15,IF(D115=15,'Tipo '!$B$16,IF(D115=16,'Tipo '!$B$17,IF(D115=17,'Tipo '!$B$18,IF(D115=18,'Tipo '!$B$19,IF(D115=19,'Tipo '!$B$20,\"No ha seleccionado un tipo de contrato válido\")))))))))))))))))))","v":"CONTRATOS DE PRESTACIÓN DE SERVICIOS PROFESIONALES Y DE APOYO A LA GESTIÓN"},"Contratación directa","Prestación de servicios profesionales y de apoyo a la gestión, o para la ejecución de trabajos artísticos que sólo puedan encomendarse a determinadas personas naturales;","“PRESTAR LOS SERVICIOS PROFESIONALES AL ÁREA DE GESTIÓN DEL DESARROLLO LOCAL DE LA ALCALDÍA LOCAL, PARA APOYAR LA LIQUIDACION DE LOS CONTRATOS , PROYECTOS, PLANES Y PROGRAMAS RELACIONADOS CON EL MANTENIMIENTO, MEJORAMIENTO Y CONSERVACIÓN DE LA INFRAESTRUCTURA VIAL Y ESPACIO PÚBLICO DE LA LOCALIDAD DE SANTA FE”","Inversión",45,{"$f":"IF(J115=1,'Equivalencia BH-BMPT'!$D$2,IF(J115=2,'Equivalencia BH-BMPT'!$D$3,IF(J115=3,'Equivalencia BH-BMPT'!$D$4,IF(J115=4,'Equivalencia BH-BMPT'!$D$5,IF(J115=5,'Equivalencia BH-BMPT'!$D$6,IF(J115=6,'Equivalencia BH-BMPT'!$D$7,IF(J115=7,'Equivalencia BH-BMPT'!$D$8,IF(J115=8,'Equivalencia BH-BMPT'!$D$9,IF(J115=9,'Equivalencia BH-BMPT'!$D$10,IF(J115=10,'Equivalencia BH-BMPT'!$D$11,IF(J115=11,'Equivalencia BH-BMPT'!$D$12,IF(J115=12,'Equivalencia BH-BMPT'!$D$13,IF(J115=13,'Equivalencia BH-BMPT'!$D$14,IF(J115=14,'Equivalencia BH-BMPT'!$D$15,IF(J115=15,'Equivalencia BH-BMPT'!$D$16,IF(J115=16,'Equivalencia BH-BMPT'!$D$17,IF(J115=17,'Equivalencia BH-BMPT'!$D$18,IF(J115=18,'Equivalencia BH-BMPT'!$D$19,IF(J115=19,'Equivalencia BH-BMPT'!$D$20,IF(J115=20,'Equivalencia BH-BMPT'!$D$21,IF(J115=21,'Equivalencia BH-BMPT'!$D$22,IF(J115=22,'Equivalencia BH-BMPT'!$D$23,IF(J115=23,'Equivalencia BH-BMPT'!#REF!,IF(J115=24,'Equivalencia BH-BMPT'!$D$25,IF(J115=25,'Equivalencia BH-BMPT'!$D$26,IF(J115=26,'Equivalencia BH-BMPT'!$D$27,IF(J115=27,'Equivalencia BH-BMPT'!$D$28,IF(J115=28,'Equivalencia BH-BMPT'!$D$29,IF(J115=29,'Equivalencia BH-BMPT'!$D$30,IF(J115=30,'Equivalencia BH-BMPT'!$D$31,IF(J115=31,'Equivalencia BH-BMPT'!$D$32,IF(J115=32,'Equivalencia BH-BMPT'!$D$33,IF(J115=33,'Equivalencia BH-BMPT'!$D$34,IF(J115=34,'Equivalencia BH-BMPT'!$D$35,IF(J115=35,'Equivalencia BH-BMPT'!$D$36,IF(J115=36,'Equivalencia BH-BMPT'!$D$37,IF(J115=37,'Equivalencia BH-BMPT'!$D$38,IF(J115=38,'Equivalencia BH-BMPT'!#REF!,IF(J115=39,'Equivalencia BH-BMPT'!$D$40,IF(J115=40,'Equivalencia BH-BMPT'!$D$41,IF(J115=41,'Equivalencia BH-BMPT'!$D$42,IF(J115=42,'Equivalencia BH-BMPT'!$D$43,IF(J115=43,'Equivalencia BH-BMPT'!$D$44,IF(J115=44,'Equivalencia BH-BMPT'!$D$45,IF(J115=45,'Equivalencia BH-BMPT'!$D$46,\"No ha seleccionado un número de programa\")))))))))))))))))))))))))))))))))))))))))))))","v":"Gobernanza e influencia local, regional e internacional"},1326,1022325648,"JHON JAIRO CRISPIN NIETO",17400000,null,null,0,0,17400000,13200000,"2017/09/08","2017/09/12",43100,116,94,null,null,"X",null,null,0.75862068965517238,null,false]
[104,2017,"CO1.PCCNTR.203508",5,{"$f":"IF(D116=1,'Tipo '!$B$2,IF(D116=2,'Tipo '!$B$3,IF(D116=3,'Tipo '!$B$4,IF(D116=4,'Tipo '!$B$5,IF(D116=5,'Tipo '!$B$6,IF(D116=6,'Tipo '!$B$7,IF(D116=7,'Tipo '!$B$8,IF(D116=8,'Tipo '!$B$9,IF(D116=9,'Tipo '!$B$10,IF(D116=10,'Tipo '!$B$11,IF(D116=11,'Tipo '!$B$12,IF(D116=12,'Tipo '!$B$13,IF(D116=13,'Tipo '!$B$14,IF(D116=14,'Tipo '!$B$15,IF(D116=15,'Tipo '!$B$16,IF(D116=16,'Tipo '!$B$17,IF(D116=17,'Tipo '!$B$18,IF(D116=18,'Tipo '!$B$19,IF(D116=19,'Tipo '!$B$20,\"No ha seleccionado un tipo de contrato válido\")))))))))))))))))))","v":"CONTRATOS DE PRESTACIÓN DE SERVICIOS PROFESIONALES Y DE APOYO A LA GESTIÓN"},"Contratación directa","Prestación de servicios profesionales y de apoyo a la gestión, o para la ejecución de trabajos artísticos que sólo puedan encomendarse a determinadas personas naturales;","Contratar los servicios para desarrollar procesos de plantación, adecuación, y mantenimiento de jardines, en la localidad de santa fe en la ciudad de Bogotá.","Inversión",38,{"$f":"IF(J116=1,'Equivalencia BH-BMPT'!$D$2,IF(J116=2,'Equivalencia BH-BMPT'!$D$3,IF(J116=3,'Equivalencia BH-BMPT'!$D$4,IF(J116=4,'Equivalencia BH-BMPT'!$D$5,IF(J116=5,'Equivalencia BH-BMPT'!$D$6,IF(J116=6,'Equivalencia BH-BMPT'!$D$7,IF(J116=7,'Equivalencia BH-BMPT'!$D$8,IF(J116=8,'Equivalencia BH-BMPT'!$D$9,IF(J116=9,'Equivalencia BH-BMPT'!$D$10,IF(J116=10,'Equivalencia BH-BMPT'!$D$11,IF(J116=11,'Equivalencia BH-BMPT'!$D$12,IF(J116=12,'Equivalencia BH-BMPT'!$D$13,IF(J116=13,'Equivalencia BH-BMPT'!$D$14,IF(J116=14,'Equivalencia BH-BMPT'!$D$15,IF(J116=15,'Equivalencia BH-BMPT'!$D$16,IF(J116=16,'Equivalencia BH-BMPT'!$D$17,IF(J116=17,'Equivalencia BH-BMPT'!$D$18,IF(J116=18,'Equivalencia BH-BMPT'!$D$19,IF(J116=19,'Equivalencia BH-BMPT'!$D$20,IF(J116=20,'Equivalencia BH-BMPT'!$D$21,IF(J116=21,'Equivalencia BH-BMPT'!$D$22,IF(J116=22,'Equivalencia BH-BMPT'!$D$23,IF(J116=23,'Equivalencia BH-BMPT'!#REF!,IF(J116=24,'Equivalencia BH-BMPT'!$D$25,IF(J116=25,'Equivalencia BH-BMPT'!$D$26,IF(J116=26,'Equivalencia BH-BMPT'!$D$27,IF(J116=27,'Equivalencia BH-BMPT'!$D$28,IF(J116=28,'Equivalencia BH-BMPT'!$D$29,IF(J116=29,'Equivalencia BH-BMPT'!$D$30,IF(J116=30,'Equivalencia BH-BMPT'!$D$31,IF(J116=31,'Equivalencia BH-BMPT'!$D$32,IF(J116=32,'Equivalencia BH-BMPT'!$D$33,IF(J116=33,'Equivalencia BH-BMPT'!$D$34,IF(J116=34,'Equivalencia BH-BMPT'!$D$35,IF(J116=35,'Equivalencia BH-BMPT'!$D$36,IF(J116=36,'Equivalencia BH-BMPT'!$D$37,IF(J116=37,'Equivalencia BH-BMPT'!$D$38,IF(J116=38,'Equivalencia BH-BMPT'!#REF!,IF(J116=39,'Equivalencia BH-BMPT'!$D$40,IF(J116=40,'Equivalencia BH-BMPT'!$D$41,IF(J116=41,'Equivalencia BH-BMPT'!$D$42,IF(J116=42,'Equivalencia BH-BMPT'!$D$43,IF(J116=43,'Equivalencia BH-BMPT'!$D$44,IF(J116=44,'Equivalencia BH-BMPT'!$D$45,IF(J116=45,'Equivalencia BH-BMPT'!$D$46,\"No ha seleccionado un número de programa\")))))))))))))))))))))))))))))))))))))))))))))","v":{"$error":"#REF!"}},1324,55118373,"LEIDY YOLIMA OCHOA GUIZA",67448248,null,null,0,0,67448248,0,"2017/09/21","2017/09/21",43363,30,95,null,null,"X",null,null,0,null,false]
[105,2017,"CO1.PCCNTR.202626",5,{"$f":"IF(D117=1,'Tipo '!$B$2,IF(D117=2,'Tipo '!$B$3,IF(D117=3,'Tipo '!$B$4,IF(D117=4,'Tipo '!$B$5,IF(D117=5,'Tipo '!$B$6,IF(D117=6,'Tipo '!$B$7,IF(D117=7,'Tipo '!$B$8,IF(D117=8,'Tipo '!$B$9,IF(D117=9,'Tipo '!$B$10,IF(D117=10,'Tipo '!$B$11,IF(D117=11,'Tipo '!$B$12,IF(D117=12,'Tipo '!$B$13,IF(D117=13,'Tipo '!$B$14,IF(D117=14,'Tipo '!$B$15,IF(D117=15,'Tipo '!$B$16,IF(D117=16,'Tipo '!$B$17,IF(D117=17,'Tipo '!$B$18,IF(D117=18,'Tipo '!$B$19,IF(D117=19,'Tipo '!$B$20,\"No ha seleccionado un tipo de contrato válido\")))))))))))))))))))","v":"CONTRATOS DE PRESTACIÓN DE SERVICIOS PROFESIONALES Y DE APOYO A LA GESTIÓN"},"Contratación directa","Prestación de servicios profesionales y de apoyo a la gestión, o para la ejecución de trabajos artísticos que sólo puedan encomendarse a determinadas personas naturales;","PRESTAR SERVICIOS PARA LA REALIZACIÓN DE ESCUELAS DE FORMACIÓN DEPORTIVAS DIRIGIDAS A LAS DIFERENTES POBLACIONES DE LA LOCALIDAD DE SANTA FE","Inversión",11,{"$f":"IF(J117=1,'Equivalencia BH-BMPT'!$D$2,IF(J117=2,'Equivalencia BH-BMPT'!$D$3,IF(J117=3,'Equivalencia BH-BMPT'!$D$4,IF(J117=4,'Equivalencia BH-BMPT'!$D$5,IF(J117=5,'Equivalencia BH-BMPT'!$D$6,IF(J117=6,'Equivalencia BH-BMPT'!$D$7,IF(J117=7,'Equivalencia BH-BMPT'!$D$8,IF(J117=8,'Equivalencia BH-BMPT'!$D$9,IF(J117=9,'Equivalencia BH-BMPT'!$D$10,IF(J117=10,'Equivalencia BH-BMPT'!$D$11,IF(J117=11,'Equivalencia BH-BMPT'!$D$12,IF(J117=12,'Equivalencia BH-BMPT'!$D$13,IF(J117=13,'Equivalencia BH-BMPT'!$D$14,IF(J117=14,'Equivalencia BH-BMPT'!$D$15,IF(J117=15,'Equivalencia BH-BMPT'!$D$16,IF(J117=16,'Equivalencia BH-BMPT'!$D$17,IF(J117=17,'Equivalencia BH-BMPT'!$D$18,IF(J117=18,'Equivalencia BH-BMPT'!$D$19,IF(J117=19,'Equivalencia BH-BMPT'!$D$20,IF(J117=20,'Equivalencia BH-BMPT'!$D$21,IF(J117=21,'Equivalencia BH-BMPT'!$D$22,IF(J117=22,'Equivalencia BH-BMPT'!$D$23,IF(J117=23,'Equivalencia BH-BMPT'!#REF!,IF(J117=24,'Equivalencia BH-BMPT'!$D$25,IF(J117=25,'Equivalencia BH-BMPT'!$D$26,IF(J117=26,'Equivalencia BH-BMPT'!$D$27,IF(J117=27,'Equivalencia BH-BMPT'!$D$28,IF(J117=28,'Equivalencia BH-BMPT'!$D$29,IF(J117=29,'Equivalencia BH-BMPT'!$D$30,IF(J117=30,'Equivalencia BH-BMPT'!$D$31,IF(J117=31,'Equivalencia BH-BMPT'!$D$32,IF(J117=32,'Equivalencia BH-BMPT'!$D$33,IF(J117=33,'Equivalencia BH-BMPT'!$D$34,IF(J117=34,'Equivalencia BH-BMPT'!$D$35,IF(J117=35,'Equivalencia BH-BMPT'!$D$36,IF(J117=36,'Equivalencia BH-BMPT'!$D$37,IF(J117=37,'Equivalencia BH-BMPT'!$D$38,IF(J117=38,'Equivalencia BH-BMPT'!#REF!,IF(J117=39,'Equivalencia BH-BMPT'!$D$40,IF(J117=40,'Equivalencia BH-BMPT'!$D$41,IF(J117=41,'Equivalencia BH-BMPT'!$D$42,IF(J117=42,'Equivalencia BH-BMPT'!$D$43,IF(J117=43,'Equivalencia BH-BMPT'!$D$44,IF(J117=44,'Equivalencia BH-BMPT'!$D$45,IF(J117=45,'Equivalencia BH-BMPT'!$D$46,\"No ha seleccionado un número de programa\")))))))))))))))))))))))))))))))))))))))))))))","v":"Mejores oportunidades para el desarrollo a través de la cultura, la recreación y el deporte"},1318,901116240,"FUNDACION PAIS SOLIDARIO FUNPES",202283066,null,null,0,0,202283066,0,"2017/09/25","2017/09/25",43183,180,96,null,null,"X",null,null,0,null,false]
[106,2017,"17-11-6897148",19,{"$f":"IF(D118=1,'Tipo '!$B$2,IF(D118=2,'Tipo '!$B$3,IF(D118=3,'Tipo '!$B$4,IF(D118=4,'Tipo '!$B$5,IF(D118=5,'Tipo '!$B$6,IF(D118=6,'Tipo '!$B$7,IF(D118=7,'Tipo '!$B$8,IF(D118=8,'Tipo '!$B$9,IF(D118=9,'Tipo '!$B$10,IF(D118=10,'Tipo '!$B$11,IF(D118=11,'Tipo '!$B$12,IF(D118=12,'Tipo '!$B$13,IF(D118=13,'Tipo '!$B$14,IF(D118=14,'Tipo '!$B$15,IF(D118=15,'Tipo '!$B$16,IF(D118=16,'Tipo '!$B$17,IF(D118=17,'Tipo '!$B$18,IF(D118=18,'Tipo '!$B$19,IF(D118=19,'Tipo '!$B$20,\"No ha seleccionado un tipo de contrato válido\")))))))))))))))))))","v":"OTROS"},"Selección abreviada ","Selección abreviada por menor cuantía ","PRESTAR EL SERVICIO DE ACTIVIDADES DE SOCIALIZACIÓN DE LA LEY 1801 DE 2016 “CÓDIGO NACIONAL DE POLICÍA Y CONVIVENCIA”, EN EL MARCO DEL PROYECTO NO. 1323 “SANTA FE, TERRITORIO SEGURO","Inversión",19,{"$f":"IF(J118=1,'Equivalencia BH-BMPT'!$D$2,IF(J118=2,'Equivalencia BH-BMPT'!$D$3,IF(J118=3,'Equivalencia BH-BMPT'!$D$4,IF(J118=4,'Equivalencia BH-BMPT'!$D$5,IF(J118=5,'Equivalencia BH-BMPT'!$D$6,IF(J118=6,'Equivalencia BH-BMPT'!$D$7,IF(J118=7,'Equivalencia BH-BMPT'!$D$8,IF(J118=8,'Equivalencia BH-BMPT'!$D$9,IF(J118=9,'Equivalencia BH-BMPT'!$D$10,IF(J118=10,'Equivalencia BH-BMPT'!$D$11,IF(J118=11,'Equivalencia BH-BMPT'!$D$12,IF(J118=12,'Equivalencia BH-BMPT'!$D$13,IF(J118=13,'Equivalencia BH-BMPT'!$D$14,IF(J118=14,'Equivalencia BH-BMPT'!$D$15,IF(J118=15,'Equivalencia BH-BMPT'!$D$16,IF(J118=16,'Equivalencia BH-BMPT'!$D$17,IF(J118=17,'Equivalencia BH-BMPT'!$D$18,IF(J118=18,'Equivalencia BH-BMPT'!$D$19,IF(J118=19,'Equivalencia BH-BMPT'!$D$20,IF(J118=20,'Equivalencia BH-BMPT'!$D$21,IF(J118=21,'Equivalencia BH-BMPT'!$D$22,IF(J118=22,'Equivalencia BH-BMPT'!$D$23,IF(J118=23,'Equivalencia BH-BMPT'!#REF!,IF(J118=24,'Equivalencia BH-BMPT'!$D$25,IF(J118=25,'Equivalencia BH-BMPT'!$D$26,IF(J118=26,'Equivalencia BH-BMPT'!$D$27,IF(J118=27,'Equivalencia BH-BMPT'!$D$28,IF(J118=28,'Equivalencia BH-BMPT'!$D$29,IF(J118=29,'Equivalencia BH-BMPT'!$D$30,IF(J118=30,'Equivalencia BH-BMPT'!$D$31,IF(J118=31,'Equivalencia BH-BMPT'!$D$32,IF(J118=32,'Equivalencia BH-BMPT'!$D$33,IF(J118=33,'Equivalencia BH-BMPT'!$D$34,IF(J118=34,'Equivalencia BH-BMPT'!$D$35,IF(J118=35,'Equivalencia BH-BMPT'!$D$36,IF(J118=36,'Equivalencia BH-BMPT'!$D$37,IF(J118=37,'Equivalencia BH-BMPT'!$D$38,IF(J118=38,'Equivalencia BH-BMPT'!#REF!,IF(J118=39,'Equivalencia BH-BMPT'!$D$40,IF(J118=40,'Equivalencia BH-BMPT'!$D$41,IF(J118=41,'Equivalencia BH-BMPT'!$D$42,IF(J118=42,'Equivalencia BH-BMPT'!$D$43,IF(J118=43,'Equivalencia BH-BMPT'!$D$44,IF(J118=44,'Equivalencia BH-BMPT'!$D$45,IF(J118=45,'Equivalencia BH-BMPT'!$D$46,\"No ha seleccionado un número de programa\")))))))))))))))))))))))))))))))))))))))))))))","v":"Seguridad y convivencia para todos"},1323,900175862,"CORPORACION ESTRATEGICA EN GESTION E INTEGRACION COLOMBIA EGESCO",137990212,null,null,0,0,137990212,7031507,"2017/09/25","2017/09/25",43155,150,97,null,null,"X",null,null,5.0956563498866139E-2,null,false]
[107,2017,"17-12-7136171",4,{"$f":"IF(D119=1,'Tipo '!$B$2,IF(D119=2,'Tipo '!$B$3,IF(D119=3,'Tipo '!$B$4,IF(D119=4,'Tipo '!$B$5,IF(D119=5,'Tipo '!$B$6,IF(D119=6,'Tipo '!$B$7,IF(D119=7,'Tipo '!$B$8,IF(D119=8,'Tipo '!$B$9,IF(D119=9,'Tipo '!$B$10,IF(D119=10,'Tipo '!$B$11,IF(D119=11,'Tipo '!$B$12,IF(D119=12,'Tipo '!$B$13,IF(D119=13,'Tipo '!$B$14,IF(D119=14,'Tipo '!$B$15,IF(D119=15,'Tipo '!$B$16,IF(D119=16,'Tipo '!$B$17,IF(D119=17,'Tipo '!$B$18,IF(D119=18,'Tipo '!$B$19,IF(D119=19,'Tipo '!$B$20,\"No ha seleccionado un tipo de contrato válido\")))))))))))))))))))","v":"CONTRATOS DE PRESTACIÓN DE SERVICIOS"},"Selección abreviada ","Selección abreviada por menor cuantía ","CONTRATACION DEL SERVICIO TECNICO Y DE APOYO PARA LA PREPRODUCCION Y PRODUCCION DE LOS EVENTOS ACADEMICOS Y CULTURALES, EN EL MARCO DEL PROYECTO 1318","Inversión",11,{"$f":"IF(J119=1,'Equivalencia BH-BMPT'!$D$2,IF(J119=2,'Equivalencia BH-BMPT'!$D$3,IF(J119=3,'Equivalencia BH-BMPT'!$D$4,IF(J119=4,'Equivalencia BH-BMPT'!$D$5,IF(J119=5,'Equivalencia BH-BMPT'!$D$6,IF(J119=6,'Equivalencia BH-BMPT'!$D$7,IF(J119=7,'Equivalencia BH-BMPT'!$D$8,IF(J119=8,'Equivalencia BH-BMPT'!$D$9,IF(J119=9,'Equivalencia BH-BMPT'!$D$10,IF(J119=10,'Equivalencia BH-BMPT'!$D$11,IF(J119=11,'Equivalencia BH-BMPT'!$D$12,IF(J119=12,'Equivalencia BH-BMPT'!$D$13,IF(J119=13,'Equivalencia BH-BMPT'!$D$14,IF(J119=14,'Equivalencia BH-BMPT'!$D$15,IF(J119=15,'Equivalencia BH-BMPT'!$D$16,IF(J119=16,'Equivalencia BH-BMPT'!$D$17,IF(J119=17,'Equivalencia BH-BMPT'!$D$18,IF(J119=18,'Equivalencia BH-BMPT'!$D$19,IF(J119=19,'Equivalencia BH-BMPT'!$D$20,IF(J119=20,'Equivalencia BH-BMPT'!$D$21,IF(J119=21,'Equivalencia BH-BMPT'!$D$22,IF(J119=22,'Equivalencia BH-BMPT'!$D$23,IF(J119=23,'Equivalencia BH-BMPT'!#REF!,IF(J119=24,'Equivalencia BH-BMPT'!$D$25,IF(J119=25,'Equivalencia BH-BMPT'!$D$26,IF(J119=26,'Equivalencia BH-BMPT'!$D$27,IF(J119=27,'Equivalencia BH-BMPT'!$D$28,IF(J119=28,'Equivalencia BH-BMPT'!$D$29,IF(J119=29,'Equivalencia BH-BMPT'!$D$30,IF(J119=30,'Equivalencia BH-BMPT'!$D$31,IF(J119=31,'Equivalencia BH-BMPT'!$D$32,IF(J119=32,'Equivalencia BH-BMPT'!$D$33,IF(J119=33,'Equivalencia BH-BMPT'!$D$34,IF(J119=34,'Equivalencia BH-BMPT'!$D$35,IF(J119=35,'Equivalencia BH-BMPT'!$D$36,IF(J119=36,'Equivalencia BH-BMPT'!$D$37,IF(J119=37,'Equivalencia BH-BMPT'!$D$38,IF(J119=38,'Equivalencia BH-BMPT'!#REF!,IF(J119=39,'Equivalencia BH-BMPT'!$D$40,IF(J119=40,'Equivalencia BH-BMPT'!$D$41,IF(J119=41,'Equivalencia BH-BMPT'!$D$42,IF(J119=42,'Equivalencia BH-BMPT'!$D$43,IF(J119=43,'Equivalencia BH-BMPT'!$D$44,IF(J119=44,'Equivalencia BH-BMPT'!$D$45,IF(J119=45,'Equivalencia BH-BMPT'!$D$46,\"No ha seleccionado un número de programa\")))))))))))))))))))))))))))))))))))))))))))))","v":"Mejores oportunidades para el desarrollo a través de la cultura, la recreación y el deporte"},1318,830012587,"CANAL CAPITAL",264818498,null,null,0,0,264818498,0,"2017/09/29","2017/09/29",42822,180,98,null,null,"X",null,null,0,null,false]
[108,2017,"17-1-176726",4,{"$f":"IF(D120=1,'Tipo '!$B$2,IF(D120=2,'Tipo '!$B$3,IF(D120=3,'Tipo '!$B$4,IF(D120=4,'Tipo '!$B$5,IF(D120=5,'Tipo '!$B$6,IF(D120=6,'Tipo '!$B$7,IF(D120=7,'Tipo '!$B$8,IF(D120=8,'Tipo '!$B$9,IF(D120=9,'Tipo '!$B$10,IF(D120=10,'Tipo '!$B$11,IF(D120=11,'Tipo '!$B$12,IF(D120=12,'Tipo '!$B$13,IF(D120=13,'Tipo '!$B$14,IF(D120=14,'Tipo '!$B$15,IF(D120=15,'Tipo '!$B$16,IF(D120=16,'Tipo '!$B$17,IF(D120=17,'Tipo '!$B$18,IF(D120=18,'Tipo '!$B$19,IF(D120=19,'Tipo '!$B$20,\"No ha seleccionado un tipo de contrato válido\")))))))))))))))))))","v":"CONTRATOS DE PRESTACIÓN DE SERVICIOS"},"Selección abreviada ","Selección abreviada por menor cuantía ","REALIZAR ACTIVIDADES QUE PROMUEVAN LA CONFORMACIÓN DE ESPACIOS DE PARTICIPACIÓN CIUDADANA INCIDENTE DE LOS HABITANTES DE LA LOCALIDAD DE SANTA FE, INTERESADOS EN LA GESTIÓN DE LOS DIFERENTES PROCESOS DEL DESARROLLO LOCAL, EN EL MARCO DEL PROYECTO No. 1327 DENOMINADO VOZ PARA TODOS”.","Inversión",45,{"$f":"IF(J120=1,'Equivalencia BH-BMPT'!$D$2,IF(J120=2,'Equivalencia BH-BMPT'!$D$3,IF(J120=3,'Equivalencia BH-BMPT'!$D$4,IF(J120=4,'Equivalencia BH-BMPT'!$D$5,IF(J120=5,'Equivalencia BH-BMPT'!$D$6,IF(J120=6,'Equivalencia BH-BMPT'!$D$7,IF(J120=7,'Equivalencia BH-BMPT'!$D$8,IF(J120=8,'Equivalencia BH-BMPT'!$D$9,IF(J120=9,'Equivalencia BH-BMPT'!$D$10,IF(J120=10,'Equivalencia BH-BMPT'!$D$11,IF(J120=11,'Equivalencia BH-BMPT'!$D$12,IF(J120=12,'Equivalencia BH-BMPT'!$D$13,IF(J120=13,'Equivalencia BH-BMPT'!$D$14,IF(J120=14,'Equivalencia BH-BMPT'!$D$15,IF(J120=15,'Equivalencia BH-BMPT'!$D$16,IF(J120=16,'Equivalencia BH-BMPT'!$D$17,IF(J120=17,'Equivalencia BH-BMPT'!$D$18,IF(J120=18,'Equivalencia BH-BMPT'!$D$19,IF(J120=19,'Equivalencia BH-BMPT'!$D$20,IF(J120=20,'Equivalencia BH-BMPT'!$D$21,IF(J120=21,'Equivalencia BH-BMPT'!$D$22,IF(J120=22,'Equivalencia BH-BMPT'!$D$23,IF(J120=23,'Equivalencia BH-BMPT'!#REF!,IF(J120=24,'Equivalencia BH-BMPT'!$D$25,IF(J120=25,'Equivalencia BH-BMPT'!$D$26,IF(J120=26,'Equivalencia BH-BMPT'!$D$27,IF(J120=27,'Equivalencia BH-BMPT'!$D$28,IF(J120=28,'Equivalencia BH-BMPT'!$D$29,IF(J120=29,'Equivalencia BH-BMPT'!$D$30,IF(J120=30,'Equivalencia BH-BMPT'!$D$31,IF(J120=31,'Equivalencia BH-BMPT'!$D$32,IF(J120=32,'Equivalencia BH-BMPT'!$D$33,IF(J120=33,'Equivalencia BH-BMPT'!$D$34,IF(J120=34,'Equivalencia BH-BMPT'!$D$35,IF(J120=35,'Equivalencia BH-BMPT'!$D$36,IF(J120=36,'Equivalencia BH-BMPT'!$D$37,IF(J120=37,'Equivalencia BH-BMPT'!$D$38,IF(J120=38,'Equivalencia BH-BMPT'!#REF!,IF(J120=39,'Equivalencia BH-BMPT'!$D$40,IF(J120=40,'Equivalencia BH-BMPT'!$D$41,IF(J120=41,'Equivalencia BH-BMPT'!$D$42,IF(J120=42,'Equivalencia BH-BMPT'!$D$43,IF(J120=43,'Equivalencia BH-BMPT'!$D$44,IF(J120=44,'Equivalencia BH-BMPT'!$D$45,IF(J120=45,'Equivalencia BH-BMPT'!$D$46,\"No ha seleccionado un número de programa\")))))))))))))))))))))))))))))))))))))))))))))","v":"Gobernanza e influencia local, regional e internacional"},1327,null,"UNION TEMPORAL PARTICIPEMOS 2017",329133030,null,null,0,0,329133030,0,"2017-10-03",43011,43314,300,99,null,null,"X",null,null,0,null,false]
[109,2017,"17-12-7269091",4,{"$f":"IF(D121=1,'Tipo '!$B$2,IF(D121=2,'Tipo '!$B$3,IF(D121=3,'Tipo '!$B$4,IF(D121=4,'Tipo '!$B$5,IF(D121=5,'Tipo '!$B$6,IF(D121=6,'Tipo '!$B$7,IF(D121=7,'Tipo '!$B$8,IF(D121=8,'Tipo '!$B$9,IF(D121=9,'Tipo '!$B$10,IF(D121=10,'Tipo '!$B$11,IF(D121=11,'Tipo '!$B$12,IF(D121=12,'Tipo '!$B$13,IF(D121=13,'Tipo '!$B$14,IF(D121=14,'Tipo '!$B$15,IF(D121=15,'Tipo '!$B$16,IF(D121=16,'Tipo '!$B$17,IF(D121=17,'Tipo '!$B$18,IF(D121=18,'Tipo '!$B$19,IF(D121=19,'Tipo '!$B$20,\"No ha seleccionado un tipo de contrato válido\")))))))))))))))))))","v":"CONTRATOS DE PRESTACIÓN DE SERVICIOS"},"Contratación directa","selección abreviada de menor cuantía","PRESTACION DE SERVICIOS DE APOYO DE LOGISTICA QUE SE REQUIERAN EN EL DESARROLLO DE LAS ACTIVIDADES REALTIVAS A RECUPERACION Y EMBELLECVIMIENTO DEL ESPACIO PUBLICO QUE TENGA A CARGO EL FONDO DE DESARROLLO LOCAL DE DESARROLLO DE SANTA FE","Inversión",18,{"$f":"IF(J121=1,'Equivalencia BH-BMPT'!$D$2,IF(J121=2,'Equivalencia BH-BMPT'!$D$3,IF(J121=3,'Equivalencia BH-BMPT'!$D$4,IF(J121=4,'Equivalencia BH-BMPT'!$D$5,IF(J121=5,'Equivalencia BH-BMPT'!$D$6,IF(J121=6,'Equivalencia BH-BMPT'!$D$7,IF(J121=7,'Equivalencia BH-BMPT'!$D$8,IF(J121=8,'Equivalencia BH-BMPT'!$D$9,IF(J121=9,'Equivalencia BH-BMPT'!$D$10,IF(J121=10,'Equivalencia BH-BMPT'!$D$11,IF(J121=11,'Equivalencia BH-BMPT'!$D$12,IF(J121=12,'Equivalencia BH-BMPT'!$D$13,IF(J121=13,'Equivalencia BH-BMPT'!$D$14,IF(J121=14,'Equivalencia BH-BMPT'!$D$15,IF(J121=15,'Equivalencia BH-BMPT'!$D$16,IF(J121=16,'Equivalencia BH-BMPT'!$D$17,IF(J121=17,'Equivalencia BH-BMPT'!$D$18,IF(J121=18,'Equivalencia BH-BMPT'!$D$19,IF(J121=19,'Equivalencia BH-BMPT'!$D$20,IF(J121=20,'Equivalencia BH-BMPT'!$D$21,IF(J121=21,'Equivalencia BH-BMPT'!$D$22,IF(J121=22,'Equivalencia BH-BMPT'!$D$23,IF(J121=23,'Equivalencia BH-BMPT'!#REF!,IF(J121=24,'Equivalencia BH-BMPT'!$D$25,IF(J121=25,'Equivalencia BH-BMPT'!$D$26,IF(J121=26,'Equivalencia BH-BMPT'!$D$27,IF(J121=27,'Equivalencia BH-BMPT'!$D$28,IF(J121=28,'Equivalencia BH-BMPT'!$D$29,IF(J121=29,'Equivalencia BH-BMPT'!$D$30,IF(J121=30,'Equivalencia BH-BMPT'!$D$31,IF(J121=31,'Equivalencia BH-BMPT'!$D$32,IF(J121=32,'Equivalencia BH-BMPT'!$D$33,IF(J121=33,'Equivalencia BH-BMPT'!$D$34,IF(J121=34,'Equivalencia BH-BMPT'!$D$35,IF(J121=35,'Equivalencia BH-BMPT'!$D$36,IF(J121=36,'Equivalencia BH-BMPT'!$D$37,IF(J121=37,'Equivalencia BH-BMPT'!$D$38,IF(J121=38,'Equivalencia BH-BMPT'!#REF!,IF(J121=39,'Equivalencia BH-BMPT'!$D$40,IF(J121=40,'Equivalencia BH-BMPT'!$D$41,IF(J121=41,'Equivalencia BH-BMPT'!$D$42,IF(J121=42,'Equivalencia BH-BMPT'!$D$43,IF(J121=43,'Equivalencia BH-BMPT'!$D$44,IF(J121=44,'Equivalencia BH-BMPT'!$D$45,IF(J121=45,'Equivalencia BH-BMPT'!$D$46,\"No ha seleccionado un número de programa\")))))))))))))))))))))))))))))))))))))))))))))","v":"Mejor movilidad para todos"},1322,80761286,"MIGUEL ANGEL GUEVARA BARRERA",4277499,null,null,0,0,4277499,2852101,"2014/10/04","2017-10-12",43100,87,100,null,null,"X",null,null,0.6667683616056953,null,false]
[110,2017,"CO1.PCCNTR.211931",4,{"$f":"IF(D122=1,'Tipo '!$B$2,IF(D122=2,'Tipo '!$B$3,IF(D122=3,'Tipo '!$B$4,IF(D122=4,'Tipo '!$B$5,IF(D122=5,'Tipo '!$B$6,IF(D122=6,'Tipo '!$B$7,IF(D122=7,'Tipo '!$B$8,IF(D122=8,'Tipo '!$B$9,IF(D122=9,'Tipo '!$B$10,IF(D122=10,'Tipo '!$B$11,IF(D122=11,'Tipo '!$B$12,IF(D122=12,'Tipo '!$B$13,IF(D122=13,'Tipo '!$B$14,IF(D122=14,'Tipo '!$B$15,IF(D122=15,'Tipo '!$B$16,IF(D122=16,'Tipo '!$B$17,IF(D122=17,'Tipo '!$B$18,IF(D122=18,'Tipo '!$B$19,IF(D122=19,'Tipo '!$B$20,\"No ha seleccionado un tipo de contrato válido\")))))))))))))))))))","v":"CONTRATOS DE PRESTACIÓN DE SERVICIOS"},"Licitación pública","No aplica","PRESTAR SERVICIOS AL AREA DE GESTION POLICIVA COMO APOYO ADMINISTRATIVO DE LA ALCALDIA LOCAL DE SANTA FE","Inversión",45,{"$f":"IF(J122=1,'Equivalencia BH-BMPT'!$D$2,IF(J122=2,'Equivalencia BH-BMPT'!$D$3,IF(J122=3,'Equivalencia BH-BMPT'!$D$4,IF(J122=4,'Equivalencia BH-BMPT'!$D$5,IF(J122=5,'Equivalencia BH-BMPT'!$D$6,IF(J122=6,'Equivalencia BH-BMPT'!$D$7,IF(J122=7,'Equivalencia BH-BMPT'!$D$8,IF(J122=8,'Equivalencia BH-BMPT'!$D$9,IF(J122=9,'Equivalencia BH-BMPT'!$D$10,IF(J122=10,'Equivalencia BH-BMPT'!$D$11,IF(J122=11,'Equivalencia BH-BMPT'!$D$12,IF(J122=12,'Equivalencia BH-BMPT'!$D$13,IF(J122=13,'Equivalencia BH-BMPT'!$D$14,IF(J122=14,'Equivalencia BH-BMPT'!$D$15,IF(J122=15,'Equivalencia BH-BMPT'!$D$16,IF(J122=16,'Equivalencia BH-BMPT'!$D$17,IF(J122=17,'Equivalencia BH-BMPT'!$D$18,IF(J122=18,'Equivalencia BH-BMPT'!$D$19,IF(J122=19,'Equivalencia BH-BMPT'!$D$20,IF(J122=20,'Equivalencia BH-BMPT'!$D$21,IF(J122=21,'Equivalencia BH-BMPT'!$D$22,IF(J122=22,'Equivalencia BH-BMPT'!$D$23,IF(J122=23,'Equivalencia BH-BMPT'!#REF!,IF(J122=24,'Equivalencia BH-BMPT'!$D$25,IF(J122=25,'Equivalencia BH-BMPT'!$D$26,IF(J122=26,'Equivalencia BH-BMPT'!$D$27,IF(J122=27,'Equivalencia BH-BMPT'!$D$28,IF(J122=28,'Equivalencia BH-BMPT'!$D$29,IF(J122=29,'Equivalencia BH-BMPT'!$D$30,IF(J122=30,'Equivalencia BH-BMPT'!$D$31,IF(J122=31,'Equivalencia BH-BMPT'!$D$32,IF(J122=32,'Equivalencia BH-BMPT'!$D$33,IF(J122=33,'Equivalencia BH-BMPT'!$D$34,IF(J122=34,'Equivalencia BH-BMPT'!$D$35,IF(J122=35,'Equivalencia BH-BMPT'!$D$36,IF(J122=36,'Equivalencia BH-BMPT'!$D$37,IF(J122=37,'Equivalencia BH-BMPT'!$D$38,IF(J122=38,'Equivalencia BH-BMPT'!#REF!,IF(J122=39,'Equivalencia BH-BMPT'!$D$40,IF(J122=40,'Equivalencia BH-BMPT'!$D$41,IF(J122=41,'Equivalencia BH-BMPT'!$D$42,IF(J122=42,'Equivalencia BH-BMPT'!$D$43,IF(J122=43,'Equivalencia BH-BMPT'!$D$44,IF(J122=44,'Equivalencia BH-BMPT'!$D$45,IF(J122=45,'Equivalencia BH-BMPT'!$D$46,\"No ha seleccionado un número de programa\")))))))))))))))))))))))))))))))))))))))))))))","v":"Gobernanza e influencia local, regional e internacional"},1326,1032450825,"KEVIN MAURICIO LOZANO ARANDA",7596666,null,null,0,1,7596667,5653333,"2017/10/05","2017-10-06",43100,86,101,null,null,"X",null,null,0.74418596997867614,null,false]
[111,2017,"CO1.PCCNTR.212508",5,{"$f":"IF(D123=1,'Tipo '!$B$2,IF(D123=2,'Tipo '!$B$3,IF(D123=3,'Tipo '!$B$4,IF(D123=4,'Tipo '!$B$5,IF(D123=5,'Tipo '!$B$6,IF(D123=6,'Tipo '!$B$7,IF(D123=7,'Tipo '!$B$8,IF(D123=8,'Tipo '!$B$9,IF(D123=9,'Tipo '!$B$10,IF(D123=10,'Tipo '!$B$11,IF(D123=11,'Tipo '!$B$12,IF(D123=12,'Tipo '!$B$13,IF(D123=13,'Tipo '!$B$14,IF(D123=14,'Tipo '!$B$15,IF(D123=15,'Tipo '!$B$16,IF(D123=16,'Tipo '!$B$17,IF(D123=17,'Tipo '!$B$18,IF(D123=18,'Tipo '!$B$19,IF(D123=19,'Tipo '!$B$20,\"No ha seleccionado un tipo de contrato válido\")))))))))))))))))))","v":"CONTRATOS DE PRESTACIÓN DE SERVICIOS PROFESIONALES Y DE APOYO A LA GESTIÓN"},"Contratación directa","Prestación de servicios profesionales y de apoyo a la gestión, o para la ejecución de trabajos artísticos que sólo puedan encomendarse a determinadas personas naturales;","APOYAR AL ALCALDE LOCAL EN LA PROMOCIÓN, ACOMPAÑAMIENTO, COORDINACIÓN Y ATENCIÓN DE LAS INSTANCIAS DE COORDINACIÓN INTERINSTITUCIONALES Y LAS INSTANCIAS DE PARTICIPACIÓN LOCALES, ASÍ COMO LOS PROCESOS COMUNITARIOS EN LA LOCALIDAD DE SANTA FÉ.","Inversión",45,{"$f":"IF(J123=1,'Equivalencia BH-BMPT'!$D$2,IF(J123=2,'Equivalencia BH-BMPT'!$D$3,IF(J123=3,'Equivalencia BH-BMPT'!$D$4,IF(J123=4,'Equivalencia BH-BMPT'!$D$5,IF(J123=5,'Equivalencia BH-BMPT'!$D$6,IF(J123=6,'Equivalencia BH-BMPT'!$D$7,IF(J123=7,'Equivalencia BH-BMPT'!$D$8,IF(J123=8,'Equivalencia BH-BMPT'!$D$9,IF(J123=9,'Equivalencia BH-BMPT'!$D$10,IF(J123=10,'Equivalencia BH-BMPT'!$D$11,IF(J123=11,'Equivalencia BH-BMPT'!$D$12,IF(J123=12,'Equivalencia BH-BMPT'!$D$13,IF(J123=13,'Equivalencia BH-BMPT'!$D$14,IF(J123=14,'Equivalencia BH-BMPT'!$D$15,IF(J123=15,'Equivalencia BH-BMPT'!$D$16,IF(J123=16,'Equivalencia BH-BMPT'!$D$17,IF(J123=17,'Equivalencia BH-BMPT'!$D$18,IF(J123=18,'Equivalencia BH-BMPT'!$D$19,IF(J123=19,'Equivalencia BH-BMPT'!$D$20,IF(J123=20,'Equivalencia BH-BMPT'!$D$21,IF(J123=21,'Equivalencia BH-BMPT'!$D$22,IF(J123=22,'Equivalencia BH-BMPT'!$D$23,IF(J123=23,'Equivalencia BH-BMPT'!#REF!,IF(J123=24,'Equivalencia BH-BMPT'!$D$25,IF(J123=25,'Equivalencia BH-BMPT'!$D$26,IF(J123=26,'Equivalencia BH-BMPT'!$D$27,IF(J123=27,'Equivalencia BH-BMPT'!$D$28,IF(J123=28,'Equivalencia BH-BMPT'!$D$29,IF(J123=29,'Equivalencia BH-BMPT'!$D$30,IF(J123=30,'Equivalencia BH-BMPT'!$D$31,IF(J123=31,'Equivalencia BH-BMPT'!$D$32,IF(J123=32,'Equivalencia BH-BMPT'!$D$33,IF(J123=33,'Equivalencia BH-BMPT'!$D$34,IF(J123=34,'Equivalencia BH-BMPT'!$D$35,IF(J123=35,'Equivalencia BH-BMPT'!$D$36,IF(J123=36,'Equivalencia BH-BMPT'!$D$37,IF(J123=37,'Equivalencia BH-BMPT'!$D$38,IF(J123=38,'Equivalencia BH-BMPT'!#REF!,IF(J123=39,'Equivalencia BH-BMPT'!$D$40,IF(J123=40,'Equivalencia BH-BMPT'!$D$41,IF(J123=41,'Equivalencia BH-BMPT'!$D$42,IF(J123=42,'Equivalencia BH-BMPT'!$D$43,IF(J123=43,'Equivalencia BH-BMPT'!$D$44,IF(J123=44,'Equivalencia BH-BMPT'!$D$45,IF(J123=45,'Equivalencia BH-BMPT'!$D$46,\"No ha seleccionado un número de programa\")))))))))))))))))))))))))))))))))))))))))))))","v":"Gobernanza e influencia local, regional e internacional"},1326,79949708,"ANDRES LEONARDO TRUJILLO DELGADILLO",16500000,null,null,0,0,16500000,0,"2017/10/05","2017/10/05",43104,90,102,null,null,"X",null,null,0,null,false]
[112,2017,"CO1.PCCNTR.212514",5,{"$f":"IF(D124=1,'Tipo '!$B$2,IF(D124=2,'Tipo '!$B$3,IF(D124=3,'Tipo '!$B$4,IF(D124=4,'Tipo '!$B$5,IF(D124=5,'Tipo '!$B$6,IF(D124=6,'Tipo '!$B$7,IF(D124=7,'Tipo '!$B$8,IF(D124=8,'Tipo '!$B$9,IF(D124=9,'Tipo '!$B$10,IF(D124=10,'Tipo '!$B$11,IF(D124=11,'Tipo '!$B$12,IF(D124=12,'Tipo '!$B$13,IF(D124=13,'Tipo '!$B$14,IF(D124=14,'Tipo '!$B$15,IF(D124=15,'Tipo '!$B$16,IF(D124=16,'Tipo '!$B$17,IF(D124=17,'Tipo '!$B$18,IF(D124=18,'Tipo '!$B$19,IF(D124=19,'Tipo '!$B$20,\"No ha seleccionado un tipo de contrato válido\")))))))))))))))))))","v":"CONTRATOS DE PRESTACIÓN DE SERVICIOS PROFESIONALES Y DE APOYO A LA GESTIÓN"},"Contratación directa","Prestación de servicios profesionales y de apoyo a la gestión, o para la ejecución de trabajos artísticos que sólo puedan encomendarse a determinadas personas naturales;","PRESTAR SERVICIOS DE APOYO AL ÁREA DE GESTIÓN DEL DESARROLLO LOCAL EN LO ATINENTE A LA ATENCIÓN AL CIUDADANO DE LA ALCALDÍA LOCAL DE SANTA FE","Inversión",45,{"$f":"IF(J124=1,'Equivalencia BH-BMPT'!$D$2,IF(J124=2,'Equivalencia BH-BMPT'!$D$3,IF(J124=3,'Equivalencia BH-BMPT'!$D$4,IF(J124=4,'Equivalencia BH-BMPT'!$D$5,IF(J124=5,'Equivalencia BH-BMPT'!$D$6,IF(J124=6,'Equivalencia BH-BMPT'!$D$7,IF(J124=7,'Equivalencia BH-BMPT'!$D$8,IF(J124=8,'Equivalencia BH-BMPT'!$D$9,IF(J124=9,'Equivalencia BH-BMPT'!$D$10,IF(J124=10,'Equivalencia BH-BMPT'!$D$11,IF(J124=11,'Equivalencia BH-BMPT'!$D$12,IF(J124=12,'Equivalencia BH-BMPT'!$D$13,IF(J124=13,'Equivalencia BH-BMPT'!$D$14,IF(J124=14,'Equivalencia BH-BMPT'!$D$15,IF(J124=15,'Equivalencia BH-BMPT'!$D$16,IF(J124=16,'Equivalencia BH-BMPT'!$D$17,IF(J124=17,'Equivalencia BH-BMPT'!$D$18,IF(J124=18,'Equivalencia BH-BMPT'!$D$19,IF(J124=19,'Equivalencia BH-BMPT'!$D$20,IF(J124=20,'Equivalencia BH-BMPT'!$D$21,IF(J124=21,'Equivalencia BH-BMPT'!$D$22,IF(J124=22,'Equivalencia BH-BMPT'!$D$23,IF(J124=23,'Equivalencia BH-BMPT'!#REF!,IF(J124=24,'Equivalencia BH-BMPT'!$D$25,IF(J124=25,'Equivalencia BH-BMPT'!$D$26,IF(J124=26,'Equivalencia BH-BMPT'!$D$27,IF(J124=27,'Equivalencia BH-BMPT'!$D$28,IF(J124=28,'Equivalencia BH-BMPT'!$D$29,IF(J124=29,'Equivalencia BH-BMPT'!$D$30,IF(J124=30,'Equivalencia BH-BMPT'!$D$31,IF(J124=31,'Equivalencia BH-BMPT'!$D$32,IF(J124=32,'Equivalencia BH-BMPT'!$D$33,IF(J124=33,'Equivalencia BH-BMPT'!$D$34,IF(J124=34,'Equivalencia BH-BMPT'!$D$35,IF(J124=35,'Equivalencia BH-BMPT'!$D$36,IF(J124=36,'Equivalencia BH-BMPT'!$D$37,IF(J124=37,'Equivalencia BH-BMPT'!$D$38,IF(J124=38,'Equivalencia BH-BMPT'!#REF!,IF(J124=39,'Equivalencia BH-BMPT'!$D$40,IF(J124=40,'Equivalencia BH-BMPT'!$D$41,IF(J124=41,'Equivalencia BH-BMPT'!$D$42,IF(J124=42,'Equivalencia BH-BMPT'!$D$43,IF(J124=43,'Equivalencia BH-BMPT'!$D$44,IF(J124=44,'Equivalencia BH-BMPT'!$D$45,IF(J124=45,'Equivalencia BH-BMPT'!$D$46,\"No ha seleccionado un número de programa\")))))))))))))))))))))))))))))))))))))))))))))","v":"Gobernanza e influencia local, regional e internacional"},1326,53072790,"ANGIE LOHE DIAZ MENDOZA",5525000,null,null,1,975000,6500000,4160000,"2017/10/06","2017-10-06",43100,85,103,null,null,"X",null,null,0.64,null,false]
[113,2017,"17-13-7123278",5,{"$f":"IF(D125=1,'Tipo '!$B$2,IF(D125=2,'Tipo '!$B$3,IF(D125=3,'Tipo '!$B$4,IF(D125=4,'Tipo '!$B$5,IF(D125=5,'Tipo '!$B$6,IF(D125=6,'Tipo '!$B$7,IF(D125=7,'Tipo '!$B$8,IF(D125=8,'Tipo '!$B$9,IF(D125=9,'Tipo '!$B$10,IF(D125=10,'Tipo '!$B$11,IF(D125=11,'Tipo '!$B$12,IF(D125=12,'Tipo '!$B$13,IF(D125=13,'Tipo '!$B$14,IF(D125=14,'Tipo '!$B$15,IF(D125=15,'Tipo '!$B$16,IF(D125=16,'Tipo '!$B$17,IF(D125=17,'Tipo '!$B$18,IF(D125=18,'Tipo '!$B$19,IF(D125=19,'Tipo '!$B$20,\"No ha seleccionado un tipo de contrato válido\")))))))))))))))))))","v":"CONTRATOS DE PRESTACIÓN DE SERVICIOS PROFESIONALES Y DE APOYO A LA GESTIÓN"},"Contratación directa","Prestación de servicios profesionales y de apoyo a la gestión, o para la ejecución de trabajos artísticos que sólo puedan encomendarse a determinadas personas naturales;","ADQUISICIÓN DE DOS (2) FIRMAS DIGITALES DURANTE DOS (2) AÑOS PARA LOS PROCESOS QUE SE REQUIERAN EN LAS APLICACIONES DE OPGET Y SIVICOF PARA EL FONDO DE DESARROLLO LOCAL DE SANTA FE”","Funcionamiento",0,{"$f":"IF(J125=1,'Equivalencia BH-BMPT'!$D$2,IF(J125=2,'Equivalencia BH-BMPT'!$D$3,IF(J125=3,'Equivalencia BH-BMPT'!$D$4,IF(J125=4,'Equivalencia BH-BMPT'!$D$5,IF(J125=5,'Equivalencia BH-BMPT'!$D$6,IF(J125=6,'Equivalencia BH-BMPT'!$D$7,IF(J125=7,'Equivalencia BH-BMPT'!$D$8,IF(J125=8,'Equivalencia BH-BMPT'!$D$9,IF(J125=9,'Equivalencia BH-BMPT'!$D$10,IF(J125=10,'Equivalencia BH-BMPT'!$D$11,IF(J125=11,'Equivalencia BH-BMPT'!$D$12,IF(J125=12,'Equivalencia BH-BMPT'!$D$13,IF(J125=13,'Equivalencia BH-BMPT'!$D$14,IF(J125=14,'Equivalencia BH-BMPT'!$D$15,IF(J125=15,'Equivalencia BH-BMPT'!$D$16,IF(J125=16,'Equivalencia BH-BMPT'!$D$17,IF(J125=17,'Equivalencia BH-BMPT'!$D$18,IF(J125=18,'Equivalencia BH-BMPT'!$D$19,IF(J125=19,'Equivalencia BH-BMPT'!$D$20,IF(J125=20,'Equivalencia BH-BMPT'!$D$21,IF(J125=21,'Equivalencia BH-BMPT'!$D$22,IF(J125=22,'Equivalencia BH-BMPT'!$D$23,IF(J125=23,'Equivalencia BH-BMPT'!#REF!,IF(J125=24,'Equivalencia BH-BMPT'!$D$25,IF(J125=25,'Equivalencia BH-BMPT'!$D$26,IF(J125=26,'Equivalencia BH-BMPT'!$D$27,IF(J125=27,'Equivalencia BH-BMPT'!$D$28,IF(J125=28,'Equivalencia BH-BMPT'!$D$29,IF(J125=29,'Equivalencia BH-BMPT'!$D$30,IF(J125=30,'Equivalencia BH-BMPT'!$D$31,IF(J125=31,'Equivalencia BH-BMPT'!$D$32,IF(J125=32,'Equivalencia BH-BMPT'!$D$33,IF(J125=33,'Equivalencia BH-BMPT'!$D$34,IF(J125=34,'Equivalencia BH-BMPT'!$D$35,IF(J125=35,'Equivalencia BH-BMPT'!$D$36,IF(J125=36,'Equivalencia BH-BMPT'!$D$37,IF(J125=37,'Equivalencia BH-BMPT'!$D$38,IF(J125=38,'Equivalencia BH-BMPT'!#REF!,IF(J125=39,'Equivalencia BH-BMPT'!$D$40,IF(J125=40,'Equivalencia BH-BMPT'!$D$41,IF(J125=41,'Equivalencia BH-BMPT'!$D$42,IF(J125=42,'Equivalencia BH-BMPT'!$D$43,IF(J125=43,'Equivalencia BH-BMPT'!$D$44,IF(J125=44,'Equivalencia BH-BMPT'!$D$45,IF(J125=45,'Equivalencia BH-BMPT'!$D$46,\"No ha seleccionado un número de programa\")))))))))))))))))))))))))))))))))))))))))))))","v":"No ha seleccionado un número de programa"},0,79942771,"HECTOR JOSE GARCIA SANTIAGO",714000,null,null,0,0,714000,0,"2017/10/06","2017/10/06",43044,30,104,null,null,"X",null,null,0,null,true]
[114,2017,"17-13-7125021",5,{"$f":"IF(D126=1,'Tipo '!$B$2,IF(D126=2,'Tipo '!$B$3,IF(D126=3,'Tipo '!$B$4,IF(D126=4,'Tipo '!$B$5,IF(D126=5,'Tipo '!$B$6,IF(D126=6,'Tipo '!$B$7,IF(D126=7,'Tipo '!$B$8,IF(D126=8,'Tipo '!$B$9,IF(D126=9,'Tipo '!$B$10,IF(D126=10,'Tipo '!$B$11,IF(D126=11,'Tipo '!$B$12,IF(D126=12,'Tipo '!$B$13,IF(D126=13,'Tipo '!$B$14,IF(D126=14,'Tipo '!$B$15,IF(D126=15,'Tipo '!$B$16,IF(D126=16,'Tipo '!$B$17,IF(D126=17,'Tipo '!$B$18,IF(D126=18,'Tipo '!$B$19,IF(D126=19,'Tipo '!$B$20,\"No ha seleccionado un tipo de contrato válido\")))))))))))))))))))","v":"CONTRATOS DE PRESTACIÓN DE SERVICIOS PROFESIONALES Y DE APOYO A LA GESTIÓN"},"Contratación directa","Prestación de servicios profesionales y de apoyo a la gestión, o para la ejecución de trabajos artísticos que sólo puedan encomendarse a determinadas personas naturales;","EL CONTRATISTA SE OBLIGA CON EL FONDO DE DESARROLLO LOCAL DE SANTA FE A PRESTAR EL SERVICIO DE MANTENIMIENTO PREVENTIVO Y CORRECTIVO CON BOLSA DE REPUESTOS A LAS PLANTAS ELÉCTRICAS, GRUPO ELECTRÓGENO, EQUIPO DE BOMBEO,  MOTOBOMBAS Y BOMBAS DE PROPIEDAD DE LA ALCALDÍA LOCAL DE SANTA FE”.","Funcionamiento",1,{"$f":"IF(J126=1,'Equivalencia BH-BMPT'!$D$2,IF(J126=2,'Equivalencia BH-BMPT'!$D$3,IF(J126=3,'Equivalencia BH-BMPT'!$D$4,IF(J126=4,'Equivalencia BH-BMPT'!$D$5,IF(J126=5,'Equivalencia BH-BMPT'!$D$6,IF(J126=6,'Equivalencia BH-BMPT'!$D$7,IF(J126=7,'Equivalencia BH-BMPT'!$D$8,IF(J126=8,'Equivalencia BH-BMPT'!$D$9,IF(J126=9,'Equivalencia BH-BMPT'!$D$10,IF(J126=10,'Equivalencia BH-BMPT'!$D$11,IF(J126=11,'Equivalencia BH-BMPT'!$D$12,IF(J126=12,'Equivalencia BH-BMPT'!$D$13,IF(J126=13,'Equivalencia BH-BMPT'!$D$14,IF(J126=14,'Equivalencia BH-BMPT'!$D$15,IF(J126=15,'Equivalencia BH-BMPT'!$D$16,IF(J126=16,'Equivalencia BH-BMPT'!$D$17,IF(J126=17,'Equivalencia BH-BMPT'!$D$18,IF(J126=18,'Equivalencia BH-BMPT'!$D$19,IF(J126=19,'Equivalencia BH-BMPT'!$D$20,IF(J126=20,'Equivalencia BH-BMPT'!$D$21,IF(J126=21,'Equivalencia BH-BMPT'!$D$22,IF(J126=22,'Equivalencia BH-BMPT'!$D$23,IF(J126=23,'Equivalencia BH-BMPT'!#REF!,IF(J126=24,'Equivalencia BH-BMPT'!$D$25,IF(J126=25,'Equivalencia BH-BMPT'!$D$26,IF(J126=26,'Equivalencia BH-BMPT'!$D$27,IF(J126=27,'Equivalencia BH-BMPT'!$D$28,IF(J126=28,'Equivalencia BH-BMPT'!$D$29,IF(J126=29,'Equivalencia BH-BMPT'!$D$30,IF(J126=30,'Equivalencia BH-BMPT'!$D$31,IF(J126=31,'Equivalencia BH-BMPT'!$D$32,IF(J126=32,'Equivalencia BH-BMPT'!$D$33,IF(J126=33,'Equivalencia BH-BMPT'!$D$34,IF(J126=34,'Equivalencia BH-BMPT'!$D$35,IF(J126=35,'Equivalencia BH-BMPT'!$D$36,IF(J126=36,'Equivalencia BH-BMPT'!$D$37,IF(J126=37,'Equivalencia BH-BMPT'!$D$38,IF(J126=38,'Equivalencia BH-BMPT'!#REF!,IF(J126=39,'Equivalencia BH-BMPT'!$D$40,IF(J126=40,'Equivalencia BH-BMPT'!$D$41,IF(J126=41,'Equivalencia BH-BMPT'!$D$42,IF(J126=42,'Equivalencia BH-BMPT'!$D$43,IF(J126=43,'Equivalencia BH-BMPT'!$D$44,IF(J126=44,'Equivalencia BH-BMPT'!$D$45,IF(J126=45,'Equivalencia BH-BMPT'!$D$46,\"No ha seleccionado un número de programa\")))))))))))))))))))))))))))))))))))))))))))))","v":"Prevención y atención de la maternidad y la paternidad tempranas"},0,900757560,"REPARACION Y SERVICIO TECNICO EMPRESARIAL SAS RYSTE",3935275,null,null,0,0,3935275,714000,"2017/10/10","2017/10/10",43199,180,105,null,"X",null,null,null,0.18143585899333592,null,false]
[115,2017,"17-13-7104073",6,{"$f":"IF(D127=1,'Tipo '!$B$2,IF(D127=2,'Tipo '!$B$3,IF(D127=3,'Tipo '!$B$4,IF(D127=4,'Tipo '!$B$5,IF(D127=5,'Tipo '!$B$6,IF(D127=6,'Tipo '!$B$7,IF(D127=7,'Tipo '!$B$8,IF(D127=8,'Tipo '!$B$9,IF(D127=9,'Tipo '!$B$10,IF(D127=10,'Tipo '!$B$11,IF(D127=11,'Tipo '!$B$12,IF(D127=12,'Tipo '!$B$13,IF(D127=13,'Tipo '!$B$14,IF(D127=14,'Tipo '!$B$15,IF(D127=15,'Tipo '!$B$16,IF(D127=16,'Tipo '!$B$17,IF(D127=17,'Tipo '!$B$18,IF(D127=18,'Tipo '!$B$19,IF(D127=19,'Tipo '!$B$20,\"No ha seleccionado un tipo de contrato válido\")))))))))))))))))))","v":"COMPRAVENTA DE BIENES MUEBLES"},"Contratación mínima cuantia ","No aplica","PRESTAR LOS SERVICIOS PROFESIONALES DE INTERVENTORIA TÉCNICA, ADMINISTRATIVA. FINANCIERA Y JURIDICA, A LOS CONTRATOS QUE TIENEN COMO OBJETO “PRESTAR SERVICIOS PARA LA REALIZACIÓN DE ESCUELAS DE FORMACIÓN DEPORTIVAS DIRIGIDAS A LAS DIFERENTES POBLACIONES DE LA LOCALIDAD DE SANTAFÉ.” y “PRESTAR LOS SERVICIOS PARA EJECUTAR LAS ACTIVIDADES DE ACONDICIONAMIENTO FÍSICO DIRIGIDO A LA POBLACIÓN PERSONA MAYOR RESIDENTES EN LA LOCALIDAD DE SANTA FE, EN MARCO DEL PROYECTO 1318 ¨UNA LOCALIDAD ARTÍSTICA, DEPORTIVA, CULTURAL Y VITAL PARA TODOS”","Inversión",11,{"$f":"IF(J127=1,'Equivalencia BH-BMPT'!$D$2,IF(J127=2,'Equivalencia BH-BMPT'!$D$3,IF(J127=3,'Equivalencia BH-BMPT'!$D$4,IF(J127=4,'Equivalencia BH-BMPT'!$D$5,IF(J127=5,'Equivalencia BH-BMPT'!$D$6,IF(J127=6,'Equivalencia BH-BMPT'!$D$7,IF(J127=7,'Equivalencia BH-BMPT'!$D$8,IF(J127=8,'Equivalencia BH-BMPT'!$D$9,IF(J127=9,'Equivalencia BH-BMPT'!$D$10,IF(J127=10,'Equivalencia BH-BMPT'!$D$11,IF(J127=11,'Equivalencia BH-BMPT'!$D$12,IF(J127=12,'Equivalencia BH-BMPT'!$D$13,IF(J127=13,'Equivalencia BH-BMPT'!$D$14,IF(J127=14,'Equivalencia BH-BMPT'!$D$15,IF(J127=15,'Equivalencia BH-BMPT'!$D$16,IF(J127=16,'Equivalencia BH-BMPT'!$D$17,IF(J127=17,'Equivalencia BH-BMPT'!$D$18,IF(J127=18,'Equivalencia BH-BMPT'!$D$19,IF(J127=19,'Equivalencia BH-BMPT'!$D$20,IF(J127=20,'Equivalencia BH-BMPT'!$D$21,IF(J127=21,'Equivalencia BH-BMPT'!$D$22,IF(J127=22,'Equivalencia BH-BMPT'!$D$23,IF(J127=23,'Equivalencia BH-BMPT'!#REF!,IF(J127=24,'Equivalencia BH-BMPT'!$D$25,IF(J127=25,'Equivalencia BH-BMPT'!$D$26,IF(J127=26,'Equivalencia BH-BMPT'!$D$27,IF(J127=27,'Equivalencia BH-BMPT'!$D$28,IF(J127=28,'Equivalencia BH-BMPT'!$D$29,IF(J127=29,'Equivalencia BH-BMPT'!$D$30,IF(J127=30,'Equivalencia BH-BMPT'!$D$31,IF(J127=31,'Equivalencia BH-BMPT'!$D$32,IF(J127=32,'Equivalencia BH-BMPT'!$D$33,IF(J127=33,'Equivalencia BH-BMPT'!$D$34,IF(J127=34,'Equivalencia BH-BMPT'!$D$35,IF(J127=35,'Equivalencia BH-BMPT'!$D$36,IF(J127=36,'Equivalencia BH-BMPT'!$D$37,IF(J127=37,'Equivalencia BH-BMPT'!$D$38,IF(J127=38,'Equivalencia BH-BMPT'!#REF!,IF(J127=39,'Equivalencia BH-BMPT'!$D$40,IF(J127=40,'Equivalencia BH-BMPT'!$D$41,IF(J127=41,'Equivalencia BH-BMPT'!$D$42,IF(J127=42,'Equivalencia BH-BMPT'!$D$43,IF(J127=43,'Equivalencia BH-BMPT'!$D$44,IF(J127=44,'Equivalencia BH-BMPT'!$D$45,IF(J127=45,'Equivalencia BH-BMPT'!$D$46,\"No ha seleccionado un número de programa\")))))))))))))))))))))))))))))))))))))))))))))","v":"Mejores oportunidades para el desarrollo a través de la cultura, la recreación y el deporte"},1318,80220338,"FRANCISCO ALBERTO ROZO TORRES",11550000,null,null,0,0,11550000,0,"2017/10/09","2017/10/09",43228,210,106,null,null,"X",null,null,0,null,false]
[116,2017,"17-13-7104000",4,{"$f":"IF(D128=1,'Tipo '!$B$2,IF(D128=2,'Tipo '!$B$3,IF(D128=3,'Tipo '!$B$4,IF(D128=4,'Tipo '!$B$5,IF(D128=5,'Tipo '!$B$6,IF(D128=6,'Tipo '!$B$7,IF(D128=7,'Tipo '!$B$8,IF(D128=8,'Tipo '!$B$9,IF(D128=9,'Tipo '!$B$10,IF(D128=10,'Tipo '!$B$11,IF(D128=11,'Tipo '!$B$12,IF(D128=12,'Tipo '!$B$13,IF(D128=13,'Tipo '!$B$14,IF(D128=14,'Tipo '!$B$15,IF(D128=15,'Tipo '!$B$16,IF(D128=16,'Tipo '!$B$17,IF(D128=17,'Tipo '!$B$18,IF(D128=18,'Tipo '!$B$19,IF(D128=19,'Tipo '!$B$20,\"No ha seleccionado un tipo de contrato válido\")))))))))))))))))))","v":"CONTRATOS DE PRESTACIÓN DE SERVICIOS"},"Contratación mínima cuantia ","No aplica","PRESTAR LOS SERVICIOS PROFESIONALES DE INTERVENTORIA TÉCNICA, ADMINISTRATIVA. FINANCIERA, CONTABLE, SOCIAL, JURÍDICA Y AMBIENTAL, AL CONTRATO QUE TIENE COMO OBJETO “Realizar actividades que promuevan la conformación de espacios de participación ciudadana incidente de los habitantes de la localidad de Santa Fe, interesados en la gestión de los diferentes procesos del desarrollo local, en el marco del proyecto no. 1327 denominado Voz Para Todos”.","Inversión",45,{"$f":"IF(J128=1,'Equivalencia BH-BMPT'!$D$2,IF(J128=2,'Equivalencia BH-BMPT'!$D$3,IF(J128=3,'Equivalencia BH-BMPT'!$D$4,IF(J128=4,'Equivalencia BH-BMPT'!$D$5,IF(J128=5,'Equivalencia BH-BMPT'!$D$6,IF(J128=6,'Equivalencia BH-BMPT'!$D$7,IF(J128=7,'Equivalencia BH-BMPT'!$D$8,IF(J128=8,'Equivalencia BH-BMPT'!$D$9,IF(J128=9,'Equivalencia BH-BMPT'!$D$10,IF(J128=10,'Equivalencia BH-BMPT'!$D$11,IF(J128=11,'Equivalencia BH-BMPT'!$D$12,IF(J128=12,'Equivalencia BH-BMPT'!$D$13,IF(J128=13,'Equivalencia BH-BMPT'!$D$14,IF(J128=14,'Equivalencia BH-BMPT'!$D$15,IF(J128=15,'Equivalencia BH-BMPT'!$D$16,IF(J128=16,'Equivalencia BH-BMPT'!$D$17,IF(J128=17,'Equivalencia BH-BMPT'!$D$18,IF(J128=18,'Equivalencia BH-BMPT'!$D$19,IF(J128=19,'Equivalencia BH-BMPT'!$D$20,IF(J128=20,'Equivalencia BH-BMPT'!$D$21,IF(J128=21,'Equivalencia BH-BMPT'!$D$22,IF(J128=22,'Equivalencia BH-BMPT'!$D$23,IF(J128=23,'Equivalencia BH-BMPT'!#REF!,IF(J128=24,'Equivalencia BH-BMPT'!$D$25,IF(J128=25,'Equivalencia BH-BMPT'!$D$26,IF(J128=26,'Equivalencia BH-BMPT'!$D$27,IF(J128=27,'Equivalencia BH-BMPT'!$D$28,IF(J128=28,'Equivalencia BH-BMPT'!$D$29,IF(J128=29,'Equivalencia BH-BMPT'!$D$30,IF(J128=30,'Equivalencia BH-BMPT'!$D$31,IF(J128=31,'Equivalencia BH-BMPT'!$D$32,IF(J128=32,'Equivalencia BH-BMPT'!$D$33,IF(J128=33,'Equivalencia BH-BMPT'!$D$34,IF(J128=34,'Equivalencia BH-BMPT'!$D$35,IF(J128=35,'Equivalencia BH-BMPT'!$D$36,IF(J128=36,'Equivalencia BH-BMPT'!$D$37,IF(J128=37,'Equivalencia BH-BMPT'!$D$38,IF(J128=38,'Equivalencia BH-BMPT'!#REF!,IF(J128=39,'Equivalencia BH-BMPT'!$D$40,IF(J128=40,'Equivalencia BH-BMPT'!$D$41,IF(J128=41,'Equivalencia BH-BMPT'!$D$42,IF(J128=42,'Equivalencia BH-BMPT'!$D$43,IF(J128=43,'Equivalencia BH-BMPT'!$D$44,IF(J128=44,'Equivalencia BH-BMPT'!$D$45,IF(J128=45,'Equivalencia BH-BMPT'!$D$46,\"No ha seleccionado un número de programa\")))))))))))))))))))))))))))))))))))))))))))))","v":"Gobernanza e influencia local, regional e internacional"},1327,900347030,"CORPORACION DE DESARROLLO SOSTENIBLE ELITE",14100000,null,null,0,0,14100000,0,"2017/10/09","2017/10/09",43320,300,107,null,"X",null,null,null,0,null,false]
[117,2017,"17-13-7103521",3,{"$f":"IF(D129=1,'Tipo '!$B$2,IF(D129=2,'Tipo '!$B$3,IF(D129=3,'Tipo '!$B$4,IF(D129=4,'Tipo '!$B$5,IF(D129=5,'Tipo '!$B$6,IF(D129=6,'Tipo '!$B$7,IF(D129=7,'Tipo '!$B$8,IF(D129=8,'Tipo '!$B$9,IF(D129=9,'Tipo '!$B$10,IF(D129=10,'Tipo '!$B$11,IF(D129=11,'Tipo '!$B$12,IF(D129=12,'Tipo '!$B$13,IF(D129=13,'Tipo '!$B$14,IF(D129=14,'Tipo '!$B$15,IF(D129=15,'Tipo '!$B$16,IF(D129=16,'Tipo '!$B$17,IF(D129=17,'Tipo '!$B$18,IF(D129=18,'Tipo '!$B$19,IF(D129=19,'Tipo '!$B$20,\"No ha seleccionado un tipo de contrato válido\")))))))))))))))))))","v":"INTERVENTORÍA"},"Contratación mínima cuantia ","No aplica","PRESTAR LOS SERVICIOS DE AUDITORIA TECNICA, ADMINISTRATIVA, FINANCIERA, CONTABLE, SOCIAL, JURIDICA Y AMBIENTAL AL CONTRATO QUE TIEN POR OBJETO \"PRESTAR EL SERVICIO DE ACTIVIDADES DE SOCIALIZACION DE LA LEY 1801 DE 2016 \"CODIGO NACIONAL DE POLICIA\" EN EL MARCO DEL PROYECTO 1323 SATA FE TERRITORIO SEGURO\"","Inversión",19,{"$f":"IF(J129=1,'Equivalencia BH-BMPT'!$D$2,IF(J129=2,'Equivalencia BH-BMPT'!$D$3,IF(J129=3,'Equivalencia BH-BMPT'!$D$4,IF(J129=4,'Equivalencia BH-BMPT'!$D$5,IF(J129=5,'Equivalencia BH-BMPT'!$D$6,IF(J129=6,'Equivalencia BH-BMPT'!$D$7,IF(J129=7,'Equivalencia BH-BMPT'!$D$8,IF(J129=8,'Equivalencia BH-BMPT'!$D$9,IF(J129=9,'Equivalencia BH-BMPT'!$D$10,IF(J129=10,'Equivalencia BH-BMPT'!$D$11,IF(J129=11,'Equivalencia BH-BMPT'!$D$12,IF(J129=12,'Equivalencia BH-BMPT'!$D$13,IF(J129=13,'Equivalencia BH-BMPT'!$D$14,IF(J129=14,'Equivalencia BH-BMPT'!$D$15,IF(J129=15,'Equivalencia BH-BMPT'!$D$16,IF(J129=16,'Equivalencia BH-BMPT'!$D$17,IF(J129=17,'Equivalencia BH-BMPT'!$D$18,IF(J129=18,'Equivalencia BH-BMPT'!$D$19,IF(J129=19,'Equivalencia BH-BMPT'!$D$20,IF(J129=20,'Equivalencia BH-BMPT'!$D$21,IF(J129=21,'Equivalencia BH-BMPT'!$D$22,IF(J129=22,'Equivalencia BH-BMPT'!$D$23,IF(J129=23,'Equivalencia BH-BMPT'!#REF!,IF(J129=24,'Equivalencia BH-BMPT'!$D$25,IF(J129=25,'Equivalencia BH-BMPT'!$D$26,IF(J129=26,'Equivalencia BH-BMPT'!$D$27,IF(J129=27,'Equivalencia BH-BMPT'!$D$28,IF(J129=28,'Equivalencia BH-BMPT'!$D$29,IF(J129=29,'Equivalencia BH-BMPT'!$D$30,IF(J129=30,'Equivalencia BH-BMPT'!$D$31,IF(J129=31,'Equivalencia BH-BMPT'!$D$32,IF(J129=32,'Equivalencia BH-BMPT'!$D$33,IF(J129=33,'Equivalencia BH-BMPT'!$D$34,IF(J129=34,'Equivalencia BH-BMPT'!$D$35,IF(J129=35,'Equivalencia BH-BMPT'!$D$36,IF(J129=36,'Equivalencia BH-BMPT'!$D$37,IF(J129=37,'Equivalencia BH-BMPT'!$D$38,IF(J129=38,'Equivalencia BH-BMPT'!#REF!,IF(J129=39,'Equivalencia BH-BMPT'!$D$40,IF(J129=40,'Equivalencia BH-BMPT'!$D$41,IF(J129=41,'Equivalencia BH-BMPT'!$D$42,IF(J129=42,'Equivalencia BH-BMPT'!$D$43,IF(J129=43,'Equivalencia BH-BMPT'!$D$44,IF(J129=44,'Equivalencia BH-BMPT'!$D$45,IF(J129=45,'Equivalencia BH-BMPT'!$D$46,\"No ha seleccionado un número de programa\")))))))))))))))))))))))))))))))))))))))))))))","v":"Seguridad y convivencia para todos"},1323,900072040,"CORPORACION PARA EL MEJORAMIENTO DE LA CALIDAD DE VIDA CORMECAV",11200000,null,null,0,0,11200000,2240000,"2017/10/09","2017/10/09",43167,150,108,null,"X",null,null,null,0.2,null,false]
[118,2017,"CO1.PCCNTR.216207",3,{"$f":"IF(D130=1,'Tipo '!$B$2,IF(D130=2,'Tipo '!$B$3,IF(D130=3,'Tipo '!$B$4,IF(D130=4,'Tipo '!$B$5,IF(D130=5,'Tipo '!$B$6,IF(D130=6,'Tipo '!$B$7,IF(D130=7,'Tipo '!$B$8,IF(D130=8,'Tipo '!$B$9,IF(D130=9,'Tipo '!$B$10,IF(D130=10,'Tipo '!$B$11,IF(D130=11,'Tipo '!$B$12,IF(D130=12,'Tipo '!$B$13,IF(D130=13,'Tipo '!$B$14,IF(D130=14,'Tipo '!$B$15,IF(D130=15,'Tipo '!$B$16,IF(D130=16,'Tipo '!$B$17,IF(D130=17,'Tipo '!$B$18,IF(D130=18,'Tipo '!$B$19,IF(D130=19,'Tipo '!$B$20,\"No ha seleccionado un tipo de contrato válido\")))))))))))))))))))","v":"INTERVENTORÍA"},"Contratación mínima cuantia ","No aplica","PRESTAR SERVICIOS PROFESIONALES APOYANDO TÉCNICAMENTE LAS DISTINTAS ETAPAS DE LOS PROCESOS DE COMPETENCIA DE LAS INSPECCIONES DE POLICÍA DE LA LOCALIDAD DE SANTA FE”.","Inversión",45,{"$f":"IF(J130=1,'Equivalencia BH-BMPT'!$D$2,IF(J130=2,'Equivalencia BH-BMPT'!$D$3,IF(J130=3,'Equivalencia BH-BMPT'!$D$4,IF(J130=4,'Equivalencia BH-BMPT'!$D$5,IF(J130=5,'Equivalencia BH-BMPT'!$D$6,IF(J130=6,'Equivalencia BH-BMPT'!$D$7,IF(J130=7,'Equivalencia BH-BMPT'!$D$8,IF(J130=8,'Equivalencia BH-BMPT'!$D$9,IF(J130=9,'Equivalencia BH-BMPT'!$D$10,IF(J130=10,'Equivalencia BH-BMPT'!$D$11,IF(J130=11,'Equivalencia BH-BMPT'!$D$12,IF(J130=12,'Equivalencia BH-BMPT'!$D$13,IF(J130=13,'Equivalencia BH-BMPT'!$D$14,IF(J130=14,'Equivalencia BH-BMPT'!$D$15,IF(J130=15,'Equivalencia BH-BMPT'!$D$16,IF(J130=16,'Equivalencia BH-BMPT'!$D$17,IF(J130=17,'Equivalencia BH-BMPT'!$D$18,IF(J130=18,'Equivalencia BH-BMPT'!$D$19,IF(J130=19,'Equivalencia BH-BMPT'!$D$20,IF(J130=20,'Equivalencia BH-BMPT'!$D$21,IF(J130=21,'Equivalencia BH-BMPT'!$D$22,IF(J130=22,'Equivalencia BH-BMPT'!$D$23,IF(J130=23,'Equivalencia BH-BMPT'!#REF!,IF(J130=24,'Equivalencia BH-BMPT'!$D$25,IF(J130=25,'Equivalencia BH-BMPT'!$D$26,IF(J130=26,'Equivalencia BH-BMPT'!$D$27,IF(J130=27,'Equivalencia BH-BMPT'!$D$28,IF(J130=28,'Equivalencia BH-BMPT'!$D$29,IF(J130=29,'Equivalencia BH-BMPT'!$D$30,IF(J130=30,'Equivalencia BH-BMPT'!$D$31,IF(J130=31,'Equivalencia BH-BMPT'!$D$32,IF(J130=32,'Equivalencia BH-BMPT'!$D$33,IF(J130=33,'Equivalencia BH-BMPT'!$D$34,IF(J130=34,'Equivalencia BH-BMPT'!$D$35,IF(J130=35,'Equivalencia BH-BMPT'!$D$36,IF(J130=36,'Equivalencia BH-BMPT'!$D$37,IF(J130=37,'Equivalencia BH-BMPT'!$D$38,IF(J130=38,'Equivalencia BH-BMPT'!#REF!,IF(J130=39,'Equivalencia BH-BMPT'!$D$40,IF(J130=40,'Equivalencia BH-BMPT'!$D$41,IF(J130=41,'Equivalencia BH-BMPT'!$D$42,IF(J130=42,'Equivalencia BH-BMPT'!$D$43,IF(J130=43,'Equivalencia BH-BMPT'!$D$44,IF(J130=44,'Equivalencia BH-BMPT'!$D$45,IF(J130=45,'Equivalencia BH-BMPT'!$D$46,\"No ha seleccionado un número de programa\")))))))))))))))))))))))))))))))))))))))))))))","v":"Gobernanza e influencia local, regional e internacional"},1326,79969466,"IVAN ARTURO VARGAS CUELLAR",15269166,null,null,0,0,15269166,10667500,"2017/10/18","2017-10-19",43100,72,109,null,null,"X",null,null,0.69863016748917395,null,false]
[119,2017,"17-12-7209045",3,{"$f":"IF(D131=1,'Tipo '!$B$2,IF(D131=2,'Tipo '!$B$3,IF(D131=3,'Tipo '!$B$4,IF(D131=4,'Tipo '!$B$5,IF(D131=5,'Tipo '!$B$6,IF(D131=6,'Tipo '!$B$7,IF(D131=7,'Tipo '!$B$8,IF(D131=8,'Tipo '!$B$9,IF(D131=9,'Tipo '!$B$10,IF(D131=10,'Tipo '!$B$11,IF(D131=11,'Tipo '!$B$12,IF(D131=12,'Tipo '!$B$13,IF(D131=13,'Tipo '!$B$14,IF(D131=14,'Tipo '!$B$15,IF(D131=15,'Tipo '!$B$16,IF(D131=16,'Tipo '!$B$17,IF(D131=17,'Tipo '!$B$18,IF(D131=18,'Tipo '!$B$19,IF(D131=19,'Tipo '!$B$20,\"No ha seleccionado un tipo de contrato válido\")))))))))))))))))))","v":"INTERVENTORÍA"},"Contratación mínima cuantia ","No aplica","PRESTAR SERVICIOS PROFESIONALES COMO ORGANISMO ASESOR DEL CONCURSO PUBLICO DE ARQUITECTURA NE LOS TERMINOS DEL DECRETO 1082 ARTICULO 2.2.1.2.1.3.8 Y SS","Inversión",45,{"$f":"IF(J131=1,'Equivalencia BH-BMPT'!$D$2,IF(J131=2,'Equivalencia BH-BMPT'!$D$3,IF(J131=3,'Equivalencia BH-BMPT'!$D$4,IF(J131=4,'Equivalencia BH-BMPT'!$D$5,IF(J131=5,'Equivalencia BH-BMPT'!$D$6,IF(J131=6,'Equivalencia BH-BMPT'!$D$7,IF(J131=7,'Equivalencia BH-BMPT'!$D$8,IF(J131=8,'Equivalencia BH-BMPT'!$D$9,IF(J131=9,'Equivalencia BH-BMPT'!$D$10,IF(J131=10,'Equivalencia BH-BMPT'!$D$11,IF(J131=11,'Equivalencia BH-BMPT'!$D$12,IF(J131=12,'Equivalencia BH-BMPT'!$D$13,IF(J131=13,'Equivalencia BH-BMPT'!$D$14,IF(J131=14,'Equivalencia BH-BMPT'!$D$15,IF(J131=15,'Equivalencia BH-BMPT'!$D$16,IF(J131=16,'Equivalencia BH-BMPT'!$D$17,IF(J131=17,'Equivalencia BH-BMPT'!$D$18,IF(J131=18,'Equivalencia BH-BMPT'!$D$19,IF(J131=19,'Equivalencia BH-BMPT'!$D$20,IF(J131=20,'Equivalencia BH-BMPT'!$D$21,IF(J131=21,'Equivalencia BH-BMPT'!$D$22,IF(J131=22,'Equivalencia BH-BMPT'!$D$23,IF(J131=23,'Equivalencia BH-BMPT'!#REF!,IF(J131=24,'Equivalencia BH-BMPT'!$D$25,IF(J131=25,'Equivalencia BH-BMPT'!$D$26,IF(J131=26,'Equivalencia BH-BMPT'!$D$27,IF(J131=27,'Equivalencia BH-BMPT'!$D$28,IF(J131=28,'Equivalencia BH-BMPT'!$D$29,IF(J131=29,'Equivalencia BH-BMPT'!$D$30,IF(J131=30,'Equivalencia BH-BMPT'!$D$31,IF(J131=31,'Equivalencia BH-BMPT'!$D$32,IF(J131=32,'Equivalencia BH-BMPT'!$D$33,IF(J131=33,'Equivalencia BH-BMPT'!$D$34,IF(J131=34,'Equivalencia BH-BMPT'!$D$35,IF(J131=35,'Equivalencia BH-BMPT'!$D$36,IF(J131=36,'Equivalencia BH-BMPT'!$D$37,IF(J131=37,'Equivalencia BH-BMPT'!$D$38,IF(J131=38,'Equivalencia BH-BMPT'!#REF!,IF(J131=39,'Equivalencia BH-BMPT'!$D$40,IF(J131=40,'Equivalencia BH-BMPT'!$D$41,IF(J131=41,'Equivalencia BH-BMPT'!$D$42,IF(J131=42,'Equivalencia BH-BMPT'!$D$43,IF(J131=43,'Equivalencia BH-BMPT'!$D$44,IF(J131=44,'Equivalencia BH-BMPT'!$D$45,IF(J131=45,'Equivalencia BH-BMPT'!$D$46,\"No ha seleccionado un número de programa\")))))))))))))))))))))))))))))))))))))))))))))","v":"Gobernanza e influencia local, regional e internacional"},1326,860029120,"SOCIEDAD COLOMBIANA DE ARQUITECTOS BOGOTA DC Y CUNDINAMARCA",456124149,null,null,1,0,456124149,42506800,"2017/10/23","2017/10/23",43181,150,110,null,null,"X",null,null,9.3191294723577553E-2,null,false]
[120,2017,"CO1.PCCNTR.219207",5,{"$f":"IF(D132=1,'Tipo '!$B$2,IF(D132=2,'Tipo '!$B$3,IF(D132=3,'Tipo '!$B$4,IF(D132=4,'Tipo '!$B$5,IF(D132=5,'Tipo '!$B$6,IF(D132=6,'Tipo '!$B$7,IF(D132=7,'Tipo '!$B$8,IF(D132=8,'Tipo '!$B$9,IF(D132=9,'Tipo '!$B$10,IF(D132=10,'Tipo '!$B$11,IF(D132=11,'Tipo '!$B$12,IF(D132=12,'Tipo '!$B$13,IF(D132=13,'Tipo '!$B$14,IF(D132=14,'Tipo '!$B$15,IF(D132=15,'Tipo '!$B$16,IF(D132=16,'Tipo '!$B$17,IF(D132=17,'Tipo '!$B$18,IF(D132=18,'Tipo '!$B$19,IF(D132=19,'Tipo '!$B$20,\"No ha seleccionado un tipo de contrato válido\")))))))))))))))))))","v":"CONTRATOS DE PRESTACIÓN DE SERVICIOS PROFESIONALES Y DE APOYO A LA GESTIÓN"},"Contratación directa","Prestación de servicios profesionales y de apoyo a la gestión, o para la ejecución de trabajos artísticos que sólo puedan encomendarse a determinadas personas naturales;","REALIZAR CONSULTORÍA TÉCNICA, SOCIAL Y JURÍDICA PARA ADELANTAR PROCESOS DE TITULACIÓN DE PREDIOS EN LA LOCALIDAD DE SANTA FE, EN MARCO DEL PROYECTO 1319. SANTA FE TERRITORIO LEGAL.","Inversión",15,{"$f":"IF(J132=1,'Equivalencia BH-BMPT'!$D$2,IF(J132=2,'Equivalencia BH-BMPT'!$D$3,IF(J132=3,'Equivalencia BH-BMPT'!$D$4,IF(J132=4,'Equivalencia BH-BMPT'!$D$5,IF(J132=5,'Equivalencia BH-BMPT'!$D$6,IF(J132=6,'Equivalencia BH-BMPT'!$D$7,IF(J132=7,'Equivalencia BH-BMPT'!$D$8,IF(J132=8,'Equivalencia BH-BMPT'!$D$9,IF(J132=9,'Equivalencia BH-BMPT'!$D$10,IF(J132=10,'Equivalencia BH-BMPT'!$D$11,IF(J132=11,'Equivalencia BH-BMPT'!$D$12,IF(J132=12,'Equivalencia BH-BMPT'!$D$13,IF(J132=13,'Equivalencia BH-BMPT'!$D$14,IF(J132=14,'Equivalencia BH-BMPT'!$D$15,IF(J132=15,'Equivalencia BH-BMPT'!$D$16,IF(J132=16,'Equivalencia BH-BMPT'!$D$17,IF(J132=17,'Equivalencia BH-BMPT'!$D$18,IF(J132=18,'Equivalencia BH-BMPT'!$D$19,IF(J132=19,'Equivalencia BH-BMPT'!$D$20,IF(J132=20,'Equivalencia BH-BMPT'!$D$21,IF(J132=21,'Equivalencia BH-BMPT'!$D$22,IF(J132=22,'Equivalencia BH-BMPT'!$D$23,IF(J132=23,'Equivalencia BH-BMPT'!#REF!,IF(J132=24,'Equivalencia BH-BMPT'!$D$25,IF(J132=25,'Equivalencia BH-BMPT'!$D$26,IF(J132=26,'Equivalencia BH-BMPT'!$D$27,IF(J132=27,'Equivalencia BH-BMPT'!$D$28,IF(J132=28,'Equivalencia BH-BMPT'!$D$29,IF(J132=29,'Equivalencia BH-BMPT'!$D$30,IF(J132=30,'Equivalencia BH-BMPT'!$D$31,IF(J132=31,'Equivalencia BH-BMPT'!$D$32,IF(J132=32,'Equivalencia BH-BMPT'!$D$33,IF(J132=33,'Equivalencia BH-BMPT'!$D$34,IF(J132=34,'Equivalencia BH-BMPT'!$D$35,IF(J132=35,'Equivalencia BH-BMPT'!$D$36,IF(J132=36,'Equivalencia BH-BMPT'!$D$37,IF(J132=37,'Equivalencia BH-BMPT'!$D$38,IF(J132=38,'Equivalencia BH-BMPT'!#REF!,IF(J132=39,'Equivalencia BH-BMPT'!$D$40,IF(J132=40,'Equivalencia BH-BMPT'!$D$41,IF(J132=41,'Equivalencia BH-BMPT'!$D$42,IF(J132=42,'Equivalencia BH-BMPT'!$D$43,IF(J132=43,'Equivalencia BH-BMPT'!$D$44,IF(J132=44,'Equivalencia BH-BMPT'!$D$45,IF(J132=45,'Equivalencia BH-BMPT'!$D$46,\"No ha seleccionado un número de programa\")))))))))))))))))))))))))))))))))))))))))))))","v":"Recuperación, incorporación, vida urbana y control de la ilegalidad"},1319,"52151335","SONIA ESPERANZA AREVALO SILVA",215904229,null,null,0,0,215904229,0,"2017-11-02","2017-11-02","2018-05-01",30,111,null,null,"X",null,null,0,null,false]
[121,2017,"CO1.PCCNTR.223351",2,{"$f":"IF(D133=1,'Tipo '!$B$2,IF(D133=2,'Tipo '!$B$3,IF(D133=3,'Tipo '!$B$4,IF(D133=4,'Tipo '!$B$5,IF(D133=5,'Tipo '!$B$6,IF(D133=6,'Tipo '!$B$7,IF(D133=7,'Tipo '!$B$8,IF(D133=8,'Tipo '!$B$9,IF(D133=9,'Tipo '!$B$10,IF(D133=10,'Tipo '!$B$11,IF(D133=11,'Tipo '!$B$12,IF(D133=12,'Tipo '!$B$13,IF(D133=13,'Tipo '!$B$14,IF(D133=14,'Tipo '!$B$15,IF(D133=15,'Tipo '!$B$16,IF(D133=16,'Tipo '!$B$17,IF(D133=17,'Tipo '!$B$18,IF(D133=18,'Tipo '!$B$19,IF(D133=19,'Tipo '!$B$20,\"No ha seleccionado un tipo de contrato válido\")))))))))))))))))))","v":"CONSULTORÍA"},"concurso de meritos","No aplica","SUMINISTRAR LOS MATERIALES Y ELEMENTOS DE FERRETERÍA NECESARIOS PARA REALIZAR LAS REPARACIONES LOCATIVAS MENORES EN LAS DIFERENTES SEDES DE LA ALCALDÍA LOCAL DE SANTA FE","Inversión",45,{"$f":"IF(J133=1,'Equivalencia BH-BMPT'!$D$2,IF(J133=2,'Equivalencia BH-BMPT'!$D$3,IF(J133=3,'Equivalencia BH-BMPT'!$D$4,IF(J133=4,'Equivalencia BH-BMPT'!$D$5,IF(J133=5,'Equivalencia BH-BMPT'!$D$6,IF(J133=6,'Equivalencia BH-BMPT'!$D$7,IF(J133=7,'Equivalencia BH-BMPT'!$D$8,IF(J133=8,'Equivalencia BH-BMPT'!$D$9,IF(J133=9,'Equivalencia BH-BMPT'!$D$10,IF(J133=10,'Equivalencia BH-BMPT'!$D$11,IF(J133=11,'Equivalencia BH-BMPT'!$D$12,IF(J133=12,'Equivalencia BH-BMPT'!$D$13,IF(J133=13,'Equivalencia BH-BMPT'!$D$14,IF(J133=14,'Equivalencia BH-BMPT'!$D$15,IF(J133=15,'Equivalencia BH-BMPT'!$D$16,IF(J133=16,'Equivalencia BH-BMPT'!$D$17,IF(J133=17,'Equivalencia BH-BMPT'!$D$18,IF(J133=18,'Equivalencia BH-BMPT'!$D$19,IF(J133=19,'Equivalencia BH-BMPT'!$D$20,IF(J133=20,'Equivalencia BH-BMPT'!$D$21,IF(J133=21,'Equivalencia BH-BMPT'!$D$22,IF(J133=22,'Equivalencia BH-BMPT'!$D$23,IF(J133=23,'Equivalencia BH-BMPT'!#REF!,IF(J133=24,'Equivalencia BH-BMPT'!$D$25,IF(J133=25,'Equivalencia BH-BMPT'!$D$26,IF(J133=26,'Equivalencia BH-BMPT'!$D$27,IF(J133=27,'Equivalencia BH-BMPT'!$D$28,IF(J133=28,'Equivalencia BH-BMPT'!$D$29,IF(J133=29,'Equivalencia BH-BMPT'!$D$30,IF(J133=30,'Equivalencia BH-BMPT'!$D$31,IF(J133=31,'Equivalencia BH-BMPT'!$D$32,IF(J133=32,'Equivalencia BH-BMPT'!$D$33,IF(J133=33,'Equivalencia BH-BMPT'!$D$34,IF(J133=34,'Equivalencia BH-BMPT'!$D$35,IF(J133=35,'Equivalencia BH-BMPT'!$D$36,IF(J133=36,'Equivalencia BH-BMPT'!$D$37,IF(J133=37,'Equivalencia BH-BMPT'!$D$38,IF(J133=38,'Equivalencia BH-BMPT'!#REF!,IF(J133=39,'Equivalencia BH-BMPT'!$D$40,IF(J133=40,'Equivalencia BH-BMPT'!$D$41,IF(J133=41,'Equivalencia BH-BMPT'!$D$42,IF(J133=42,'Equivalencia BH-BMPT'!$D$43,IF(J133=43,'Equivalencia BH-BMPT'!$D$44,IF(J133=44,'Equivalencia BH-BMPT'!$D$45,IF(J133=45,'Equivalencia BH-BMPT'!$D$46,\"No ha seleccionado un número de programa\")))))))))))))))))))))))))))))))))))))))))))))","v":"Gobernanza e influencia local, regional e internacional"},1326,900305433,"COMERCIALIZADORA SUMITEC KARCH LTDA",109000000,null,null,0,0,109000000,0,"2017-11-07","2017-11-07","2018-05-06",180,112,null,"X",null,null,null,0,null,false]
[122,2017,"17-12-7282995",11,{"$f":"IF(D134=1,'Tipo '!$B$2,IF(D134=2,'Tipo '!$B$3,IF(D134=3,'Tipo '!$B$4,IF(D134=4,'Tipo '!$B$5,IF(D134=5,'Tipo '!$B$6,IF(D134=6,'Tipo '!$B$7,IF(D134=7,'Tipo '!$B$8,IF(D134=8,'Tipo '!$B$9,IF(D134=9,'Tipo '!$B$10,IF(D134=10,'Tipo '!$B$11,IF(D134=11,'Tipo '!$B$12,IF(D134=12,'Tipo '!$B$13,IF(D134=13,'Tipo '!$B$14,IF(D134=14,'Tipo '!$B$15,IF(D134=15,'Tipo '!$B$16,IF(D134=16,'Tipo '!$B$17,IF(D134=17,'Tipo '!$B$18,IF(D134=18,'Tipo '!$B$19,IF(D134=19,'Tipo '!$B$20,\"No ha seleccionado un tipo de contrato válido\")))))))))))))))))))","v":"SUMINISTRO"},"Selección abreviada ","Selección abreviada por menor cuantía ","promocionar la gestión de la administración local mediante la difusión de las acciones derivadas de la ejecución del plan de desarrollo “Santa Fe, mejor para todos” (2017 – 2020), como ejercicio de transparencia y control social","Inversión",45,{"$f":"IF(J134=1,'Equivalencia BH-BMPT'!$D$2,IF(J134=2,'Equivalencia BH-BMPT'!$D$3,IF(J134=3,'Equivalencia BH-BMPT'!$D$4,IF(J134=4,'Equivalencia BH-BMPT'!$D$5,IF(J134=5,'Equivalencia BH-BMPT'!$D$6,IF(J134=6,'Equivalencia BH-BMPT'!$D$7,IF(J134=7,'Equivalencia BH-BMPT'!$D$8,IF(J134=8,'Equivalencia BH-BMPT'!$D$9,IF(J134=9,'Equivalencia BH-BMPT'!$D$10,IF(J134=10,'Equivalencia BH-BMPT'!$D$11,IF(J134=11,'Equivalencia BH-BMPT'!$D$12,IF(J134=12,'Equivalencia BH-BMPT'!$D$13,IF(J134=13,'Equivalencia BH-BMPT'!$D$14,IF(J134=14,'Equivalencia BH-BMPT'!$D$15,IF(J134=15,'Equivalencia BH-BMPT'!$D$16,IF(J134=16,'Equivalencia BH-BMPT'!$D$17,IF(J134=17,'Equivalencia BH-BMPT'!$D$18,IF(J134=18,'Equivalencia BH-BMPT'!$D$19,IF(J134=19,'Equivalencia BH-BMPT'!$D$20,IF(J134=20,'Equivalencia BH-BMPT'!$D$21,IF(J134=21,'Equivalencia BH-BMPT'!$D$22,IF(J134=22,'Equivalencia BH-BMPT'!$D$23,IF(J134=23,'Equivalencia BH-BMPT'!#REF!,IF(J134=24,'Equivalencia BH-BMPT'!$D$25,IF(J134=25,'Equivalencia BH-BMPT'!$D$26,IF(J134=26,'Equivalencia BH-BMPT'!$D$27,IF(J134=27,'Equivalencia BH-BMPT'!$D$28,IF(J134=28,'Equivalencia BH-BMPT'!$D$29,IF(J134=29,'Equivalencia BH-BMPT'!$D$30,IF(J134=30,'Equivalencia BH-BMPT'!$D$31,IF(J134=31,'Equivalencia BH-BMPT'!$D$32,IF(J134=32,'Equivalencia BH-BMPT'!$D$33,IF(J134=33,'Equivalencia BH-BMPT'!$D$34,IF(J134=34,'Equivalencia BH-BMPT'!$D$35,IF(J134=35,'Equivalencia BH-BMPT'!$D$36,IF(J134=36,'Equivalencia BH-BMPT'!$D$37,IF(J134=37,'Equivalencia BH-BMPT'!$D$38,IF(J134=38,'Equivalencia BH-BMPT'!#REF!,IF(J134=39,'Equivalencia BH-BMPT'!$D$40,IF(J134=40,'Equivalencia BH-BMPT'!$D$41,IF(J134=41,'Equivalencia BH-BMPT'!$D$42,IF(J134=42,'Equivalencia BH-BMPT'!$D$43,IF(J134=43,'Equivalencia BH-BMPT'!$D$44,IF(J134=44,'Equivalencia BH-BMPT'!$D$45,IF(J134=45,'Equivalencia BH-BMPT'!$D$46,\"No ha seleccionado un número de programa\")))))))))))))))))))))))))))))))))))))))))))))","v":"Gobernanza e influencia local, regional e internacional"},1327,830012587,"CANAL CAPITAL",117974617,null,null,0,0,117974617,0,null,"2017-11-09","2018-09-08",300,113,null,"X",null,null,null,0,null,false]
[123,2017,"17-12-7281750",4,{"$f":"IF(D135=1,'Tipo '!$B$2,IF(D135=2,'Tipo '!$B$3,IF(D135=3,'Tipo '!$B$4,IF(D135=4,'Tipo '!$B$5,IF(D135=5,'Tipo '!$B$6,IF(D135=6,'Tipo '!$B$7,IF(D135=7,'Tipo '!$B$8,IF(D135=8,'Tipo '!$B$9,IF(D135=9,'Tipo '!$B$10,IF(D135=10,'Tipo '!$B$11,IF(D135=11,'Tipo '!$B$12,IF(D135=12,'Tipo '!$B$13,IF(D135=13,'Tipo '!$B$14,IF(D135=14,'Tipo '!$B$15,IF(D135=15,'Tipo '!$B$16,IF(D135=16,'Tipo '!$B$17,IF(D135=17,'Tipo '!$B$18,IF(D135=18,'Tipo '!$B$19,IF(D135=19,'Tipo '!$B$20,\"No ha seleccionado un tipo de contrato válido\")))))))))))))))))))","v":"CONTRATOS DE PRESTACIÓN DE SERVICIOS"},"Contratación directa","Subasta inversa","Aunar esfuerzos operativos, administrativos y financieros para realizar actividades de intervención física, social y mantenimiento de los puntos críticos de la localidad de Santa Fe.","Inversión",45,{"$f":"IF(J135=1,'Equivalencia BH-BMPT'!$D$2,IF(J135=2,'Equivalencia BH-BMPT'!$D$3,IF(J135=3,'Equivalencia BH-BMPT'!$D$4,IF(J135=4,'Equivalencia BH-BMPT'!$D$5,IF(J135=5,'Equivalencia BH-BMPT'!$D$6,IF(J135=6,'Equivalencia BH-BMPT'!$D$7,IF(J135=7,'Equivalencia BH-BMPT'!$D$8,IF(J135=8,'Equivalencia BH-BMPT'!$D$9,IF(J135=9,'Equivalencia BH-BMPT'!$D$10,IF(J135=10,'Equivalencia BH-BMPT'!$D$11,IF(J135=11,'Equivalencia BH-BMPT'!$D$12,IF(J135=12,'Equivalencia BH-BMPT'!$D$13,IF(J135=13,'Equivalencia BH-BMPT'!$D$14,IF(J135=14,'Equivalencia BH-BMPT'!$D$15,IF(J135=15,'Equivalencia BH-BMPT'!$D$16,IF(J135=16,'Equivalencia BH-BMPT'!$D$17,IF(J135=17,'Equivalencia BH-BMPT'!$D$18,IF(J135=18,'Equivalencia BH-BMPT'!$D$19,IF(J135=19,'Equivalencia BH-BMPT'!$D$20,IF(J135=20,'Equivalencia BH-BMPT'!$D$21,IF(J135=21,'Equivalencia BH-BMPT'!$D$22,IF(J135=22,'Equivalencia BH-BMPT'!$D$23,IF(J135=23,'Equivalencia BH-BMPT'!#REF!,IF(J135=24,'Equivalencia BH-BMPT'!$D$25,IF(J135=25,'Equivalencia BH-BMPT'!$D$26,IF(J135=26,'Equivalencia BH-BMPT'!$D$27,IF(J135=27,'Equivalencia BH-BMPT'!$D$28,IF(J135=28,'Equivalencia BH-BMPT'!$D$29,IF(J135=29,'Equivalencia BH-BMPT'!$D$30,IF(J135=30,'Equivalencia BH-BMPT'!$D$31,IF(J135=31,'Equivalencia BH-BMPT'!$D$32,IF(J135=32,'Equivalencia BH-BMPT'!$D$33,IF(J135=33,'Equivalencia BH-BMPT'!$D$34,IF(J135=34,'Equivalencia BH-BMPT'!$D$35,IF(J135=35,'Equivalencia BH-BMPT'!$D$36,IF(J135=36,'Equivalencia BH-BMPT'!$D$37,IF(J135=37,'Equivalencia BH-BMPT'!$D$38,IF(J135=38,'Equivalencia BH-BMPT'!#REF!,IF(J135=39,'Equivalencia BH-BMPT'!$D$40,IF(J135=40,'Equivalencia BH-BMPT'!$D$41,IF(J135=41,'Equivalencia BH-BMPT'!$D$42,IF(J135=42,'Equivalencia BH-BMPT'!$D$43,IF(J135=43,'Equivalencia BH-BMPT'!$D$44,IF(J135=44,'Equivalencia BH-BMPT'!$D$45,IF(J135=45,'Equivalencia BH-BMPT'!$D$46,\"No ha seleccionado un número de programa\")))))))))))))))))))))))))))))))))))))))))))))","v":"Gobernanza e influencia local, regional e internacional"},1326,830128286,"AGUAS DE BOGOTA",130866990,null,null,0,null,130866990,0,"2017-11-09","2017-11-09","2018-02-08",90,114,null,"X",null,null,null,0,null,false]
[124,2017,"CO1.PCCNTR.228701",1,{"$f":"IF(D136=1,'Tipo '!$B$2,IF(D136=2,'Tipo '!$B$3,IF(D136=3,'Tipo '!$B$4,IF(D136=4,'Tipo '!$B$5,IF(D136=5,'Tipo '!$B$6,IF(D136=6,'Tipo '!$B$7,IF(D136=7,'Tipo '!$B$8,IF(D136=8,'Tipo '!$B$9,IF(D136=9,'Tipo '!$B$10,IF(D136=10,'Tipo '!$B$11,IF(D136=11,'Tipo '!$B$12,IF(D136=12,'Tipo '!$B$13,IF(D136=13,'Tipo '!$B$14,IF(D136=14,'Tipo '!$B$15,IF(D136=15,'Tipo '!$B$16,IF(D136=16,'Tipo '!$B$17,IF(D136=17,'Tipo '!$B$18,IF(D136=18,'Tipo '!$B$19,IF(D136=19,'Tipo '!$B$20,\"No ha seleccionado un tipo de contrato válido\")))))))))))))))))))","v":"OBRA PÚBLICA"},"Licitación pública","No aplica","CONTRATAR A MONTO AGOTABLE LAS OBRAS Y ACTIVIDADES PARA LA CONSERVACIÓN DE LA MALLA VIAL DE LA LOCALIDAD DE SANTA FE Y SU ESPACIO PÚBLICO ASOCIADO. LOTE No. 1","Inversión",18,{"$f":"IF(J136=1,'Equivalencia BH-BMPT'!$D$2,IF(J136=2,'Equivalencia BH-BMPT'!$D$3,IF(J136=3,'Equivalencia BH-BMPT'!$D$4,IF(J136=4,'Equivalencia BH-BMPT'!$D$5,IF(J136=5,'Equivalencia BH-BMPT'!$D$6,IF(J136=6,'Equivalencia BH-BMPT'!$D$7,IF(J136=7,'Equivalencia BH-BMPT'!$D$8,IF(J136=8,'Equivalencia BH-BMPT'!$D$9,IF(J136=9,'Equivalencia BH-BMPT'!$D$10,IF(J136=10,'Equivalencia BH-BMPT'!$D$11,IF(J136=11,'Equivalencia BH-BMPT'!$D$12,IF(J136=12,'Equivalencia BH-BMPT'!$D$13,IF(J136=13,'Equivalencia BH-BMPT'!$D$14,IF(J136=14,'Equivalencia BH-BMPT'!$D$15,IF(J136=15,'Equivalencia BH-BMPT'!$D$16,IF(J136=16,'Equivalencia BH-BMPT'!$D$17,IF(J136=17,'Equivalencia BH-BMPT'!$D$18,IF(J136=18,'Equivalencia BH-BMPT'!$D$19,IF(J136=19,'Equivalencia BH-BMPT'!$D$20,IF(J136=20,'Equivalencia BH-BMPT'!$D$21,IF(J136=21,'Equivalencia BH-BMPT'!$D$22,IF(J136=22,'Equivalencia BH-BMPT'!$D$23,IF(J136=23,'Equivalencia BH-BMPT'!#REF!,IF(J136=24,'Equivalencia BH-BMPT'!$D$25,IF(J136=25,'Equivalencia BH-BMPT'!$D$26,IF(J136=26,'Equivalencia BH-BMPT'!$D$27,IF(J136=27,'Equivalencia BH-BMPT'!$D$28,IF(J136=28,'Equivalencia BH-BMPT'!$D$29,IF(J136=29,'Equivalencia BH-BMPT'!$D$30,IF(J136=30,'Equivalencia BH-BMPT'!$D$31,IF(J136=31,'Equivalencia BH-BMPT'!$D$32,IF(J136=32,'Equivalencia BH-BMPT'!$D$33,IF(J136=33,'Equivalencia BH-BMPT'!$D$34,IF(J136=34,'Equivalencia BH-BMPT'!$D$35,IF(J136=35,'Equivalencia BH-BMPT'!$D$36,IF(J136=36,'Equivalencia BH-BMPT'!$D$37,IF(J136=37,'Equivalencia BH-BMPT'!$D$38,IF(J136=38,'Equivalencia BH-BMPT'!#REF!,IF(J136=39,'Equivalencia BH-BMPT'!$D$40,IF(J136=40,'Equivalencia BH-BMPT'!$D$41,IF(J136=41,'Equivalencia BH-BMPT'!$D$42,IF(J136=42,'Equivalencia BH-BMPT'!$D$43,IF(J136=43,'Equivalencia BH-BMPT'!$D$44,IF(J136=44,'Equivalencia BH-BMPT'!$D$45,IF(J136=45,'Equivalencia BH-BMPT'!$D$46,\"No ha seleccionado un número de programa\")))))))))))))))))))))))))))))))))))))))))))))","v":"Mejor movilidad para todos"},1322,"901131372","CONSORCIO VIAL LOS CERROS",4000000000,null,null,0,0,4000000000,0,"2017-11-20","2017-11-20","2018-02-19",90,115,null,"X",null,null,null,0,null,false]
[125,2017,"CO1.PCCNTR.228602",1,{"$f":"IF(D137=1,'Tipo '!$B$2,IF(D137=2,'Tipo '!$B$3,IF(D137=3,'Tipo '!$B$4,IF(D137=4,'Tipo '!$B$5,IF(D137=5,'Tipo '!$B$6,IF(D137=6,'Tipo '!$B$7,IF(D137=7,'Tipo '!$B$8,IF(D137=8,'Tipo '!$B$9,IF(D137=9,'Tipo '!$B$10,IF(D137=10,'Tipo '!$B$11,IF(D137=11,'Tipo '!$B$12,IF(D137=12,'Tipo '!$B$13,IF(D137=13,'Tipo '!$B$14,IF(D137=14,'Tipo '!$B$15,IF(D137=15,'Tipo '!$B$16,IF(D137=16,'Tipo '!$B$17,IF(D137=17,'Tipo '!$B$18,IF(D137=18,'Tipo '!$B$19,IF(D137=19,'Tipo '!$B$20,\"No ha seleccionado un tipo de contrato válido\")))))))))))))))))))","v":"OBRA PÚBLICA"},"Licitación pública","No aplica","CONTRATAR A MONTO AGOTABLE LAS OBRAS Y ACTIVIDADES PARA LA CONSERVACIÓN DE LA MALLA VIAL DE LA LOCALIDAD DE SANTA FE Y SU ESPACIO PÚBLICO ASOCIADO. LOTE No. 2","Inversión",18,{"$f":"IF(J137=1,'Equivalencia BH-BMPT'!$D$2,IF(J137=2,'Equivalencia BH-BMPT'!$D$3,IF(J137=3,'Equivalencia BH-BMPT'!$D$4,IF(J137=4,'Equivalencia BH-BMPT'!$D$5,IF(J137=5,'Equivalencia BH-BMPT'!$D$6,IF(J137=6,'Equivalencia BH-BMPT'!$D$7,IF(J137=7,'Equivalencia BH-BMPT'!$D$8,IF(J137=8,'Equivalencia BH-BMPT'!$D$9,IF(J137=9,'Equivalencia BH-BMPT'!$D$10,IF(J137=10,'Equivalencia BH-BMPT'!$D$11,IF(J137=11,'Equivalencia BH-BMPT'!$D$12,IF(J137=12,'Equivalencia BH-BMPT'!$D$13,IF(J137=13,'Equivalencia BH-BMPT'!$D$14,IF(J137=14,'Equivalencia BH-BMPT'!$D$15,IF(J137=15,'Equivalencia BH-BMPT'!$D$16,IF(J137=16,'Equivalencia BH-BMPT'!$D$17,IF(J137=17,'Equivalencia BH-BMPT'!$D$18,IF(J137=18,'Equivalencia BH-BMPT'!$D$19,IF(J137=19,'Equivalencia BH-BMPT'!$D$20,IF(J137=20,'Equivalencia BH-BMPT'!$D$21,IF(J137=21,'Equivalencia BH-BMPT'!$D$22,IF(J137=22,'Equivalencia BH-BMPT'!$D$23,IF(J137=23,'Equivalencia BH-BMPT'!#REF!,IF(J137=24,'Equivalencia BH-BMPT'!$D$25,IF(J137=25,'Equivalencia BH-BMPT'!$D$26,IF(J137=26,'Equivalencia BH-BMPT'!$D$27,IF(J137=27,'Equivalencia BH-BMPT'!$D$28,IF(J137=28,'Equivalencia BH-BMPT'!$D$29,IF(J137=29,'Equivalencia BH-BMPT'!$D$30,IF(J137=30,'Equivalencia BH-BMPT'!$D$31,IF(J137=31,'Equivalencia BH-BMPT'!$D$32,IF(J137=32,'Equivalencia BH-BMPT'!$D$33,IF(J137=33,'Equivalencia BH-BMPT'!$D$34,IF(J137=34,'Equivalencia BH-BMPT'!$D$35,IF(J137=35,'Equivalencia BH-BMPT'!$D$36,IF(J137=36,'Equivalencia BH-BMPT'!$D$37,IF(J137=37,'Equivalencia BH-BMPT'!$D$38,IF(J137=38,'Equivalencia BH-BMPT'!#REF!,IF(J137=39,'Equivalencia BH-BMPT'!$D$40,IF(J137=40,'Equivalencia BH-BMPT'!$D$41,IF(J137=41,'Equivalencia BH-BMPT'!$D$42,IF(J137=42,'Equivalencia BH-BMPT'!$D$43,IF(J137=43,'Equivalencia BH-BMPT'!$D$44,IF(J137=44,'Equivalencia BH-BMPT'!$D$45,IF(J137=45,'Equivalencia BH-BMPT'!$D$46,\"No ha seleccionado un número de programa\")))))))))))))))))))))))))))))))))))))))))))))","v":"Mejor movilidad para todos"},1322,null,"CONSORCIO UNO",4000000000,null,null,0,0,4000000000,0,"201/11/2017","2017-11-23","2017-12-22",30,116,null,"X",null,null,null,0,null,false]
[126,2017,"17-13-7221417",6,{"$f":"IF(D138=1,'Tipo '!$B$2,IF(D138=2,'Tipo '!$B$3,IF(D138=3,'Tipo '!$B$4,IF(D138=4,'Tipo '!$B$5,IF(D138=5,'Tipo '!$B$6,IF(D138=6,'Tipo '!$B$7,IF(D138=7,'Tipo '!$B$8,IF(D138=8,'Tipo '!$B$9,IF(D138=9,'Tipo '!$B$10,IF(D138=10,'Tipo '!$B$11,IF(D138=11,'Tipo '!$B$12,IF(D138=12,'Tipo '!$B$13,IF(D138=13,'Tipo '!$B$14,IF(D138=14,'Tipo '!$B$15,IF(D138=15,'Tipo '!$B$16,IF(D138=16,'Tipo '!$B$17,IF(D138=17,'Tipo '!$B$18,IF(D138=18,'Tipo '!$B$19,IF(D138=19,'Tipo '!$B$20,\"No ha seleccionado un tipo de contrato válido\")))))))))))))))))))","v":"COMPRAVENTA DE BIENES MUEBLES"},"Contratación mínima cuantia ","No aplica","ADQUIRIR MATERIALES, ELEMENTOS Y CONSUMIBLES, CON EL ÁNIMO DE REALIZAR ACCIONES DE EMBELLECIMIENTO DE ESPACIO PÚBLICO EN LA LOCALIDAD DE SANTA FE.  DE ACUERDO A MEMORANDO RADICADO BAJO EL NÚMERO 2017-532-00-12023 DE FECHA NOVIEMBRE 17   DE 2017, FIRMADO POR EL ALCALDE LOCAL","Inversión",18,{"$f":"IF(J138=1,'Equivalencia BH-BMPT'!$D$2,IF(J138=2,'Equivalencia BH-BMPT'!$D$3,IF(J138=3,'Equivalencia BH-BMPT'!$D$4,IF(J138=4,'Equivalencia BH-BMPT'!$D$5,IF(J138=5,'Equivalencia BH-BMPT'!$D$6,IF(J138=6,'Equivalencia BH-BMPT'!$D$7,IF(J138=7,'Equivalencia BH-BMPT'!$D$8,IF(J138=8,'Equivalencia BH-BMPT'!$D$9,IF(J138=9,'Equivalencia BH-BMPT'!$D$10,IF(J138=10,'Equivalencia BH-BMPT'!$D$11,IF(J138=11,'Equivalencia BH-BMPT'!$D$12,IF(J138=12,'Equivalencia BH-BMPT'!$D$13,IF(J138=13,'Equivalencia BH-BMPT'!$D$14,IF(J138=14,'Equivalencia BH-BMPT'!$D$15,IF(J138=15,'Equivalencia BH-BMPT'!$D$16,IF(J138=16,'Equivalencia BH-BMPT'!$D$17,IF(J138=17,'Equivalencia BH-BMPT'!$D$18,IF(J138=18,'Equivalencia BH-BMPT'!$D$19,IF(J138=19,'Equivalencia BH-BMPT'!$D$20,IF(J138=20,'Equivalencia BH-BMPT'!$D$21,IF(J138=21,'Equivalencia BH-BMPT'!$D$22,IF(J138=22,'Equivalencia BH-BMPT'!$D$23,IF(J138=23,'Equivalencia BH-BMPT'!#REF!,IF(J138=24,'Equivalencia BH-BMPT'!$D$25,IF(J138=25,'Equivalencia BH-BMPT'!$D$26,IF(J138=26,'Equivalencia BH-BMPT'!$D$27,IF(J138=27,'Equivalencia BH-BMPT'!$D$28,IF(J138=28,'Equivalencia BH-BMPT'!$D$29,IF(J138=29,'Equivalencia BH-BMPT'!$D$30,IF(J138=30,'Equivalencia BH-BMPT'!$D$31,IF(J138=31,'Equivalencia BH-BMPT'!$D$32,IF(J138=32,'Equivalencia BH-BMPT'!$D$33,IF(J138=33,'Equivalencia BH-BMPT'!$D$34,IF(J138=34,'Equivalencia BH-BMPT'!$D$35,IF(J138=35,'Equivalencia BH-BMPT'!$D$36,IF(J138=36,'Equivalencia BH-BMPT'!$D$37,IF(J138=37,'Equivalencia BH-BMPT'!$D$38,IF(J138=38,'Equivalencia BH-BMPT'!#REF!,IF(J138=39,'Equivalencia BH-BMPT'!$D$40,IF(J138=40,'Equivalencia BH-BMPT'!$D$41,IF(J138=41,'Equivalencia BH-BMPT'!$D$42,IF(J138=42,'Equivalencia BH-BMPT'!$D$43,IF(J138=43,'Equivalencia BH-BMPT'!$D$44,IF(J138=44,'Equivalencia BH-BMPT'!$D$45,IF(J138=45,'Equivalencia BH-BMPT'!$D$46,\"No ha seleccionado un número de programa\")))))))))))))))))))))))))))))))))))))))))))))","v":"Mejor movilidad para todos"},1322,900922935,"DISTRIBUCIONES EYS SAS",18770227,null,null,0,0,18770227,0,"2017/12/06","2017/12/06","2018-01-05",30,117,null,"X",null,null,null,0,null,false]
[127,2017,"CO1.PCCNTR.239428",4,{"$f":"IF(D139=1,'Tipo '!$B$2,IF(D139=2,'Tipo '!$B$3,IF(D139=3,'Tipo '!$B$4,IF(D139=4,'Tipo '!$B$5,IF(D139=5,'Tipo '!$B$6,IF(D139=6,'Tipo '!$B$7,IF(D139=7,'Tipo '!$B$8,IF(D139=8,'Tipo '!$B$9,IF(D139=9,'Tipo '!$B$10,IF(D139=10,'Tipo '!$B$11,IF(D139=11,'Tipo '!$B$12,IF(D139=12,'Tipo '!$B$13,IF(D139=13,'Tipo '!$B$14,IF(D139=14,'Tipo '!$B$15,IF(D139=15,'Tipo '!$B$16,IF(D139=16,'Tipo '!$B$17,IF(D139=17,'Tipo '!$B$18,IF(D139=18,'Tipo '!$B$19,IF(D139=19,'Tipo '!$B$20,\"No ha seleccionado un tipo de contrato válido\")))))))))))))))))))","v":"CONTRATOS DE PRESTACIÓN DE SERVICIOS"},"Selección abreviada ","Selección abreviada por menor cuantía ","PRESTAR LOS SERVICIOS PARA LA FORMACIÓN NO FORMAL Y EL FOMENTO EN ARTE Y CULTURA A TRAVÉS DE ESCUELAS DE FORMACIÓN ARTÍSTICA Y CULTURAL DE LA LOCALIDAD DE LA LOCALIDAD DE SANTA FE, EN EL MARCO DEL PROYECTO NO. 1318, DE ACUERDO A MEMORANDO RADICADO BAJO EL NÚMERO 2017-532-00-13313 DE FECHA DICIEMBRE 15  DE 2017, FIRMADO POR EL ALCALDE LOCAL,","Inversión",11,{"$f":"IF(J139=1,'Equivalencia BH-BMPT'!$D$2,IF(J139=2,'Equivalencia BH-BMPT'!$D$3,IF(J139=3,'Equivalencia BH-BMPT'!$D$4,IF(J139=4,'Equivalencia BH-BMPT'!$D$5,IF(J139=5,'Equivalencia BH-BMPT'!$D$6,IF(J139=6,'Equivalencia BH-BMPT'!$D$7,IF(J139=7,'Equivalencia BH-BMPT'!$D$8,IF(J139=8,'Equivalencia BH-BMPT'!$D$9,IF(J139=9,'Equivalencia BH-BMPT'!$D$10,IF(J139=10,'Equivalencia BH-BMPT'!$D$11,IF(J139=11,'Equivalencia BH-BMPT'!$D$12,IF(J139=12,'Equivalencia BH-BMPT'!$D$13,IF(J139=13,'Equivalencia BH-BMPT'!$D$14,IF(J139=14,'Equivalencia BH-BMPT'!$D$15,IF(J139=15,'Equivalencia BH-BMPT'!$D$16,IF(J139=16,'Equivalencia BH-BMPT'!$D$17,IF(J139=17,'Equivalencia BH-BMPT'!$D$18,IF(J139=18,'Equivalencia BH-BMPT'!$D$19,IF(J139=19,'Equivalencia BH-BMPT'!$D$20,IF(J139=20,'Equivalencia BH-BMPT'!$D$21,IF(J139=21,'Equivalencia BH-BMPT'!$D$22,IF(J139=22,'Equivalencia BH-BMPT'!$D$23,IF(J139=23,'Equivalencia BH-BMPT'!#REF!,IF(J139=24,'Equivalencia BH-BMPT'!$D$25,IF(J139=25,'Equivalencia BH-BMPT'!$D$26,IF(J139=26,'Equivalencia BH-BMPT'!$D$27,IF(J139=27,'Equivalencia BH-BMPT'!$D$28,IF(J139=28,'Equivalencia BH-BMPT'!$D$29,IF(J139=29,'Equivalencia BH-BMPT'!$D$30,IF(J139=30,'Equivalencia BH-BMPT'!$D$31,IF(J139=31,'Equivalencia BH-BMPT'!$D$32,IF(J139=32,'Equivalencia BH-BMPT'!$D$33,IF(J139=33,'Equivalencia BH-BMPT'!$D$34,IF(J139=34,'Equivalencia BH-BMPT'!$D$35,IF(J139=35,'Equivalencia BH-BMPT'!$D$36,IF(J139=36,'Equivalencia BH-BMPT'!$D$37,IF(J139=37,'Equivalencia BH-BMPT'!$D$38,IF(J139=38,'Equivalencia BH-BMPT'!#REF!,IF(J139=39,'Equivalencia BH-BMPT'!$D$40,IF(J139=40,'Equivalencia BH-BMPT'!$D$41,IF(J139=41,'Equivalencia BH-BMPT'!$D$42,IF(J139=42,'Equivalencia BH-BMPT'!$D$43,IF(J139=43,'Equivalencia BH-BMPT'!$D$44,IF(J139=44,'Equivalencia BH-BMPT'!$D$45,IF(J139=45,'Equivalencia BH-BMPT'!$D$46,\"No ha seleccionado un número de programa\")))))))))))))))))))))))))))))))))))))))))))))","v":"Mejores oportunidades para el desarrollo a través de la cultura, la recreación y el deporte"},1318,900017160,"CORPORACION FUTURO DE COLOMBIA - CORFUTURO",145962817,null,null,0,0,145962817,0,"2017/12/06","2017/12/06","2018-05-05",180,118,null,"X",null,null,null,0,null,false]
[128,2017,"17-11-7156265",11,{"$f":"IF(D140=1,'Tipo '!$B$2,IF(D140=2,'Tipo '!$B$3,IF(D140=3,'Tipo '!$B$4,IF(D140=4,'Tipo '!$B$5,IF(D140=5,'Tipo '!$B$6,IF(D140=6,'Tipo '!$B$7,IF(D140=7,'Tipo '!$B$8,IF(D140=8,'Tipo '!$B$9,IF(D140=9,'Tipo '!$B$10,IF(D140=10,'Tipo '!$B$11,IF(D140=11,'Tipo '!$B$12,IF(D140=12,'Tipo '!$B$13,IF(D140=13,'Tipo '!$B$14,IF(D140=14,'Tipo '!$B$15,IF(D140=15,'Tipo '!$B$16,IF(D140=16,'Tipo '!$B$17,IF(D140=17,'Tipo '!$B$18,IF(D140=18,'Tipo '!$B$19,IF(D140=19,'Tipo '!$B$20,\"No ha seleccionado un tipo de contrato válido\")))))))))))))))))))","v":"SUMINISTRO"},"Selección abreviada ","Selección abreviada por menor cuantía ","CONTRATAR LA PRESTACIÓN DE LOS SERVICIOS DE MANTENIMIENTO PREVENTIVO Y CORRECTIVO, CON SUMINISTRO DE AUTOPARTES Y MANO DE OBRA CALIFICADA, PARA LOS VEHÍCULOS QUE INTEGRAN EL PARQUE AUTOMOTOR DE LA ALCALDÍA LOCAL DE SANTA FE Y LOS QUE TENGA O LLEGARE A TENER EN CUIDADO O CUSTODIA.,  DE ACUERDO A MEMORANDO RADICADO BAJO EL NÚMERO 2017-532-00-12543 DE FECHA DICIEMBRE 01  DE 2017, FIRMADO POR EL ALCALDE LOCAL","Funcionamiento",1,{"$f":"IF(J140=1,'Equivalencia BH-BMPT'!$D$2,IF(J140=2,'Equivalencia BH-BMPT'!$D$3,IF(J140=3,'Equivalencia BH-BMPT'!$D$4,IF(J140=4,'Equivalencia BH-BMPT'!$D$5,IF(J140=5,'Equivalencia BH-BMPT'!$D$6,IF(J140=6,'Equivalencia BH-BMPT'!$D$7,IF(J140=7,'Equivalencia BH-BMPT'!$D$8,IF(J140=8,'Equivalencia BH-BMPT'!$D$9,IF(J140=9,'Equivalencia BH-BMPT'!$D$10,IF(J140=10,'Equivalencia BH-BMPT'!$D$11,IF(J140=11,'Equivalencia BH-BMPT'!$D$12,IF(J140=12,'Equivalencia BH-BMPT'!$D$13,IF(J140=13,'Equivalencia BH-BMPT'!$D$14,IF(J140=14,'Equivalencia BH-BMPT'!$D$15,IF(J140=15,'Equivalencia BH-BMPT'!$D$16,IF(J140=16,'Equivalencia BH-BMPT'!$D$17,IF(J140=17,'Equivalencia BH-BMPT'!$D$18,IF(J140=18,'Equivalencia BH-BMPT'!$D$19,IF(J140=19,'Equivalencia BH-BMPT'!$D$20,IF(J140=20,'Equivalencia BH-BMPT'!$D$21,IF(J140=21,'Equivalencia BH-BMPT'!$D$22,IF(J140=22,'Equivalencia BH-BMPT'!$D$23,IF(J140=23,'Equivalencia BH-BMPT'!#REF!,IF(J140=24,'Equivalencia BH-BMPT'!$D$25,IF(J140=25,'Equivalencia BH-BMPT'!$D$26,IF(J140=26,'Equivalencia BH-BMPT'!$D$27,IF(J140=27,'Equivalencia BH-BMPT'!$D$28,IF(J140=28,'Equivalencia BH-BMPT'!$D$29,IF(J140=29,'Equivalencia BH-BMPT'!$D$30,IF(J140=30,'Equivalencia BH-BMPT'!$D$31,IF(J140=31,'Equivalencia BH-BMPT'!$D$32,IF(J140=32,'Equivalencia BH-BMPT'!$D$33,IF(J140=33,'Equivalencia BH-BMPT'!$D$34,IF(J140=34,'Equivalencia BH-BMPT'!$D$35,IF(J140=35,'Equivalencia BH-BMPT'!$D$36,IF(J140=36,'Equivalencia BH-BMPT'!$D$37,IF(J140=37,'Equivalencia BH-BMPT'!$D$38,IF(J140=38,'Equivalencia BH-BMPT'!#REF!,IF(J140=39,'Equivalencia BH-BMPT'!$D$40,IF(J140=40,'Equivalencia BH-BMPT'!$D$41,IF(J140=41,'Equivalencia BH-BMPT'!$D$42,IF(J140=42,'Equivalencia BH-BMPT'!$D$43,IF(J140=43,'Equivalencia BH-BMPT'!$D$44,IF(J140=44,'Equivalencia BH-BMPT'!$D$45,IF(J140=45,'Equivalencia BH-BMPT'!$D$46,\"No ha seleccionado un número de programa\")))))))))))))))))))))))))))))))))))))))))))))","v":"Prevención y atención de la maternidad y la paternidad tempranas"},0,800250589,"CENTRO CAR 19 LIMITADA",32261000,null,null,0,0,32261000,0,"2017/12/01","2017/12/01","2018-09-30",300,119,null,null,"X",null,null,0,null,false]
[129,2017,"CO1.PCCNTR.248329",7,{"$f":"IF(D141=1,'Tipo '!$B$2,IF(D141=2,'Tipo '!$B$3,IF(D141=3,'Tipo '!$B$4,IF(D141=4,'Tipo '!$B$5,IF(D141=5,'Tipo '!$B$6,IF(D141=6,'Tipo '!$B$7,IF(D141=7,'Tipo '!$B$8,IF(D141=8,'Tipo '!$B$9,IF(D141=9,'Tipo '!$B$10,IF(D141=10,'Tipo '!$B$11,IF(D141=11,'Tipo '!$B$12,IF(D141=12,'Tipo '!$B$13,IF(D141=13,'Tipo '!$B$14,IF(D141=14,'Tipo '!$B$15,IF(D141=15,'Tipo '!$B$16,IF(D141=16,'Tipo '!$B$17,IF(D141=17,'Tipo '!$B$18,IF(D141=18,'Tipo '!$B$19,IF(D141=19,'Tipo '!$B$20,\"No ha seleccionado un tipo de contrato válido\")))))))))))))))))))","v":"COMPRAVENTA DE BIENES INMUEBLES"},"Selección abreviada ","Selección abreviada por menor cuantía ","VENDER Y ENTREGAR AL FDLSF LOS ELEMENTOS:  MUSICALES; DE  INFORMÁTICA Y  MOBILIARIO PARA LOS IED DE LA LOCALIDAD DE SANTA FE CONFORME A LAS CANTIDADES Y ESPECIFICACIONES TÉCNICAS CONTENIDAS EN LOS DOCUMENTOS DEL PROCESO FDLSF-SASI-024-2017, EN EL MARCO DEL PROYECTO 1317 ¿MEJORANDO AMBIENTES DE APRENDIZAJE PARA TODOS,  DE ACUERDO A MEMORANDO RADICADO BAJO EL NÚMERO 2017-532-00-13323 DE FECHA DICIEMBRE 15   DE 2017, FIRMADO POR EL ALCALDE LOCAL","Inversión",7,{"$f":"IF(J141=1,'Equivalencia BH-BMPT'!$D$2,IF(J141=2,'Equivalencia BH-BMPT'!$D$3,IF(J141=3,'Equivalencia BH-BMPT'!$D$4,IF(J141=4,'Equivalencia BH-BMPT'!$D$5,IF(J141=5,'Equivalencia BH-BMPT'!$D$6,IF(J141=6,'Equivalencia BH-BMPT'!$D$7,IF(J141=7,'Equivalencia BH-BMPT'!$D$8,IF(J141=8,'Equivalencia BH-BMPT'!$D$9,IF(J141=9,'Equivalencia BH-BMPT'!$D$10,IF(J141=10,'Equivalencia BH-BMPT'!$D$11,IF(J141=11,'Equivalencia BH-BMPT'!$D$12,IF(J141=12,'Equivalencia BH-BMPT'!$D$13,IF(J141=13,'Equivalencia BH-BMPT'!$D$14,IF(J141=14,'Equivalencia BH-BMPT'!$D$15,IF(J141=15,'Equivalencia BH-BMPT'!$D$16,IF(J141=16,'Equivalencia BH-BMPT'!$D$17,IF(J141=17,'Equivalencia BH-BMPT'!$D$18,IF(J141=18,'Equivalencia BH-BMPT'!$D$19,IF(J141=19,'Equivalencia BH-BMPT'!$D$20,IF(J141=20,'Equivalencia BH-BMPT'!$D$21,IF(J141=21,'Equivalencia BH-BMPT'!$D$22,IF(J141=22,'Equivalencia BH-BMPT'!$D$23,IF(J141=23,'Equivalencia BH-BMPT'!#REF!,IF(J141=24,'Equivalencia BH-BMPT'!$D$25,IF(J141=25,'Equivalencia BH-BMPT'!$D$26,IF(J141=26,'Equivalencia BH-BMPT'!$D$27,IF(J141=27,'Equivalencia BH-BMPT'!$D$28,IF(J141=28,'Equivalencia BH-BMPT'!$D$29,IF(J141=29,'Equivalencia BH-BMPT'!$D$30,IF(J141=30,'Equivalencia BH-BMPT'!$D$31,IF(J141=31,'Equivalencia BH-BMPT'!$D$32,IF(J141=32,'Equivalencia BH-BMPT'!$D$33,IF(J141=33,'Equivalencia BH-BMPT'!$D$34,IF(J141=34,'Equivalencia BH-BMPT'!$D$35,IF(J141=35,'Equivalencia BH-BMPT'!$D$36,IF(J141=36,'Equivalencia BH-BMPT'!$D$37,IF(J141=37,'Equivalencia BH-BMPT'!$D$38,IF(J141=38,'Equivalencia BH-BMPT'!#REF!,IF(J141=39,'Equivalencia BH-BMPT'!$D$40,IF(J141=40,'Equivalencia BH-BMPT'!$D$41,IF(J141=41,'Equivalencia BH-BMPT'!$D$42,IF(J141=42,'Equivalencia BH-BMPT'!$D$43,IF(J141=43,'Equivalencia BH-BMPT'!$D$44,IF(J141=44,'Equivalencia BH-BMPT'!$D$45,IF(J141=45,'Equivalencia BH-BMPT'!$D$46,\"No ha seleccionado un número de programa\")))))))))))))))))))))))))))))))))))))))))))))","v":"Inclusión educativa para la equidad"},1317,860003735,"METALICAS LA INDUSTRIAL LTDA",101389194,null,null,0,0,101389194,0,"2017/12/11","2017/12/11","2018-03-10",90,120,null,null,"X",null,null,0,null,false]
[130,2017,"CO1.PCCNTR.248130",6,{"$f":"IF(D142=1,'Tipo '!$B$2,IF(D142=2,'Tipo '!$B$3,IF(D142=3,'Tipo '!$B$4,IF(D142=4,'Tipo '!$B$5,IF(D142=5,'Tipo '!$B$6,IF(D142=6,'Tipo '!$B$7,IF(D142=7,'Tipo '!$B$8,IF(D142=8,'Tipo '!$B$9,IF(D142=9,'Tipo '!$B$10,IF(D142=10,'Tipo '!$B$11,IF(D142=11,'Tipo '!$B$12,IF(D142=12,'Tipo '!$B$13,IF(D142=13,'Tipo '!$B$14,IF(D142=14,'Tipo '!$B$15,IF(D142=15,'Tipo '!$B$16,IF(D142=16,'Tipo '!$B$17,IF(D142=17,'Tipo '!$B$18,IF(D142=18,'Tipo '!$B$19,IF(D142=19,'Tipo '!$B$20,\"No ha seleccionado un tipo de contrato válido\")))))))))))))))))))","v":"COMPRAVENTA DE BIENES MUEBLES"},"Selección abreviada ","Subasta inversa","VENDER Y ENTREGAR AL FDLSF LOS ELEMENTOS:  MUSICALES; DE  INFORMÁTICA Y  MOBILIARIO PARA LOS IED DE LA LOCALIDAD DE SANTA FE CONFORME A LAS CANTIDADES Y ESPECIFICACIONES TÉCNICAS CONTENIDAS EN LOS DOCUMENTOS DEL PROCESO FDLSF-SASI-024-2017, EN EL MARCO DEL PROYECTO 1317 ¿MEJORANDO AMBIENTES DE APRENDIZAJE PARA TODOS,  DE ACUERDO A MEMORANDO RADICADO BAJO EL NÚMERO 2017-532-00-13573 DE FECHA DICIEMBRE 21   DE 2017, FIRMADO POR EL ALCALDE LOCAL","Inversión",7,{"$f":"IF(J142=1,'Equivalencia BH-BMPT'!$D$2,IF(J142=2,'Equivalencia BH-BMPT'!$D$3,IF(J142=3,'Equivalencia BH-BMPT'!$D$4,IF(J142=4,'Equivalencia BH-BMPT'!$D$5,IF(J142=5,'Equivalencia BH-BMPT'!$D$6,IF(J142=6,'Equivalencia BH-BMPT'!$D$7,IF(J142=7,'Equivalencia BH-BMPT'!$D$8,IF(J142=8,'Equivalencia BH-BMPT'!$D$9,IF(J142=9,'Equivalencia BH-BMPT'!$D$10,IF(J142=10,'Equivalencia BH-BMPT'!$D$11,IF(J142=11,'Equivalencia BH-BMPT'!$D$12,IF(J142=12,'Equivalencia BH-BMPT'!$D$13,IF(J142=13,'Equivalencia BH-BMPT'!$D$14,IF(J142=14,'Equivalencia BH-BMPT'!$D$15,IF(J142=15,'Equivalencia BH-BMPT'!$D$16,IF(J142=16,'Equivalencia BH-BMPT'!$D$17,IF(J142=17,'Equivalencia BH-BMPT'!$D$18,IF(J142=18,'Equivalencia BH-BMPT'!$D$19,IF(J142=19,'Equivalencia BH-BMPT'!$D$20,IF(J142=20,'Equivalencia BH-BMPT'!$D$21,IF(J142=21,'Equivalencia BH-BMPT'!$D$22,IF(J142=22,'Equivalencia BH-BMPT'!$D$23,IF(J142=23,'Equivalencia BH-BMPT'!#REF!,IF(J142=24,'Equivalencia BH-BMPT'!$D$25,IF(J142=25,'Equivalencia BH-BMPT'!$D$26,IF(J142=26,'Equivalencia BH-BMPT'!$D$27,IF(J142=27,'Equivalencia BH-BMPT'!$D$28,IF(J142=28,'Equivalencia BH-BMPT'!$D$29,IF(J142=29,'Equivalencia BH-BMPT'!$D$30,IF(J142=30,'Equivalencia BH-BMPT'!$D$31,IF(J142=31,'Equivalencia BH-BMPT'!$D$32,IF(J142=32,'Equivalencia BH-BMPT'!$D$33,IF(J142=33,'Equivalencia BH-BMPT'!$D$34,IF(J142=34,'Equivalencia BH-BMPT'!$D$35,IF(J142=35,'Equivalencia BH-BMPT'!$D$36,IF(J142=36,'Equivalencia BH-BMPT'!$D$37,IF(J142=37,'Equivalencia BH-BMPT'!$D$38,IF(J142=38,'Equivalencia BH-BMPT'!#REF!,IF(J142=39,'Equivalencia BH-BMPT'!$D$40,IF(J142=40,'Equivalencia BH-BMPT'!$D$41,IF(J142=41,'Equivalencia BH-BMPT'!$D$42,IF(J142=42,'Equivalencia BH-BMPT'!$D$43,IF(J142=43,'Equivalencia BH-BMPT'!$D$44,IF(J142=44,'Equivalencia BH-BMPT'!$D$45,IF(J142=45,'Equivalencia BH-BMPT'!$D$46,\"No ha seleccionado un número de programa\")))))))))))))))))))))))))))))))))))))))))))))","v":"Inclusión educativa para la equidad"},1317,860053274,"GRUPO LOS LAGOS S.A.S",8458735,null,null,0,0,8458735,0,"2017/12/11","2017/12/11","2018-03-10",90,121,null,null,"X",null,null,0,null,false]
[131,2017,"17-12-7425217",5,{"$f":"IF(D143=1,'Tipo '!$B$2,IF(D143=2,'Tipo '!$B$3,IF(D143=3,'Tipo '!$B$4,IF(D143=4,'Tipo '!$B$5,IF(D143=5,'Tipo '!$B$6,IF(D143=6,'Tipo '!$B$7,IF(D143=7,'Tipo '!$B$8,IF(D143=8,'Tipo '!$B$9,IF(D143=9,'Tipo '!$B$10,IF(D143=10,'Tipo '!$B$11,IF(D143=11,'Tipo '!$B$12,IF(D143=12,'Tipo '!$B$13,IF(D143=13,'Tipo '!$B$14,IF(D143=14,'Tipo '!$B$15,IF(D143=15,'Tipo '!$B$16,IF(D143=16,'Tipo '!$B$17,IF(D143=17,'Tipo '!$B$18,IF(D143=18,'Tipo '!$B$19,IF(D143=19,'Tipo '!$B$20,\"No ha seleccionado un tipo de contrato válido\")))))))))))))))))))","v":"CONTRATOS DE PRESTACIÓN DE SERVICIOS PROFESIONALES Y DE APOYO A LA GESTIÓN"},"Contratación directa","Acuerdo marco de precios ","PRESTAR SERVICIOS DE APOYO A LA GESTIÓN DE LA ALCALDÍA LOCAL DE SANTA FE ENCAMINADOS A LA COORDINACIÓN Y GESTIÓN OPERATIVA DE LA FERIA NAVIDEÑA DE VENDEDORES INFORMALES A DESARROLLARSE EN EL MES DE DICIEMBRE DE 2017, EN MARCO DEL PROYECTO 1326. ¿FORTALECIMIENTO INSTITUCIONAL¿. DE ACUERDO A MEMORANDO RADICADO BAJO EL NÚMERO 2017-532-00-13023 DE FECHA DICIEMBRE 11 DE 2017, FIRMADO POR EL ALCALDE LOCAL Y DOCUMENTO NO HAY NÚMERO  2101/2017      DE FECHA  VIERNES 1 DE DICIEMBRE DE 2017 EXPEDIDO POR LA DIRECCION DE GESTION DEL TALENTO HUMANO DE LA SECRETARIA DISTRITAL DE GOBIERNO.","Inversión",45,{"$f":"IF(J143=1,'Equivalencia BH-BMPT'!$D$2,IF(J143=2,'Equivalencia BH-BMPT'!$D$3,IF(J143=3,'Equivalencia BH-BMPT'!$D$4,IF(J143=4,'Equivalencia BH-BMPT'!$D$5,IF(J143=5,'Equivalencia BH-BMPT'!$D$6,IF(J143=6,'Equivalencia BH-BMPT'!$D$7,IF(J143=7,'Equivalencia BH-BMPT'!$D$8,IF(J143=8,'Equivalencia BH-BMPT'!$D$9,IF(J143=9,'Equivalencia BH-BMPT'!$D$10,IF(J143=10,'Equivalencia BH-BMPT'!$D$11,IF(J143=11,'Equivalencia BH-BMPT'!$D$12,IF(J143=12,'Equivalencia BH-BMPT'!$D$13,IF(J143=13,'Equivalencia BH-BMPT'!$D$14,IF(J143=14,'Equivalencia BH-BMPT'!$D$15,IF(J143=15,'Equivalencia BH-BMPT'!$D$16,IF(J143=16,'Equivalencia BH-BMPT'!$D$17,IF(J143=17,'Equivalencia BH-BMPT'!$D$18,IF(J143=18,'Equivalencia BH-BMPT'!$D$19,IF(J143=19,'Equivalencia BH-BMPT'!$D$20,IF(J143=20,'Equivalencia BH-BMPT'!$D$21,IF(J143=21,'Equivalencia BH-BMPT'!$D$22,IF(J143=22,'Equivalencia BH-BMPT'!$D$23,IF(J143=23,'Equivalencia BH-BMPT'!#REF!,IF(J143=24,'Equivalencia BH-BMPT'!$D$25,IF(J143=25,'Equivalencia BH-BMPT'!$D$26,IF(J143=26,'Equivalencia BH-BMPT'!$D$27,IF(J143=27,'Equivalencia BH-BMPT'!$D$28,IF(J143=28,'Equivalencia BH-BMPT'!$D$29,IF(J143=29,'Equivalencia BH-BMPT'!$D$30,IF(J143=30,'Equivalencia BH-BMPT'!$D$31,IF(J143=31,'Equivalencia BH-BMPT'!$D$32,IF(J143=32,'Equivalencia BH-BMPT'!$D$33,IF(J143=33,'Equivalencia BH-BMPT'!$D$34,IF(J143=34,'Equivalencia BH-BMPT'!$D$35,IF(J143=35,'Equivalencia BH-BMPT'!$D$36,IF(J143=36,'Equivalencia BH-BMPT'!$D$37,IF(J143=37,'Equivalencia BH-BMPT'!$D$38,IF(J143=38,'Equivalencia BH-BMPT'!#REF!,IF(J143=39,'Equivalencia BH-BMPT'!$D$40,IF(J143=40,'Equivalencia BH-BMPT'!$D$41,IF(J143=41,'Equivalencia BH-BMPT'!$D$42,IF(J143=42,'Equivalencia BH-BMPT'!$D$43,IF(J143=43,'Equivalencia BH-BMPT'!$D$44,IF(J143=44,'Equivalencia BH-BMPT'!$D$45,IF(J143=45,'Equivalencia BH-BMPT'!$D$46,\"No ha seleccionado un número de programa\")))))))))))))))))))))))))))))))))))))))))))))","v":"Gobernanza e influencia local, regional e internacional"},1326,1010218952,"KEVIN OSWALDO LEIVA QUIMBAYO",2000000,null,null,0,0,2000000,0,"2017/12/11","2017/12/11","2018-01-10",30,122,null,null,"X",null,null,0,null,false]
[132,2017,"17-12-7425467",5,{"$f":"IF(D144=1,'Tipo '!$B$2,IF(D144=2,'Tipo '!$B$3,IF(D144=3,'Tipo '!$B$4,IF(D144=4,'Tipo '!$B$5,IF(D144=5,'Tipo '!$B$6,IF(D144=6,'Tipo '!$B$7,IF(D144=7,'Tipo '!$B$8,IF(D144=8,'Tipo '!$B$9,IF(D144=9,'Tipo '!$B$10,IF(D144=10,'Tipo '!$B$11,IF(D144=11,'Tipo '!$B$12,IF(D144=12,'Tipo '!$B$13,IF(D144=13,'Tipo '!$B$14,IF(D144=14,'Tipo '!$B$15,IF(D144=15,'Tipo '!$B$16,IF(D144=16,'Tipo '!$B$17,IF(D144=17,'Tipo '!$B$18,IF(D144=18,'Tipo '!$B$19,IF(D144=19,'Tipo '!$B$20,\"No ha seleccionado un tipo de contrato válido\")))))))))))))))))))","v":"CONTRATOS DE PRESTACIÓN DE SERVICIOS PROFESIONALES Y DE APOYO A LA GESTIÓN"},"Contratación directa","Prestación de servicios profesionales y de apoyo a la gestión, o para la ejecución de trabajos artísticos que sólo puedan encomendarse a determinadas personas naturales;","PRESTAR SERVICIOS DE APOYO A LA GESTIÓN A LA ALCALDÍA LOCAL DE SANTA FE ENCAMINADOS A LA ATENCIÓN, GESTIÓN Y SOPORTE OPERATIVO EN LA FERIA NAVIDEÑA DE VENDEDORES INFORMALES A DESARROLLARSE EN EL MES DE DICIEMBRE DE 2017, EN MARCO DEL PROYECTO 1326. ¿FORTALECIMIENTO INSTITUCIONAL¿. DE ACUERDO A MEMORANDO RADICADO BAJO EL NÚMERO 2017-532-00-13013 DE FECHA DICIEMBRE 11 DE 2017, FIRMADO POR EL ALCALDE LOCAL Y DOCUMENTO NO HAY NÚMERO  2102/2017      DE FECHA  VIERNES 1 DE DICIEMBRE DE 2017 EXPEDIDO POR LA DIRECCION DE GESTION DEL TALENTO HUMANO DE LA SECRETARIA DISTRITAL DE GOBIERNO.","Inversión",45,{"$f":"IF(J144=1,'Equivalencia BH-BMPT'!$D$2,IF(J144=2,'Equivalencia BH-BMPT'!$D$3,IF(J144=3,'Equivalencia BH-BMPT'!$D$4,IF(J144=4,'Equivalencia BH-BMPT'!$D$5,IF(J144=5,'Equivalencia BH-BMPT'!$D$6,IF(J144=6,'Equivalencia BH-BMPT'!$D$7,IF(J144=7,'Equivalencia BH-BMPT'!$D$8,IF(J144=8,'Equivalencia BH-BMPT'!$D$9,IF(J144=9,'Equivalencia BH-BMPT'!$D$10,IF(J144=10,'Equivalencia BH-BMPT'!$D$11,IF(J144=11,'Equivalencia BH-BMPT'!$D$12,IF(J144=12,'Equivalencia BH-BMPT'!$D$13,IF(J144=13,'Equivalencia BH-BMPT'!$D$14,IF(J144=14,'Equivalencia BH-BMPT'!$D$15,IF(J144=15,'Equivalencia BH-BMPT'!$D$16,IF(J144=16,'Equivalencia BH-BMPT'!$D$17,IF(J144=17,'Equivalencia BH-BMPT'!$D$18,IF(J144=18,'Equivalencia BH-BMPT'!$D$19,IF(J144=19,'Equivalencia BH-BMPT'!$D$20,IF(J144=20,'Equivalencia BH-BMPT'!$D$21,IF(J144=21,'Equivalencia BH-BMPT'!$D$22,IF(J144=22,'Equivalencia BH-BMPT'!$D$23,IF(J144=23,'Equivalencia BH-BMPT'!#REF!,IF(J144=24,'Equivalencia BH-BMPT'!$D$25,IF(J144=25,'Equivalencia BH-BMPT'!$D$26,IF(J144=26,'Equivalencia BH-BMPT'!$D$27,IF(J144=27,'Equivalencia BH-BMPT'!$D$28,IF(J144=28,'Equivalencia BH-BMPT'!$D$29,IF(J144=29,'Equivalencia BH-BMPT'!$D$30,IF(J144=30,'Equivalencia BH-BMPT'!$D$31,IF(J144=31,'Equivalencia BH-BMPT'!$D$32,IF(J144=32,'Equivalencia BH-BMPT'!$D$33,IF(J144=33,'Equivalencia BH-BMPT'!$D$34,IF(J144=34,'Equivalencia BH-BMPT'!$D$35,IF(J144=35,'Equivalencia BH-BMPT'!$D$36,IF(J144=36,'Equivalencia BH-BMPT'!$D$37,IF(J144=37,'Equivalencia BH-BMPT'!$D$38,IF(J144=38,'Equivalencia BH-BMPT'!#REF!,IF(J144=39,'Equivalencia BH-BMPT'!$D$40,IF(J144=40,'Equivalencia BH-BMPT'!$D$41,IF(J144=41,'Equivalencia BH-BMPT'!$D$42,IF(J144=42,'Equivalencia BH-BMPT'!$D$43,IF(J144=43,'Equivalencia BH-BMPT'!$D$44,IF(J144=44,'Equivalencia BH-BMPT'!$D$45,IF(J144=45,'Equivalencia BH-BMPT'!$D$46,\"No ha seleccionado un número de programa\")))))))))))))))))))))))))))))))))))))))))))))","v":"Gobernanza e influencia local, regional e internacional"},1326,80927357,"CARLOS JAVIER FLOREZ AGUILERA",1400000,null,null,0,0,1400000,0,"2017/12/11","2017/12/11","2018-01-10",30,123,null,null,"X",null,null,0,null,false]
[133,2017,"17-12-7425522",5,{"$f":"IF(D145=1,'Tipo '!$B$2,IF(D145=2,'Tipo '!$B$3,IF(D145=3,'Tipo '!$B$4,IF(D145=4,'Tipo '!$B$5,IF(D145=5,'Tipo '!$B$6,IF(D145=6,'Tipo '!$B$7,IF(D145=7,'Tipo '!$B$8,IF(D145=8,'Tipo '!$B$9,IF(D145=9,'Tipo '!$B$10,IF(D145=10,'Tipo '!$B$11,IF(D145=11,'Tipo '!$B$12,IF(D145=12,'Tipo '!$B$13,IF(D145=13,'Tipo '!$B$14,IF(D145=14,'Tipo '!$B$15,IF(D145=15,'Tipo '!$B$16,IF(D145=16,'Tipo '!$B$17,IF(D145=17,'Tipo '!$B$18,IF(D145=18,'Tipo '!$B$19,IF(D145=19,'Tipo '!$B$20,\"No ha seleccionado un tipo de contrato válido\")))))))))))))))))))","v":"CONTRATOS DE PRESTACIÓN DE SERVICIOS PROFESIONALES Y DE APOYO A LA GESTIÓN"},"Contratación directa","Prestación de servicios profesionales y de apoyo a la gestión, o para la ejecución de trabajos artísticos que sólo puedan encomendarse a determinadas personas naturales;","PRESTAR SERVICIOS DE APOYO A LA GESTIÓN A LA ALCALDÍA LOCAL DE SANTA FE ENCAMINADOS A LA ATENCIÓN, GESTIÓN Y SOPORTE OPERATIVO EN LA FERIA NAVIDEÑA DE VENDEDORES INFORMALES A DESARROLLARSE EN EL MES DE DICIEMBRE DE 2017, EN MARCO DEL PROYECTO 1326. ¿FORTALECIMIENTO INSTITUCIONAL¿. DE ACUERDO A MEMORANDO RADICADO BAJO EL NÚMERO 2017-532-00-13003 DE FECHA DICIEMBRE 11 DE 2017, FIRMADO POR EL ALCALDE LOCAL Y DOCUMENTO NO HAY NÚMERO  2102/2017      DE FECHA  VIERNES 1 DE DICIEMBRE DE 2017 EXPEDIDO POR LA DIRECCION DE GESTION DEL TALENTO HUMANO DE LA SECRETARIA DISTRITAL DE GOBIERNO.","Inversión",45,{"$f":"IF(J145=1,'Equivalencia BH-BMPT'!$D$2,IF(J145=2,'Equivalencia BH-BMPT'!$D$3,IF(J145=3,'Equivalencia BH-BMPT'!$D$4,IF(J145=4,'Equivalencia BH-BMPT'!$D$5,IF(J145=5,'Equivalencia BH-BMPT'!$D$6,IF(J145=6,'Equivalencia BH-BMPT'!$D$7,IF(J145=7,'Equivalencia BH-BMPT'!$D$8,IF(J145=8,'Equivalencia BH-BMPT'!$D$9,IF(J145=9,'Equivalencia BH-BMPT'!$D$10,IF(J145=10,'Equivalencia BH-BMPT'!$D$11,IF(J145=11,'Equivalencia BH-BMPT'!$D$12,IF(J145=12,'Equivalencia BH-BMPT'!$D$13,IF(J145=13,'Equivalencia BH-BMPT'!$D$14,IF(J145=14,'Equivalencia BH-BMPT'!$D$15,IF(J145=15,'Equivalencia BH-BMPT'!$D$16,IF(J145=16,'Equivalencia BH-BMPT'!$D$17,IF(J145=17,'Equivalencia BH-BMPT'!$D$18,IF(J145=18,'Equivalencia BH-BMPT'!$D$19,IF(J145=19,'Equivalencia BH-BMPT'!$D$20,IF(J145=20,'Equivalencia BH-BMPT'!$D$21,IF(J145=21,'Equivalencia BH-BMPT'!$D$22,IF(J145=22,'Equivalencia BH-BMPT'!$D$23,IF(J145=23,'Equivalencia BH-BMPT'!#REF!,IF(J145=24,'Equivalencia BH-BMPT'!$D$25,IF(J145=25,'Equivalencia BH-BMPT'!$D$26,IF(J145=26,'Equivalencia BH-BMPT'!$D$27,IF(J145=27,'Equivalencia BH-BMPT'!$D$28,IF(J145=28,'Equivalencia BH-BMPT'!$D$29,IF(J145=29,'Equivalencia BH-BMPT'!$D$30,IF(J145=30,'Equivalencia BH-BMPT'!$D$31,IF(J145=31,'Equivalencia BH-BMPT'!$D$32,IF(J145=32,'Equivalencia BH-BMPT'!$D$33,IF(J145=33,'Equivalencia BH-BMPT'!$D$34,IF(J145=34,'Equivalencia BH-BMPT'!$D$35,IF(J145=35,'Equivalencia BH-BMPT'!$D$36,IF(J145=36,'Equivalencia BH-BMPT'!$D$37,IF(J145=37,'Equivalencia BH-BMPT'!$D$38,IF(J145=38,'Equivalencia BH-BMPT'!#REF!,IF(J145=39,'Equivalencia BH-BMPT'!$D$40,IF(J145=40,'Equivalencia BH-BMPT'!$D$41,IF(J145=41,'Equivalencia BH-BMPT'!$D$42,IF(J145=42,'Equivalencia BH-BMPT'!$D$43,IF(J145=43,'Equivalencia BH-BMPT'!$D$44,IF(J145=44,'Equivalencia BH-BMPT'!$D$45,IF(J145=45,'Equivalencia BH-BMPT'!$D$46,\"No ha seleccionado un número de programa\")))))))))))))))))))))))))))))))))))))))))))))","v":"Gobernanza e influencia local, regional e internacional"},1326,1048211471,"ANDREINA MERCEDES GOENAGA POLO",1400000,null,null,0,0,1400000,0,"2017/12/11","2017/12/11","2018-01-10",30,124,null,null,"X",null,null,{"$f":"SUM(U145/T145)","v":0},null,{"$f":"IF(I145=\"Funcionamiento\",J145=0,J145=\"\")","v":false}]
[134,2017,"17-12-7425552",5,{"$f":"IF(D146=1,'Tipo '!$B$2,IF(D146=2,'Tipo '!$B$3,IF(D146=3,'Tipo '!$B$4,IF(D146=4,'Tipo '!$B$5,IF(D146=5,'Tipo '!$B$6,IF(D146=6,'Tipo '!$B$7,IF(D146=7,'Tipo '!$B$8,IF(D146=8,'Tipo '!$B$9,IF(D146=9,'Tipo '!$B$10,IF(D146=10,'Tipo '!$B$11,IF(D146=11,'Tipo '!$B$12,IF(D146=12,'Tipo '!$B$13,IF(D146=13,'Tipo '!$B$14,IF(D146=14,'Tipo '!$B$15,IF(D146=15,'Tipo '!$B$16,IF(D146=16,'Tipo '!$B$17,IF(D146=17,'Tipo '!$B$18,IF(D146=18,'Tipo '!$B$19,IF(D146=19,'Tipo '!$B$20,\"No ha seleccionado un tipo de contrato válido\")))))))))))))))))))","v":"CONTRATOS DE PRESTACIÓN DE SERVICIOS PROFESIONALES Y DE APOYO A LA GESTIÓN"},"Contratación directa","Prestación de servicios profesionales y de apoyo a la gestión, o para la ejecución de trabajos artísticos que sólo puedan encomendarse a determinadas personas naturales;","PRESTAR SERVICIOS DE APOYO A LA GESTIÓN A LA ALCALDÍA LOCAL DE SANTA FE ENCAMINADOS A LA ATENCIÓN, GESTIÓN Y SOPORTE OPERATIVO EN LA FERIA NAVIDEÑA DE VENDEDORES INFORMALES A DESARROLLARSE EN EL MES DE DICIEMBRE DE 2017, EN MARCO DEL PROYECTO 1326. ¿FORTALECIMIENTO INSTITUCIONAL¿. DE ACUERDO A MEMORANDO RADICADO BAJO EL NÚMERO 2017-532-00-12983 DE FECHA DICIEMBRE 11 DE 2017, FIRMADO POR EL ALCALDE LOCAL Y DOCUMENTO NO HAY NÚMERO  2102/2017      DE FECHA  VIERNES 1 DE DICIEMBRE DE 2017 EXPEDIDO POR LA DIRECCION DE GESTION DEL TALENTO HUMANO DE LA SECRETARIA DISTRITAL DE GOBIERNO.","Inversión",45,{"$f":"IF(J146=1,'Equivalencia BH-BMPT'!$D$2,IF(J146=2,'Equivalencia BH-BMPT'!$D$3,IF(J146=3,'Equivalencia BH-BMPT'!$D$4,IF(J146=4,'Equivalencia BH-BMPT'!$D$5,IF(J146=5,'Equivalencia BH-BMPT'!$D$6,IF(J146=6,'Equivalencia BH-BMPT'!$D$7,IF(J146=7,'Equivalencia BH-BMPT'!$D$8,IF(J146=8,'Equivalencia BH-BMPT'!$D$9,IF(J146=9,'Equivalencia BH-BMPT'!$D$10,IF(J146=10,'Equivalencia BH-BMPT'!$D$11,IF(J146=11,'Equivalencia BH-BMPT'!$D$12,IF(J146=12,'Equivalencia BH-BMPT'!$D$13,IF(J146=13,'Equivalencia BH-BMPT'!$D$14,IF(J146=14,'Equivalencia BH-BMPT'!$D$15,IF(J146=15,'Equivalencia BH-BMPT'!$D$16,IF(J146=16,'Equivalencia BH-BMPT'!$D$17,IF(J146=17,'Equivalencia BH-BMPT'!$D$18,IF(J146=18,'Equivalencia BH-BMPT'!$D$19,IF(J146=19,'Equivalencia BH-BMPT'!$D$20,IF(J146=20,'Equivalencia BH-BMPT'!$D$21,IF(J146=21,'Equivalencia BH-BMPT'!$D$22,IF(J146=22,'Equivalencia BH-BMPT'!$D$23,IF(J146=23,'Equivalencia BH-BMPT'!#REF!,IF(J146=24,'Equivalencia BH-BMPT'!$D$25,IF(J146=25,'Equivalencia BH-BMPT'!$D$26,IF(J146=26,'Equivalencia BH-BMPT'!$D$27,IF(J146=27,'Equivalencia BH-BMPT'!$D$28,IF(J146=28,'Equivalencia BH-BMPT'!$D$29,IF(J146=29,'Equivalencia BH-BMPT'!$D$30,IF(J146=30,'Equivalencia BH-BMPT'!$D$31,IF(J146=31,'Equivalencia BH-BMPT'!$D$32,IF(J146=32,'Equivalencia BH-BMPT'!$D$33,IF(J146=33,'Equivalencia BH-BMPT'!$D$34,IF(J146=34,'Equivalencia BH-BMPT'!$D$35,IF(J146=35,'Equivalencia BH-BMPT'!$D$36,IF(J146=36,'Equivalencia BH-BMPT'!$D$37,IF(J146=37,'Equivalencia BH-BMPT'!$D$38,IF(J146=38,'Equivalencia BH-BMPT'!#REF!,IF(J146=39,'Equivalencia BH-BMPT'!$D$40,IF(J146=40,'Equivalencia BH-BMPT'!$D$41,IF(J146=41,'Equivalencia BH-BMPT'!$D$42,IF(J146=42,'Equivalencia BH-BMPT'!$D$43,IF(J146=43,'Equivalencia BH-BMPT'!$D$44,IF(J146=44,'Equivalencia BH-BMPT'!$D$45,IF(J146=45,'Equivalencia BH-BMPT'!$D$46,\"No ha seleccionado un número de programa\")))))))))))))))))))))))))))))))))))))))))))))","v":"Gobernanza e influencia local, regional e internacional"},1326,1026299252,"FABIAN ESTEBAN HERRERA BALLESTEROS",1400000,null,null,0,0,1400000,0,"2017/12/11","2017/12/11","2018-01-10",30,125,null,null,"X",null,null,0,null,false]
[135,2017,"17-12-7425590",5,{"$f":"IF(D147=1,'Tipo '!$B$2,IF(D147=2,'Tipo '!$B$3,IF(D147=3,'Tipo '!$B$4,IF(D147=4,'Tipo '!$B$5,IF(D147=5,'Tipo '!$B$6,IF(D147=6,'Tipo '!$B$7,IF(D147=7,'Tipo '!$B$8,IF(D147=8,'Tipo '!$B$9,IF(D147=9,'Tipo '!$B$10,IF(D147=10,'Tipo '!$B$11,IF(D147=11,'Tipo '!$B$12,IF(D147=12,'Tipo '!$B$13,IF(D147=13,'Tipo '!$B$14,IF(D147=14,'Tipo '!$B$15,IF(D147=15,'Tipo '!$B$16,IF(D147=16,'Tipo '!$B$17,IF(D147=17,'Tipo '!$B$18,IF(D147=18,'Tipo '!$B$19,IF(D147=19,'Tipo '!$B$20,\"No ha seleccionado un tipo de contrato válido\")))))))))))))))))))","v":"CONTRATOS DE PRESTACIÓN DE SERVICIOS PROFESIONALES Y DE APOYO A LA GESTIÓN"},"Contratación directa","Prestación de servicios profesionales y de apoyo a la gestión, o para la ejecución de trabajos artísticos que sólo puedan encomendarse a determinadas personas naturales;","PRESTAR SERVICIOS DE APOYO A LA GESTIÓN A LA ALCALDÍA LOCAL DE SANTA FE ENCAMINADOS A LA ATENCIÓN, GESTIÓN Y SOPORTE OPERATIVO EN LA FERIA NAVIDEÑA DE VENDEDORES INFORMALES A DESARROLLARSE EN EL MES DE DICIEMBRE DE 2017, EN MARCO DEL PROYECTO 1326. ¿FORTALECIMIENTO INSTITUCIONAL¿. DE ACUERDO A MEMORANDO RADICADO BAJO EL NÚMERO 2017-532-00-13103 DE FECHA DICIEMBRE    13   DE 2017, FIRMADO POR EL ALCALDE LOCAL Y DOCUMENTO NO HAY NÚMERO  2102/2017      DE FECHA  VIERNES 1 DE DICIEMBRE DE 2017 EXPEDIDO POR LA DIRECCION DE GESTION DEL TALENTO HUMANO DE LA SECRETARIA DISTRITAL DE GOBIERNO.","Inversión",45,{"$f":"IF(J147=1,'Equivalencia BH-BMPT'!$D$2,IF(J147=2,'Equivalencia BH-BMPT'!$D$3,IF(J147=3,'Equivalencia BH-BMPT'!$D$4,IF(J147=4,'Equivalencia BH-BMPT'!$D$5,IF(J147=5,'Equivalencia BH-BMPT'!$D$6,IF(J147=6,'Equivalencia BH-BMPT'!$D$7,IF(J147=7,'Equivalencia BH-BMPT'!$D$8,IF(J147=8,'Equivalencia BH-BMPT'!$D$9,IF(J147=9,'Equivalencia BH-BMPT'!$D$10,IF(J147=10,'Equivalencia BH-BMPT'!$D$11,IF(J147=11,'Equivalencia BH-BMPT'!$D$12,IF(J147=12,'Equivalencia BH-BMPT'!$D$13,IF(J147=13,'Equivalencia BH-BMPT'!$D$14,IF(J147=14,'Equivalencia BH-BMPT'!$D$15,IF(J147=15,'Equivalencia BH-BMPT'!$D$16,IF(J147=16,'Equivalencia BH-BMPT'!$D$17,IF(J147=17,'Equivalencia BH-BMPT'!$D$18,IF(J147=18,'Equivalencia BH-BMPT'!$D$19,IF(J147=19,'Equivalencia BH-BMPT'!$D$20,IF(J147=20,'Equivalencia BH-BMPT'!$D$21,IF(J147=21,'Equivalencia BH-BMPT'!$D$22,IF(J147=22,'Equivalencia BH-BMPT'!$D$23,IF(J147=23,'Equivalencia BH-BMPT'!#REF!,IF(J147=24,'Equivalencia BH-BMPT'!$D$25,IF(J147=25,'Equivalencia BH-BMPT'!$D$26,IF(J147=26,'Equivalencia BH-BMPT'!$D$27,IF(J147=27,'Equivalencia BH-BMPT'!$D$28,IF(J147=28,'Equivalencia BH-BMPT'!$D$29,IF(J147=29,'Equivalencia BH-BMPT'!$D$30,IF(J147=30,'Equivalencia BH-BMPT'!$D$31,IF(J147=31,'Equivalencia BH-BMPT'!$D$32,IF(J147=32,'Equivalencia BH-BMPT'!$D$33,IF(J147=33,'Equivalencia BH-BMPT'!$D$34,IF(J147=34,'Equivalencia BH-BMPT'!$D$35,IF(J147=35,'Equivalencia BH-BMPT'!$D$36,IF(J147=36,'Equivalencia BH-BMPT'!$D$37,IF(J147=37,'Equivalencia BH-BMPT'!$D$38,IF(J147=38,'Equivalencia BH-BMPT'!#REF!,IF(J147=39,'Equivalencia BH-BMPT'!$D$40,IF(J147=40,'Equivalencia BH-BMPT'!$D$41,IF(J147=41,'Equivalencia BH-BMPT'!$D$42,IF(J147=42,'Equivalencia BH-BMPT'!$D$43,IF(J147=43,'Equivalencia BH-BMPT'!$D$44,IF(J147=44,'Equivalencia BH-BMPT'!$D$45,IF(J147=45,'Equivalencia BH-BMPT'!$D$46,\"No ha seleccionado un número de programa\")))))))))))))))))))))))))))))))))))))))))))))","v":"Gobernanza e influencia local, regional e internacional"},1326,6135251,"CRISTIAN  RENDON GOMEZ",1400000,null,null,0,0,1400000,0,"2017/12/13","2017/12/13","2018-01-10",30,126,null,null,"X",null,null,0,null,false]
[136,2017,"CO1.PCCNTR.256443",4,{"$f":"IF(D148=1,'Tipo '!$B$2,IF(D148=2,'Tipo '!$B$3,IF(D148=3,'Tipo '!$B$4,IF(D148=4,'Tipo '!$B$5,IF(D148=5,'Tipo '!$B$6,IF(D148=6,'Tipo '!$B$7,IF(D148=7,'Tipo '!$B$8,IF(D148=8,'Tipo '!$B$9,IF(D148=9,'Tipo '!$B$10,IF(D148=10,'Tipo '!$B$11,IF(D148=11,'Tipo '!$B$12,IF(D148=12,'Tipo '!$B$13,IF(D148=13,'Tipo '!$B$14,IF(D148=14,'Tipo '!$B$15,IF(D148=15,'Tipo '!$B$16,IF(D148=16,'Tipo '!$B$17,IF(D148=17,'Tipo '!$B$18,IF(D148=18,'Tipo '!$B$19,IF(D148=19,'Tipo '!$B$20,\"No ha seleccionado un tipo de contrato válido\")))))))))))))))))))","v":"CONTRATOS DE PRESTACIÓN DE SERVICIOS"},"Selección abreviada ","Selección abreviada por menor cuantía ","REALIZAR ACCIONES QUE FORTALEZCAN LA PROMOCIÓN DEL BUEN TRATO INFANTIL Y LA PREVENCIÓN DE LA VIOLENCIA INTRAFAMILIAR CON ENFOQUE INTEGRAL, EN EL MARCO DEL PROYECTO NO. 1314., DE ACUERDO A MEMORANDO RADICADO BAJO EL NÚMERO 2017-532-00-13443 DE FECHA DICIEMBRE 20  DE 2017, FIRMADO POR EL ALCALDE LOCAL,","Inversión",2,{"$f":"IF(J148=1,'Equivalencia BH-BMPT'!$D$2,IF(J148=2,'Equivalencia BH-BMPT'!$D$3,IF(J148=3,'Equivalencia BH-BMPT'!$D$4,IF(J148=4,'Equivalencia BH-BMPT'!$D$5,IF(J148=5,'Equivalencia BH-BMPT'!$D$6,IF(J148=6,'Equivalencia BH-BMPT'!$D$7,IF(J148=7,'Equivalencia BH-BMPT'!$D$8,IF(J148=8,'Equivalencia BH-BMPT'!$D$9,IF(J148=9,'Equivalencia BH-BMPT'!$D$10,IF(J148=10,'Equivalencia BH-BMPT'!$D$11,IF(J148=11,'Equivalencia BH-BMPT'!$D$12,IF(J148=12,'Equivalencia BH-BMPT'!$D$13,IF(J148=13,'Equivalencia BH-BMPT'!$D$14,IF(J148=14,'Equivalencia BH-BMPT'!$D$15,IF(J148=15,'Equivalencia BH-BMPT'!$D$16,IF(J148=16,'Equivalencia BH-BMPT'!$D$17,IF(J148=17,'Equivalencia BH-BMPT'!$D$18,IF(J148=18,'Equivalencia BH-BMPT'!$D$19,IF(J148=19,'Equivalencia BH-BMPT'!$D$20,IF(J148=20,'Equivalencia BH-BMPT'!$D$21,IF(J148=21,'Equivalencia BH-BMPT'!$D$22,IF(J148=22,'Equivalencia BH-BMPT'!$D$23,IF(J148=23,'Equivalencia BH-BMPT'!#REF!,IF(J148=24,'Equivalencia BH-BMPT'!$D$25,IF(J148=25,'Equivalencia BH-BMPT'!$D$26,IF(J148=26,'Equivalencia BH-BMPT'!$D$27,IF(J148=27,'Equivalencia BH-BMPT'!$D$28,IF(J148=28,'Equivalencia BH-BMPT'!$D$29,IF(J148=29,'Equivalencia BH-BMPT'!$D$30,IF(J148=30,'Equivalencia BH-BMPT'!$D$31,IF(J148=31,'Equivalencia BH-BMPT'!$D$32,IF(J148=32,'Equivalencia BH-BMPT'!$D$33,IF(J148=33,'Equivalencia BH-BMPT'!$D$34,IF(J148=34,'Equivalencia BH-BMPT'!$D$35,IF(J148=35,'Equivalencia BH-BMPT'!$D$36,IF(J148=36,'Equivalencia BH-BMPT'!$D$37,IF(J148=37,'Equivalencia BH-BMPT'!$D$38,IF(J148=38,'Equivalencia BH-BMPT'!#REF!,IF(J148=39,'Equivalencia BH-BMPT'!$D$40,IF(J148=40,'Equivalencia BH-BMPT'!$D$41,IF(J148=41,'Equivalencia BH-BMPT'!$D$42,IF(J148=42,'Equivalencia BH-BMPT'!$D$43,IF(J148=43,'Equivalencia BH-BMPT'!$D$44,IF(J148=44,'Equivalencia BH-BMPT'!$D$45,IF(J148=45,'Equivalencia BH-BMPT'!$D$46,\"No ha seleccionado un número de programa\")))))))))))))))))))))))))))))))))))))))))))))","v":"Desarrollo integral desde la gestación hasta la adolescencia"},1314,900175862,"CORPORACION ESTRATEGICA EN GESTION E INTEGRACION COLOMBIA",103636862,null,null,0,0,103636862,0,"2017/12/18",null,"2018-05-17",150,127,null,"X",null,null,null,0,null,false]
[137,2017,"CO1.PCCNTR.25645",19,{"$f":"IF(D149=1,'Tipo '!$B$2,IF(D149=2,'Tipo '!$B$3,IF(D149=3,'Tipo '!$B$4,IF(D149=4,'Tipo '!$B$5,IF(D149=5,'Tipo '!$B$6,IF(D149=6,'Tipo '!$B$7,IF(D149=7,'Tipo '!$B$8,IF(D149=8,'Tipo '!$B$9,IF(D149=9,'Tipo '!$B$10,IF(D149=10,'Tipo '!$B$11,IF(D149=11,'Tipo '!$B$12,IF(D149=12,'Tipo '!$B$13,IF(D149=13,'Tipo '!$B$14,IF(D149=14,'Tipo '!$B$15,IF(D149=15,'Tipo '!$B$16,IF(D149=16,'Tipo '!$B$17,IF(D149=17,'Tipo '!$B$18,IF(D149=18,'Tipo '!$B$19,IF(D149=19,'Tipo '!$B$20,\"No ha seleccionado un tipo de contrato válido\")))))))))))))))))))","v":"OTROS"},"Selección abreviada ","Selección abreviada por menor cuantía ","REALIZAR LA SUSTITUCIÓN DE ESPECIES EXÓTICAS (RETAMO LISO Y ESPINOSO) EN LA ZONA RURAL DE LA LOCALIDAD DE SANTA FE, MEDIANTE PROCESOS DE RESTAURACIÓN ECOLÓGICA EN EL MARCO DEL PROYECTO 1324 RENATURALIZANDO LAS ZONAS VERDES DE SANTA FE,  DE ACUERDO A MEMORANDO RADICADO BAJO EL NÚMERO 2017-532-00-13473 DE FECHA DICIEMBRE 20  DE 2017, FIRMADO POR EL ALCALDE LOCAL","Inversión",38,{"$f":"IF(J149=1,'Equivalencia BH-BMPT'!$D$2,IF(J149=2,'Equivalencia BH-BMPT'!$D$3,IF(J149=3,'Equivalencia BH-BMPT'!$D$4,IF(J149=4,'Equivalencia BH-BMPT'!$D$5,IF(J149=5,'Equivalencia BH-BMPT'!$D$6,IF(J149=6,'Equivalencia BH-BMPT'!$D$7,IF(J149=7,'Equivalencia BH-BMPT'!$D$8,IF(J149=8,'Equivalencia BH-BMPT'!$D$9,IF(J149=9,'Equivalencia BH-BMPT'!$D$10,IF(J149=10,'Equivalencia BH-BMPT'!$D$11,IF(J149=11,'Equivalencia BH-BMPT'!$D$12,IF(J149=12,'Equivalencia BH-BMPT'!$D$13,IF(J149=13,'Equivalencia BH-BMPT'!$D$14,IF(J149=14,'Equivalencia BH-BMPT'!$D$15,IF(J149=15,'Equivalencia BH-BMPT'!$D$16,IF(J149=16,'Equivalencia BH-BMPT'!$D$17,IF(J149=17,'Equivalencia BH-BMPT'!$D$18,IF(J149=18,'Equivalencia BH-BMPT'!$D$19,IF(J149=19,'Equivalencia BH-BMPT'!$D$20,IF(J149=20,'Equivalencia BH-BMPT'!$D$21,IF(J149=21,'Equivalencia BH-BMPT'!$D$22,IF(J149=22,'Equivalencia BH-BMPT'!$D$23,IF(J149=23,'Equivalencia BH-BMPT'!#REF!,IF(J149=24,'Equivalencia BH-BMPT'!$D$25,IF(J149=25,'Equivalencia BH-BMPT'!$D$26,IF(J149=26,'Equivalencia BH-BMPT'!$D$27,IF(J149=27,'Equivalencia BH-BMPT'!$D$28,IF(J149=28,'Equivalencia BH-BMPT'!$D$29,IF(J149=29,'Equivalencia BH-BMPT'!$D$30,IF(J149=30,'Equivalencia BH-BMPT'!$D$31,IF(J149=31,'Equivalencia BH-BMPT'!$D$32,IF(J149=32,'Equivalencia BH-BMPT'!$D$33,IF(J149=33,'Equivalencia BH-BMPT'!$D$34,IF(J149=34,'Equivalencia BH-BMPT'!$D$35,IF(J149=35,'Equivalencia BH-BMPT'!$D$36,IF(J149=36,'Equivalencia BH-BMPT'!$D$37,IF(J149=37,'Equivalencia BH-BMPT'!$D$38,IF(J149=38,'Equivalencia BH-BMPT'!#REF!,IF(J149=39,'Equivalencia BH-BMPT'!$D$40,IF(J149=40,'Equivalencia BH-BMPT'!$D$41,IF(J149=41,'Equivalencia BH-BMPT'!$D$42,IF(J149=42,'Equivalencia BH-BMPT'!$D$43,IF(J149=43,'Equivalencia BH-BMPT'!$D$44,IF(J149=44,'Equivalencia BH-BMPT'!$D$45,IF(J149=45,'Equivalencia BH-BMPT'!$D$46,\"No ha seleccionado un número de programa\")))))))))))))))))))))))))))))))))))))))))))))","v":{"$error":"#REF!"}},1324,900205943,"PALMACTIVA",203018479,null,null,0,0,203018479,0,"2017/12/19",null,"2018-08-18",240,128,null,"X",null,null,null,0,null,false]
[138,2017,"CO1.PCCNTR.256149",1,{"$f":"IF(D150=1,'Tipo '!$B$2,IF(D150=2,'Tipo '!$B$3,IF(D150=3,'Tipo '!$B$4,IF(D150=4,'Tipo '!$B$5,IF(D150=5,'Tipo '!$B$6,IF(D150=6,'Tipo '!$B$7,IF(D150=7,'Tipo '!$B$8,IF(D150=8,'Tipo '!$B$9,IF(D150=9,'Tipo '!$B$10,IF(D150=10,'Tipo '!$B$11,IF(D150=11,'Tipo '!$B$12,IF(D150=12,'Tipo '!$B$13,IF(D150=13,'Tipo '!$B$14,IF(D150=14,'Tipo '!$B$15,IF(D150=15,'Tipo '!$B$16,IF(D150=16,'Tipo '!$B$17,IF(D150=17,'Tipo '!$B$18,IF(D150=18,'Tipo '!$B$19,IF(D150=19,'Tipo '!$B$20,\"No ha seleccionado un tipo de contrato válido\")))))))))))))))))))","v":"OBRA PÚBLICA"},"Selección abreviada ","Selección abreviada por menor cuantía ","CONTRATAR A MONTO AGOTABLE LAS OBRAS DE REPARACIONES LOCATIVAS REQUERIDAS EN LOS SALONES COMUNALES DE LA LOCALIDAD DE SANTA FE  ALCALDÍA LOCAL DE SANTA FE, DE ACUERDO A MEMORANDO RADICADO BAJO EL NÚMERO 2017-532-00-13563  DE FECHA   DICIEMBRE 21     DE 2017, FIRMADO POR EL ALCALDE LOCAL","Inversión",17,{"$f":"IF(J150=1,'Equivalencia BH-BMPT'!$D$2,IF(J150=2,'Equivalencia BH-BMPT'!$D$3,IF(J150=3,'Equivalencia BH-BMPT'!$D$4,IF(J150=4,'Equivalencia BH-BMPT'!$D$5,IF(J150=5,'Equivalencia BH-BMPT'!$D$6,IF(J150=6,'Equivalencia BH-BMPT'!$D$7,IF(J150=7,'Equivalencia BH-BMPT'!$D$8,IF(J150=8,'Equivalencia BH-BMPT'!$D$9,IF(J150=9,'Equivalencia BH-BMPT'!$D$10,IF(J150=10,'Equivalencia BH-BMPT'!$D$11,IF(J150=11,'Equivalencia BH-BMPT'!$D$12,IF(J150=12,'Equivalencia BH-BMPT'!$D$13,IF(J150=13,'Equivalencia BH-BMPT'!$D$14,IF(J150=14,'Equivalencia BH-BMPT'!$D$15,IF(J150=15,'Equivalencia BH-BMPT'!$D$16,IF(J150=16,'Equivalencia BH-BMPT'!$D$17,IF(J150=17,'Equivalencia BH-BMPT'!$D$18,IF(J150=18,'Equivalencia BH-BMPT'!$D$19,IF(J150=19,'Equivalencia BH-BMPT'!$D$20,IF(J150=20,'Equivalencia BH-BMPT'!$D$21,IF(J150=21,'Equivalencia BH-BMPT'!$D$22,IF(J150=22,'Equivalencia BH-BMPT'!$D$23,IF(J150=23,'Equivalencia BH-BMPT'!#REF!,IF(J150=24,'Equivalencia BH-BMPT'!$D$25,IF(J150=25,'Equivalencia BH-BMPT'!$D$26,IF(J150=26,'Equivalencia BH-BMPT'!$D$27,IF(J150=27,'Equivalencia BH-BMPT'!$D$28,IF(J150=28,'Equivalencia BH-BMPT'!$D$29,IF(J150=29,'Equivalencia BH-BMPT'!$D$30,IF(J150=30,'Equivalencia BH-BMPT'!$D$31,IF(J150=31,'Equivalencia BH-BMPT'!$D$32,IF(J150=32,'Equivalencia BH-BMPT'!$D$33,IF(J150=33,'Equivalencia BH-BMPT'!$D$34,IF(J150=34,'Equivalencia BH-BMPT'!$D$35,IF(J150=35,'Equivalencia BH-BMPT'!$D$36,IF(J150=36,'Equivalencia BH-BMPT'!$D$37,IF(J150=37,'Equivalencia BH-BMPT'!$D$38,IF(J150=38,'Equivalencia BH-BMPT'!#REF!,IF(J150=39,'Equivalencia BH-BMPT'!$D$40,IF(J150=40,'Equivalencia BH-BMPT'!$D$41,IF(J150=41,'Equivalencia BH-BMPT'!$D$42,IF(J150=42,'Equivalencia BH-BMPT'!$D$43,IF(J150=43,'Equivalencia BH-BMPT'!$D$44,IF(J150=44,'Equivalencia BH-BMPT'!$D$45,IF(J150=45,'Equivalencia BH-BMPT'!$D$46,\"No ha seleccionado un número de programa\")))))))))))))))))))))))))))))))))))))))))))))","v":"Espacio público, derecho de todos"},1321,19233842,"HECTOR VICENTE RODRIGUEZ ROMERO",150000000,null,null,0,0,150000000,0,"2017/12/21",null,"2018-03-20",90,129,null,"X",null,null,null,0,null,false]
[139,2017,"CO1.PCCNTR.257557",5,{"$f":"IF(D151=1,'Tipo '!$B$2,IF(D151=2,'Tipo '!$B$3,IF(D151=3,'Tipo '!$B$4,IF(D151=4,'Tipo '!$B$5,IF(D151=5,'Tipo '!$B$6,IF(D151=6,'Tipo '!$B$7,IF(D151=7,'Tipo '!$B$8,IF(D151=8,'Tipo '!$B$9,IF(D151=9,'Tipo '!$B$10,IF(D151=10,'Tipo '!$B$11,IF(D151=11,'Tipo '!$B$12,IF(D151=12,'Tipo '!$B$13,IF(D151=13,'Tipo '!$B$14,IF(D151=14,'Tipo '!$B$15,IF(D151=15,'Tipo '!$B$16,IF(D151=16,'Tipo '!$B$17,IF(D151=17,'Tipo '!$B$18,IF(D151=18,'Tipo '!$B$19,IF(D151=19,'Tipo '!$B$20,\"No ha seleccionado un tipo de contrato válido\")))))))))))))))))))","v":"CONTRATOS DE PRESTACIÓN DE SERVICIOS PROFESIONALES Y DE APOYO A LA GESTIÓN"},"Selección abreviada ","Selección abreviada por menor cuantía ","PRESTAR LOS SERVICIOS PARA LA PLANEACIÓN Y EJECUCIÓN DE LAS VACACIONES RECREATIVAS, DIRIGIDAS A NIÑOS Y NIÑAS DE LA LOCALIDAD DE SANTA FE, ENCAMINADAS AL FÁCIL ACCESO DE LA POBLACIÓN VULNERABLE A LA OFERTA DE SERVICIOS RECREO-DEPORTIVOS, EN EL MARCO DEL PROYECTO 1318,  DE ACUERDO A MEMORANDO RADICADO BAJO EL NÚMERO 2017-532-00-13673 DE FECHA DICIEMBRE 26  DE 2017, FIRMADO POR EL ALCALDE LOCAL","Inversión",11,{"$f":"IF(J151=1,'Equivalencia BH-BMPT'!$D$2,IF(J151=2,'Equivalencia BH-BMPT'!$D$3,IF(J151=3,'Equivalencia BH-BMPT'!$D$4,IF(J151=4,'Equivalencia BH-BMPT'!$D$5,IF(J151=5,'Equivalencia BH-BMPT'!$D$6,IF(J151=6,'Equivalencia BH-BMPT'!$D$7,IF(J151=7,'Equivalencia BH-BMPT'!$D$8,IF(J151=8,'Equivalencia BH-BMPT'!$D$9,IF(J151=9,'Equivalencia BH-BMPT'!$D$10,IF(J151=10,'Equivalencia BH-BMPT'!$D$11,IF(J151=11,'Equivalencia BH-BMPT'!$D$12,IF(J151=12,'Equivalencia BH-BMPT'!$D$13,IF(J151=13,'Equivalencia BH-BMPT'!$D$14,IF(J151=14,'Equivalencia BH-BMPT'!$D$15,IF(J151=15,'Equivalencia BH-BMPT'!$D$16,IF(J151=16,'Equivalencia BH-BMPT'!$D$17,IF(J151=17,'Equivalencia BH-BMPT'!$D$18,IF(J151=18,'Equivalencia BH-BMPT'!$D$19,IF(J151=19,'Equivalencia BH-BMPT'!$D$20,IF(J151=20,'Equivalencia BH-BMPT'!$D$21,IF(J151=21,'Equivalencia BH-BMPT'!$D$22,IF(J151=22,'Equivalencia BH-BMPT'!$D$23,IF(J151=23,'Equivalencia BH-BMPT'!#REF!,IF(J151=24,'Equivalencia BH-BMPT'!$D$25,IF(J151=25,'Equivalencia BH-BMPT'!$D$26,IF(J151=26,'Equivalencia BH-BMPT'!$D$27,IF(J151=27,'Equivalencia BH-BMPT'!$D$28,IF(J151=28,'Equivalencia BH-BMPT'!$D$29,IF(J151=29,'Equivalencia BH-BMPT'!$D$30,IF(J151=30,'Equivalencia BH-BMPT'!$D$31,IF(J151=31,'Equivalencia BH-BMPT'!$D$32,IF(J151=32,'Equivalencia BH-BMPT'!$D$33,IF(J151=33,'Equivalencia BH-BMPT'!$D$34,IF(J151=34,'Equivalencia BH-BMPT'!$D$35,IF(J151=35,'Equivalencia BH-BMPT'!$D$36,IF(J151=36,'Equivalencia BH-BMPT'!$D$37,IF(J151=37,'Equivalencia BH-BMPT'!$D$38,IF(J151=38,'Equivalencia BH-BMPT'!#REF!,IF(J151=39,'Equivalencia BH-BMPT'!$D$40,IF(J151=40,'Equivalencia BH-BMPT'!$D$41,IF(J151=41,'Equivalencia BH-BMPT'!$D$42,IF(J151=42,'Equivalencia BH-BMPT'!$D$43,IF(J151=43,'Equivalencia BH-BMPT'!$D$44,IF(J151=44,'Equivalencia BH-BMPT'!$D$45,IF(J151=45,'Equivalencia BH-BMPT'!$D$46,\"No ha seleccionado un número de programa\")))))))))))))))))))))))))))))))))))))))))))))","v":"Mejores oportunidades para el desarrollo a través de la cultura, la recreación y el deporte"},1318,79867234,"CARLOS ALBERTO PINZON MOLINA",148594110,null,null,0,0,148594110,0,"2017/12/21",null,"2018-02-20",60,130,null,"X",null,null,null,0,null,false]
[140,2017,"CO1.PCCNTR.260116",4,{"$f":"IF(D152=1,'Tipo '!$B$2,IF(D152=2,'Tipo '!$B$3,IF(D152=3,'Tipo '!$B$4,IF(D152=4,'Tipo '!$B$5,IF(D152=5,'Tipo '!$B$6,IF(D152=6,'Tipo '!$B$7,IF(D152=7,'Tipo '!$B$8,IF(D152=8,'Tipo '!$B$9,IF(D152=9,'Tipo '!$B$10,IF(D152=10,'Tipo '!$B$11,IF(D152=11,'Tipo '!$B$12,IF(D152=12,'Tipo '!$B$13,IF(D152=13,'Tipo '!$B$14,IF(D152=14,'Tipo '!$B$15,IF(D152=15,'Tipo '!$B$16,IF(D152=16,'Tipo '!$B$17,IF(D152=17,'Tipo '!$B$18,IF(D152=18,'Tipo '!$B$19,IF(D152=19,'Tipo '!$B$20,\"No ha seleccionado un tipo de contrato válido\")))))))))))))))))))","v":"CONTRATOS DE PRESTACIÓN DE SERVICIOS"},"Selección abreviada ","Selección abreviada por menor cuantía ","PRESTAR LOS SERVICIOS TÉCNICOS Y DE APOYO PARA LA REALIZACIÓN DE UN EVENTO DE RECREACIÓN Y DEPORTE QUE PERMITA DESARROLLAR DIFERENTES PRÁCTICAS Y DISCIPLINAS DEPORTIVAS TRADICIONALES Y ALTERNATIVAS, DIRIGIDAS A LA POBLACIÓN DE LA LOCALIDAD DE SANTA FE,  DE ACUERDO A MEMORANDO RADICADO BAJO EL NÚMERO 2017-532-00-13763 DE FECHA  DICIEMBRE 27  DE 2017, FIRMADO POR EL ALCALDE LOCAL","Inversión",11,{"$f":"IF(J152=1,'Equivalencia BH-BMPT'!$D$2,IF(J152=2,'Equivalencia BH-BMPT'!$D$3,IF(J152=3,'Equivalencia BH-BMPT'!$D$4,IF(J152=4,'Equivalencia BH-BMPT'!$D$5,IF(J152=5,'Equivalencia BH-BMPT'!$D$6,IF(J152=6,'Equivalencia BH-BMPT'!$D$7,IF(J152=7,'Equivalencia BH-BMPT'!$D$8,IF(J152=8,'Equivalencia BH-BMPT'!$D$9,IF(J152=9,'Equivalencia BH-BMPT'!$D$10,IF(J152=10,'Equivalencia BH-BMPT'!$D$11,IF(J152=11,'Equivalencia BH-BMPT'!$D$12,IF(J152=12,'Equivalencia BH-BMPT'!$D$13,IF(J152=13,'Equivalencia BH-BMPT'!$D$14,IF(J152=14,'Equivalencia BH-BMPT'!$D$15,IF(J152=15,'Equivalencia BH-BMPT'!$D$16,IF(J152=16,'Equivalencia BH-BMPT'!$D$17,IF(J152=17,'Equivalencia BH-BMPT'!$D$18,IF(J152=18,'Equivalencia BH-BMPT'!$D$19,IF(J152=19,'Equivalencia BH-BMPT'!$D$20,IF(J152=20,'Equivalencia BH-BMPT'!$D$21,IF(J152=21,'Equivalencia BH-BMPT'!$D$22,IF(J152=22,'Equivalencia BH-BMPT'!$D$23,IF(J152=23,'Equivalencia BH-BMPT'!#REF!,IF(J152=24,'Equivalencia BH-BMPT'!$D$25,IF(J152=25,'Equivalencia BH-BMPT'!$D$26,IF(J152=26,'Equivalencia BH-BMPT'!$D$27,IF(J152=27,'Equivalencia BH-BMPT'!$D$28,IF(J152=28,'Equivalencia BH-BMPT'!$D$29,IF(J152=29,'Equivalencia BH-BMPT'!$D$30,IF(J152=30,'Equivalencia BH-BMPT'!$D$31,IF(J152=31,'Equivalencia BH-BMPT'!$D$32,IF(J152=32,'Equivalencia BH-BMPT'!$D$33,IF(J152=33,'Equivalencia BH-BMPT'!$D$34,IF(J152=34,'Equivalencia BH-BMPT'!$D$35,IF(J152=35,'Equivalencia BH-BMPT'!$D$36,IF(J152=36,'Equivalencia BH-BMPT'!$D$37,IF(J152=37,'Equivalencia BH-BMPT'!$D$38,IF(J152=38,'Equivalencia BH-BMPT'!#REF!,IF(J152=39,'Equivalencia BH-BMPT'!$D$40,IF(J152=40,'Equivalencia BH-BMPT'!$D$41,IF(J152=41,'Equivalencia BH-BMPT'!$D$42,IF(J152=42,'Equivalencia BH-BMPT'!$D$43,IF(J152=43,'Equivalencia BH-BMPT'!$D$44,IF(J152=44,'Equivalencia BH-BMPT'!$D$45,IF(J152=45,'Equivalencia BH-BMPT'!$D$46,\"No ha seleccionado un número de programa\")))))))))))))))))))))))))))))))))))))))))))))","v":"Mejores oportunidades para el desarrollo a través de la cultura, la recreación y el deporte"},1318,900109948,"FUNDACION DEPORTIVA ARNOLDO IGUARAN",42082565,null,null,0,0,42082565,0,"2017/12/27",null,"2018-02-26",60,131,null,"X",null,null,null,0,null,false]
[141,2017,"17-13-7374035",3,{"$f":"IF(D153=1,'Tipo '!$B$2,IF(D153=2,'Tipo '!$B$3,IF(D153=3,'Tipo '!$B$4,IF(D153=4,'Tipo '!$B$5,IF(D153=5,'Tipo '!$B$6,IF(D153=6,'Tipo '!$B$7,IF(D153=7,'Tipo '!$B$8,IF(D153=8,'Tipo '!$B$9,IF(D153=9,'Tipo '!$B$10,IF(D153=10,'Tipo '!$B$11,IF(D153=11,'Tipo '!$B$12,IF(D153=12,'Tipo '!$B$13,IF(D153=13,'Tipo '!$B$14,IF(D153=14,'Tipo '!$B$15,IF(D153=15,'Tipo '!$B$16,IF(D153=16,'Tipo '!$B$17,IF(D153=17,'Tipo '!$B$18,IF(D153=18,'Tipo '!$B$19,IF(D153=19,'Tipo '!$B$20,\"No ha seleccionado un tipo de contrato válido\")))))))))))))))))))","v":"INTERVENTORÍA"},"Contratación mínima cuantia ","No aplica","PRESTAR LOS SERVICIOS PROFESIONALES DE INTERVENTORIA TÉCNICA, ADMINISTRATIVA, AMBIENTAL, FINANCIERA Y JURIDICA, AL CONTRATO QUE TIENE COMO OBJETO CONTRATAR A MONTO AGOTABLE LAS OBRAS DE REPARACIONES LOCATIVAS REQUERIDAS EN LOS SALONES COMUNALES DE LA LOCALIDAD DE SANTA FE  ALCALDÍA LOCAL DE SANTA FE,  DE ACUERDO A MEMORANDO RADICADO BAJO EL NÚMERO 2017-532-00-13453 DE FECHA DICIEMBRE 20    DE 2017, FIRMADO POR EL ALCALDE LOCAL,","Inversión",17,{"$f":"IF(J153=1,'Equivalencia BH-BMPT'!$D$2,IF(J153=2,'Equivalencia BH-BMPT'!$D$3,IF(J153=3,'Equivalencia BH-BMPT'!$D$4,IF(J153=4,'Equivalencia BH-BMPT'!$D$5,IF(J153=5,'Equivalencia BH-BMPT'!$D$6,IF(J153=6,'Equivalencia BH-BMPT'!$D$7,IF(J153=7,'Equivalencia BH-BMPT'!$D$8,IF(J153=8,'Equivalencia BH-BMPT'!$D$9,IF(J153=9,'Equivalencia BH-BMPT'!$D$10,IF(J153=10,'Equivalencia BH-BMPT'!$D$11,IF(J153=11,'Equivalencia BH-BMPT'!$D$12,IF(J153=12,'Equivalencia BH-BMPT'!$D$13,IF(J153=13,'Equivalencia BH-BMPT'!$D$14,IF(J153=14,'Equivalencia BH-BMPT'!$D$15,IF(J153=15,'Equivalencia BH-BMPT'!$D$16,IF(J153=16,'Equivalencia BH-BMPT'!$D$17,IF(J153=17,'Equivalencia BH-BMPT'!$D$18,IF(J153=18,'Equivalencia BH-BMPT'!$D$19,IF(J153=19,'Equivalencia BH-BMPT'!$D$20,IF(J153=20,'Equivalencia BH-BMPT'!$D$21,IF(J153=21,'Equivalencia BH-BMPT'!$D$22,IF(J153=22,'Equivalencia BH-BMPT'!$D$23,IF(J153=23,'Equivalencia BH-BMPT'!#REF!,IF(J153=24,'Equivalencia BH-BMPT'!$D$25,IF(J153=25,'Equivalencia BH-BMPT'!$D$26,IF(J153=26,'Equivalencia BH-BMPT'!$D$27,IF(J153=27,'Equivalencia BH-BMPT'!$D$28,IF(J153=28,'Equivalencia BH-BMPT'!$D$29,IF(J153=29,'Equivalencia BH-BMPT'!$D$30,IF(J153=30,'Equivalencia BH-BMPT'!$D$31,IF(J153=31,'Equivalencia BH-BMPT'!$D$32,IF(J153=32,'Equivalencia BH-BMPT'!$D$33,IF(J153=33,'Equivalencia BH-BMPT'!$D$34,IF(J153=34,'Equivalencia BH-BMPT'!$D$35,IF(J153=35,'Equivalencia BH-BMPT'!$D$36,IF(J153=36,'Equivalencia BH-BMPT'!$D$37,IF(J153=37,'Equivalencia BH-BMPT'!$D$38,IF(J153=38,'Equivalencia BH-BMPT'!#REF!,IF(J153=39,'Equivalencia BH-BMPT'!$D$40,IF(J153=40,'Equivalencia BH-BMPT'!$D$41,IF(J153=41,'Equivalencia BH-BMPT'!$D$42,IF(J153=42,'Equivalencia BH-BMPT'!$D$43,IF(J153=43,'Equivalencia BH-BMPT'!$D$44,IF(J153=44,'Equivalencia BH-BMPT'!$D$45,IF(J153=45,'Equivalencia BH-BMPT'!$D$46,\"No ha seleccionado un número de programa\")))))))))))))))))))))))))))))))))))))))))))))","v":"Espacio público, derecho de todos"},1321,93200589,"HECTOR MILCIADES GUERRA MONCALEANO",8940000,null,null,0,0,8940000,0,"2017/12/19",null,"2018-03-18",90,132,null,"X",null,null,null,0,null,false]
[142,2017,"CO1.PCCNTR.257330",1,{"$f":"IF(D154=1,'Tipo '!$B$2,IF(D154=2,'Tipo '!$B$3,IF(D154=3,'Tipo '!$B$4,IF(D154=4,'Tipo '!$B$5,IF(D154=5,'Tipo '!$B$6,IF(D154=6,'Tipo '!$B$7,IF(D154=7,'Tipo '!$B$8,IF(D154=8,'Tipo '!$B$9,IF(D154=9,'Tipo '!$B$10,IF(D154=10,'Tipo '!$B$11,IF(D154=11,'Tipo '!$B$12,IF(D154=12,'Tipo '!$B$13,IF(D154=13,'Tipo '!$B$14,IF(D154=14,'Tipo '!$B$15,IF(D154=15,'Tipo '!$B$16,IF(D154=16,'Tipo '!$B$17,IF(D154=17,'Tipo '!$B$18,IF(D154=18,'Tipo '!$B$19,IF(D154=19,'Tipo '!$B$20,\"No ha seleccionado un tipo de contrato válido\")))))))))))))))))))","v":"OBRA PÚBLICA"},"Licitación pública","No aplica","CONTRATAR A PRECIOS UNITARIOS FIJOS, SIN FORMULA DE AJUSTE, A MONTO AGOTABLE, EL DIAGNOSTICO, CONSTRUCCION, MANTENIMIENTO Y DOTACION DE MOBILIARIO DE LOS PARQUES CATALOGADOS COMO VECINALES Y DE BOLSILLO, EN LA LOCALIDAD DE SANTA FE EN BOGOTA D,C.,  DE ACUERDO A MEMORANDO RADICADO BAJO EL NÚMERO 2017-532-00-13883  DE FECHA DICIEMBRE 28  DE 2017, FIRMADO POR EL ALCALDE LOCAL.","Inversión",17,{"$f":"IF(J154=1,'Equivalencia BH-BMPT'!$D$2,IF(J154=2,'Equivalencia BH-BMPT'!$D$3,IF(J154=3,'Equivalencia BH-BMPT'!$D$4,IF(J154=4,'Equivalencia BH-BMPT'!$D$5,IF(J154=5,'Equivalencia BH-BMPT'!$D$6,IF(J154=6,'Equivalencia BH-BMPT'!$D$7,IF(J154=7,'Equivalencia BH-BMPT'!$D$8,IF(J154=8,'Equivalencia BH-BMPT'!$D$9,IF(J154=9,'Equivalencia BH-BMPT'!$D$10,IF(J154=10,'Equivalencia BH-BMPT'!$D$11,IF(J154=11,'Equivalencia BH-BMPT'!$D$12,IF(J154=12,'Equivalencia BH-BMPT'!$D$13,IF(J154=13,'Equivalencia BH-BMPT'!$D$14,IF(J154=14,'Equivalencia BH-BMPT'!$D$15,IF(J154=15,'Equivalencia BH-BMPT'!$D$16,IF(J154=16,'Equivalencia BH-BMPT'!$D$17,IF(J154=17,'Equivalencia BH-BMPT'!$D$18,IF(J154=18,'Equivalencia BH-BMPT'!$D$19,IF(J154=19,'Equivalencia BH-BMPT'!$D$20,IF(J154=20,'Equivalencia BH-BMPT'!$D$21,IF(J154=21,'Equivalencia BH-BMPT'!$D$22,IF(J154=22,'Equivalencia BH-BMPT'!$D$23,IF(J154=23,'Equivalencia BH-BMPT'!#REF!,IF(J154=24,'Equivalencia BH-BMPT'!$D$25,IF(J154=25,'Equivalencia BH-BMPT'!$D$26,IF(J154=26,'Equivalencia BH-BMPT'!$D$27,IF(J154=27,'Equivalencia BH-BMPT'!$D$28,IF(J154=28,'Equivalencia BH-BMPT'!$D$29,IF(J154=29,'Equivalencia BH-BMPT'!$D$30,IF(J154=30,'Equivalencia BH-BMPT'!$D$31,IF(J154=31,'Equivalencia BH-BMPT'!$D$32,IF(J154=32,'Equivalencia BH-BMPT'!$D$33,IF(J154=33,'Equivalencia BH-BMPT'!$D$34,IF(J154=34,'Equivalencia BH-BMPT'!$D$35,IF(J154=35,'Equivalencia BH-BMPT'!$D$36,IF(J154=36,'Equivalencia BH-BMPT'!$D$37,IF(J154=37,'Equivalencia BH-BMPT'!$D$38,IF(J154=38,'Equivalencia BH-BMPT'!#REF!,IF(J154=39,'Equivalencia BH-BMPT'!$D$40,IF(J154=40,'Equivalencia BH-BMPT'!$D$41,IF(J154=41,'Equivalencia BH-BMPT'!$D$42,IF(J154=42,'Equivalencia BH-BMPT'!$D$43,IF(J154=43,'Equivalencia BH-BMPT'!$D$44,IF(J154=44,'Equivalencia BH-BMPT'!$D$45,IF(J154=45,'Equivalencia BH-BMPT'!$D$46,\"No ha seleccionado un número de programa\")))))))))))))))))))))))))))))))))))))))))))))","v":"Espacio público, derecho de todos"},1320,9011400998,"CONSORCIO BP PARQUES",1560000000,null,null,0,0,1560000000,0,"2017/12/28",null,"2018-06-27",180,133,null,"X",null,null,null,0,null,false]
[143,2017,"CO1.PCCNTR.260006",3,{"$f":"IF(D155=1,'Tipo '!$B$2,IF(D155=2,'Tipo '!$B$3,IF(D155=3,'Tipo '!$B$4,IF(D155=4,'Tipo '!$B$5,IF(D155=5,'Tipo '!$B$6,IF(D155=6,'Tipo '!$B$7,IF(D155=7,'Tipo '!$B$8,IF(D155=8,'Tipo '!$B$9,IF(D155=9,'Tipo '!$B$10,IF(D155=10,'Tipo '!$B$11,IF(D155=11,'Tipo '!$B$12,IF(D155=12,'Tipo '!$B$13,IF(D155=13,'Tipo '!$B$14,IF(D155=14,'Tipo '!$B$15,IF(D155=15,'Tipo '!$B$16,IF(D155=16,'Tipo '!$B$17,IF(D155=17,'Tipo '!$B$18,IF(D155=18,'Tipo '!$B$19,IF(D155=19,'Tipo '!$B$20,\"No ha seleccionado un tipo de contrato válido\")))))))))))))))))))","v":"INTERVENTORÍA"},"Selección abreviada ","Selección abreviada por menor cuantía ","INTERVENTORIA TECNICA, ADMINISTRATIVA, LEGAL, FINANCIERA, SOCIAL, AMBIENTAL Y SISO AL CONTRATO DE OBRA PUBLICA DERIVADO DE LA LICITACION FDLSF- LP  21 DE 2017 CONVOCADA POR LA ALCALDIA LOCAL FONDO DE DESARROLLO LOCAL DE SANTA FE  , DE ACUERDO A MEMORANDO RADICADO BAJO EL NÚMERO 2017-532-00-13873   DE FECHA DICIEMBRE 28   DE 2017, FIRMADO POR EL ALCALDE LOCAL,","Inversión",17,{"$f":"IF(J155=1,'Equivalencia BH-BMPT'!$D$2,IF(J155=2,'Equivalencia BH-BMPT'!$D$3,IF(J155=3,'Equivalencia BH-BMPT'!$D$4,IF(J155=4,'Equivalencia BH-BMPT'!$D$5,IF(J155=5,'Equivalencia BH-BMPT'!$D$6,IF(J155=6,'Equivalencia BH-BMPT'!$D$7,IF(J155=7,'Equivalencia BH-BMPT'!$D$8,IF(J155=8,'Equivalencia BH-BMPT'!$D$9,IF(J155=9,'Equivalencia BH-BMPT'!$D$10,IF(J155=10,'Equivalencia BH-BMPT'!$D$11,IF(J155=11,'Equivalencia BH-BMPT'!$D$12,IF(J155=12,'Equivalencia BH-BMPT'!$D$13,IF(J155=13,'Equivalencia BH-BMPT'!$D$14,IF(J155=14,'Equivalencia BH-BMPT'!$D$15,IF(J155=15,'Equivalencia BH-BMPT'!$D$16,IF(J155=16,'Equivalencia BH-BMPT'!$D$17,IF(J155=17,'Equivalencia BH-BMPT'!$D$18,IF(J155=18,'Equivalencia BH-BMPT'!$D$19,IF(J155=19,'Equivalencia BH-BMPT'!$D$20,IF(J155=20,'Equivalencia BH-BMPT'!$D$21,IF(J155=21,'Equivalencia BH-BMPT'!$D$22,IF(J155=22,'Equivalencia BH-BMPT'!$D$23,IF(J155=23,'Equivalencia BH-BMPT'!#REF!,IF(J155=24,'Equivalencia BH-BMPT'!$D$25,IF(J155=25,'Equivalencia BH-BMPT'!$D$26,IF(J155=26,'Equivalencia BH-BMPT'!$D$27,IF(J155=27,'Equivalencia BH-BMPT'!$D$28,IF(J155=28,'Equivalencia BH-BMPT'!$D$29,IF(J155=29,'Equivalencia BH-BMPT'!$D$30,IF(J155=30,'Equivalencia BH-BMPT'!$D$31,IF(J155=31,'Equivalencia BH-BMPT'!$D$32,IF(J155=32,'Equivalencia BH-BMPT'!$D$33,IF(J155=33,'Equivalencia BH-BMPT'!$D$34,IF(J155=34,'Equivalencia BH-BMPT'!$D$35,IF(J155=35,'Equivalencia BH-BMPT'!$D$36,IF(J155=36,'Equivalencia BH-BMPT'!$D$37,IF(J155=37,'Equivalencia BH-BMPT'!$D$38,IF(J155=38,'Equivalencia BH-BMPT'!#REF!,IF(J155=39,'Equivalencia BH-BMPT'!$D$40,IF(J155=40,'Equivalencia BH-BMPT'!$D$41,IF(J155=41,'Equivalencia BH-BMPT'!$D$42,IF(J155=42,'Equivalencia BH-BMPT'!$D$43,IF(J155=43,'Equivalencia BH-BMPT'!$D$44,IF(J155=44,'Equivalencia BH-BMPT'!$D$45,IF(J155=45,'Equivalencia BH-BMPT'!$D$46,\"No ha seleccionado un número de programa\")))))))))))))))))))))))))))))))))))))))))))))","v":"Espacio público, derecho de todos"},1320,830028126,"R & M CONSTRUCCIONES E INTERVENTORIAS S A S",149999941,null,null,0,0,149999941,0,"2017/12/27",null,"2018-07-26",210,134,null,"X",null,null,null,0,null,false]
[144,2017,"17-1-181951",6,{"$f":"IF(D156=1,'Tipo '!$B$2,IF(D156=2,'Tipo '!$B$3,IF(D156=3,'Tipo '!$B$4,IF(D156=4,'Tipo '!$B$5,IF(D156=5,'Tipo '!$B$6,IF(D156=6,'Tipo '!$B$7,IF(D156=7,'Tipo '!$B$8,IF(D156=8,'Tipo '!$B$9,IF(D156=9,'Tipo '!$B$10,IF(D156=10,'Tipo '!$B$11,IF(D156=11,'Tipo '!$B$12,IF(D156=12,'Tipo '!$B$13,IF(D156=13,'Tipo '!$B$14,IF(D156=14,'Tipo '!$B$15,IF(D156=15,'Tipo '!$B$16,IF(D156=16,'Tipo '!$B$17,IF(D156=17,'Tipo '!$B$18,IF(D156=18,'Tipo '!$B$19,IF(D156=19,'Tipo '!$B$20,\"No ha seleccionado un tipo de contrato válido\")))))))))))))))))))","v":"COMPRAVENTA DE BIENES MUEBLES"},"Licitación pública","No aplica","VENDER Y ENTREGAR LOS ELEMENTOS PEDAGÓGICOS CONFORME A LAS ESPECIFICACIONES TÉCNICAS CONTENIDAS EN LOS DOCUMENTOS DEL PROCESO FDLSF-LP-034-2017 QUE FACILITEN EL DESARROLLO DE HABILIDADES Y POTENCIALIDADES EN LOS NIÑOS Y LAS NIÑAS EN PRIMERA INFANCIA DE JARDINES DE LA SDIS E ICBF DE LA LOCALIDAD DE SANTA FE. ,  DE ACUERDO A MEMORANDO RADICADO BAJO EL NÚMERO 2017-532-00-13843 DE FECHA   DICIEMBRE 28   DE 2017, FIRMADO POR EL ALCALDE LOCAL","Inversión",2,{"$f":"IF(J156=1,'Equivalencia BH-BMPT'!$D$2,IF(J156=2,'Equivalencia BH-BMPT'!$D$3,IF(J156=3,'Equivalencia BH-BMPT'!$D$4,IF(J156=4,'Equivalencia BH-BMPT'!$D$5,IF(J156=5,'Equivalencia BH-BMPT'!$D$6,IF(J156=6,'Equivalencia BH-BMPT'!$D$7,IF(J156=7,'Equivalencia BH-BMPT'!$D$8,IF(J156=8,'Equivalencia BH-BMPT'!$D$9,IF(J156=9,'Equivalencia BH-BMPT'!$D$10,IF(J156=10,'Equivalencia BH-BMPT'!$D$11,IF(J156=11,'Equivalencia BH-BMPT'!$D$12,IF(J156=12,'Equivalencia BH-BMPT'!$D$13,IF(J156=13,'Equivalencia BH-BMPT'!$D$14,IF(J156=14,'Equivalencia BH-BMPT'!$D$15,IF(J156=15,'Equivalencia BH-BMPT'!$D$16,IF(J156=16,'Equivalencia BH-BMPT'!$D$17,IF(J156=17,'Equivalencia BH-BMPT'!$D$18,IF(J156=18,'Equivalencia BH-BMPT'!$D$19,IF(J156=19,'Equivalencia BH-BMPT'!$D$20,IF(J156=20,'Equivalencia BH-BMPT'!$D$21,IF(J156=21,'Equivalencia BH-BMPT'!$D$22,IF(J156=22,'Equivalencia BH-BMPT'!$D$23,IF(J156=23,'Equivalencia BH-BMPT'!#REF!,IF(J156=24,'Equivalencia BH-BMPT'!$D$25,IF(J156=25,'Equivalencia BH-BMPT'!$D$26,IF(J156=26,'Equivalencia BH-BMPT'!$D$27,IF(J156=27,'Equivalencia BH-BMPT'!$D$28,IF(J156=28,'Equivalencia BH-BMPT'!$D$29,IF(J156=29,'Equivalencia BH-BMPT'!$D$30,IF(J156=30,'Equivalencia BH-BMPT'!$D$31,IF(J156=31,'Equivalencia BH-BMPT'!$D$32,IF(J156=32,'Equivalencia BH-BMPT'!$D$33,IF(J156=33,'Equivalencia BH-BMPT'!$D$34,IF(J156=34,'Equivalencia BH-BMPT'!$D$35,IF(J156=35,'Equivalencia BH-BMPT'!$D$36,IF(J156=36,'Equivalencia BH-BMPT'!$D$37,IF(J156=37,'Equivalencia BH-BMPT'!$D$38,IF(J156=38,'Equivalencia BH-BMPT'!#REF!,IF(J156=39,'Equivalencia BH-BMPT'!$D$40,IF(J156=40,'Equivalencia BH-BMPT'!$D$41,IF(J156=41,'Equivalencia BH-BMPT'!$D$42,IF(J156=42,'Equivalencia BH-BMPT'!$D$43,IF(J156=43,'Equivalencia BH-BMPT'!$D$44,IF(J156=44,'Equivalencia BH-BMPT'!$D$45,IF(J156=45,'Equivalencia BH-BMPT'!$D$46,\"No ha seleccionado un número de programa\")))))))))))))))))))))))))))))))))))))))))))))","v":"Desarrollo integral desde la gestación hasta la adolescencia"},1314,901141983,"UNION TEMPORAL INFANCIA SANTA FE",287298397,null,null,0,0,287298397,0,"2017/12/28",null,"2018-03-27",90,135,null,"X",null,null,null,0,null,false]
[145,2017,"CO1.PCCNTR.265375",2,{"$f":"IF(D157=1,'Tipo '!$B$2,IF(D157=2,'Tipo '!$B$3,IF(D157=3,'Tipo '!$B$4,IF(D157=4,'Tipo '!$B$5,IF(D157=5,'Tipo '!$B$6,IF(D157=6,'Tipo '!$B$7,IF(D157=7,'Tipo '!$B$8,IF(D157=8,'Tipo '!$B$9,IF(D157=9,'Tipo '!$B$10,IF(D157=10,'Tipo '!$B$11,IF(D157=11,'Tipo '!$B$12,IF(D157=12,'Tipo '!$B$13,IF(D157=13,'Tipo '!$B$14,IF(D157=14,'Tipo '!$B$15,IF(D157=15,'Tipo '!$B$16,IF(D157=16,'Tipo '!$B$17,IF(D157=17,'Tipo '!$B$18,IF(D157=18,'Tipo '!$B$19,IF(D157=19,'Tipo '!$B$20,\"No ha seleccionado un tipo de contrato válido\")))))))))))))))))))","v":"CONSULTORÍA"},"concurso de meritos","No aplica","REALIZAR CONSULTORÍA TÉCNICA DE DIAGNÓSTICO  Y PRE FACTIBILIDAD DE PROCESOS ECONÓMICOS, PRODUCTIVOS, ASISTENCIA TÉCNICA AGROPECUARIA Y DE SUSTITUCIÓN EN LAS VEREDAS DE LA LOCALIDAD, QUE CONTRIBUYAN A UNA MEJOR INTEGRACIÓN ECONÓMICA DE LOS PRODUCTORES CON LA REGIÓN, EN MARCO DEL PROYECTO 1325 SANTA FE POR UNA RURALIDAD EMPRENDEDORA Y TECNIFICADA., DE ACUERDO A MEMORANDO RADICADO BAJO EL NÚMERO 2017-532-00-13793 DE FECHA  DICIIEMBRE   27 DE 2017, FIRMADO POR EL ALCALDE LOCAL ,","Inversión",41,{"$f":"IF(J157=1,'Equivalencia BH-BMPT'!$D$2,IF(J157=2,'Equivalencia BH-BMPT'!$D$3,IF(J157=3,'Equivalencia BH-BMPT'!$D$4,IF(J157=4,'Equivalencia BH-BMPT'!$D$5,IF(J157=5,'Equivalencia BH-BMPT'!$D$6,IF(J157=6,'Equivalencia BH-BMPT'!$D$7,IF(J157=7,'Equivalencia BH-BMPT'!$D$8,IF(J157=8,'Equivalencia BH-BMPT'!$D$9,IF(J157=9,'Equivalencia BH-BMPT'!$D$10,IF(J157=10,'Equivalencia BH-BMPT'!$D$11,IF(J157=11,'Equivalencia BH-BMPT'!$D$12,IF(J157=12,'Equivalencia BH-BMPT'!$D$13,IF(J157=13,'Equivalencia BH-BMPT'!$D$14,IF(J157=14,'Equivalencia BH-BMPT'!$D$15,IF(J157=15,'Equivalencia BH-BMPT'!$D$16,IF(J157=16,'Equivalencia BH-BMPT'!$D$17,IF(J157=17,'Equivalencia BH-BMPT'!$D$18,IF(J157=18,'Equivalencia BH-BMPT'!$D$19,IF(J157=19,'Equivalencia BH-BMPT'!$D$20,IF(J157=20,'Equivalencia BH-BMPT'!$D$21,IF(J157=21,'Equivalencia BH-BMPT'!$D$22,IF(J157=22,'Equivalencia BH-BMPT'!$D$23,IF(J157=23,'Equivalencia BH-BMPT'!#REF!,IF(J157=24,'Equivalencia BH-BMPT'!$D$25,IF(J157=25,'Equivalencia BH-BMPT'!$D$26,IF(J157=26,'Equivalencia BH-BMPT'!$D$27,IF(J157=27,'Equivalencia BH-BMPT'!$D$28,IF(J157=28,'Equivalencia BH-BMPT'!$D$29,IF(J157=29,'Equivalencia BH-BMPT'!$D$30,IF(J157=30,'Equivalencia BH-BMPT'!$D$31,IF(J157=31,'Equivalencia BH-BMPT'!$D$32,IF(J157=32,'Equivalencia BH-BMPT'!$D$33,IF(J157=33,'Equivalencia BH-BMPT'!$D$34,IF(J157=34,'Equivalencia BH-BMPT'!$D$35,IF(J157=35,'Equivalencia BH-BMPT'!$D$36,IF(J157=36,'Equivalencia BH-BMPT'!$D$37,IF(J157=37,'Equivalencia BH-BMPT'!$D$38,IF(J157=38,'Equivalencia BH-BMPT'!#REF!,IF(J157=39,'Equivalencia BH-BMPT'!$D$40,IF(J157=40,'Equivalencia BH-BMPT'!$D$41,IF(J157=41,'Equivalencia BH-BMPT'!$D$42,IF(J157=42,'Equivalencia BH-BMPT'!$D$43,IF(J157=43,'Equivalencia BH-BMPT'!$D$44,IF(J157=44,'Equivalencia BH-BMPT'!$D$45,IF(J157=45,'Equivalencia BH-BMPT'!$D$46,\"No ha seleccionado un número de programa\")))))))))))))))))))))))))))))))))))))))))))))","v":"Desarrollo rural sostenible"},1325,900895294,"FUNDACION PARA EL DESARROLLO ECONOMICO SOCIAL Y EMPRESARIAL",246684000,null,null,0,0,246684000,0,"2017/12/27",null,"2018-06-26",180,136,null,"X",null,null,null,0,null,false]
[146,2017,"CO1.PCCNTR.265501",3,{"$f":"IF(D158=1,'Tipo '!$B$2,IF(D158=2,'Tipo '!$B$3,IF(D158=3,'Tipo '!$B$4,IF(D158=4,'Tipo '!$B$5,IF(D158=5,'Tipo '!$B$6,IF(D158=6,'Tipo '!$B$7,IF(D158=7,'Tipo '!$B$8,IF(D158=8,'Tipo '!$B$9,IF(D158=9,'Tipo '!$B$10,IF(D158=10,'Tipo '!$B$11,IF(D158=11,'Tipo '!$B$12,IF(D158=12,'Tipo '!$B$13,IF(D158=13,'Tipo '!$B$14,IF(D158=14,'Tipo '!$B$15,IF(D158=15,'Tipo '!$B$16,IF(D158=16,'Tipo '!$B$17,IF(D158=17,'Tipo '!$B$18,IF(D158=18,'Tipo '!$B$19,IF(D158=19,'Tipo '!$B$20,\"No ha seleccionado un tipo de contrato válido\")))))))))))))))))))","v":"INTERVENTORÍA"},"Selección abreviada ","Selección abreviada por menor cuantía ","REALIZAR LA INTERVENTORIA TECNICA ADMINISTRATIVA LEGAL, FINANCIERA, SOCIAL, AMBIENTAL Y S&SO, A LOS CONTRATOS DE OBRA PUBLICA DERIVADOS DE LA LICITACION NO FDLSF-LP-008-2017 SEGUN RADICADO 2017-532-00-13863 DE FECHA DICIEMBRE 28 DE 2017  FIRMADO POR ALCALDE LOCAL, RECIBIDO EN PRESUPUESTO EN 23/08/2017","Inversión",18,{"$f":"IF(J158=1,'Equivalencia BH-BMPT'!$D$2,IF(J158=2,'Equivalencia BH-BMPT'!$D$3,IF(J158=3,'Equivalencia BH-BMPT'!$D$4,IF(J158=4,'Equivalencia BH-BMPT'!$D$5,IF(J158=5,'Equivalencia BH-BMPT'!$D$6,IF(J158=6,'Equivalencia BH-BMPT'!$D$7,IF(J158=7,'Equivalencia BH-BMPT'!$D$8,IF(J158=8,'Equivalencia BH-BMPT'!$D$9,IF(J158=9,'Equivalencia BH-BMPT'!$D$10,IF(J158=10,'Equivalencia BH-BMPT'!$D$11,IF(J158=11,'Equivalencia BH-BMPT'!$D$12,IF(J158=12,'Equivalencia BH-BMPT'!$D$13,IF(J158=13,'Equivalencia BH-BMPT'!$D$14,IF(J158=14,'Equivalencia BH-BMPT'!$D$15,IF(J158=15,'Equivalencia BH-BMPT'!$D$16,IF(J158=16,'Equivalencia BH-BMPT'!$D$17,IF(J158=17,'Equivalencia BH-BMPT'!$D$18,IF(J158=18,'Equivalencia BH-BMPT'!$D$19,IF(J158=19,'Equivalencia BH-BMPT'!$D$20,IF(J158=20,'Equivalencia BH-BMPT'!$D$21,IF(J158=21,'Equivalencia BH-BMPT'!$D$22,IF(J158=22,'Equivalencia BH-BMPT'!$D$23,IF(J158=23,'Equivalencia BH-BMPT'!#REF!,IF(J158=24,'Equivalencia BH-BMPT'!$D$25,IF(J158=25,'Equivalencia BH-BMPT'!$D$26,IF(J158=26,'Equivalencia BH-BMPT'!$D$27,IF(J158=27,'Equivalencia BH-BMPT'!$D$28,IF(J158=28,'Equivalencia BH-BMPT'!$D$29,IF(J158=29,'Equivalencia BH-BMPT'!$D$30,IF(J158=30,'Equivalencia BH-BMPT'!$D$31,IF(J158=31,'Equivalencia BH-BMPT'!$D$32,IF(J158=32,'Equivalencia BH-BMPT'!$D$33,IF(J158=33,'Equivalencia BH-BMPT'!$D$34,IF(J158=34,'Equivalencia BH-BMPT'!$D$35,IF(J158=35,'Equivalencia BH-BMPT'!$D$36,IF(J158=36,'Equivalencia BH-BMPT'!$D$37,IF(J158=37,'Equivalencia BH-BMPT'!$D$38,IF(J158=38,'Equivalencia BH-BMPT'!#REF!,IF(J158=39,'Equivalencia BH-BMPT'!$D$40,IF(J158=40,'Equivalencia BH-BMPT'!$D$41,IF(J158=41,'Equivalencia BH-BMPT'!$D$42,IF(J158=42,'Equivalencia BH-BMPT'!$D$43,IF(J158=43,'Equivalencia BH-BMPT'!$D$44,IF(J158=44,'Equivalencia BH-BMPT'!$D$45,IF(J158=45,'Equivalencia BH-BMPT'!$D$46,\"No ha seleccionado un número de programa\")))))))))))))))))))))))))))))))))))))))))))))","v":"Mejor movilidad para todos"},1322,901141885,"CONSORCIO INTERVENTORIA SANTAFE 2017",688054977,null,null,0,0,688054977,0,"2017/12/28",null,"2018-08-27",240,137,null,"X",null,null,null,0,null,false]
[318,2017,null,4,{"$f":"IF(D159=1,'Tipo '!$B$2,IF(D159=2,'Tipo '!$B$3,IF(D159=3,'Tipo '!$B$4,IF(D159=4,'Tipo '!$B$5,IF(D159=5,'Tipo '!$B$6,IF(D159=6,'Tipo '!$B$7,IF(D159=7,'Tipo '!$B$8,IF(D159=8,'Tipo '!$B$9,IF(D159=9,'Tipo '!$B$10,IF(D159=10,'Tipo '!$B$11,IF(D159=11,'Tipo '!$B$12,IF(D159=12,'Tipo '!$B$13,IF(D159=13,'Tipo '!$B$14,IF(D159=14,'Tipo '!$B$15,IF(D159=15,'Tipo '!$B$16,IF(D159=16,'Tipo '!$B$17,IF(D159=17,'Tipo '!$B$18,IF(D159=18,'Tipo '!$B$19,IF(D159=19,'Tipo '!$B$20,\"No ha seleccionado un tipo de contrato válido\")))))))))))))))))))","v":"CONTRATOS DE PRESTACIÓN DE SERVICIOS"},"Contratación directa","selección abreviada de menor cuantía","PAGO DE LOS COSTOS OPERATIVOS QUE SE CAUSEN EN DESARROLLO DEL CONVENIO MARCO DE ASO-CIACIÓN NO. 4002 DE 2011 Y SUS MODIFICACIONES, CELEBRADO ENTRE LA ALCALDÍA LOCAL DE SANTA FE, LA SECRETARÍA DISTRITAL DE INTEGRACIÓN SOCIAL Y LA CAJA DE COMPENSACIÓN FAMI-LIAR   COMPENSAR DENTRO DEL PROYECTO NO. 1315 DE LA LOCALIDAD DE SANTA FE, QUE GARANTIZA LA EJECUCIÓN DEL CONVENIO ,  DE ACUERDO A MEMORANDO RADICADO BAJO EL NÚMERO 2017-532-00-11043  DE FECHA OCTUBRE 27      DE 2017, FIRMADO POR EL ALCALDE LOCAL","Inversión",3,{"$f":"IF(J159=1,'Equivalencia BH-BMPT'!$D$2,IF(J159=2,'Equivalencia BH-BMPT'!$D$3,IF(J159=3,'Equivalencia BH-BMPT'!$D$4,IF(J159=4,'Equivalencia BH-BMPT'!$D$5,IF(J159=5,'Equivalencia BH-BMPT'!$D$6,IF(J159=6,'Equivalencia BH-BMPT'!$D$7,IF(J159=7,'Equivalencia BH-BMPT'!$D$8,IF(J159=8,'Equivalencia BH-BMPT'!$D$9,IF(J159=9,'Equivalencia BH-BMPT'!$D$10,IF(J159=10,'Equivalencia BH-BMPT'!$D$11,IF(J159=11,'Equivalencia BH-BMPT'!$D$12,IF(J159=12,'Equivalencia BH-BMPT'!$D$13,IF(J159=13,'Equivalencia BH-BMPT'!$D$14,IF(J159=14,'Equivalencia BH-BMPT'!$D$15,IF(J159=15,'Equivalencia BH-BMPT'!$D$16,IF(J159=16,'Equivalencia BH-BMPT'!$D$17,IF(J159=17,'Equivalencia BH-BMPT'!$D$18,IF(J159=18,'Equivalencia BH-BMPT'!$D$19,IF(J159=19,'Equivalencia BH-BMPT'!$D$20,IF(J159=20,'Equivalencia BH-BMPT'!$D$21,IF(J159=21,'Equivalencia BH-BMPT'!$D$22,IF(J159=22,'Equivalencia BH-BMPT'!$D$23,IF(J159=23,'Equivalencia BH-BMPT'!#REF!,IF(J159=24,'Equivalencia BH-BMPT'!$D$25,IF(J159=25,'Equivalencia BH-BMPT'!$D$26,IF(J159=26,'Equivalencia BH-BMPT'!$D$27,IF(J159=27,'Equivalencia BH-BMPT'!$D$28,IF(J159=28,'Equivalencia BH-BMPT'!$D$29,IF(J159=29,'Equivalencia BH-BMPT'!$D$30,IF(J159=30,'Equivalencia BH-BMPT'!$D$31,IF(J159=31,'Equivalencia BH-BMPT'!$D$32,IF(J159=32,'Equivalencia BH-BMPT'!$D$33,IF(J159=33,'Equivalencia BH-BMPT'!$D$34,IF(J159=34,'Equivalencia BH-BMPT'!$D$35,IF(J159=35,'Equivalencia BH-BMPT'!$D$36,IF(J159=36,'Equivalencia BH-BMPT'!$D$37,IF(J159=37,'Equivalencia BH-BMPT'!$D$38,IF(J159=38,'Equivalencia BH-BMPT'!#REF!,IF(J159=39,'Equivalencia BH-BMPT'!$D$40,IF(J159=40,'Equivalencia BH-BMPT'!$D$41,IF(J159=41,'Equivalencia BH-BMPT'!$D$42,IF(J159=42,'Equivalencia BH-BMPT'!$D$43,IF(J159=43,'Equivalencia BH-BMPT'!$D$44,IF(J159=44,'Equivalencia BH-BMPT'!$D$45,IF(J159=45,'Equivalencia BH-BMPT'!$D$46,\"No ha seleccionado un número de programa\")))))))))))))))))))))))))))))))))))))))))))))","v":"Igualdad y autonomía para una Bogotá incluyente"},1315,860066942,"CAJA DE COMPENSACION FAMILIAR - COMPENSAR",22228302,null,null,0,0,22228302,2576157,null,null,"2018-10-26",360,138,null,"X",null,null,null,0.1158953571892266,null,false]
[319,2017,null,4,{"$f":"IF(D160=1,'Tipo '!$B$2,IF(D160=2,'Tipo '!$B$3,IF(D160=3,'Tipo '!$B$4,IF(D160=4,'Tipo '!$B$5,IF(D160=5,'Tipo '!$B$6,IF(D160=6,'Tipo '!$B$7,IF(D160=7,'Tipo '!$B$8,IF(D160=8,'Tipo '!$B$9,IF(D160=9,'Tipo '!$B$10,IF(D160=10,'Tipo '!$B$11,IF(D160=11,'Tipo '!$B$12,IF(D160=12,'Tipo '!$B$13,IF(D160=13,'Tipo '!$B$14,IF(D160=14,'Tipo '!$B$15,IF(D160=15,'Tipo '!$B$16,IF(D160=16,'Tipo '!$B$17,IF(D160=17,'Tipo '!$B$18,IF(D160=18,'Tipo '!$B$19,IF(D160=19,'Tipo '!$B$20,\"No ha seleccionado un tipo de contrato válido\")))))))))))))))))))","v":"CONTRATOS DE PRESTACIÓN DE SERVICIOS"},"Contratación directa","Selección abreviada por menor cuantía ","PAGO DE LOS SUBSIDIOS CORRESPONDIENTES AL PROYECTO NO. 1315 SANTA FE POR UNA VEJEZ DIGNA¿, COMPONENTE: SUBSIDIO TIPO C. LOCALIDAD DE SANTA FE-. VIGENCIA 2017,   DE ACUERDO A MEMORANDO RADICADO BAJO EL NÚMERO 2017-532-00-11033 DE FECHA OCTUBRE  27    DE 2017, FIRMADO POR EL ALCALDE LOCAL","Inversión",3,{"$f":"IF(J160=1,'Equivalencia BH-BMPT'!$D$2,IF(J160=2,'Equivalencia BH-BMPT'!$D$3,IF(J160=3,'Equivalencia BH-BMPT'!$D$4,IF(J160=4,'Equivalencia BH-BMPT'!$D$5,IF(J160=5,'Equivalencia BH-BMPT'!$D$6,IF(J160=6,'Equivalencia BH-BMPT'!$D$7,IF(J160=7,'Equivalencia BH-BMPT'!$D$8,IF(J160=8,'Equivalencia BH-BMPT'!$D$9,IF(J160=9,'Equivalencia BH-BMPT'!$D$10,IF(J160=10,'Equivalencia BH-BMPT'!$D$11,IF(J160=11,'Equivalencia BH-BMPT'!$D$12,IF(J160=12,'Equivalencia BH-BMPT'!$D$13,IF(J160=13,'Equivalencia BH-BMPT'!$D$14,IF(J160=14,'Equivalencia BH-BMPT'!$D$15,IF(J160=15,'Equivalencia BH-BMPT'!$D$16,IF(J160=16,'Equivalencia BH-BMPT'!$D$17,IF(J160=17,'Equivalencia BH-BMPT'!$D$18,IF(J160=18,'Equivalencia BH-BMPT'!$D$19,IF(J160=19,'Equivalencia BH-BMPT'!$D$20,IF(J160=20,'Equivalencia BH-BMPT'!$D$21,IF(J160=21,'Equivalencia BH-BMPT'!$D$22,IF(J160=22,'Equivalencia BH-BMPT'!$D$23,IF(J160=23,'Equivalencia BH-BMPT'!#REF!,IF(J160=24,'Equivalencia BH-BMPT'!$D$25,IF(J160=25,'Equivalencia BH-BMPT'!$D$26,IF(J160=26,'Equivalencia BH-BMPT'!$D$27,IF(J160=27,'Equivalencia BH-BMPT'!$D$28,IF(J160=28,'Equivalencia BH-BMPT'!$D$29,IF(J160=29,'Equivalencia BH-BMPT'!$D$30,IF(J160=30,'Equivalencia BH-BMPT'!$D$31,IF(J160=31,'Equivalencia BH-BMPT'!$D$32,IF(J160=32,'Equivalencia BH-BMPT'!$D$33,IF(J160=33,'Equivalencia BH-BMPT'!$D$34,IF(J160=34,'Equivalencia BH-BMPT'!$D$35,IF(J160=35,'Equivalencia BH-BMPT'!$D$36,IF(J160=36,'Equivalencia BH-BMPT'!$D$37,IF(J160=37,'Equivalencia BH-BMPT'!$D$38,IF(J160=38,'Equivalencia BH-BMPT'!#REF!,IF(J160=39,'Equivalencia BH-BMPT'!$D$40,IF(J160=40,'Equivalencia BH-BMPT'!$D$41,IF(J160=41,'Equivalencia BH-BMPT'!$D$42,IF(J160=42,'Equivalencia BH-BMPT'!$D$43,IF(J160=43,'Equivalencia BH-BMPT'!$D$44,IF(J160=44,'Equivalencia BH-BMPT'!$D$45,IF(J160=45,'Equivalencia BH-BMPT'!$D$46,\"No ha seleccionado un número de programa\")))))))))))))))))))))))))))))))))))))))))))))","v":"Igualdad y autonomía para una Bogotá incluyente"},1315,860066942,"CAJA DE COMPENSACION FAMILIAR - COMPENSAR",1456702566,null,null,0,0,1456702566,556582566,null,null,"2018-10-26",360,139,null,"X",null,null,null,0.38208387833649221,null,false]
[13989,2017,null,11,{"$f":"IF(D161=1,'Tipo '!$B$2,IF(D161=2,'Tipo '!$B$3,IF(D161=3,'Tipo '!$B$4,IF(D161=4,'Tipo '!$B$5,IF(D161=5,'Tipo '!$B$6,IF(D161=6,'Tipo '!$B$7,IF(D161=7,'Tipo '!$B$8,IF(D161=8,'Tipo '!$B$9,IF(D161=9,'Tipo '!$B$10,IF(D161=10,'Tipo '!$B$11,IF(D161=11,'Tipo '!$B$12,IF(D161=12,'Tipo '!$B$13,IF(D161=13,'Tipo '!$B$14,IF(D161=14,'Tipo '!$B$15,IF(D161=15,'Tipo '!$B$16,IF(D161=16,'Tipo '!$B$17,IF(D161=17,'Tipo '!$B$18,IF(D161=18,'Tipo '!$B$19,IF(D161=19,'Tipo '!$B$20,\"No ha seleccionado un tipo de contrato válido\")))))))))))))))))))","v":"SUMINISTRO"},"Selección abreviada ","Acuerdo marco de precios ","ADQUIRIR LOS INSUMOS, ELEMENTOS, MAQUINARIA Y SERVICIOS PROFESIONALES DE ASEO Y CAFETERIA PARA EL MANTENIMIENTO DE LA ENTIDAD A TRAVES DE ACUERDO MARCO DE PRECIOS DE LA TIENDA VIRTUAL DE COLOMBIA COMPRA EFICIENTE,  DE ACUERDO A MEMORANDO RADICADO BAJO EL NÚMERO 2017-532-000-1083 DE FECHA FEBRERO 6  DE 2017, FIRMADO POR EL ALCALDE LOCAL.","Funcionamiento",1,{"$f":"IF(J161=1,'Equivalencia BH-BMPT'!$D$2,IF(J161=2,'Equivalencia BH-BMPT'!$D$3,IF(J161=3,'Equivalencia BH-BMPT'!$D$4,IF(J161=4,'Equivalencia BH-BMPT'!$D$5,IF(J161=5,'Equivalencia BH-BMPT'!$D$6,IF(J161=6,'Equivalencia BH-BMPT'!$D$7,IF(J161=7,'Equivalencia BH-BMPT'!$D$8,IF(J161=8,'Equivalencia BH-BMPT'!$D$9,IF(J161=9,'Equivalencia BH-BMPT'!$D$10,IF(J161=10,'Equivalencia BH-BMPT'!$D$11,IF(J161=11,'Equivalencia BH-BMPT'!$D$12,IF(J161=12,'Equivalencia BH-BMPT'!$D$13,IF(J161=13,'Equivalencia BH-BMPT'!$D$14,IF(J161=14,'Equivalencia BH-BMPT'!$D$15,IF(J161=15,'Equivalencia BH-BMPT'!$D$16,IF(J161=16,'Equivalencia BH-BMPT'!$D$17,IF(J161=17,'Equivalencia BH-BMPT'!$D$18,IF(J161=18,'Equivalencia BH-BMPT'!$D$19,IF(J161=19,'Equivalencia BH-BMPT'!$D$20,IF(J161=20,'Equivalencia BH-BMPT'!$D$21,IF(J161=21,'Equivalencia BH-BMPT'!$D$22,IF(J161=22,'Equivalencia BH-BMPT'!$D$23,IF(J161=23,'Equivalencia BH-BMPT'!#REF!,IF(J161=24,'Equivalencia BH-BMPT'!$D$25,IF(J161=25,'Equivalencia BH-BMPT'!$D$26,IF(J161=26,'Equivalencia BH-BMPT'!$D$27,IF(J161=27,'Equivalencia BH-BMPT'!$D$28,IF(J161=28,'Equivalencia BH-BMPT'!$D$29,IF(J161=29,'Equivalencia BH-BMPT'!$D$30,IF(J161=30,'Equivalencia BH-BMPT'!$D$31,IF(J161=31,'Equivalencia BH-BMPT'!$D$32,IF(J161=32,'Equivalencia BH-BMPT'!$D$33,IF(J161=33,'Equivalencia BH-BMPT'!$D$34,IF(J161=34,'Equivalencia BH-BMPT'!$D$35,IF(J161=35,'Equivalencia BH-BMPT'!$D$36,IF(J161=36,'Equivalencia BH-BMPT'!$D$37,IF(J161=37,'Equivalencia BH-BMPT'!$D$38,IF(J161=38,'Equivalencia BH-BMPT'!#REF!,IF(J161=39,'Equivalencia BH-BMPT'!$D$40,IF(J161=40,'Equivalencia BH-BMPT'!$D$41,IF(J161=41,'Equivalencia BH-BMPT'!$D$42,IF(J161=42,'Equivalencia BH-BMPT'!$D$43,IF(J161=43,'Equivalencia BH-BMPT'!$D$44,IF(J161=44,'Equivalencia BH-BMPT'!$D$45,IF(J161=45,'Equivalencia BH-BMPT'!$D$46,\"No ha seleccionado un número de programa\")))))))))))))))))))))))))))))))))))))))))))))","v":"Prevención y atención de la maternidad y la paternidad tempranas"},0,860067479,"SERVIASEO S.A. SERVIASEO",87887382,null,null,0,0,87887382,59752143,null,null,"2018-02-08",360,0,null,"X",null,null,null,0.67987169079629661,null,false]
[17839,2017,null,11,{"$f":"IF(D162=1,'Tipo '!$B$2,IF(D162=2,'Tipo '!$B$3,IF(D162=3,'Tipo '!$B$4,IF(D162=4,'Tipo '!$B$5,IF(D162=5,'Tipo '!$B$6,IF(D162=6,'Tipo '!$B$7,IF(D162=7,'Tipo '!$B$8,IF(D162=8,'Tipo '!$B$9,IF(D162=9,'Tipo '!$B$10,IF(D162=10,'Tipo '!$B$11,IF(D162=11,'Tipo '!$B$12,IF(D162=12,'Tipo '!$B$13,IF(D162=13,'Tipo '!$B$14,IF(D162=14,'Tipo '!$B$15,IF(D162=15,'Tipo '!$B$16,IF(D162=16,'Tipo '!$B$17,IF(D162=17,'Tipo '!$B$18,IF(D162=18,'Tipo '!$B$19,IF(D162=19,'Tipo '!$B$20,\"No ha seleccionado un tipo de contrato válido\")))))))))))))))))))","v":"SUMINISTRO"},"Selección abreviada ","Acuerdo marco de precios ","EL CONTRATISTA SE OBLIGA CON EL FONDO DE DESARROLLO LOCAL A REALIZAR EL SUMINISTRO DE COMBUSTIBLE: (GASOLINA CORRIENTE Y ACPM)    PARA LOS VEHICULOS Y PLANTAS ELECTRICAS DE PROPIEDAD DE LA ALCALDÍA LOCAL DE SANTA FE,  DE ACUERDO A MEMORANDO RADICADO BAJO EL NÚMERO 2017-532-000-5793 DE FECHA JUNIO 7   DE 2017, FIRMADO POR EL ALCALDE LOCAL,","Funcionamiento",0,{"$f":"IF(J162=1,'Equivalencia BH-BMPT'!$D$2,IF(J162=2,'Equivalencia BH-BMPT'!$D$3,IF(J162=3,'Equivalencia BH-BMPT'!$D$4,IF(J162=4,'Equivalencia BH-BMPT'!$D$5,IF(J162=5,'Equivalencia BH-BMPT'!$D$6,IF(J162=6,'Equivalencia BH-BMPT'!$D$7,IF(J162=7,'Equivalencia BH-BMPT'!$D$8,IF(J162=8,'Equivalencia BH-BMPT'!$D$9,IF(J162=9,'Equivalencia BH-BMPT'!$D$10,IF(J162=10,'Equivalencia BH-BMPT'!$D$11,IF(J162=11,'Equivalencia BH-BMPT'!$D$12,IF(J162=12,'Equivalencia BH-BMPT'!$D$13,IF(J162=13,'Equivalencia BH-BMPT'!$D$14,IF(J162=14,'Equivalencia BH-BMPT'!$D$15,IF(J162=15,'Equivalencia BH-BMPT'!$D$16,IF(J162=16,'Equivalencia BH-BMPT'!$D$17,IF(J162=17,'Equivalencia BH-BMPT'!$D$18,IF(J162=18,'Equivalencia BH-BMPT'!$D$19,IF(J162=19,'Equivalencia BH-BMPT'!$D$20,IF(J162=20,'Equivalencia BH-BMPT'!$D$21,IF(J162=21,'Equivalencia BH-BMPT'!$D$22,IF(J162=22,'Equivalencia BH-BMPT'!$D$23,IF(J162=23,'Equivalencia BH-BMPT'!#REF!,IF(J162=24,'Equivalencia BH-BMPT'!$D$25,IF(J162=25,'Equivalencia BH-BMPT'!$D$26,IF(J162=26,'Equivalencia BH-BMPT'!$D$27,IF(J162=27,'Equivalencia BH-BMPT'!$D$28,IF(J162=28,'Equivalencia BH-BMPT'!$D$29,IF(J162=29,'Equivalencia BH-BMPT'!$D$30,IF(J162=30,'Equivalencia BH-BMPT'!$D$31,IF(J162=31,'Equivalencia BH-BMPT'!$D$32,IF(J162=32,'Equivalencia BH-BMPT'!$D$33,IF(J162=33,'Equivalencia BH-BMPT'!$D$34,IF(J162=34,'Equivalencia BH-BMPT'!$D$35,IF(J162=35,'Equivalencia BH-BMPT'!$D$36,IF(J162=36,'Equivalencia BH-BMPT'!$D$37,IF(J162=37,'Equivalencia BH-BMPT'!$D$38,IF(J162=38,'Equivalencia BH-BMPT'!#REF!,IF(J162=39,'Equivalencia BH-BMPT'!$D$40,IF(J162=40,'Equivalencia BH-BMPT'!$D$41,IF(J162=41,'Equivalencia BH-BMPT'!$D$42,IF(J162=42,'Equivalencia BH-BMPT'!$D$43,IF(J162=43,'Equivalencia BH-BMPT'!$D$44,IF(J162=44,'Equivalencia BH-BMPT'!$D$45,IF(J162=45,'Equivalencia BH-BMPT'!$D$46,\"No ha seleccionado un número de programa\")))))))))))))))))))))))))))))))))))))))))))))","v":"No ha seleccionado un número de programa"},0,830095213,"ORGANIZACION TERPEL S A",42000000,null,null,0,0,42000000,12098667,null,null,"2018-06-06",360,0,null,"X",null,null,null,0.28806349999999997,null,true]
[22017,2017,null,11,{"$f":"IF(D163=1,'Tipo '!$B$2,IF(D163=2,'Tipo '!$B$3,IF(D163=3,'Tipo '!$B$4,IF(D163=4,'Tipo '!$B$5,IF(D163=5,'Tipo '!$B$6,IF(D163=6,'Tipo '!$B$7,IF(D163=7,'Tipo '!$B$8,IF(D163=8,'Tipo '!$B$9,IF(D163=9,'Tipo '!$B$10,IF(D163=10,'Tipo '!$B$11,IF(D163=11,'Tipo '!$B$12,IF(D163=12,'Tipo '!$B$13,IF(D163=13,'Tipo '!$B$14,IF(D163=14,'Tipo '!$B$15,IF(D163=15,'Tipo '!$B$16,IF(D163=16,'Tipo '!$B$17,IF(D163=17,'Tipo '!$B$18,IF(D163=18,'Tipo '!$B$19,IF(D163=19,'Tipo '!$B$20,\"No ha seleccionado un tipo de contrato válido\")))))))))))))))))))","v":"SUMINISTRO"},"Selección abreviada ","Acuerdo marco de precios ","ADQUISICIÓN A TRAVÉS DE LA BOLSA MERCANTIL DE COLOMBIA S.A EL SERVICIO DE VIGILANCIA Y SEGURIDAD PRIVADA EN LOS  PREDIOS Y CON LAS CONDICIONES TECNICAS QUE DESIGNE EL FONDO DE  DESARROLLO LOCAL DE SANTAFE,  DE ACUERDO A MEMORANDO RADICADO BAJO EL NÚMERO 2017-532-0000-1503 DE FECHA FEBRERO 24 DE 2017 , FIRMADO POR EL ALCALDE LOCAL. - RUEDA NUMERO 39 DE FECHA FEBRERO 24 DE 2017. OPERACION DE MERCADO ABIERTO O.M.A. NUMERO 28089093-0","Funcionamiento",1,{"$f":"IF(J163=1,'Equivalencia BH-BMPT'!$D$2,IF(J163=2,'Equivalencia BH-BMPT'!$D$3,IF(J163=3,'Equivalencia BH-BMPT'!$D$4,IF(J163=4,'Equivalencia BH-BMPT'!$D$5,IF(J163=5,'Equivalencia BH-BMPT'!$D$6,IF(J163=6,'Equivalencia BH-BMPT'!$D$7,IF(J163=7,'Equivalencia BH-BMPT'!$D$8,IF(J163=8,'Equivalencia BH-BMPT'!$D$9,IF(J163=9,'Equivalencia BH-BMPT'!$D$10,IF(J163=10,'Equivalencia BH-BMPT'!$D$11,IF(J163=11,'Equivalencia BH-BMPT'!$D$12,IF(J163=12,'Equivalencia BH-BMPT'!$D$13,IF(J163=13,'Equivalencia BH-BMPT'!$D$14,IF(J163=14,'Equivalencia BH-BMPT'!$D$15,IF(J163=15,'Equivalencia BH-BMPT'!$D$16,IF(J163=16,'Equivalencia BH-BMPT'!$D$17,IF(J163=17,'Equivalencia BH-BMPT'!$D$18,IF(J163=18,'Equivalencia BH-BMPT'!$D$19,IF(J163=19,'Equivalencia BH-BMPT'!$D$20,IF(J163=20,'Equivalencia BH-BMPT'!$D$21,IF(J163=21,'Equivalencia BH-BMPT'!$D$22,IF(J163=22,'Equivalencia BH-BMPT'!$D$23,IF(J163=23,'Equivalencia BH-BMPT'!#REF!,IF(J163=24,'Equivalencia BH-BMPT'!$D$25,IF(J163=25,'Equivalencia BH-BMPT'!$D$26,IF(J163=26,'Equivalencia BH-BMPT'!$D$27,IF(J163=27,'Equivalencia BH-BMPT'!$D$28,IF(J163=28,'Equivalencia BH-BMPT'!$D$29,IF(J163=29,'Equivalencia BH-BMPT'!$D$30,IF(J163=30,'Equivalencia BH-BMPT'!$D$31,IF(J163=31,'Equivalencia BH-BMPT'!$D$32,IF(J163=32,'Equivalencia BH-BMPT'!$D$33,IF(J163=33,'Equivalencia BH-BMPT'!$D$34,IF(J163=34,'Equivalencia BH-BMPT'!$D$35,IF(J163=35,'Equivalencia BH-BMPT'!$D$36,IF(J163=36,'Equivalencia BH-BMPT'!$D$37,IF(J163=37,'Equivalencia BH-BMPT'!$D$38,IF(J163=38,'Equivalencia BH-BMPT'!#REF!,IF(J163=39,'Equivalencia BH-BMPT'!$D$40,IF(J163=40,'Equivalencia BH-BMPT'!$D$41,IF(J163=41,'Equivalencia BH-BMPT'!$D$42,IF(J163=42,'Equivalencia BH-BMPT'!$D$43,IF(J163=43,'Equivalencia BH-BMPT'!$D$44,IF(J163=44,'Equivalencia BH-BMPT'!$D$45,IF(J163=45,'Equivalencia BH-BMPT'!$D$46,\"No ha seleccionado un número de programa\")))))))))))))))))))))))))))))))))))))))))))))","v":"Prevención y atención de la maternidad y la paternidad tempranas"},0,"805000867","CORREAGRO S.A",7205411,null,null,0,0,7205411,4483956,null,null,"2018-02-23",360,0,null,"X",null,null,null,0.62230398793351271,null,false]
[24367,2017,null,11,{"$f":"IF(D164=1,'Tipo '!$B$2,IF(D164=2,'Tipo '!$B$3,IF(D164=3,'Tipo '!$B$4,IF(D164=4,'Tipo '!$B$5,IF(D164=5,'Tipo '!$B$6,IF(D164=6,'Tipo '!$B$7,IF(D164=7,'Tipo '!$B$8,IF(D164=8,'Tipo '!$B$9,IF(D164=9,'Tipo '!$B$10,IF(D164=10,'Tipo '!$B$11,IF(D164=11,'Tipo '!$B$12,IF(D164=12,'Tipo '!$B$13,IF(D164=13,'Tipo '!$B$14,IF(D164=14,'Tipo '!$B$15,IF(D164=15,'Tipo '!$B$16,IF(D164=16,'Tipo '!$B$17,IF(D164=17,'Tipo '!$B$18,IF(D164=18,'Tipo '!$B$19,IF(D164=19,'Tipo '!$B$20,\"No ha seleccionado un tipo de contrato válido\")))))))))))))))))))","v":"SUMINISTRO"},"Selección abreviada ","Acuerdo marco de precios ","ADQUISICIÓN DEL SISTEMA DE VIDEO VIGILANCIA DEL DISTRITO A TRAVÉS DE LA OPERACIÓN SECUNDARIA DEL INSTRUMENTO DE AGREGACIÓN DE DEMANDA LP-151-AG-2017 DE COLOMBIA COMPRA EFICIENTE PARA LA LOCALIDAD DE SANTA FE,   DE ACUERDO A MEMORANDO RADICADO BAJO EL NÚMERO 2017-532-00-13833 DE FECHA DICIEMBRE 28   DE 2017, FIRMADO POR EL ALCALDE LOCAL","Inversión",19,{"$f":"IF(J164=1,'Equivalencia BH-BMPT'!$D$2,IF(J164=2,'Equivalencia BH-BMPT'!$D$3,IF(J164=3,'Equivalencia BH-BMPT'!$D$4,IF(J164=4,'Equivalencia BH-BMPT'!$D$5,IF(J164=5,'Equivalencia BH-BMPT'!$D$6,IF(J164=6,'Equivalencia BH-BMPT'!$D$7,IF(J164=7,'Equivalencia BH-BMPT'!$D$8,IF(J164=8,'Equivalencia BH-BMPT'!$D$9,IF(J164=9,'Equivalencia BH-BMPT'!$D$10,IF(J164=10,'Equivalencia BH-BMPT'!$D$11,IF(J164=11,'Equivalencia BH-BMPT'!$D$12,IF(J164=12,'Equivalencia BH-BMPT'!$D$13,IF(J164=13,'Equivalencia BH-BMPT'!$D$14,IF(J164=14,'Equivalencia BH-BMPT'!$D$15,IF(J164=15,'Equivalencia BH-BMPT'!$D$16,IF(J164=16,'Equivalencia BH-BMPT'!$D$17,IF(J164=17,'Equivalencia BH-BMPT'!$D$18,IF(J164=18,'Equivalencia BH-BMPT'!$D$19,IF(J164=19,'Equivalencia BH-BMPT'!$D$20,IF(J164=20,'Equivalencia BH-BMPT'!$D$21,IF(J164=21,'Equivalencia BH-BMPT'!$D$22,IF(J164=22,'Equivalencia BH-BMPT'!$D$23,IF(J164=23,'Equivalencia BH-BMPT'!#REF!,IF(J164=24,'Equivalencia BH-BMPT'!$D$25,IF(J164=25,'Equivalencia BH-BMPT'!$D$26,IF(J164=26,'Equivalencia BH-BMPT'!$D$27,IF(J164=27,'Equivalencia BH-BMPT'!$D$28,IF(J164=28,'Equivalencia BH-BMPT'!$D$29,IF(J164=29,'Equivalencia BH-BMPT'!$D$30,IF(J164=30,'Equivalencia BH-BMPT'!$D$31,IF(J164=31,'Equivalencia BH-BMPT'!$D$32,IF(J164=32,'Equivalencia BH-BMPT'!$D$33,IF(J164=33,'Equivalencia BH-BMPT'!$D$34,IF(J164=34,'Equivalencia BH-BMPT'!$D$35,IF(J164=35,'Equivalencia BH-BMPT'!$D$36,IF(J164=36,'Equivalencia BH-BMPT'!$D$37,IF(J164=37,'Equivalencia BH-BMPT'!$D$38,IF(J164=38,'Equivalencia BH-BMPT'!#REF!,IF(J164=39,'Equivalencia BH-BMPT'!$D$40,IF(J164=40,'Equivalencia BH-BMPT'!$D$41,IF(J164=41,'Equivalencia BH-BMPT'!$D$42,IF(J164=42,'Equivalencia BH-BMPT'!$D$43,IF(J164=43,'Equivalencia BH-BMPT'!$D$44,IF(J164=44,'Equivalencia BH-BMPT'!$D$45,IF(J164=45,'Equivalencia BH-BMPT'!$D$46,\"No ha seleccionado un número de programa\")))))))))))))))))))))))))))))))))))))))))))))","v":"Seguridad y convivencia para todos"},1323,9011348174,"UT BOGOTA ALCALDIAS SEGURIDAD CIUDADANA",867224000,null,null,0,0,867224000,0,null,null,"2018-02-27",60,0,null,"X",null,null,null,0,null,false]
[14313,2017,null,11,{"$f":"IF(D165=1,'Tipo '!$B$2,IF(D165=2,'Tipo '!$B$3,IF(D165=3,'Tipo '!$B$4,IF(D165=4,'Tipo '!$B$5,IF(D165=5,'Tipo '!$B$6,IF(D165=6,'Tipo '!$B$7,IF(D165=7,'Tipo '!$B$8,IF(D165=8,'Tipo '!$B$9,IF(D165=9,'Tipo '!$B$10,IF(D165=10,'Tipo '!$B$11,IF(D165=11,'Tipo '!$B$12,IF(D165=12,'Tipo '!$B$13,IF(D165=13,'Tipo '!$B$14,IF(D165=14,'Tipo '!$B$15,IF(D165=15,'Tipo '!$B$16,IF(D165=16,'Tipo '!$B$17,IF(D165=17,'Tipo '!$B$18,IF(D165=18,'Tipo '!$B$19,IF(D165=19,'Tipo '!$B$20,\"No ha seleccionado un tipo de contrato válido\")))))))))))))))))))","v":"SUMINISTRO"},"Selección abreviada ","Bolsas de productos","ADQUIRIR PRODUCTOS DE PAPELERÍA Y ÚTILES  DE OFICINA DE ACUERDO CON LAS ESPECIFICACIONES ESTABLECIDAS EN EL ANEXO 1, PLIEGO DE CONDICIONES, LA CLAUSULA 8","Funcionamiento",0,{"$f":"IF(J165=1,'Equivalencia BH-BMPT'!$D$2,IF(J165=2,'Equivalencia BH-BMPT'!$D$3,IF(J165=3,'Equivalencia BH-BMPT'!$D$4,IF(J165=4,'Equivalencia BH-BMPT'!$D$5,IF(J165=5,'Equivalencia BH-BMPT'!$D$6,IF(J165=6,'Equivalencia BH-BMPT'!$D$7,IF(J165=7,'Equivalencia BH-BMPT'!$D$8,IF(J165=8,'Equivalencia BH-BMPT'!$D$9,IF(J165=9,'Equivalencia BH-BMPT'!$D$10,IF(J165=10,'Equivalencia BH-BMPT'!$D$11,IF(J165=11,'Equivalencia BH-BMPT'!$D$12,IF(J165=12,'Equivalencia BH-BMPT'!$D$13,IF(J165=13,'Equivalencia BH-BMPT'!$D$14,IF(J165=14,'Equivalencia BH-BMPT'!$D$15,IF(J165=15,'Equivalencia BH-BMPT'!$D$16,IF(J165=16,'Equivalencia BH-BMPT'!$D$17,IF(J165=17,'Equivalencia BH-BMPT'!$D$18,IF(J165=18,'Equivalencia BH-BMPT'!$D$19,IF(J165=19,'Equivalencia BH-BMPT'!$D$20,IF(J165=20,'Equivalencia BH-BMPT'!$D$21,IF(J165=21,'Equivalencia BH-BMPT'!$D$22,IF(J165=22,'Equivalencia BH-BMPT'!$D$23,IF(J165=23,'Equivalencia BH-BMPT'!#REF!,IF(J165=24,'Equivalencia BH-BMPT'!$D$25,IF(J165=25,'Equivalencia BH-BMPT'!$D$26,IF(J165=26,'Equivalencia BH-BMPT'!$D$27,IF(J165=27,'Equivalencia BH-BMPT'!$D$28,IF(J165=28,'Equivalencia BH-BMPT'!$D$29,IF(J165=29,'Equivalencia BH-BMPT'!$D$30,IF(J165=30,'Equivalencia BH-BMPT'!$D$31,IF(J165=31,'Equivalencia BH-BMPT'!$D$32,IF(J165=32,'Equivalencia BH-BMPT'!$D$33,IF(J165=33,'Equivalencia BH-BMPT'!$D$34,IF(J165=34,'Equivalencia BH-BMPT'!$D$35,IF(J165=35,'Equivalencia BH-BMPT'!$D$36,IF(J165=36,'Equivalencia BH-BMPT'!$D$37,IF(J165=37,'Equivalencia BH-BMPT'!$D$38,IF(J165=38,'Equivalencia BH-BMPT'!#REF!,IF(J165=39,'Equivalencia BH-BMPT'!$D$40,IF(J165=40,'Equivalencia BH-BMPT'!$D$41,IF(J165=41,'Equivalencia BH-BMPT'!$D$42,IF(J165=42,'Equivalencia BH-BMPT'!$D$43,IF(J165=43,'Equivalencia BH-BMPT'!$D$44,IF(J165=44,'Equivalencia BH-BMPT'!$D$45,IF(J165=45,'Equivalencia BH-BMPT'!$D$46,\"No ha seleccionado un número de programa\")))))))))))))))))))))))))))))))))))))))))))))","v":"No ha seleccionado un número de programa"},0,"860053274","GRUPO LOS LAGOS S.A.S",29440745,null,null,0,0,29440745,18663822,"2017-02-22","2017-02-22","2018-02-21",360,0,null,null,"X",null,null,0.63394530267491533]
[24373,2017,null,11,{"$f":"IF(D166=1,'Tipo '!$B$2,IF(D166=2,'Tipo '!$B$3,IF(D166=3,'Tipo '!$B$4,IF(D166=4,'Tipo '!$B$5,IF(D166=5,'Tipo '!$B$6,IF(D166=6,'Tipo '!$B$7,IF(D166=7,'Tipo '!$B$8,IF(D166=8,'Tipo '!$B$9,IF(D166=9,'Tipo '!$B$10,IF(D166=10,'Tipo '!$B$11,IF(D166=11,'Tipo '!$B$12,IF(D166=12,'Tipo '!$B$13,IF(D166=13,'Tipo '!$B$14,IF(D166=14,'Tipo '!$B$15,IF(D166=15,'Tipo '!$B$16,IF(D166=16,'Tipo '!$B$17,IF(D166=17,'Tipo '!$B$18,IF(D166=18,'Tipo '!$B$19,IF(D166=19,'Tipo '!$B$20,\"No ha seleccionado un tipo de contrato válido\")))))))))))))))))))","v":"SUMINISTRO"},"Selección abreviada ","Bolsas de productos","ADQUISICION DE TREINTA Y DOS (32) LICENCIAS DE MICROSOFT OFFICE 2016 GOVERNMENT OLP 1 A TRAVES DEL ACUERDO MARCO DE PRECIOS,  DE ACUERDO A MEMORANDO RADICADO BAJO EL NÚMERO 2017-532-00-13823 DE FECHA DICIEMBRE    28     DE 2017, FIRMADO POR EL ALCALDE LOCAL","Funcionamiento",0,{"$f":"IF(J166=1,'Equivalencia BH-BMPT'!$D$2,IF(J166=2,'Equivalencia BH-BMPT'!$D$3,IF(J166=3,'Equivalencia BH-BMPT'!$D$4,IF(J166=4,'Equivalencia BH-BMPT'!$D$5,IF(J166=5,'Equivalencia BH-BMPT'!$D$6,IF(J166=6,'Equivalencia BH-BMPT'!$D$7,IF(J166=7,'Equivalencia BH-BMPT'!$D$8,IF(J166=8,'Equivalencia BH-BMPT'!$D$9,IF(J166=9,'Equivalencia BH-BMPT'!$D$10,IF(J166=10,'Equivalencia BH-BMPT'!$D$11,IF(J166=11,'Equivalencia BH-BMPT'!$D$12,IF(J166=12,'Equivalencia BH-BMPT'!$D$13,IF(J166=13,'Equivalencia BH-BMPT'!$D$14,IF(J166=14,'Equivalencia BH-BMPT'!$D$15,IF(J166=15,'Equivalencia BH-BMPT'!$D$16,IF(J166=16,'Equivalencia BH-BMPT'!$D$17,IF(J166=17,'Equivalencia BH-BMPT'!$D$18,IF(J166=18,'Equivalencia BH-BMPT'!$D$19,IF(J166=19,'Equivalencia BH-BMPT'!$D$20,IF(J166=20,'Equivalencia BH-BMPT'!$D$21,IF(J166=21,'Equivalencia BH-BMPT'!$D$22,IF(J166=22,'Equivalencia BH-BMPT'!$D$23,IF(J166=23,'Equivalencia BH-BMPT'!#REF!,IF(J166=24,'Equivalencia BH-BMPT'!$D$25,IF(J166=25,'Equivalencia BH-BMPT'!$D$26,IF(J166=26,'Equivalencia BH-BMPT'!$D$27,IF(J166=27,'Equivalencia BH-BMPT'!$D$28,IF(J166=28,'Equivalencia BH-BMPT'!$D$29,IF(J166=29,'Equivalencia BH-BMPT'!$D$30,IF(J166=30,'Equivalencia BH-BMPT'!$D$31,IF(J166=31,'Equivalencia BH-BMPT'!$D$32,IF(J166=32,'Equivalencia BH-BMPT'!$D$33,IF(J166=33,'Equivalencia BH-BMPT'!$D$34,IF(J166=34,'Equivalencia BH-BMPT'!$D$35,IF(J166=35,'Equivalencia BH-BMPT'!$D$36,IF(J166=36,'Equivalencia BH-BMPT'!$D$37,IF(J166=37,'Equivalencia BH-BMPT'!$D$38,IF(J166=38,'Equivalencia BH-BMPT'!#REF!,IF(J166=39,'Equivalencia BH-BMPT'!$D$40,IF(J166=40,'Equivalencia BH-BMPT'!$D$41,IF(J166=41,'Equivalencia BH-BMPT'!$D$42,IF(J166=42,'Equivalencia BH-BMPT'!$D$43,IF(J166=43,'Equivalencia BH-BMPT'!$D$44,IF(J166=44,'Equivalencia BH-BMPT'!$D$45,IF(J166=45,'Equivalencia BH-BMPT'!$D$46,\"No ha seleccionado un número de programa\")))))))))))))))))))))))))))))))))))))))))))))","v":"No ha seleccionado un número de programa"},0,"800058607","CONTROLES EMPRESARIALES LTDA",28284957,null,null,0,0,28284957,0,null,null,"2018-12-27",0,0,null,"X",null,null,null,0,null,true]
[20,2016,"16-12-4959489",5,{"$f":"IF(D167=1,'Tipo '!$B$2,IF(D167=2,'Tipo '!$B$3,IF(D167=3,'Tipo '!$B$4,IF(D167=4,'Tipo '!$B$5,IF(D167=5,'Tipo '!$B$6,IF(D167=6,'Tipo '!$B$7,IF(D167=7,'Tipo '!$B$8,IF(D167=8,'Tipo '!$B$9,IF(D167=9,'Tipo '!$B$10,IF(D167=10,'Tipo '!$B$11,IF(D167=11,'Tipo '!$B$12,IF(D167=12,'Tipo '!$B$13,IF(D167=13,'Tipo '!$B$14,IF(D167=14,'Tipo '!$B$15,IF(D167=15,'Tipo '!$B$16,IF(D167=16,'Tipo '!$B$17,IF(D167=17,'Tipo '!$B$18,IF(D167=18,'Tipo '!$B$19,IF(D167=19,'Tipo '!$B$20,\"No ha seleccionado un tipo de contrato válido\")))))))))))))))))))","v":"CONTRATOS DE PRESTACIÓN DE SERVICIOS PROFESIONALES Y DE APOYO A LA GESTIÓN"},"Contratación directa","Prestación de servicios profesionales y de apoyo a la gestión, o para la ejecución de trabajos artísticos que sólo puedan encomendarse a determinadas personas naturales;","ADICION   Y   PRORROGA PRESTAR SUS SERVICIOS PROFESIONALES EN LAS ETAPAS PRECONTRACTUAL, CONTRACTUAL Y POSCONTRACTUAL DE LOS PROCESOS QUE LE SEAN ASIGNADOS REALIZANDO EL ACOMPAÑAMIENTO DESDE LA FORMULACION DEL PROYECTO Y DEMAS FUNCIONES PROPIAS DEL AREA JURIDICA DEL FONDO DE DESARROLLO LOCAL DE SANTA FEDE ACUERDO A MEMORANDO RADICADO BAJO EL NÚMERO 2017-532-000-1273 DE FECHA FEBRERO 14 DE 2017, FIRMADO POR EL ALCALDE LOCAL","Inversión",45,null,1326,1010161691,"LILIANA ANDREA IBARRA MENDEZ",0,null,null,2,5553333,5553333,5553333,42780,42780,42812,34,46,null,null,null,"X",null,1]
[28,2016,"16-12-5065731",5,{"$f":"IF(D168=1,'Tipo '!$B$2,IF(D168=2,'Tipo '!$B$3,IF(D168=3,'Tipo '!$B$4,IF(D168=4,'Tipo '!$B$5,IF(D168=5,'Tipo '!$B$6,IF(D168=6,'Tipo '!$B$7,IF(D168=7,'Tipo '!$B$8,IF(D168=8,'Tipo '!$B$9,IF(D168=9,'Tipo '!$B$10,IF(D168=10,'Tipo '!$B$11,IF(D168=11,'Tipo '!$B$12,IF(D168=12,'Tipo '!$B$13,IF(D168=13,'Tipo '!$B$14,IF(D168=14,'Tipo '!$B$15,IF(D168=15,'Tipo '!$B$16,IF(D168=16,'Tipo '!$B$17,IF(D168=17,'Tipo '!$B$18,IF(D168=18,'Tipo '!$B$19,IF(D168=19,'Tipo '!$B$20,\"No ha seleccionado un tipo de contrato válido\")))))))))))))))))))","v":"CONTRATOS DE PRESTACIÓN DE SERVICIOS PROFESIONALES Y DE APOYO A LA GESTIÓN"},"Contratación directa","Prestación de servicios profesionales y de apoyo a la gestión, o para la ejecución de trabajos artísticos que sólo puedan encomendarse a determinadas personas naturales;","ADICION   Y   PRORROGA EL CONTRATISTA SE OBLIGA CON EL FDLSF A PRESTAR SUS SERVICIOS PROFESIONALES AL DESPACHO DE LA ALCALDIA LOCAL EN MATERIA TECNICA, EN TODAS LAS ACTUCIONES PROPIAS DEL AREA DE PLANEACION EN LA REVISION DE LA FORMULACION, VIABILIZACION,SUPERVISION Y SEGUIMIENTO DE LOS PROYECTOS GENERADOS POR DICHA DEPENDENCIADE ACUERDO A MEMORANDO RADICADO BAJO EL NÚMERO 2017-532-000-1273 DE FECHA FEBRERO 14 DE 2017, FIRMADO POR EL ALCALDE LOCAL","Inversión",45,null,1326,79876655,"RENEE MAURICIO QUIMBAY BARRERA",0,null,null,1,6000000,6000000,6000000,42780,42780,42820,40,40,null,null,null,"X",null,1]
[29,2016,"16-12-5064566",5,{"$f":"IF(D169=1,'Tipo '!$B$2,IF(D169=2,'Tipo '!$B$3,IF(D169=3,'Tipo '!$B$4,IF(D169=4,'Tipo '!$B$5,IF(D169=5,'Tipo '!$B$6,IF(D169=6,'Tipo '!$B$7,IF(D169=7,'Tipo '!$B$8,IF(D169=8,'Tipo '!$B$9,IF(D169=9,'Tipo '!$B$10,IF(D169=10,'Tipo '!$B$11,IF(D169=11,'Tipo '!$B$12,IF(D169=12,'Tipo '!$B$13,IF(D169=13,'Tipo '!$B$14,IF(D169=14,'Tipo '!$B$15,IF(D169=15,'Tipo '!$B$16,IF(D169=16,'Tipo '!$B$17,IF(D169=17,'Tipo '!$B$18,IF(D169=18,'Tipo '!$B$19,IF(D169=19,'Tipo '!$B$20,\"No ha seleccionado un tipo de contrato válido\")))))))))))))))))))","v":"CONTRATOS DE PRESTACIÓN DE SERVICIOS PROFESIONALES Y DE APOYO A LA GESTIÓN"},"Contratación directa","Prestación de servicios profesionales y de apoyo a la gestión, o para la ejecución de trabajos artísticos que sólo puedan encomendarse a determinadas personas naturales;","ADICION   Y   PRORROGA PRESTAR  SUS SERVICIOS PROFESIONALES  AL DESPACHO  DE LA ALCALDIA LOCAL DEL FONDO DE DESARROLLO LOCAL DE SANTA FE EN MATERIA JURIDICA EN TODAS LAS ACTUACIONES PROPIAS  DE LAS COORDINACIONES ADMINISTATIVAS Y FINANCIERAS Y NORMATIVA YJURIDICADE ACUERDO A MEMORANDO RADICADO BAJO EL NÚMERO 2017-532-000-1273 DE FECHA FEBRERO 14 DE 2017, FIRMADO POR EL ALCALDE LOCAL","Inversión",45,null,1326,1065596343,"MIGUEL ANGEL ROCHA CUELLO",0,null,null,1,6000000,6000000,6000000,42780,42780,42821,41,41,null,null,null,"X",null,1]
[30,2016,"16-12-5064618",5,{"$f":"IF(D170=1,'Tipo '!$B$2,IF(D170=2,'Tipo '!$B$3,IF(D170=3,'Tipo '!$B$4,IF(D170=4,'Tipo '!$B$5,IF(D170=5,'Tipo '!$B$6,IF(D170=6,'Tipo '!$B$7,IF(D170=7,'Tipo '!$B$8,IF(D170=8,'Tipo '!$B$9,IF(D170=9,'Tipo '!$B$10,IF(D170=10,'Tipo '!$B$11,IF(D170=11,'Tipo '!$B$12,IF(D170=12,'Tipo '!$B$13,IF(D170=13,'Tipo '!$B$14,IF(D170=14,'Tipo '!$B$15,IF(D170=15,'Tipo '!$B$16,IF(D170=16,'Tipo '!$B$17,IF(D170=17,'Tipo '!$B$18,IF(D170=18,'Tipo '!$B$19,IF(D170=19,'Tipo '!$B$20,\"No ha seleccionado un tipo de contrato válido\")))))))))))))))))))","v":"CONTRATOS DE PRESTACIÓN DE SERVICIOS PROFESIONALES Y DE APOYO A LA GESTIÓN"},"Contratación directa","Prestación de servicios profesionales y de apoyo a la gestión, o para la ejecución de trabajos artísticos que sólo puedan encomendarse a determinadas personas naturales;","ADICION   Y   PRORROGA PRESTAR SUS SERVICIOS PROFESIONALES  PARA EFECTUAR LA GESTION DE RELACIONES INTERINSTITUCIONALES, COMUNITARIAS, EN CAMPO Y SEDE ADMINISTRATIVA, DESIGNADAS POR EL DESPACHO DE LA ALCALDIA LOCAL DE SANTA FE, CON EL FIN DE PROMOVER LA INTEGRACION  DE LOS DIFERENTES SECTORES HACIA LA ENTIDADDE ACUERDO A MEMORANDO RADICADO BAJO EL NÚMERO 2017-532-000-1273 DE FECHA FEBRERO 14 DE 2017, FIRMADO POR EL ALCALDE LOCAL","Inversión",45,null,1326,1022329582,"RAFAEL  PEÑA HERRERA",0,null,null,1,6000000,6000000,6000000,42780,42780,42813,33,33,null,null,null,"X",null,1]
[31,2016,"16-12-5181652",5,{"$f":"IF(D171=1,'Tipo '!$B$2,IF(D171=2,'Tipo '!$B$3,IF(D171=3,'Tipo '!$B$4,IF(D171=4,'Tipo '!$B$5,IF(D171=5,'Tipo '!$B$6,IF(D171=6,'Tipo '!$B$7,IF(D171=7,'Tipo '!$B$8,IF(D171=8,'Tipo '!$B$9,IF(D171=9,'Tipo '!$B$10,IF(D171=10,'Tipo '!$B$11,IF(D171=11,'Tipo '!$B$12,IF(D171=12,'Tipo '!$B$13,IF(D171=13,'Tipo '!$B$14,IF(D171=14,'Tipo '!$B$15,IF(D171=15,'Tipo '!$B$16,IF(D171=16,'Tipo '!$B$17,IF(D171=17,'Tipo '!$B$18,IF(D171=18,'Tipo '!$B$19,IF(D171=19,'Tipo '!$B$20,\"No ha seleccionado un tipo de contrato válido\")))))))))))))))))))","v":"CONTRATOS DE PRESTACIÓN DE SERVICIOS PROFESIONALES Y DE APOYO A LA GESTIÓN"},"Contratación directa","Prestación de servicios profesionales y de apoyo a la gestión, o para la ejecución de trabajos artísticos que sólo puedan encomendarse a determinadas personas naturales;","ADICION   Y   PRORROGA PRESTAR SUS SERVICIOS PARA APOYAR LA DISTRIBUCION DE CORRESPONDENCIA PRODUCIDA EN LAS DIFERENTES AREAS DE LA ALCALDIA LOCAL DE SANTA FEDE ACUERDO A MEMORANDO RADICADO BAJO EL NÚMERO 2017-532-000-1273 DE FECHA FEBRERO 14 DE 2017, FIRMADO POR EL ALCALDE LOCAL","Inversión",45,null,1326,82360623,"EUMIR ANTONIO PALACIOS CAICEDO",0,null,null,1,1800000,1800000,1800000,42780,42780,42824,44,44,null,null,null,"X",null,1]
[32,2016,"16-12-5118364",5,{"$f":"IF(D172=1,'Tipo '!$B$2,IF(D172=2,'Tipo '!$B$3,IF(D172=3,'Tipo '!$B$4,IF(D172=4,'Tipo '!$B$5,IF(D172=5,'Tipo '!$B$6,IF(D172=6,'Tipo '!$B$7,IF(D172=7,'Tipo '!$B$8,IF(D172=8,'Tipo '!$B$9,IF(D172=9,'Tipo '!$B$10,IF(D172=10,'Tipo '!$B$11,IF(D172=11,'Tipo '!$B$12,IF(D172=12,'Tipo '!$B$13,IF(D172=13,'Tipo '!$B$14,IF(D172=14,'Tipo '!$B$15,IF(D172=15,'Tipo '!$B$16,IF(D172=16,'Tipo '!$B$17,IF(D172=17,'Tipo '!$B$18,IF(D172=18,'Tipo '!$B$19,IF(D172=19,'Tipo '!$B$20,\"No ha seleccionado un tipo de contrato válido\")))))))))))))))))))","v":"CONTRATOS DE PRESTACIÓN DE SERVICIOS PROFESIONALES Y DE APOYO A LA GESTIÓN"},"Contratación directa","Prestación de servicios profesionales y de apoyo a la gestión, o para la ejecución de trabajos artísticos que sólo puedan encomendarse a determinadas personas naturales;","ADICION   Y   PRORROGA PRESTAR SUS SERVICIOS PROFESIONALES PARA FORTALECER LOS PROCESOS DE FORMULACION, ELABORACION, VIABILIZACION, CONTRATACION, SUPERVISION Y SEGUIMIENTO DE LOS PROYECTOS DEL PRESUPUESTO DEL FDLSF Y DEMAS QUE LE SEAN ASIGNADOSDE ACUERDO A MEMORANDO RADICADO BAJO EL NÚMERO 2017-532-000-1273 DE FECHA FEBRERO 14 DE 2017, FIRMADO POR EL ALCALDE LOCAL","Inversión",45,null,1326,1128470583,"JESUS AUGUSTO SANTOS FERREIRA",0,null,null,1,4000000,4000000,4000000,42780,42780,42824,44,44,null,null,null,"X",null,1]
[33,2016,"16-12-5118466",5,{"$f":"IF(D173=1,'Tipo '!$B$2,IF(D173=2,'Tipo '!$B$3,IF(D173=3,'Tipo '!$B$4,IF(D173=4,'Tipo '!$B$5,IF(D173=5,'Tipo '!$B$6,IF(D173=6,'Tipo '!$B$7,IF(D173=7,'Tipo '!$B$8,IF(D173=8,'Tipo '!$B$9,IF(D173=9,'Tipo '!$B$10,IF(D173=10,'Tipo '!$B$11,IF(D173=11,'Tipo '!$B$12,IF(D173=12,'Tipo '!$B$13,IF(D173=13,'Tipo '!$B$14,IF(D173=14,'Tipo '!$B$15,IF(D173=15,'Tipo '!$B$16,IF(D173=16,'Tipo '!$B$17,IF(D173=17,'Tipo '!$B$18,IF(D173=18,'Tipo '!$B$19,IF(D173=19,'Tipo '!$B$20,\"No ha seleccionado un tipo de contrato válido\")))))))))))))))))))","v":"CONTRATOS DE PRESTACIÓN DE SERVICIOS PROFESIONALES Y DE APOYO A LA GESTIÓN"},"Contratación directa","Prestación de servicios profesionales y de apoyo a la gestión, o para la ejecución de trabajos artísticos que sólo puedan encomendarse a determinadas personas naturales;","ADICION   Y   PRORROGA PRESTAR LOS SERVICIOS COMO APOYO TECNICO EN LO RELACIONADO CON LA PLATAFORMA INFORMATICA Y MEDIOS TECNOLOGICOS DE LA ALCALDIA LOCAL DE SANTA FEDE ACUERDO A MEMORANDO RADICADO BAJO EL NÚMERO 2017-532-000-1273 DE FECHA FEBRERO 14 DE 2017, FIRMADO POR EL ALCALDE LOCAL","Inversión",45,null,1326,1082879244,"RAFAEL RICARDO BALAGUERA BONITTO",0,null,null,1,3000000,3000000,3000000,42780,42780,42824,44,44,null,null,null,"X",null,1]
[34,2016,"16-12-5166688",5,{"$f":"IF(D174=1,'Tipo '!$B$2,IF(D174=2,'Tipo '!$B$3,IF(D174=3,'Tipo '!$B$4,IF(D174=4,'Tipo '!$B$5,IF(D174=5,'Tipo '!$B$6,IF(D174=6,'Tipo '!$B$7,IF(D174=7,'Tipo '!$B$8,IF(D174=8,'Tipo '!$B$9,IF(D174=9,'Tipo '!$B$10,IF(D174=10,'Tipo '!$B$11,IF(D174=11,'Tipo '!$B$12,IF(D174=12,'Tipo '!$B$13,IF(D174=13,'Tipo '!$B$14,IF(D174=14,'Tipo '!$B$15,IF(D174=15,'Tipo '!$B$16,IF(D174=16,'Tipo '!$B$17,IF(D174=17,'Tipo '!$B$18,IF(D174=18,'Tipo '!$B$19,IF(D174=19,'Tipo '!$B$20,\"No ha seleccionado un tipo de contrato válido\")))))))))))))))))))","v":"CONTRATOS DE PRESTACIÓN DE SERVICIOS PROFESIONALES Y DE APOYO A LA GESTIÓN"},"Contratación directa","Prestación de servicios profesionales y de apoyo a la gestión, o para la ejecución de trabajos artísticos que sólo puedan encomendarse a determinadas personas naturales;","ADICION   Y   PRORROGA PRESTAR SUS SEVICIOS PROFESIONALES PARA FORTALECER LOS PROCESOS DE FORMULACION, ELABORACION, VIABILIZACION, CONTRATACION, SUPERVISION Y SEGUMIENTO DE LOS PROYECTOS DEL PRESUPEUSTO DEL FDL DE SANTA FEDE ACUERDO A MEMORANDO RADICADO BAJO EL NÚMERO 2017-532-000-1273 DE FECHA FEBRERO 14 DE 2017, FIRMADO POR EL ALCALDE LOCAL","Inversión",45,null,1326,1019039660,"JORGE ANDRES RIAÑO LEON",0,null,null,1,3500000,3500000,3500000,42780,42780,42824,44,44,null,null,null,"X",null,1]
[36,2016,"16-12-5166682",5,{"$f":"IF(D175=1,'Tipo '!$B$2,IF(D175=2,'Tipo '!$B$3,IF(D175=3,'Tipo '!$B$4,IF(D175=4,'Tipo '!$B$5,IF(D175=5,'Tipo '!$B$6,IF(D175=6,'Tipo '!$B$7,IF(D175=7,'Tipo '!$B$8,IF(D175=8,'Tipo '!$B$9,IF(D175=9,'Tipo '!$B$10,IF(D175=10,'Tipo '!$B$11,IF(D175=11,'Tipo '!$B$12,IF(D175=12,'Tipo '!$B$13,IF(D175=13,'Tipo '!$B$14,IF(D175=14,'Tipo '!$B$15,IF(D175=15,'Tipo '!$B$16,IF(D175=16,'Tipo '!$B$17,IF(D175=17,'Tipo '!$B$18,IF(D175=18,'Tipo '!$B$19,IF(D175=19,'Tipo '!$B$20,\"No ha seleccionado un tipo de contrato válido\")))))))))))))))))))","v":"CONTRATOS DE PRESTACIÓN DE SERVICIOS PROFESIONALES Y DE APOYO A LA GESTIÓN"},"Contratación directa","Prestación de servicios profesionales y de apoyo a la gestión, o para la ejecución de trabajos artísticos que sólo puedan encomendarse a determinadas personas naturales;","ADICION   Y   PRORROGA PRESTAR SUS SERVICIOS PARA EL APOYO ADMINISTRATIVO EN LOS TRAMITES DE LA OFICINA DEL DESPACHO DE LA ALCALDIA LOCAL DE SANTA FE, POR CUANTO SE REALIZAN DIFERENTES ACTIVIDADES Y TRABAJOS Y SE ATIENDE A LA COMUNIDADDE ACUERDO A MEMORANDO RADICADO BAJO EL NÚMERO 2017-532-000-1273 DE FECHA FEBRERO 14 DE 2017, FIRMADO POR EL ALCALDE LOCAL","Inversión",45,null,1326,1098669457,"RUBBY MARCELA FLECHAS MORALES",0,null,null,2,7000000,7000000,7000000,42780,42780,42824,44,44,null,null,null,"X",null,1]
[38,2016,"16-12-5128288",5,{"$f":"IF(D176=1,'Tipo '!$B$2,IF(D176=2,'Tipo '!$B$3,IF(D176=3,'Tipo '!$B$4,IF(D176=4,'Tipo '!$B$5,IF(D176=5,'Tipo '!$B$6,IF(D176=6,'Tipo '!$B$7,IF(D176=7,'Tipo '!$B$8,IF(D176=8,'Tipo '!$B$9,IF(D176=9,'Tipo '!$B$10,IF(D176=10,'Tipo '!$B$11,IF(D176=11,'Tipo '!$B$12,IF(D176=12,'Tipo '!$B$13,IF(D176=13,'Tipo '!$B$14,IF(D176=14,'Tipo '!$B$15,IF(D176=15,'Tipo '!$B$16,IF(D176=16,'Tipo '!$B$17,IF(D176=17,'Tipo '!$B$18,IF(D176=18,'Tipo '!$B$19,IF(D176=19,'Tipo '!$B$20,\"No ha seleccionado un tipo de contrato válido\")))))))))))))))))))","v":"CONTRATOS DE PRESTACIÓN DE SERVICIOS PROFESIONALES Y DE APOYO A LA GESTIÓN"},"Contratación directa","Prestación de servicios profesionales y de apoyo a la gestión, o para la ejecución de trabajos artísticos que sólo puedan encomendarse a determinadas personas naturales;","ADICION   Y   PRORROGA PRESTAR SUS SERVICIOS PROFESIONALES PARA LA FORMULACION, VIABILIZACION,CONTRATACION, SUPERVISION Y SEGUIMIENTO DE LOS PROYECTOS  DEL PRESUPUESTO DEL FDL DE SANTA FE Y DEMAS QUE LE SEAN ASIGNADASDE ACUERDO A MEMORANDO RADICADO BAJO EL NÚMERO 2017-532-000-1273 DE FECHA FEBRERO 14 DE 2017, FIRMADO POR EL ALCALDE LOCAL","Inversión",45,null,1326,53073076,"LEIDY JURANNY CRUZ MORENO",0,null,null,1,4500000,4500000,4500000,42780,42780,42824,44,44,null,null,null,"X",null,1]
[39,2016,"16-12-5166672",5,{"$f":"IF(D177=1,'Tipo '!$B$2,IF(D177=2,'Tipo '!$B$3,IF(D177=3,'Tipo '!$B$4,IF(D177=4,'Tipo '!$B$5,IF(D177=5,'Tipo '!$B$6,IF(D177=6,'Tipo '!$B$7,IF(D177=7,'Tipo '!$B$8,IF(D177=8,'Tipo '!$B$9,IF(D177=9,'Tipo '!$B$10,IF(D177=10,'Tipo '!$B$11,IF(D177=11,'Tipo '!$B$12,IF(D177=12,'Tipo '!$B$13,IF(D177=13,'Tipo '!$B$14,IF(D177=14,'Tipo '!$B$15,IF(D177=15,'Tipo '!$B$16,IF(D177=16,'Tipo '!$B$17,IF(D177=17,'Tipo '!$B$18,IF(D177=18,'Tipo '!$B$19,IF(D177=19,'Tipo '!$B$20,\"No ha seleccionado un tipo de contrato válido\")))))))))))))))))))","v":"CONTRATOS DE PRESTACIÓN DE SERVICIOS PROFESIONALES Y DE APOYO A LA GESTIÓN"},"Contratación directa","Prestación de servicios profesionales y de apoyo a la gestión, o para la ejecución de trabajos artísticos que sólo puedan encomendarse a determinadas personas naturales;","ADICION   Y   PRORROGA PRESTAR SERVICIOS PROFESIONALES A LA COORDINACIÓN JURÍDICA Y NORMATIVA, CON EL PROPÓSITO DE IMPULSAR LAS ACTUACIONES DE COMPETENCIA DE LA ALCALDÍA LOCAL DE SANTA FE.DE ACUERDO A MEMORANDO RADICADO BAJO EL NÚMERO 2017-532-000-1273 DE FECHA FEBRERO 14 DE 2017, FIRMADO POR EL ALCALDE LOCAL","Inversión",45,null,1326,79851423,"DIEGO ALBERTO YARA PALENCIA",0,null,null,1,4800000,4800000,4800000,42780,42780,42824,44,44,null,null,null,"X",null,1]
[40,2016,"16-12-5166717",5,{"$f":"IF(D178=1,'Tipo '!$B$2,IF(D178=2,'Tipo '!$B$3,IF(D178=3,'Tipo '!$B$4,IF(D178=4,'Tipo '!$B$5,IF(D178=5,'Tipo '!$B$6,IF(D178=6,'Tipo '!$B$7,IF(D178=7,'Tipo '!$B$8,IF(D178=8,'Tipo '!$B$9,IF(D178=9,'Tipo '!$B$10,IF(D178=10,'Tipo '!$B$11,IF(D178=11,'Tipo '!$B$12,IF(D178=12,'Tipo '!$B$13,IF(D178=13,'Tipo '!$B$14,IF(D178=14,'Tipo '!$B$15,IF(D178=15,'Tipo '!$B$16,IF(D178=16,'Tipo '!$B$17,IF(D178=17,'Tipo '!$B$18,IF(D178=18,'Tipo '!$B$19,IF(D178=19,'Tipo '!$B$20,\"No ha seleccionado un tipo de contrato válido\")))))))))))))))))))","v":"CONTRATOS DE PRESTACIÓN DE SERVICIOS PROFESIONALES Y DE APOYO A LA GESTIÓN"},"Contratación directa","Prestación de servicios profesionales y de apoyo a la gestión, o para la ejecución de trabajos artísticos que sólo puedan encomendarse a determinadas personas naturales;","ADICION   Y   PRORROGA EL CONTRATISTA SE OBLIGA A PRESTAR SUS SERVICIOS PROFESIONALES COMO APOYO AL ÁREA DE PRESUPUESTO Y CONTABILIDAD DE LA ALCALDÍA LOCAL DE SANTA FE EN LOS TRAMITES, PROCEDIMIENTOS Y APLICATIVOS DESIGNADOS A DICHAS AREAS.DE ACUERDO A MEMORANDO RADICADO BAJO EL NÚMERO 2017-532-000-1273 DE FECHA FEBRERO 14 DE 2017, FIRMADO POR EL ALCALDE LOCAL","Inversión",45,null,1326,51574722,"ANA LUISA FERNAN ESCANDON GARCIA",0,null,null,1,4500000,4500000,4500000,42780,42780,42824,44,44,null,null,null,"X",null,1]
[41,2016,"16-12-5183434",5,{"$f":"IF(D179=1,'Tipo '!$B$2,IF(D179=2,'Tipo '!$B$3,IF(D179=3,'Tipo '!$B$4,IF(D179=4,'Tipo '!$B$5,IF(D179=5,'Tipo '!$B$6,IF(D179=6,'Tipo '!$B$7,IF(D179=7,'Tipo '!$B$8,IF(D179=8,'Tipo '!$B$9,IF(D179=9,'Tipo '!$B$10,IF(D179=10,'Tipo '!$B$11,IF(D179=11,'Tipo '!$B$12,IF(D179=12,'Tipo '!$B$13,IF(D179=13,'Tipo '!$B$14,IF(D179=14,'Tipo '!$B$15,IF(D179=15,'Tipo '!$B$16,IF(D179=16,'Tipo '!$B$17,IF(D179=17,'Tipo '!$B$18,IF(D179=18,'Tipo '!$B$19,IF(D179=19,'Tipo '!$B$20,\"No ha seleccionado un tipo de contrato válido\")))))))))))))))))))","v":"CONTRATOS DE PRESTACIÓN DE SERVICIOS PROFESIONALES Y DE APOYO A LA GESTIÓN"},"Contratación directa","Prestación de servicios profesionales y de apoyo a la gestión, o para la ejecución de trabajos artísticos que sólo puedan encomendarse a determinadas personas naturales;","ADICION   Y   PRORROGA EL CONTRATISTA SE OBLIGA APRESTAR LOS SERVICIOS PROFESIONALES AL GRUPO DE GESTIÓN ADMINISTRATIVA Y FINANCIERA, REALIZANDO ACTIVIDADES INHERENTES AL CONSEJO LOCAL DE GESTIÓN DEL RIESGO, DE LA LOCALIDAD DE SANTA FE.DE ACUERDO A MEMORANDO RADICADO BAJO EL NÚMERO 2017-532-000-1273 DE FECHA FEBRERO 14 DE 2017, FIRMADO POR EL ALCALDE LOCAL","Inversión",45,null,1326,80189215,"GIOVANNY GABRIEL ORJUELA VARGAS",0,null,null,1,3500000,3500000,3500000,42780,42780,42824,44,44,null,null,null,"X",null,1]
[45,2016,"16-12-5166650",5,{"$f":"IF(D180=1,'Tipo '!$B$2,IF(D180=2,'Tipo '!$B$3,IF(D180=3,'Tipo '!$B$4,IF(D180=4,'Tipo '!$B$5,IF(D180=5,'Tipo '!$B$6,IF(D180=6,'Tipo '!$B$7,IF(D180=7,'Tipo '!$B$8,IF(D180=8,'Tipo '!$B$9,IF(D180=9,'Tipo '!$B$10,IF(D180=10,'Tipo '!$B$11,IF(D180=11,'Tipo '!$B$12,IF(D180=12,'Tipo '!$B$13,IF(D180=13,'Tipo '!$B$14,IF(D180=14,'Tipo '!$B$15,IF(D180=15,'Tipo '!$B$16,IF(D180=16,'Tipo '!$B$17,IF(D180=17,'Tipo '!$B$18,IF(D180=18,'Tipo '!$B$19,IF(D180=19,'Tipo '!$B$20,\"No ha seleccionado un tipo de contrato válido\")))))))))))))))))))","v":"CONTRATOS DE PRESTACIÓN DE SERVICIOS PROFESIONALES Y DE APOYO A LA GESTIÓN"},"Contratación directa","Prestación de servicios profesionales y de apoyo a la gestión, o para la ejecución de trabajos artísticos que sólo puedan encomendarse a determinadas personas naturales;","ADICION   Y   PRORROGA PRESTAR SUS SERVICIOS PROFESIONALES PARA LA FORMULACION, VIABILIZACION,CONTRATACION, SUPERVISION Y SEGUIMIENTO DE LOS PROYECTOS  DEL PRESUPUESTO DEL FDL DE SANTA FE Y DEMAS QUE LE SEAN ASIGNADASDE ACUERDO A MEMORANDO RADICADO BAJO EL NÚMERO 2017-532-000-1273 DE FECHA FEBRERO 14 DE 2017, FIRMADO POR EL ALCALDE LOCAL","Inversión",45,null,1326,1019028211,"LAURA CATALINA MARTINEZ CASTILLO",0,null,null,1,3550000,3550000,3550000,42780,42780,42824,44,44,null,null,null,"X",null,1]
[47,2016,"16-12-5166734",5,{"$f":"IF(D181=1,'Tipo '!$B$2,IF(D181=2,'Tipo '!$B$3,IF(D181=3,'Tipo '!$B$4,IF(D181=4,'Tipo '!$B$5,IF(D181=5,'Tipo '!$B$6,IF(D181=6,'Tipo '!$B$7,IF(D181=7,'Tipo '!$B$8,IF(D181=8,'Tipo '!$B$9,IF(D181=9,'Tipo '!$B$10,IF(D181=10,'Tipo '!$B$11,IF(D181=11,'Tipo '!$B$12,IF(D181=12,'Tipo '!$B$13,IF(D181=13,'Tipo '!$B$14,IF(D181=14,'Tipo '!$B$15,IF(D181=15,'Tipo '!$B$16,IF(D181=16,'Tipo '!$B$17,IF(D181=17,'Tipo '!$B$18,IF(D181=18,'Tipo '!$B$19,IF(D181=19,'Tipo '!$B$20,\"No ha seleccionado un tipo de contrato válido\")))))))))))))))))))","v":"CONTRATOS DE PRESTACIÓN DE SERVICIOS PROFESIONALES Y DE APOYO A LA GESTIÓN"},"Contratación directa","Prestación de servicios profesionales y de apoyo a la gestión, o para la ejecución de trabajos artísticos que sólo puedan encomendarse a determinadas personas naturales;","ADICION Y PRORROGA PRESTAR APOYO A LA GESTIÓN ADMINISTRATIVA Y FINANCIERA EN LA CONDUCCIÓN DE UN VEHÍCULO DE TRANSPORTE DE PROPIEDAD DEL FDLSF QUE LE SEA ASIGNADO.DE ACUERDO A MEMORANDO RADICADO BAJO EL NÚMERO 2017-532-000-1273 DE FECHA FEBRERO 14 DE 2017, FIRMADO POR EL ALCALDE LOCAL","Inversión",45,null,1326,79750912,"JOHN ALEXANDER SANABRIA",0,null,null,1,2200000,2200000,2200000,42780,42780,42824,44,44,null,null,null,"X",null,1]
[52,2016,"16-12-5166663",5,{"$f":"IF(D182=1,'Tipo '!$B$2,IF(D182=2,'Tipo '!$B$3,IF(D182=3,'Tipo '!$B$4,IF(D182=4,'Tipo '!$B$5,IF(D182=5,'Tipo '!$B$6,IF(D182=6,'Tipo '!$B$7,IF(D182=7,'Tipo '!$B$8,IF(D182=8,'Tipo '!$B$9,IF(D182=9,'Tipo '!$B$10,IF(D182=10,'Tipo '!$B$11,IF(D182=11,'Tipo '!$B$12,IF(D182=12,'Tipo '!$B$13,IF(D182=13,'Tipo '!$B$14,IF(D182=14,'Tipo '!$B$15,IF(D182=15,'Tipo '!$B$16,IF(D182=16,'Tipo '!$B$17,IF(D182=17,'Tipo '!$B$18,IF(D182=18,'Tipo '!$B$19,IF(D182=19,'Tipo '!$B$20,\"No ha seleccionado un tipo de contrato válido\")))))))))))))))))))","v":"CONTRATOS DE PRESTACIÓN DE SERVICIOS PROFESIONALES Y DE APOYO A LA GESTIÓN"},"Contratación directa","Prestación de servicios profesionales y de apoyo a la gestión, o para la ejecución de trabajos artísticos que sólo puedan encomendarse a determinadas personas naturales;","ADICION   Y   PRORROGA PRESTAR SUS SERVICIOS PROFESIONALES PARA LA FORMULACION, VIABILIZACION,CONTRATACION, SUPERVISION Y SEGUIMIENTO DE LOS PROYECTOS  DEL PRESUPUESTO DEL FDL DE SANTA FE Y DEMAS QUE LE SEAN ASIGNADASDE ACUERDO A MEMORANDO RADICADO BAJO EL NÚMERO 2017-532-000-1273 DE FECHA FEBRERO 14 DE 2017, FIRMADO POR EL ALCALDE LOCAL","Inversión",45,null,1326,53097642,"DIANA CAROLINA GIRALDO MAYORGA",0,null,null,1,5000000,5000000,5000000,42780,42780,42824,44,44,null,null,null,"X",null,1]
[53,2016,"16-12-5166658",5,{"$f":"IF(D183=1,'Tipo '!$B$2,IF(D183=2,'Tipo '!$B$3,IF(D183=3,'Tipo '!$B$4,IF(D183=4,'Tipo '!$B$5,IF(D183=5,'Tipo '!$B$6,IF(D183=6,'Tipo '!$B$7,IF(D183=7,'Tipo '!$B$8,IF(D183=8,'Tipo '!$B$9,IF(D183=9,'Tipo '!$B$10,IF(D183=10,'Tipo '!$B$11,IF(D183=11,'Tipo '!$B$12,IF(D183=12,'Tipo '!$B$13,IF(D183=13,'Tipo '!$B$14,IF(D183=14,'Tipo '!$B$15,IF(D183=15,'Tipo '!$B$16,IF(D183=16,'Tipo '!$B$17,IF(D183=17,'Tipo '!$B$18,IF(D183=18,'Tipo '!$B$19,IF(D183=19,'Tipo '!$B$20,\"No ha seleccionado un tipo de contrato válido\")))))))))))))))))))","v":"CONTRATOS DE PRESTACIÓN DE SERVICIOS PROFESIONALES Y DE APOYO A LA GESTIÓN"},"Contratación directa","Prestación de servicios profesionales y de apoyo a la gestión, o para la ejecución de trabajos artísticos que sólo puedan encomendarse a determinadas personas naturales;","ADICION Y PRORROGA - PRESTAR SERVICIOS AL GRUPO DE GESTIÓN ADMINISTRATIVA Y FINANCIERA, EN EL FDLSF,  EN LAS ETAPAS PRECONTRACTUAL, CONTRACTUAL, Y POSCONTRACTUAL DE LOS PROCESOS QUE LE ASIGNE EN LA ALCALDÍA LOCAL Y DEMÁS ACTIVIDADES PROPIAS DEL ÁREA. DE ACUERDO A MEMORANDO RADICADO BAJO EL NÚMERO 2017-532-0000-743 DE FECHA ENERO 26  DE 2017, FIRMADO POR EL ALCALDE LOCAL.","Inversión",45,null,1326,52905897,"CLAUDIA LORENA GOMEZ LEGUIZAMON",0,null,null,2,8250000,8250000,8250000,42762,42762,42792,30,30,null,null,null,"X",null,1]
[55,2016,"16-12-5184-486",5,{"$f":"IF(D184=1,'Tipo '!$B$2,IF(D184=2,'Tipo '!$B$3,IF(D184=3,'Tipo '!$B$4,IF(D184=4,'Tipo '!$B$5,IF(D184=5,'Tipo '!$B$6,IF(D184=6,'Tipo '!$B$7,IF(D184=7,'Tipo '!$B$8,IF(D184=8,'Tipo '!$B$9,IF(D184=9,'Tipo '!$B$10,IF(D184=10,'Tipo '!$B$11,IF(D184=11,'Tipo '!$B$12,IF(D184=12,'Tipo '!$B$13,IF(D184=13,'Tipo '!$B$14,IF(D184=14,'Tipo '!$B$15,IF(D184=15,'Tipo '!$B$16,IF(D184=16,'Tipo '!$B$17,IF(D184=17,'Tipo '!$B$18,IF(D184=18,'Tipo '!$B$19,IF(D184=19,'Tipo '!$B$20,\"No ha seleccionado un tipo de contrato válido\")))))))))))))))))))","v":"CONTRATOS DE PRESTACIÓN DE SERVICIOS PROFESIONALES Y DE APOYO A LA GESTIÓN"},"Contratación directa","Prestación de servicios profesionales y de apoyo a la gestión, o para la ejecución de trabajos artísticos que sólo puedan encomendarse a determinadas personas naturales;","ADICION   Y   PRORROGA EL CONTRATISTA SE OBLIGA A PRESTAR  EL APOYO EN EL GRUPO DE GESTIÓN ADMINISTRATIVA Y FINANCIERA PARA ADELANTAR EL PROCESO DE CERTIFICACIÓN DE CALIDAD Y SERVIR DE REFERENTE DE CALIDAD DE LA ALCALDÍA LOCAL DE SANTA FEDE ACUERDO A MEMORANDO RADICADO BAJO EL NÚMERO 2017-532-000-1273 DE FECHA FEBRERO 14 DE 2017, FIRMADO POR EL ALCALDE LOCAL","Inversión",45,null,1326,51738812,"REBECA  GONZALEZ JAIMES",0,null,null,1,4250000,4250000,4250000,42780,42780,42822,42,42,null,null,null,"X",null,1]
[56,2016,"16-12-5183954",5,{"$f":"IF(D185=1,'Tipo '!$B$2,IF(D185=2,'Tipo '!$B$3,IF(D185=3,'Tipo '!$B$4,IF(D185=4,'Tipo '!$B$5,IF(D185=5,'Tipo '!$B$6,IF(D185=6,'Tipo '!$B$7,IF(D185=7,'Tipo '!$B$8,IF(D185=8,'Tipo '!$B$9,IF(D185=9,'Tipo '!$B$10,IF(D185=10,'Tipo '!$B$11,IF(D185=11,'Tipo '!$B$12,IF(D185=12,'Tipo '!$B$13,IF(D185=13,'Tipo '!$B$14,IF(D185=14,'Tipo '!$B$15,IF(D185=15,'Tipo '!$B$16,IF(D185=16,'Tipo '!$B$17,IF(D185=17,'Tipo '!$B$18,IF(D185=18,'Tipo '!$B$19,IF(D185=19,'Tipo '!$B$20,\"No ha seleccionado un tipo de contrato válido\")))))))))))))))))))","v":"CONTRATOS DE PRESTACIÓN DE SERVICIOS PROFESIONALES Y DE APOYO A LA GESTIÓN"},"Contratación directa","Prestación de servicios profesionales y de apoyo a la gestión, o para la ejecución de trabajos artísticos que sólo puedan encomendarse a determinadas personas naturales;","ADICION   Y   PRORROGA PRESTAR SERVICIOS PROFESIONALES A LA COORDINACIÓN JURÍDICA Y NORMATIVA, CON EL PROPÓSITO DE IMPULSAR LAS ACTUACIONES DE COMPETENCIA DE LA ALCALDÍA LOCAL DE SANTA FE.DE ACUERDO A MEMORANDO RADICADO BAJO EL NÚMERO 2017-532-000-1273 DE FECHA FEBRERO 14 DE 2017, FIRMADO POR EL ALCALDE LOCAL","Inversión",45,null,1326,1010165338,"YULY ANDREA FERNANDEZ MONSALVE",0,null,null,1,3500000,3500000,3500000,42780,42780,42824,44,44,null,null,null,"X",null,1]
[59,2016,"16-12-5184401",5,{"$f":"IF(D186=1,'Tipo '!$B$2,IF(D186=2,'Tipo '!$B$3,IF(D186=3,'Tipo '!$B$4,IF(D186=4,'Tipo '!$B$5,IF(D186=5,'Tipo '!$B$6,IF(D186=6,'Tipo '!$B$7,IF(D186=7,'Tipo '!$B$8,IF(D186=8,'Tipo '!$B$9,IF(D186=9,'Tipo '!$B$10,IF(D186=10,'Tipo '!$B$11,IF(D186=11,'Tipo '!$B$12,IF(D186=12,'Tipo '!$B$13,IF(D186=13,'Tipo '!$B$14,IF(D186=14,'Tipo '!$B$15,IF(D186=15,'Tipo '!$B$16,IF(D186=16,'Tipo '!$B$17,IF(D186=17,'Tipo '!$B$18,IF(D186=18,'Tipo '!$B$19,IF(D186=19,'Tipo '!$B$20,\"No ha seleccionado un tipo de contrato válido\")))))))))))))))))))","v":"CONTRATOS DE PRESTACIÓN DE SERVICIOS PROFESIONALES Y DE APOYO A LA GESTIÓN"},"Contratación directa","Prestación de servicios profesionales y de apoyo a la gestión, o para la ejecución de trabajos artísticos que sólo puedan encomendarse a determinadas personas naturales;","APOYAR LAS LABORES ADMINISTRAIVAS Y DE GESTION DE LA JUNTA ADMINISTRADORA LOCAL DE SANTA FEDE ACUERDO A MEMORANDO RADICADO BAJO EL NÚMERO 2017-532-000-1273 DE FECHA FEBRERO 14 DE 2017, FIRMADO POR EL ALCALDE LOCAL","Inversión",45,null,1326,1013581981,"NADIESDA LILIANA FLOREZ PARRA",0,null,null,1,2500000,2500000,2500000,42780,42780,42823,43,43,null,null,null,"X",null,1]
[61,2016,"16-12-5256718",5,{"$f":"IF(D187=1,'Tipo '!$B$2,IF(D187=2,'Tipo '!$B$3,IF(D187=3,'Tipo '!$B$4,IF(D187=4,'Tipo '!$B$5,IF(D187=5,'Tipo '!$B$6,IF(D187=6,'Tipo '!$B$7,IF(D187=7,'Tipo '!$B$8,IF(D187=8,'Tipo '!$B$9,IF(D187=9,'Tipo '!$B$10,IF(D187=10,'Tipo '!$B$11,IF(D187=11,'Tipo '!$B$12,IF(D187=12,'Tipo '!$B$13,IF(D187=13,'Tipo '!$B$14,IF(D187=14,'Tipo '!$B$15,IF(D187=15,'Tipo '!$B$16,IF(D187=16,'Tipo '!$B$17,IF(D187=17,'Tipo '!$B$18,IF(D187=18,'Tipo '!$B$19,IF(D187=19,'Tipo '!$B$20,\"No ha seleccionado un tipo de contrato válido\")))))))))))))))))))","v":"CONTRATOS DE PRESTACIÓN DE SERVICIOS PROFESIONALES Y DE APOYO A LA GESTIÓN"},"Contratación directa","Prestación de servicios profesionales y de apoyo a la gestión, o para la ejecución de trabajos artísticos que sólo puedan encomendarse a determinadas personas naturales;","ADICION   Y   PRORROGA PRESTAR SERVICIOS PROFESIONALES EN EL GRUPO DE GESTION ADMINISTRATIVA Y FINANCIERA ESPECIFICAMENTE A LA OFICINA DE CONTRATOS DE LA ALCALDIA, EN LO  ATIENDE A LOS PROCESOS PRECONTRACTUALES, CONTRACTUALES Y POSTCONTRAACTUALES NECESARIOS PARA EL CUMPLIMIENTO DE LOS PLANES , PROGRAMAS Y PROYECTOS DEL FDLSFDE ACUERDO A MEMORANDO RADICADO BAJO EL NÚMERO 2017-532-000-1273 DE FECHA FEBRERO 14 DE 2017, FIRMADO POR EL ALCALDE LOCAL","Inversión",45,null,1326,53039712,"DIANA CATHERINE CLAVIJO ORTIZ",0,null,null,1,5200000,5200000,5200000,42780,42780,42825,45,45,null,null,null,"X",null,1]
[62,2016,"16-12-5256899",5,{"$f":"IF(D188=1,'Tipo '!$B$2,IF(D188=2,'Tipo '!$B$3,IF(D188=3,'Tipo '!$B$4,IF(D188=4,'Tipo '!$B$5,IF(D188=5,'Tipo '!$B$6,IF(D188=6,'Tipo '!$B$7,IF(D188=7,'Tipo '!$B$8,IF(D188=8,'Tipo '!$B$9,IF(D188=9,'Tipo '!$B$10,IF(D188=10,'Tipo '!$B$11,IF(D188=11,'Tipo '!$B$12,IF(D188=12,'Tipo '!$B$13,IF(D188=13,'Tipo '!$B$14,IF(D188=14,'Tipo '!$B$15,IF(D188=15,'Tipo '!$B$16,IF(D188=16,'Tipo '!$B$17,IF(D188=17,'Tipo '!$B$18,IF(D188=18,'Tipo '!$B$19,IF(D188=19,'Tipo '!$B$20,\"No ha seleccionado un tipo de contrato válido\")))))))))))))))))))","v":"CONTRATOS DE PRESTACIÓN DE SERVICIOS PROFESIONALES Y DE APOYO A LA GESTIÓN"},"Contratación directa","Prestación de servicios profesionales y de apoyo a la gestión, o para la ejecución de trabajos artísticos que sólo puedan encomendarse a determinadas personas naturales;","ADICION   Y   PRORROGA PRESTAR  SERVICIOS PORFESIONALES EN EL GRUPO DE GESTION ADMINISTRATIVA Y FINANCIERA ESPECIFICAMENTE A LA OFICINA DE CONTRATOS DE LA ALCALDIA, EN LO  RELACIONADO CON  LOS PROCESOS PRECONTRACTUALES, CONTRACTUALES Y POSTCONTRAACTUALES, LA ACTUALIZACION DE LAS BASES DE DATOS Y DE LOS DIFERENTES APLICATIVOS (SIVICOF, SECOV) CORRESPONDIENTES A LAS ACTIVIDAD CONTRACTUAL DEL FDLSFDE ACUERDO A MEMORANDO RADICADO BAJO EL NÚMERO 2017-532-000-1273 DE FECHA FEBRERO 14 DE 2017, FIRMADO POR EL ALCALDE LOCAL","Inversión",45,null,1326,80111338,"SEBASTIAN  GARCES RESTREPO",0,null,null,1,3700000,3700000,3576667,42780,42780,42825,45,45,null,null,"X",null,null,0.96666675675675673]
[63,2016,"16-12-5268583",5,{"$f":"IF(D189=1,'Tipo '!$B$2,IF(D189=2,'Tipo '!$B$3,IF(D189=3,'Tipo '!$B$4,IF(D189=4,'Tipo '!$B$5,IF(D189=5,'Tipo '!$B$6,IF(D189=6,'Tipo '!$B$7,IF(D189=7,'Tipo '!$B$8,IF(D189=8,'Tipo '!$B$9,IF(D189=9,'Tipo '!$B$10,IF(D189=10,'Tipo '!$B$11,IF(D189=11,'Tipo '!$B$12,IF(D189=12,'Tipo '!$B$13,IF(D189=13,'Tipo '!$B$14,IF(D189=14,'Tipo '!$B$15,IF(D189=15,'Tipo '!$B$16,IF(D189=16,'Tipo '!$B$17,IF(D189=17,'Tipo '!$B$18,IF(D189=18,'Tipo '!$B$19,IF(D189=19,'Tipo '!$B$20,\"No ha seleccionado un tipo de contrato válido\")))))))))))))))))))","v":"CONTRATOS DE PRESTACIÓN DE SERVICIOS PROFESIONALES Y DE APOYO A LA GESTIÓN"},"Contratación directa","Prestación de servicios profesionales y de apoyo a la gestión, o para la ejecución de trabajos artísticos que sólo puedan encomendarse a determinadas personas naturales;","ADICION   Y   PRORROGA PRESTAR LOS SERVICIOS PROFESIONALES EN LA ALCALDÍA LOCAL DE SANTA FE, PARA PLANEAR, DIRIGIR, FORMULAR Y COORDINAR LAS ACTIVIDADES DE GESTIÓN AMBIENTAL AL INTERIOR DE LA ENTIDAD, IDENTIFICANDO Y CONTROLANDO LOS ASPECTOS AMBIENTALES CON LA NORMATIVIDAD AMBIENTAL VIGENTE Y ASÍ FORTALECER EL PROGRAMA AMBIENTAL DEL FDLSF.DE ACUERDO A MEMORANDO RADICADO BAJO EL NÚMERO 2017-532-000-1273 DE FECHA FEBRERO 14 DE 2017, FIRMADO POR EL ALCALDE LOCAL","Inversión",45,null,1326,80735860,"JAIRO ALONSO PAEZ RUALES",0,null,null,1,4500000,4500000,4500000,42780,42780,42825,45,45,null,null,null,"X",null,1]
[70,2016,"16-12-5296734",5,{"$f":"IF(D190=1,'Tipo '!$B$2,IF(D190=2,'Tipo '!$B$3,IF(D190=3,'Tipo '!$B$4,IF(D190=4,'Tipo '!$B$5,IF(D190=5,'Tipo '!$B$6,IF(D190=6,'Tipo '!$B$7,IF(D190=7,'Tipo '!$B$8,IF(D190=8,'Tipo '!$B$9,IF(D190=9,'Tipo '!$B$10,IF(D190=10,'Tipo '!$B$11,IF(D190=11,'Tipo '!$B$12,IF(D190=12,'Tipo '!$B$13,IF(D190=13,'Tipo '!$B$14,IF(D190=14,'Tipo '!$B$15,IF(D190=15,'Tipo '!$B$16,IF(D190=16,'Tipo '!$B$17,IF(D190=17,'Tipo '!$B$18,IF(D190=18,'Tipo '!$B$19,IF(D190=19,'Tipo '!$B$20,\"No ha seleccionado un tipo de contrato válido\")))))))))))))))))))","v":"CONTRATOS DE PRESTACIÓN DE SERVICIOS PROFESIONALES Y DE APOYO A LA GESTIÓN"},"Contratación directa","Prestación de servicios profesionales y de apoyo a la gestión, o para la ejecución de trabajos artísticos que sólo puedan encomendarse a determinadas personas naturales;","ADICION   Y   PRORROGA PRESTAR SERVICIOS DE APOYO A LA GESTION EN EL SEGUIMIENTO ADMINISTRATIVO Y MONITOREO DEL FLUJO DOCUMENTAL EN EL GRUPO DE GESTION ADMINISTRATIVA Y FINANCIERA  OFICINA DE CONTRATOS  DEL FONDO DE  DESARROLLO LOCALDE ACUERDO A MEMORANDO RADICADO BAJO EL NÚMERO 2017-532-000-1273 DE FECHA FEBRERO 14 DE 2017, FIRMADO POR EL ALCALDE LOCAL","Inversión",45,null,1326,1023902688,"LINDA ESTEFANIA ARIAS BAQUERO",0,null,null,1,1600000,1600000,1600000,42780,42780,42816,36,36,null,null,null,"X",null,1]
[71,2016,"16-12-5310420",5,{"$f":"IF(D191=1,'Tipo '!$B$2,IF(D191=2,'Tipo '!$B$3,IF(D191=3,'Tipo '!$B$4,IF(D191=4,'Tipo '!$B$5,IF(D191=5,'Tipo '!$B$6,IF(D191=6,'Tipo '!$B$7,IF(D191=7,'Tipo '!$B$8,IF(D191=8,'Tipo '!$B$9,IF(D191=9,'Tipo '!$B$10,IF(D191=10,'Tipo '!$B$11,IF(D191=11,'Tipo '!$B$12,IF(D191=12,'Tipo '!$B$13,IF(D191=13,'Tipo '!$B$14,IF(D191=14,'Tipo '!$B$15,IF(D191=15,'Tipo '!$B$16,IF(D191=16,'Tipo '!$B$17,IF(D191=17,'Tipo '!$B$18,IF(D191=18,'Tipo '!$B$19,IF(D191=19,'Tipo '!$B$20,\"No ha seleccionado un tipo de contrato válido\")))))))))))))))))))","v":"CONTRATOS DE PRESTACIÓN DE SERVICIOS PROFESIONALES Y DE APOYO A LA GESTIÓN"},"Contratación directa","Prestación de servicios profesionales y de apoyo a la gestión, o para la ejecución de trabajos artísticos que sólo puedan encomendarse a determinadas personas naturales;","ADICION   Y   PRORROGA PRESTAR APOYO A LA GESTIÓN ADMINISTRATIVA Y FINANCIERA EN LA CONDUCCIÓN DE UN VEHÍCULO DE TRANSPORTE DE PROPIEDAD DEL FDLSF QUE LEA SEA ASIGNADO DE ACUERDO A MEMORANDO RADICADO BAJO EL NÚMERO 2017-532-000-1273 DE FECHA FEBRERO 14 DE 2017, FIRMADO POR EL ALCALDE LOCAL","Inversión",45,null,1326,80231510,"JOSE MIGUEL GIRALDO GARCIA",0,null,null,1,1800000,1800000,1800000,42780,42780,42820,40,40,null,null,null,"X",null,1]
[73,2016,"16-12-5309314",5,{"$f":"IF(D192=1,'Tipo '!$B$2,IF(D192=2,'Tipo '!$B$3,IF(D192=3,'Tipo '!$B$4,IF(D192=4,'Tipo '!$B$5,IF(D192=5,'Tipo '!$B$6,IF(D192=6,'Tipo '!$B$7,IF(D192=7,'Tipo '!$B$8,IF(D192=8,'Tipo '!$B$9,IF(D192=9,'Tipo '!$B$10,IF(D192=10,'Tipo '!$B$11,IF(D192=11,'Tipo '!$B$12,IF(D192=12,'Tipo '!$B$13,IF(D192=13,'Tipo '!$B$14,IF(D192=14,'Tipo '!$B$15,IF(D192=15,'Tipo '!$B$16,IF(D192=16,'Tipo '!$B$17,IF(D192=17,'Tipo '!$B$18,IF(D192=18,'Tipo '!$B$19,IF(D192=19,'Tipo '!$B$20,\"No ha seleccionado un tipo de contrato válido\")))))))))))))))))))","v":"CONTRATOS DE PRESTACIÓN DE SERVICIOS PROFESIONALES Y DE APOYO A LA GESTIÓN"},"Contratación directa","Prestación de servicios profesionales y de apoyo a la gestión, o para la ejecución de trabajos artísticos que sólo puedan encomendarse a determinadas personas naturales;","ADICION   Y   PRORROGA PRESTAR LOS SERVICIOS PROFESIONALES EN EL GRUPO DE GESTIÓN NORMATIVA Y JURÍDICA, PARA APOYAR LOS TEMAS DE SEGURIDAD Y CONVIVENCIA DE LA LOCALIDAD DE SANTA FE.DE ACUERDO A MEMORANDO RADICADO BAJO EL NÚMERO 2017-532-000-1273 DE FECHA FEBRERO 14 DE 2017, FIRMADO POR EL ALCALDE LOCAL","Inversión",45,null,1326,79989849,"SERGIO ANDRES CALDERON GARZON",0,null,null,1,4300000,4300000,4300000,42780,42780,42825,45,45,null,null,null,"X",null,1]
[76,2016,"16-12-5344699",5,{"$f":"IF(D193=1,'Tipo '!$B$2,IF(D193=2,'Tipo '!$B$3,IF(D193=3,'Tipo '!$B$4,IF(D193=4,'Tipo '!$B$5,IF(D193=5,'Tipo '!$B$6,IF(D193=6,'Tipo '!$B$7,IF(D193=7,'Tipo '!$B$8,IF(D193=8,'Tipo '!$B$9,IF(D193=9,'Tipo '!$B$10,IF(D193=10,'Tipo '!$B$11,IF(D193=11,'Tipo '!$B$12,IF(D193=12,'Tipo '!$B$13,IF(D193=13,'Tipo '!$B$14,IF(D193=14,'Tipo '!$B$15,IF(D193=15,'Tipo '!$B$16,IF(D193=16,'Tipo '!$B$17,IF(D193=17,'Tipo '!$B$18,IF(D193=18,'Tipo '!$B$19,IF(D193=19,'Tipo '!$B$20,\"No ha seleccionado un tipo de contrato válido\")))))))))))))))))))","v":"CONTRATOS DE PRESTACIÓN DE SERVICIOS PROFESIONALES Y DE APOYO A LA GESTIÓN"},"Contratación directa","Prestación de servicios profesionales y de apoyo a la gestión, o para la ejecución de trabajos artísticos que sólo puedan encomendarse a determinadas personas naturales;","ADICION   Y   PRORROGA PRESTAR SERVICIOS PROFESIONALES  EN LOS PROYECTOS  QUE TIENEN POR OBJECTO LA CONSTRUCCION , REHABILITACION Y MANTENIMIENTO DE LA INFRAESTRUCTURA VIAL Y ESPACIO PUBLICO  DE LA LOCALIDAD DE SANTA FEDE ACUERDO A MEMORANDO RADICADO BAJO EL NÚMERO 2017-532-000-1273 DE FECHA FEBRERO 14 DE 2017, FIRMADO POR EL ALCALDE LOCAL","Inversión",45,null,1326,1026568535,"DORIS JULIETH MORA DAZA",0,null,null,1,3466666,3466666,3466666,42780,42780,42824,44,44,null,null,null,"X",null,1]
[77,2016,"16-12-5344929",5,{"$f":"IF(D194=1,'Tipo '!$B$2,IF(D194=2,'Tipo '!$B$3,IF(D194=3,'Tipo '!$B$4,IF(D194=4,'Tipo '!$B$5,IF(D194=5,'Tipo '!$B$6,IF(D194=6,'Tipo '!$B$7,IF(D194=7,'Tipo '!$B$8,IF(D194=8,'Tipo '!$B$9,IF(D194=9,'Tipo '!$B$10,IF(D194=10,'Tipo '!$B$11,IF(D194=11,'Tipo '!$B$12,IF(D194=12,'Tipo '!$B$13,IF(D194=13,'Tipo '!$B$14,IF(D194=14,'Tipo '!$B$15,IF(D194=15,'Tipo '!$B$16,IF(D194=16,'Tipo '!$B$17,IF(D194=17,'Tipo '!$B$18,IF(D194=18,'Tipo '!$B$19,IF(D194=19,'Tipo '!$B$20,\"No ha seleccionado un tipo de contrato válido\")))))))))))))))))))","v":"CONTRATOS DE PRESTACIÓN DE SERVICIOS PROFESIONALES Y DE APOYO A LA GESTIÓN"},"Contratación directa","Prestación de servicios profesionales y de apoyo a la gestión, o para la ejecución de trabajos artísticos que sólo puedan encomendarse a determinadas personas naturales;","ADICION   Y   PRORROGA PRESTAR LOS SERVICIOS PROFESIONALES PARA LA IMPLEMENTACIÓN DE LOS PROYECTOS DE MANTENIMIENTO, MEJORAMIENTO, REHABILITACIÓN Y CONSTRUCCIÓN DE LA INFRAESTRUCTURA VIAL Y ESPACIO PÚBLICO DE LA LOCALIDAD DE SANTA FE.DE ACUERDO A MEMORANDO RADICADO BAJO EL NÚMERO 2017-532-000-1273 DE FECHA FEBRERO 14 DE 2017, FIRMADO POR EL ALCALDE LOCAL","Inversión",45,null,1326,74375345,"RUBEN DARIO DIAZ ARANGO",0,null,null,1,5500000,5500000,5500000,42780,42780,42820,40,40,null,null,null,"X",null,1]
[80,2016,"16-12-5373465",5,{"$f":"IF(D195=1,'Tipo '!$B$2,IF(D195=2,'Tipo '!$B$3,IF(D195=3,'Tipo '!$B$4,IF(D195=4,'Tipo '!$B$5,IF(D195=5,'Tipo '!$B$6,IF(D195=6,'Tipo '!$B$7,IF(D195=7,'Tipo '!$B$8,IF(D195=8,'Tipo '!$B$9,IF(D195=9,'Tipo '!$B$10,IF(D195=10,'Tipo '!$B$11,IF(D195=11,'Tipo '!$B$12,IF(D195=12,'Tipo '!$B$13,IF(D195=13,'Tipo '!$B$14,IF(D195=14,'Tipo '!$B$15,IF(D195=15,'Tipo '!$B$16,IF(D195=16,'Tipo '!$B$17,IF(D195=17,'Tipo '!$B$18,IF(D195=18,'Tipo '!$B$19,IF(D195=19,'Tipo '!$B$20,\"No ha seleccionado un tipo de contrato válido\")))))))))))))))))))","v":"CONTRATOS DE PRESTACIÓN DE SERVICIOS PROFESIONALES Y DE APOYO A LA GESTIÓN"},"Contratación directa","Prestación de servicios profesionales y de apoyo a la gestión, o para la ejecución de trabajos artísticos que sólo puedan encomendarse a determinadas personas naturales;","ADICION   Y   PRORROGA PRESTAR SUS SERVICIOS COMO APOYO AL ÁREA DE CONTABILIDAD DE LA ALCALDÍA LOCAL DE SANTA FE EN LOS TRÁMITES, PROCEDIMIENTOS Y APLICATIVOS DESIGNADOS AL ÁREA EN MENCIÓNDE ACUERDO A MEMORANDO RADICADO BAJO EL NÚMERO 2017-532-000-1273 DE FECHA FEBRERO 14 DE 2017, FIRMADO POR EL ALCALDE LOCAL","Inversión",45,null,1326,52581670,"CLAUDIA PATRICIA GOMEZ GUTIERREZ",0,null,null,1,2600000,2600000,2600000,42780,42780,42821,41,41,null,null,null,"X",null,1]
[86,2016,"16-12-5606615",5,{"$f":"IF(D196=1,'Tipo '!$B$2,IF(D196=2,'Tipo '!$B$3,IF(D196=3,'Tipo '!$B$4,IF(D196=4,'Tipo '!$B$5,IF(D196=5,'Tipo '!$B$6,IF(D196=6,'Tipo '!$B$7,IF(D196=7,'Tipo '!$B$8,IF(D196=8,'Tipo '!$B$9,IF(D196=9,'Tipo '!$B$10,IF(D196=10,'Tipo '!$B$11,IF(D196=11,'Tipo '!$B$12,IF(D196=12,'Tipo '!$B$13,IF(D196=13,'Tipo '!$B$14,IF(D196=14,'Tipo '!$B$15,IF(D196=15,'Tipo '!$B$16,IF(D196=16,'Tipo '!$B$17,IF(D196=17,'Tipo '!$B$18,IF(D196=18,'Tipo '!$B$19,IF(D196=19,'Tipo '!$B$20,\"No ha seleccionado un tipo de contrato válido\")))))))))))))))))))","v":"CONTRATOS DE PRESTACIÓN DE SERVICIOS PROFESIONALES Y DE APOYO A LA GESTIÓN"},"Contratación directa","Prestación de servicios profesionales y de apoyo a la gestión, o para la ejecución de trabajos artísticos que sólo puedan encomendarse a determinadas personas naturales;","ADICION   Y   PRORROGA PRESTAR SERVICIOS PROFESIONALES PARA FORTALECER LOS PROCESOS TENDIENTES A DESARROLLAR LOS PROYECTOS DEL PLAN DE DESARROLLO LOCAL PARA LA VIGENCIA 2016.DE ACUERDO A MEMORANDO RADICADO BAJO EL NÚMERO 2017-532-000-1273 DE FECHA FEBRERO 14 DE 2017, FIRMADO POR EL ALCALDE LOCAL","Inversión",45,null,1326,"52808564","ANDREA  PEREZ ARISMENDI",0,null,null,1,783333,783333,783333,42780,42780,42825,45,45,null,null,null,"X",null,1]
[110,2016,"16-1-162662",1,{"$f":"IF(D197=1,'Tipo '!$B$2,IF(D197=2,'Tipo '!$B$3,IF(D197=3,'Tipo '!$B$4,IF(D197=4,'Tipo '!$B$5,IF(D197=5,'Tipo '!$B$6,IF(D197=6,'Tipo '!$B$7,IF(D197=7,'Tipo '!$B$8,IF(D197=8,'Tipo '!$B$9,IF(D197=9,'Tipo '!$B$10,IF(D197=10,'Tipo '!$B$11,IF(D197=11,'Tipo '!$B$12,IF(D197=12,'Tipo '!$B$13,IF(D197=13,'Tipo '!$B$14,IF(D197=14,'Tipo '!$B$15,IF(D197=15,'Tipo '!$B$16,IF(D197=16,'Tipo '!$B$17,IF(D197=17,'Tipo '!$B$18,IF(D197=18,'Tipo '!$B$19,IF(D197=19,'Tipo '!$B$20,\"No ha seleccionado un tipo de contrato válido\")))))))))))))))))))","v":"OBRA PÚBLICA"},"Licitación pública","No aplica","ADICIÓN NO. 1 AL COP1102016 - SUSCRITO ENTRE EL FONDO DE DESARROLLO LOCAL DE SANTA FE Y EL CONSORCIO VIAL SF - CONTRATAR A MONTO AGOTABLE Y A PRECIOS UNITARIOS FIJOS, SIN FORMULA DE AJUSTE, EL DIAGNÓSTICO, ESTUDIOS Y DISEÑOS, EL MANTENIMIENTO, REHABILITACIÓN Y RECONSTRUCCIÓN DE LA INFRAESTRUCTURA DE LA MALLA VIAL LOCAL Y ESPACIO PÚPLICO DE LA LOCALIDAD DE SANTA FE, EN BOGOTA D,C., MEDIANTE LA ADJUDICACIÓN DE DOS (2) MÓDULOS, CONFORME A LOS SEGMENTOS PRIORIZADOS POR LA COMUNIDAD Y/U OTROS SEGMENTOS DE LA LOCALIDAD, CON LOS RECURSOS DE LA VIGENCIA 2016.  DE ACUERDO A MEMORANDO RADICADO BAJO EL NÚMERO 2017-532-00-11943  DE FECHA NOVIEMBRE 16    DE 2017, FIRMADO POR EL ALCALDE LOCAL,","Inversión",18,null,1322,901030280,"CONSORCIO VIAL S F 2016",0,null,null,1,579300955,579300955,0,43056,43056,43116,60,60,null,null,"X",null,null,0]
[112,2016,"16-15-5740593",3,{"$f":"IF(D198=1,'Tipo '!$B$2,IF(D198=2,'Tipo '!$B$3,IF(D198=3,'Tipo '!$B$4,IF(D198=4,'Tipo '!$B$5,IF(D198=5,'Tipo '!$B$6,IF(D198=6,'Tipo '!$B$7,IF(D198=7,'Tipo '!$B$8,IF(D198=8,'Tipo '!$B$9,IF(D198=9,'Tipo '!$B$10,IF(D198=10,'Tipo '!$B$11,IF(D198=11,'Tipo '!$B$12,IF(D198=12,'Tipo '!$B$13,IF(D198=13,'Tipo '!$B$14,IF(D198=14,'Tipo '!$B$15,IF(D198=15,'Tipo '!$B$16,IF(D198=16,'Tipo '!$B$17,IF(D198=17,'Tipo '!$B$18,IF(D198=18,'Tipo '!$B$19,IF(D198=19,'Tipo '!$B$20,\"No ha seleccionado un tipo de contrato válido\")))))))))))))))))))","v":"INTERVENTORÍA"},"Selección abreviada ","Selección abreviada por menor cuantía ","ADICION Y PRORROGA NO. 4 AL CONTRATO DE INTERVENTORIA NO. 112-2015 SUSCRITO ENTRE EL FONDO DE DESARROLLO LOCAL DE SANTAFE Y CODIPRO INGENIERIA Y ARQUITECTURA LTDA. SEGUN  SOLICITUD 2017532-0000543  DE FECHA ENERO 19  DE 2017 FIRMADA POR EL ALCALDE LOCAL","Inversión",18,null,1322,"901.034.361","CODIPRO INGENIERIA Y ARQUITECTURA LTDA CONSTRUCCIONES DISEÑOS Y PROYECTOS S",0,null,null,3,347555171,347555171,0,42754,42754,43116,60,60,null,null,"X",null,null,0]
[113,2016,"16-1-162662",1,{"$f":"IF(D199=1,'Tipo '!$B$2,IF(D199=2,'Tipo '!$B$3,IF(D199=3,'Tipo '!$B$4,IF(D199=4,'Tipo '!$B$5,IF(D199=5,'Tipo '!$B$6,IF(D199=6,'Tipo '!$B$7,IF(D199=7,'Tipo '!$B$8,IF(D199=8,'Tipo '!$B$9,IF(D199=9,'Tipo '!$B$10,IF(D199=10,'Tipo '!$B$11,IF(D199=11,'Tipo '!$B$12,IF(D199=12,'Tipo '!$B$13,IF(D199=13,'Tipo '!$B$14,IF(D199=14,'Tipo '!$B$15,IF(D199=15,'Tipo '!$B$16,IF(D199=16,'Tipo '!$B$17,IF(D199=17,'Tipo '!$B$18,IF(D199=18,'Tipo '!$B$19,IF(D199=19,'Tipo '!$B$20,\"No ha seleccionado un tipo de contrato válido\")))))))))))))))))))","v":"OBRA PÚBLICA"},"Licitación pública","No aplica","ADICIÓN NO. 1 AL COP1132016 - ¿SUSCRITO ENTRE EL FONDO DE DESARROLLO LOCAL DE SANTA FE Y EL CONSORCIO MAN VIALES SANTA FECONTRATAR A MONTO AGOTABLE Y A PRECIOS UNITARIOS FIJOS, SIN FORMULA DE AJUSTE, EL DIAGNÓSTICO, ESTUDIOS Y DISEÑOS, EL MANTENIMIENTO, REHABILITACIÓN Y RECONSTRUCCIÓN DE LA INFRAESTRUCTURA DE LA MALLA VIAL LOCAL Y ESPACIO PÚPLICO DE LA LOCALIDAD DE SANTA FE, EN BOGOTA D,C., MEDIANTE LA ADJUDICACIÓN DE DOS (2) MÓDULOS, CONFORME A LOS SEGMENTOS PRIORIZADOS POR LA COMUNIDAD Y/U OTROS SEGMENTOS DE LA LOCALIDAD, CON LOS RECURSOS DE LA VIGENCIA 2016.  DE ACUERDO A MEMORANDO RADICADO BAJO EL NÚMERO 2017-532-00-11953 DE FECHA NOVIEMBRE 16  DE 2017, FIRMADO POR EL ALCALDE LOCAL,","Inversión",18,null,1322,"901.031.447","CONSORCIO MANVIALES SANTA FE",0,null,null,1,1156010763,1156010763,0,43056,43056,43116,60,60,null,null,"X",null,null,0]
[125,2016,"16-11-5819211",4,{"$f":"IF(D200=1,'Tipo '!$B$2,IF(D200=2,'Tipo '!$B$3,IF(D200=3,'Tipo '!$B$4,IF(D200=4,'Tipo '!$B$5,IF(D200=5,'Tipo '!$B$6,IF(D200=6,'Tipo '!$B$7,IF(D200=7,'Tipo '!$B$8,IF(D200=8,'Tipo '!$B$9,IF(D200=9,'Tipo '!$B$10,IF(D200=10,'Tipo '!$B$11,IF(D200=11,'Tipo '!$B$12,IF(D200=12,'Tipo '!$B$13,IF(D200=13,'Tipo '!$B$14,IF(D200=14,'Tipo '!$B$15,IF(D200=15,'Tipo '!$B$16,IF(D200=16,'Tipo '!$B$17,IF(D200=17,'Tipo '!$B$18,IF(D200=18,'Tipo '!$B$19,IF(D200=19,'Tipo '!$B$20,\"No ha seleccionado un tipo de contrato válido\")))))))))))))))))))","v":"CONTRATOS DE PRESTACIÓN DE SERVICIOS"},"Selección abreviada ","Selección abreviada por menor cuantía ","ADICION 1. PRESTAR LOS SERVICIOS NECESARIOS PARA LA ORGANIZACIÓN Y DESARROLLO DE LAS PRESENTACIONES MUSICALES DE TIPO SINFÓNICO RESULTANTE DEL CONVE-NIO INTERADMINISTRATIVO SUSCRITO ENTRE EL FONDO DE DESARROLLO LOCAL Y LA FILARMÓNICA DE BOGOTÁ,  DE ACUERDO A MEMORANDO RADICADO BAJO EL NÚMERO 2017-532-000-8893 DE FECHA SEPTIEMBRE 5  DE 2017, FIRMADO POR EL ALCALDE LOCAL","Inversión",11,null,1318,"900.332.118","FUNDACION SOCIAL COLOMBIA ACTIVA",0,null,null,1,93760760,93760760,0,42984,42984,43168,184,184,null,null,"X",null,null,0]
[126,2016,"16-1-164168",1,{"$f":"IF(D201=1,'Tipo '!$B$2,IF(D201=2,'Tipo '!$B$3,IF(D201=3,'Tipo '!$B$4,IF(D201=4,'Tipo '!$B$5,IF(D201=5,'Tipo '!$B$6,IF(D201=6,'Tipo '!$B$7,IF(D201=7,'Tipo '!$B$8,IF(D201=8,'Tipo '!$B$9,IF(D201=9,'Tipo '!$B$10,IF(D201=10,'Tipo '!$B$11,IF(D201=11,'Tipo '!$B$12,IF(D201=12,'Tipo '!$B$13,IF(D201=13,'Tipo '!$B$14,IF(D201=14,'Tipo '!$B$15,IF(D201=15,'Tipo '!$B$16,IF(D201=16,'Tipo '!$B$17,IF(D201=17,'Tipo '!$B$18,IF(D201=18,'Tipo '!$B$19,IF(D201=19,'Tipo '!$B$20,\"No ha seleccionado un tipo de contrato válido\")))))))))))))))))))","v":"OBRA PÚBLICA"},"Licitación pública","No aplica","ADICIÓN NO. 1 AL CONTRATO DE OBRA PÚBLICA NO. 126-2016 SUSCRITO ENTRE EL FONDO DE DESARROLLO LOCAL DE SANTA FE Y EL CONSORCIO 2 CP 2016 - CONTRATAR POR EL SISTEMA DE PRECIO GLOBAL FIJO LOS ESTUDIOS Y DISEÑOS TECNICOS Y A PRECIOS UNITARIOS FIJOS, SIN FORMULA DE AJUSTE A MONTO AGOTABLE, LA CONSTRUCCION DE LAS OBRAS PARA LA CANCHA SINTETICA DEL PARQUE DE LOS LACHES, EN LA LOCALIDAD DE SANTA FE EN BOGOTÁ D.C,  DE ACUERDO A MEMORANDO RADICADO BAJO EL NÚMERO 2017-532-000-4743 DE FECHA ABRIL 28  DE 2017, FIRMADO POR EL ALCALDE LOCAL,","Inversión",17,null,1320,"901.038.200","CONSORCIO 2 C P 2016",0,null,null,1,558651578,558651578,0,42853,42853,43174,321,443,null,null,"X",null,null,0]
[127,2016,"16-13-5949446",3,{"$f":"IF(D202=1,'Tipo '!$B$2,IF(D202=2,'Tipo '!$B$3,IF(D202=3,'Tipo '!$B$4,IF(D202=4,'Tipo '!$B$5,IF(D202=5,'Tipo '!$B$6,IF(D202=6,'Tipo '!$B$7,IF(D202=7,'Tipo '!$B$8,IF(D202=8,'Tipo '!$B$9,IF(D202=9,'Tipo '!$B$10,IF(D202=10,'Tipo '!$B$11,IF(D202=11,'Tipo '!$B$12,IF(D202=12,'Tipo '!$B$13,IF(D202=13,'Tipo '!$B$14,IF(D202=14,'Tipo '!$B$15,IF(D202=15,'Tipo '!$B$16,IF(D202=16,'Tipo '!$B$17,IF(D202=17,'Tipo '!$B$18,IF(D202=18,'Tipo '!$B$19,IF(D202=19,'Tipo '!$B$20,\"No ha seleccionado un tipo de contrato válido\")))))))))))))))))))","v":"INTERVENTORÍA"},"Selección abreviada ","Selección abreviada por menor cuantía ","ADICION 01 PRORROGA 01 - PRESTAR LOS SERVICIOS PROFESIONALES DE INTERVENTORÍA, TÉCNICA, ADMINISTRA-TIVA. FINANCIERA Y JURÍDICA, A LOS CONTRATOS QUE TIENEN COMO OBJETO ¿CONTRA-TAR PROCESOS DE FORMACIÓN DEPORTIVO PARA LA GENERACIÓN DE UNA CULTURA DEPORTIVA EN LOS  NIÑOS, NIÑAS Y ADOLESCENTES EN LA PRÁCTICA DEPORTIVA, QUE LOS COMPROMETA EN LA FORMACIÓN DE VALORES Y HÁBITOS DE  APROVECHAMIENTO SANO Y CONSTRUCTIVO DEL TIEMPO LIBRE. Y PRESTAR LOS SERVICIOS PARA EJECUTAR ACTIVIDADES DE ACONDICIONAMIENTO FÍSICO, DIRIGIDO A LA POBLACIÓN ADULTO MA-YOR RESIDENTES EN LA LOCALIDAD DE SANTA FE, DENTRO DEL MARCO DEL PROYECTO 1163 ¨SANTA FE MÁS ACTIVA Y DINÁMICA.,  DE ACUERDO A MEMORANDO RADICADO BAJO EL NÚMERO 2017-532-000-6433 DE FECHA JUNIO   29  DE 2017, FIRMADO POR EL ALCALDE LOCAL","Inversión",11,null,1318,"79.819.273","NELSON RODRIGO GONZALEZ GUAYANA",0,null,null,1,6000000,6000000,3000000,42915,42915,"38/08-2017",60,60,null,null,"X",null,null,0.5]
[132,2016,"16-15-5819667",3,{"$f":"IF(D203=1,'Tipo '!$B$2,IF(D203=2,'Tipo '!$B$3,IF(D203=3,'Tipo '!$B$4,IF(D203=4,'Tipo '!$B$5,IF(D203=5,'Tipo '!$B$6,IF(D203=6,'Tipo '!$B$7,IF(D203=7,'Tipo '!$B$8,IF(D203=8,'Tipo '!$B$9,IF(D203=9,'Tipo '!$B$10,IF(D203=10,'Tipo '!$B$11,IF(D203=11,'Tipo '!$B$12,IF(D203=12,'Tipo '!$B$13,IF(D203=13,'Tipo '!$B$14,IF(D203=14,'Tipo '!$B$15,IF(D203=15,'Tipo '!$B$16,IF(D203=16,'Tipo '!$B$17,IF(D203=17,'Tipo '!$B$18,IF(D203=18,'Tipo '!$B$19,IF(D203=19,'Tipo '!$B$20,\"No ha seleccionado un tipo de contrato válido\")))))))))))))))))))","v":"INTERVENTORÍA"},"Selección abreviada ","Selección abreviada por menor cuantía ","ADICIÓN NO. 1  - PRORROGA NUMERO DOS, AL CONTRATO DE INTERVENTORÍA NO. 132-2016 SUSCRITO ENTRE EL FONDO DE DESARROLLO LOCAL DE SANTA FE Y EL CONSORCIO RUIZ MEDINA - REALIZAR LA INTERVENTORÍA TÉCNICA, ADMINISTRATIVA, LEGAL, FINANCIERA, SOCIAL, AMBIENTAL Y S&SO, AL CONTRATO DE OBRA PÚBLICA DERIVADO DE LA LICITACION NO. FDLSF-LP-013-2016 (CUYO OBJETO CONTRATAR POR EL SISTEMA DE PRECIO GLOBAL FIJO LOS ESTUDIOS Y DISEÑOS TECNICOS Y A PRECIOS UNITARIOS FIJOS, SIN FORMULA DE AJUSTE, A MONTO AGOTABLE, LA CONSTRUCCION DE LAS OBRAS PARA LA CANCHA SINTETICA DEL PARQUE DE LOS LACHES, EN LA LOCALIDAD DE SANTA FE EN BOGOTÁ D.C.), CONVOCADA POR LA ALCALDÍA LOCAL  FONDO DE DESARROLLO LOCAL DE SANTA FE,  DE ACUERDO A MEMORANDO RADICADO BAJO EL NÚMERO 2017-532-000-5123 DE FECHA    MAYO 16  DE 2017, FIRMADO POR EL ALCALDE LOCAL,","Inversión",17,null,1320,"901.038.419","CONSORCIO RUIZ MEDINA",0,null,null,1,54012384,54012384,5064608,42871,42871,42989,85,85,null,null,"X",null,null,9.3767533016131999E-2]
[133,2016,"16-11-5832351",4,{"$f":"IF(D204=1,'Tipo '!$B$2,IF(D204=2,'Tipo '!$B$3,IF(D204=3,'Tipo '!$B$4,IF(D204=4,'Tipo '!$B$5,IF(D204=5,'Tipo '!$B$6,IF(D204=6,'Tipo '!$B$7,IF(D204=7,'Tipo '!$B$8,IF(D204=8,'Tipo '!$B$9,IF(D204=9,'Tipo '!$B$10,IF(D204=10,'Tipo '!$B$11,IF(D204=11,'Tipo '!$B$12,IF(D204=12,'Tipo '!$B$13,IF(D204=13,'Tipo '!$B$14,IF(D204=14,'Tipo '!$B$15,IF(D204=15,'Tipo '!$B$16,IF(D204=16,'Tipo '!$B$17,IF(D204=17,'Tipo '!$B$18,IF(D204=18,'Tipo '!$B$19,IF(D204=19,'Tipo '!$B$20,\"No ha seleccionado un tipo de contrato válido\")))))))))))))))))))","v":"CONTRATOS DE PRESTACIÓN DE SERVICIOS"},"Selección abreviada ","Selección abreviada por menor cuantía ","ADICIÓN Y PRORROGA DEL CONTRATO CPS NO 1332016 CUYO OBJETO ES: IDENTIFICAR E INTERVENIR 13 HA EN ZONAS DE IMPORTANCIA AMBIENTAL AFECTADAS POR FACTORES NATURALES Y/O ANTROPICOS EN LA ZONA RURAL DE LA LOCALIDAD DE SANTA FE POR MEDIO DE RE FORESTACIÓN Y SUSTITUCIÓN DE ESPECIES VEGETALES FOMENTANDO LA PARTICIPACIÓN CAMPESINA EN LOS PROCESOS DE CONSERVA-CIÓN DE LOS RECURSOS NATURALES ESTRATÉGICOS., DE ACUERDO A MEMORANDO RADICADO BAJO EL NÚMERO 2017-532-00-10843 DE FECHA OCTUBRE  26  DE 2017, FIRMADO POR EL ALCALDE LOCAL. SEGUN SOLICITUD 20175320011113 DEL 30-10-2017","Inversión",38,null,1324,"830.514.060","CORPORACION FUTURO SOSTENIBLE",0,null,null,1,30080000,30080000,0,43038,42736,42855,90,90,null,null,"X",null,null,0]
[134,2016,"16-12-5981981",16,{"$f":"IF(D205=1,'Tipo '!$B$2,IF(D205=2,'Tipo '!$B$3,IF(D205=3,'Tipo '!$B$4,IF(D205=4,'Tipo '!$B$5,IF(D205=5,'Tipo '!$B$6,IF(D205=6,'Tipo '!$B$7,IF(D205=7,'Tipo '!$B$8,IF(D205=8,'Tipo '!$B$9,IF(D205=9,'Tipo '!$B$10,IF(D205=10,'Tipo '!$B$11,IF(D205=11,'Tipo '!$B$12,IF(D205=12,'Tipo '!$B$13,IF(D205=13,'Tipo '!$B$14,IF(D205=14,'Tipo '!$B$15,IF(D205=15,'Tipo '!$B$16,IF(D205=16,'Tipo '!$B$17,IF(D205=17,'Tipo '!$B$18,IF(D205=18,'Tipo '!$B$19,IF(D205=19,'Tipo '!$B$20,\"No ha seleccionado un tipo de contrato válido\")))))))))))))))))))","v":"CONTRATOS INTERADMINISTRATIVOS"},"Selección abreviada ","Contratos interadministrativos","ADICIONAR Y PRORROGAR EL CONTRATO INTERADMINISTRATIVO CIA134-2016 QUE TIENE COMO OBJETO PARA LA PRESTACIÓN DEL SERVICIO EN  ACCIONES DE PREVENCIÓN Y PROMOCIÓN EN SALUD, CON EL FIN DE FORTALECER EL BANCO DE AYUDAS TÉCNICAS EN MARCO DEL PROYECTO 1316 \"SANTA FE INCLUYENTE. DE ACUERDO A MEMORANDO RADICADO BAJO EL NÚMERO 2017-532-00-11533 DE FECHA NOVIEMBRE   8   DE 2017, FIRMADO POR EL ALCALDE LOCAL ,","Inversión",3,null,1316,"900959051","SUBRED INTEGRADA DE SERVICIOS DE SALUD CENTRO ORIENTE ESE",0,null,null,1,98440163,98440163,0,43048,43048,43217,169,169,null,null,"X",null,null,0]
[149,2015,"16-12-4578078",5,{"$f":"IF(D206=1,'Tipo '!$B$2,IF(D206=2,'Tipo '!$B$3,IF(D206=3,'Tipo '!$B$4,IF(D206=4,'Tipo '!$B$5,IF(D206=5,'Tipo '!$B$6,IF(D206=6,'Tipo '!$B$7,IF(D206=7,'Tipo '!$B$8,IF(D206=8,'Tipo '!$B$9,IF(D206=9,'Tipo '!$B$10,IF(D206=10,'Tipo '!$B$11,IF(D206=11,'Tipo '!$B$12,IF(D206=12,'Tipo '!$B$13,IF(D206=13,'Tipo '!$B$14,IF(D206=14,'Tipo '!$B$15,IF(D206=15,'Tipo '!$B$16,IF(D206=16,'Tipo '!$B$17,IF(D206=17,'Tipo '!$B$18,IF(D206=18,'Tipo '!$B$19,IF(D206=19,'Tipo '!$B$20,\"No ha seleccionado un tipo de contrato válido\")))))))))))))))))))","v":"CONTRATOS DE PRESTACIÓN DE SERVICIOS PROFESIONALES Y DE APOYO A LA GESTIÓN"},"Contratación directa","Prestación de servicios profesionales y de apoyo a la gestión, o para la ejecución de trabajos artísticos que sólo puedan encomendarse a determinadas personas naturales;","ADICION   Y   PRORROGA EL CONTRATISTA SE OBLIGA A PRESTAR LOS SERVICIOS DE APOYO A LA DESCONGESTIÓN DE LOS ASUNTOS, TRAMITES Y ATENCION A LA COMUNIDAD DE LA OFICINA DEL DESPACHO DE LA ALCALDIA LOCAL DE SANTA FE.DE ACUERDO A MEMORANDO RADICADO BAJO EL NÚMERO 2017-532-000-1273 DE FECHA FEBRERO 14 DE 2017, FIRMADO POR EL ALCALDE LOCAL","Inversión",45,null,1326,41441151,"CONSUELO  SUAREZ DE PALACIOS",0,null,null,1,2300000,2300000,2300000,42780,42780,42825,45,45,null,null,null,"X",null,1]
[152,2015,"16-12-4577890",5,{"$f":"IF(D207=1,'Tipo '!$B$2,IF(D207=2,'Tipo '!$B$3,IF(D207=3,'Tipo '!$B$4,IF(D207=4,'Tipo '!$B$5,IF(D207=5,'Tipo '!$B$6,IF(D207=6,'Tipo '!$B$7,IF(D207=7,'Tipo '!$B$8,IF(D207=8,'Tipo '!$B$9,IF(D207=9,'Tipo '!$B$10,IF(D207=10,'Tipo '!$B$11,IF(D207=11,'Tipo '!$B$12,IF(D207=12,'Tipo '!$B$13,IF(D207=13,'Tipo '!$B$14,IF(D207=14,'Tipo '!$B$15,IF(D207=15,'Tipo '!$B$16,IF(D207=16,'Tipo '!$B$17,IF(D207=17,'Tipo '!$B$18,IF(D207=18,'Tipo '!$B$19,IF(D207=19,'Tipo '!$B$20,\"No ha seleccionado un tipo de contrato válido\")))))))))))))))))))","v":"CONTRATOS DE PRESTACIÓN DE SERVICIOS PROFESIONALES Y DE APOYO A LA GESTIÓN"},"Selección abreviada ","Selección abreviada por menor cuantía ","ADICION CPS N°152/2015. EL CONTRATISTA SE OBLIGA  CON EL FONDO DE DESARROLLO LOCAL DE SANTA FE A PRESTAR LOS SERVICIOS DE APOYO LOGISTICO, ELEMENTOS, Y RECURSO HUMANO  REQUERIDO POR LA ENTIDAD PARA EL DESARROLLO DE LOS DIFERENTES EVENTOS  DE LA ALCALDIA LOCAL DE SANTA FE DE ACUERDO CON LAS ESPECIFICACIONES CONTEMPLADAS EN EL APOYO TECNICO DOCUMENTO QUE HACE  PARTE DEL PRESENTE,  DE ACUERDO A MEMORANDO RADICADO BAJO EL NÚMERO 2017-532-000-1023 DE FECHA FEBRERO 2   DE 2017, FIRMADO POR EL ALCALDE LOCAL.","Inversión",45,null,1326,79867234,"CARLOS ALBERTO PINZON MOLINA",0,null,null,1,2000000,2000000,2000000,42769,42769,42856,90,90,null,null,null,"X",null,1]
["Ediles",2017,null,19,{"$f":"IF(D208=1,'Tipo '!$B$2,IF(D208=2,'Tipo '!$B$3,IF(D208=3,'Tipo '!$B$4,IF(D208=4,'Tipo '!$B$5,IF(D208=5,'Tipo '!$B$6,IF(D208=6,'Tipo '!$B$7,IF(D208=7,'Tipo '!$B$8,IF(D208=8,'Tipo '!$B$9,IF(D208=9,'Tipo '!$B$10,IF(D208=10,'Tipo '!$B$11,IF(D208=11,'Tipo '!$B$12,IF(D208=12,'Tipo '!$B$13,IF(D208=13,'Tipo '!$B$14,IF(D208=14,'Tipo '!$B$15,IF(D208=15,'Tipo '!$B$16,IF(D208=16,'Tipo '!$B$17,IF(D208=17,'Tipo '!$B$18,IF(D208=18,'Tipo '!$B$19,IF(D208=19,'Tipo '!$B$20,\"No ha seleccionado un tipo de contrato válido\")))))))))))))))))))","v":"OTROS"},null,null,"pago honorarios ediles","Inversión",45,null,1326,null,"EDILES",543600960,null,null,0,null,543600960,543600960,null,null,null,null,null,null,null,null,"X",null,1]
["TOTALES",null,null,null,null,null,null,null,null,null,null,null,null,null,null,null,null,null,null,{"$f":"SUM(T14:T208)","v":24228749970}]
[]
[]
[]
[]
[]
[null,null,null,null,null,null,null,null,null,null,null,null,null,null,null,null,null,null,null,{"$f":"SUBTOTAL(9,T14:T108)","v":3670637481}]

{"sheet":"Instructivo","index":1,"n_rows":85,"n_cols":3,"rows_kept":85,"cut":false,"hidden":false,"merged":[[2,0,2,2],[27,0,47,0],[60,0,62,0],[60,1,62,1],[22,0,22,2],[23,0,24,0],[23,1,24,1],[30,1,31,1],[48,0,49,0],[48,1,49,1],[4,0,4,2],[52,0,54,0],[53,1,54,1],[56,0,57,0],[59,0,59,2],[11,0,11,2],[0,0,0,2],[74,0,74,2],[75,0,76,0],[75,1,76,1],[82,0,82,2],[68,0,71,0],[68,1,71,1],[63,0,64,0],[63,1,64,1],[1,0,1,2],[3,0,3,2],[9,0,9,2],[8,0,8,2],[7,0,7,2],[6,0,6,2],[5,0,5,2]]}
["INSTRUCTIVO PARA DILIGENCIAMIENTO DEL FORMATO DE RENDICIÓN DE CUENTAS A 31 DE DICIEMBRE DE 2017"]
["OBSERVACIONES INICIALES"]
["Recomendamos leer cuidadosamente y poner en práctica las instrucciones que se explican en este instructivo. De la calidad de la información que se registre, depende en gran medida la calidad del informe de rendición de cuentas de la Gestión Contractual que presenta el Alcalde Mayor, consolidado por la Veeduría Distrital."]
["La base en Excel a diligenciar es inmodificable, debe utilizar versión Excel 2010 o posteriores, la versión 2007 no habilita los macros.  La base no permite que se incluyan columnas con otro tipo de información que la Veeduría Distrital no está solicitando o que se cambie el formato de celda establecido. Tenga en cuenta que muchas celdas están bloqueadas y/o solo permiten el registro de una información determinada."]
["La información que se registre en la base, debe coincidir con los reportes realizados en PREDIS y en el SECOP"]
["Diligencie la totalidad de celdas requeridas."]
["Para insertar una o varias filas,  seleccione una fila que no sea la primera fila del formato (shift+espacio), posteriormente copiar (Control +c), inmediatamente seleccione el numero de filas a insertar, desde 1 hasta las que usted requiera, por ultimo aplique Control+. Si usted no sigue este procedimiento las filas que copie no "]
["En primer lugar diligencie toda la información correspondiente a los contratos suscritos con cargo a la vigencia 2017."]
["Una vez incluidos todos los contratos de la vigencia 2017, a continuación diligencie el formato completo con la información correspondiente a las adiciones efectuadas con cargo a la vigencia 2017 de contratos suscritos en vigencias anteriores. La información general del contrato como: modalidad de selección, tipología contractual, objeto, entre otros, debe corresponder a la información del contrato adicionado o modificado."]
["En caso de haber realizado apropiaciones presupuestales en la vigencia a través de resoluciones, caja menor, honorarios ediles, servicios públicos, debe relacionar dicha información en una sola fila al final de la base, indicando de que se trata la apropiación."]
[]
["ENCABEZADO DEL FORMATO"]
[1,"Entidad","Indique el nombre completo de la Entidad."]
[2,"Sector","Relacione el sector al cual pertenece la Entidad."]
[3,"Presupuesto Disponible Inversión Directa","Indique el valor total del presupuesto disponible de inversión directa, de acuerdo con el PREDIS, a 31 de diciembre de 2017."]
[4,"Presupuesto comprometido de inversión ","Escriba el valor total del presupuesto comprometido de inversión directa, de acuerdo con el PREDIS a 31 de diciembre de 2017."]
[5,"Presupuesto Disponible Funcionamiento","Indique el valor total del presupuesto de funcionamiento disponible, de acuerdo con el PREDIS a 31 de diciembre de 2017."]
[6,"Presupuesto comprometido funcionamiento ","Escriba el monto del presupuesto de funcionamiento, comprometido mediante contratos, de acuerdo con el PREDIS a 31 de diciembre de 2017."]
[7,"Presupuesto Disponible Operación","Coloque el monto del presupuesto de operación disponible, de acuerdo con el PREDIS, a 31 de diciembre de 2017. Los gastos de operación corresponden solamente a aquellas entidades de régimen de contratación  privado."]
[8,"Presupuesto comprometido operación mediante contratos:","Escriba el monto del presupuesto de operación comprometido mediante contratos a  31 de diciembre de 2017."]
[9,"Nombre de quien diligencia el formato:","Indique el nombre completo, cargo, número de teléfono con extensión y correo electrónico del funcionario que diligencia el formato y que posteriormente realizará los ajustes y aclaraciones a que haya lugar por solicitud de la Veeduría Distrital."]
[]
["1- INFORMACIÓN GENERAL"]
[1,"Número de Contrato","En estricto orden consecutivo (1, 2, 3 y así sucesivamente, hasta llegar al último contrato suscrito durante la vigencia) registre el número del contrato, el orden consecutivo hace necesario registrar también, los contratos que fueron anulados, se debe indicar tal situación en la columna 19 (Estado)."]
[null,null,"Una vez terminado el registro de los contratos con cargo a la vigencia 2017, en las siguientes filas registre la información correspondiente a las adiciones efectuadas con cargo a la vigencia 2017 de contratos suscritos en vigencias anteriores, especificando el año de suscripción en la columna dos."]
[2,"Año","Registre el año de celebración del contrato."]
[3,"Número de proceso en el SECOP","Relacione el número de proceso con el cual se encuentra publicado el contrato en el SECOP. Ejemplo 005-FDLU-2017."]
[4,"Tipo de Contrato:","En esta columna solamente escriba el NUMERO de uno de los 19 tipos de contratos relacionados a continuación, al digitar el numero de tipo de contrato, en la columna equivalencia tipo de contrato, aparecerá automáticamente el tipo. Ejemplo si usted digita el numero 2, automáticamente en la siguiente columna aparecerá el tipo Consultoría:"]
[null,"1. Obra :","Son contratos de obra los que celebren las entidades estatales para la construcción, mantenimiento, instalación y, en general, para la realización de cualquier otro trabajo material sobre bienes inmuebles, cualquiera que sea la modalidad de ejecución y pago. Numeral 1 del Artículo 32 de la Ley 80 de 1993. "]
[null,"2. Consultoría:","Aquellos que celebran las entidades estatales, referidos a los estudios necesarios para la ejecución de proyectos de inversión, de diagnósticos, prefactibilidad o factibilidad para programas o proyectos específicos, así como a las asesorías técnicas de coordinación, control y supervisión. Numeral 2 del Artículo 32 de la Ley 80 de 1993. "]
[null,"3. Interventoría:","Son también  contratos de consultoría los que tienen por objeto la Interventoría, asesoría, gerencia de obras o de proyectos, dirección, programación y la ejecución de diseños, planos, anteproyectos y proyectos. Numeral 2 del Artículo 32 de la Ley 80 de 1993."]
[null,null,"El contrato de Interventoría tiene por objeto la  supervisión, seguimiento y vigilancia a la ejecución material de un contrato principal."]
[null,"4. Contrato de Prestación de servicios:","Son contratos de prestación de servicios los que celebren las entidades estatales para desarrollar actividades relacionadas con la administración o funcionamiento de la entidad. Numeral 3 del Artículo 32 de la Ley 80 de 1993."]
[null,"5. Contrato de Prestación de servicios profesionales y de apoyo a la gestión:","Corresponden a aquellos de naturaleza intelectual diferentes a los de consultoría que se derivan del cumplimiento de las funciones de la entidad estatal; así como los relacionados con actividades operativas, logísticas, o asistenciales. Art. 2.2.1.2.1.4.9, Decreto 1082 de 2015"]
[null,"6. Compraventa de bienes muebles:","Son aquellos contratos donde se transfiere el dominio de un bien mueble (aquellos susceptibles de ser trasladadas de un lugar a otro sin alterar ni su forma ni su esencia, tal es el caso del mobiliario y equipo de oficina, maquinaria, automóviles, etc.), cuya ejecución se agota de manera instantánea. Artículo 660, Código Civil."]
[null,"7. Compraventa de bienes inmuebles:","Son aquellos contratos donde se transfiere el dominio de un bien inmueble (todos aquellos bienes considerados bienes raíces, por tener de común la circunstancia de estar íntimamente ligados al suelo, unidos de modo inseparable, física o jurídicamente, al terreno). Artículo 656, Código Civil."]
[null,"8. Arrendamiento de bienes muebles","Es un contrato que tiene por objeto, conceder el uso y goce de un bien mueble a cambio de un precio determinado.  Artículo 1974 Código Civil."]
[null,"9. Arrendamiento de bienes inmuebles:","Es un contrato que tiene por objeto, conceder el uso y goce de un bien inmueble a cambio de un precio determinado.  Artículo 2.2.1.2.1.4.11 Decreto 1082 de 2015"]
[null,"10. Seguros:","El seguro es un contrato, en virtud del cual una persona jurídica llamada asegurador, asume, a cambio de una prima, un riesgo que le es trasladado por una persona natural o jurídica llamado tomador y en el cual éste tiene un interés asegurable, con el fin de indemnizarlo, en el evento de que ocurra la realización del riesgo amparado. de conformidad con el Título V, del Libro Cuarto del Código de Comercio "]
[null,"11. Suministro:","El suministro es el contrato por el cual una parte se obliga, a cambio de una contraprestación, a cumplir en favor de otra, en forma independiente, prestaciones periódicas o continuadas de cosas o servicios. Artículo 968, Código de Comercio"]
[null,"12. Empréstitos:","Son contratos de empréstito los que tienen por objeto proveer a la entidad estatal contratante de recursos en moneda nacional o extranjera con plazo para su pago. Artículo 7,  Decreto 2681 de 1996. "]
[null,"13. Fiducia mercantil o encargo fiduciario:","Son contratos que tienen por objeto la administración o el manejo de los recursos vinculados a los contratos que tales entidades celebren. Numeral 5 de Articulo 32 de la Ley 80 de 1993."]
[null,"14. Concesión:","Este contrato tiene por objeto otorgar a una persona llamada CONCESIONARIO  la prestación, operación, explotación, organización o gestión, total o parcial, de un servicio público, o la construcción, explotación o conservación total o parcial, de una obra o bien destinados al servicio o uso público, así como todas aquellas actividades necesarias para la adecuada prestación o funcionamiento de la obra o servicio por cuenta y riesgo del CONCESIONARIO, y bajo la vigilancia y control de la entidad concedente, a cambio de una remuneración que puede consistir en derechos, tarifas, tasas, valorización, o en la participación que se le otorgue en la explotación del bien, obra o servicio, o en una suma periódica, única o porcentual, y en general, en cualquier otra modalidad de contraprestación que las partes acuerden. Numeral 4 del Artículo 32 de la Ley 80 de 1993 "]
[null,"15. Convenios de cooperación:","Son aquellos mediante los cuales se formaliza la asistencia, ayuda, auxilio, soporte o colaboración entre entidades de una misma nación, de distintos países o por parte de organizaciones internacionales de naturaleza pública o privada a favor de entidades públicas. Artículo 20 de la ley 1150"]
[null,"16. Convenios/Contratos interadministrativos:","El convenio interadministrativo es el negocio jurídico en el cual están presentes dos entidades públicas en desarrollo de relaciones interadministrativas cuyo objeto es coordinar, cooperar, colaborar o distribuir competencias en la realización de funciones administrativas de interés común a los sujetos negóciales. Artículo 95 de la ley 489 de 1998."]
[null,"17. Convenios de Apoyo y/o Convenios de Asociación:","Los contratos que en desarrollo de lo dispuesto en el segundo inciso del artículo 355 de la Constitución Política celebren la Nación, los Departamentos, Distritos y Municipios con entidades privadas sin ánimo de lucro y de reconocida idoneidad, con el propósito de impulsar programas y actividades de interés público.  Reglamentado mediante Decreto 92 de 2017"]
[null,"18. Asociaciones Público Privadas:","Los contratos con personas naturales o jurídicas que se celebran en desarrollo de lo dispuesto en el Decreto 1508 de 2012."]
[null,"19. Otros:","Los demás tipos de contratos que no se encuentren definidos en las anteriores tipologías."]
[5,"Modalidad de Selección","Al ubicarse en la celda, se despliega una lista de modalidades de selección, de las cuales debe seleccionar la indicada. El formato no permite incluir modalidades diferentes a las señaladas en la lista desplegable.  "]
[null,null,"Para las adiciones a contratos de años anteriores se debe diligenciar la modalidad de selección del contrato adicionado o modificado"]
[6,"Procedimiento o causal","Esta columna solo se diligencia para las modalidades de selección abreviada y contratación directa. Al ubicarse en la celda, se despliega una lista de procedimientos o causales, de las cuales debe seleccionar la indicada. El formato no permite incluir procedimientos o causales diferentes a las señaladas en la lista desplegable.  "]
[7,"Objeto","Registre el objeto del contrato."]
[8,"Afectación ","Registre la afectación según la clasificación de cuentas del presupuesto de gastos. Funcionamiento, Inversión y Operación, esta última aplica únicamente para entidades de régimen privado. La celda solamente permite registrar estas tres opciones."]
[null,"Número Programa:","Si en la columna anterior “Afectación”,  indicó funcionamiento u operación deje en blanco el número de programa, es decir esta columna solamente aplica para Inversión."]
[null,null,"Identifíquelo de acuerdo con el código presupuestal del plan de desarrollo Bogotá Mejor Para Todos. Si un mismo contrato afecta más de un código presupuestal discrimine el contrato por cada código que afecte en filas separadas. Si se registra el número del programa (de 1 a 45), automáticamente en la columna siguiente aparece el nombre del mismo."]
[9,"Número Proyecto:","Indique el código presupuestal con el que se identifica el proyecto. Si un mismo contrato afecta más de un proyecto, discriminar el contrato por cada proyecto que afecte en filas separadas."]
[10,"Número de Identificación del contratista:"," "]
[null,"Nombre del Contratista","Indicar el nombre del contratista, persona natural o jurídica."]
[]
["2- INFORMACIÓN FINANCIERA"]
[11,"Valor Inicial ","Registre el valor inicial del contrato con cargo a la vigencia 2017, el formato de celda no permite guiones, puntos, comas o texto escrito. Esta columna solo debe contener información numérica."]
[null,null,"En el caso de adiciones a contratos de años anteriores,  no diligencie esta columna, solamente la columna 15 \"Adiciones\" "]
[null,null,"Excluya las reservas de apropiación y cuentas por pagar."]
[12,"Número de reducciones ","Diligencie esta columna solo en el caso de reducciones, reintegros, liberaciones, saldos a favor o cualquier factor que disminuya el valor de los contratos con cargo a la vigencia."]
[null,null,"Registre en esta celda la cantidad de reducciones que se realizaron al contrato."]
[13,"Valor total reducciones (En valor negativo)","Registre el valor total de las reducciones que se realizaron al contrato, el formato de celda no permite guiones, puntos, comas o texto escrito. Esta columna solo debe contener información numérica."]
[14,"Número de adiciones ","Diligencie esta columna solo en el caso de adiciones al valor inicial que aumenten el valor del contrato con cargo a la vigencia."]
[15,"Valor total de adiciones","Registre el valor total de las adiciones que se realizaron al contrato,  el formato de celda no permite guiones, puntos, comas o texto escrito. Esta columna solo debe contener información numérica."]
[16,"Valor Final","Esta columna se encuentra formulada y bloqueada, sí el valor final no coincide, es porque están mal diligenciadas las columnas valor inicial, valor de reducciones y/o valor de adiciones. En tal caso se debe verificar dicha información."]
[null,null,"La sumatoria de la columna 16 (valor final) para los contratos de Inversión Directa, según el programa del Plan de Desarrollo, deberá coincidir con el rubro registrado en el encabezado 4, Presupuesto comprometido de inversión según PREDIS, este valor debe coincidir a la vez con los informes de ejecución presupuestal del PREDIS.  "]
[null,null,"Si los valores no coinciden debe especificarse al final del formato en qué está representada la diferencia (discriminando los conceptos por Programa y Proyecto de inversión), con sus respectivos valores. Recuerde que la justificación debe hacerse solo para los contratos de inversión."]
[null,null,"Las bases donde dichos valores no coincidan serán devueltas por la Veeduría Distrital a cada entidad para los respectivos ajustes."]
[17,"Giros","En esta columna se debe registrar el valor de los giros a la fecha de corte del presente informe, 31 de diciembre de 2017, el formato de celda no permite guiones, puntos, comas o texto escrito. Esta columna solo debe contener información numérica."]
[]
["3- PLAZOS"]
[18,"Fecha de Suscripción","Relacionar la fecha en que se suscribió el contrato original. La celda solo admite el formato Día/Mes/Año así  25/02/2017."]
[null,null,"Para las adiciones a contratos de años anteriores se debe registrar en esta columna la fecha de suscripción de la adición en la vigencia 2017."]
[19,"Fecha de inicio","Indicar la fecha de inicio del contrato. Para las adiciones a contratos de años anteriores se debe diligenciar la fecha de inicio de la adición en la vigencia 2017. La celda solo admite el formato Día/Mes/Año así  25/02/2017."]
[20,"Fecha de terminación","Indicar la fecha efectiva de terminación del contrato. La celda solo admite el formato Día/Mes/Año así  25/02/2017."]
[21,"Plazo en días","Esta columna contiene el plazo inicial del contrato con el número total de días a ejecutar (sólo número de días, no mes, no texto)."]
[22,"Prórroga en días","En caso de presentarse este evento, indicar en días, el tiempo por el cual se prorrogó el contrato a partir de la fecha inicial de terminación (sólo número de días, no mes, no texto)."]
[]
["4- ESTADO A 31 DE DICIEMBRE DE 2017"]
[23,"Estado","Marque con una X en la respectiva columna si el contrato se encuentra Anulado, Por Iniciar, En Ejecución, Terminado o Liquidado."]
[24,"% Avance y/o cumplimiento","Indica el porcentaje de avance o de cumplimiento del mismo en términos presupuestales, es decir lo efectivamente pagado al contratista. Si no se ha iniciado la ejecución, él % de avance es 0%. La celda se encuentra formulada y protegida. Es la relación entre el valor de los giros y el valor final del contrato. Si el porcentaje de avance no coincide, se debe revisar los valores que se registraron en estas columnas. "]

{"sheet":"Equivalencia BH-BMPT","index":2,"n_rows":46,"n_cols":4,"rows_kept":46,"cut":false,"hidden":false,"merged":[]}
[null,null,"Cod_BMT","Programa - Bogotá Mejor para Todos"]
[null,null,1,"Prevención y atención de la maternidad y la paternidad tempranas"]
[null,null,2,"Desarrollo integral desde la gestación hasta la adolescencia"]
[null,null,3,"Igualdad y autonomía para una Bogotá incluyente"]
[null,null,4,"Familias protegidas y adaptadas al cambio climático"]
[null,null,5,"Desarrollo integral para la felicidad y el ejercicio de la ciudadanía"]
[null,null,6,"Calidad educativa para todos"]
[null,null,7,"Inclusión educativa para la equidad"]
[null,null,8,"Acceso con calidad a la educación superior"]
[null,null,9,"Atención integral y eficiente en salud"]
[null,null,10,"Modernización de la infraestructura física y tecnológica en salud"]
[null,null,11,"Mejores oportunidades para el desarrollo a través de la cultura, la recreación y el deporte"]
[null,null,12,"Mujeres protagonistas, activas y empoderadas en el cierre de brechas de género"]
[null,null,13,"Infraestructura para el desarrollo del hábitat"]
[null,null,14,"Intervenciones integrales del hábitat"]
[null,null,15,"Recuperación, incorporación, vida urbana y control de la ilegalidad"]
[null,null,16,"Integración social para una ciudad de oportunidades"]
[null,null,17,"Espacio público, derecho de todos"]
[null,null,18,"Mejor movilidad para todos"]
[null,null,19,"Seguridad y convivencia para todos"]
[null,null,20,"Fortalecimiento del Sistema de Protección Integral a Mujeres Víctimas de Violencia - SOFIA"]
[null,null,21,"Justicia para todos: consolidación del Sistema Distrital de Justicia"]
[null,null,22,"Bogotá vive los derechos humanos"]
[null,null,23,"Bogotá mejor para las víctimas, la paz y la reconciliación"]
[null,null,24,"Equipo por la educación para el reencuentro, la reconciliación y la paz"]
[null,null,25,"Cambio cultural y construcción del tejido social para la vida"]
[null,null,26,"Información relevante e integral para la planeación territorial"]
[null,null,27,"Proyectos urbanos integrales con visión de ciudad"]
[null,null,28,"Suelo para reducir el déficit habitacional de suelo urbanizable, vivienda y soportes urbanos"]
[null,null,29,"Articulación regional y planeación integral del transporte"]
[null,null,30,"Financiación para el Desarrollo Territorial"]
[null,null,31,"Fundamentar el desarrollo económico en la generación y uso del conocimiento para mejorar la competitividad de la Ciudad Región"]
[null,null,32,"Generar alternativas de ingreso y empleo de mejor calidad"]
[null,null,33,"Elevar la eficiencia de los mercados de la ciudad"]
[null,null,34,"Mejorar y fortalecer el recaudo tributario de la ciudad e impulsar el uso de mecanismos de vinculación de capital privado"]
[null,null,35,"Bogotá, ciudad inteligente"]
[null,null,36,"Bogotá, una ciudad digital"]
[null,null,37,"Consolidar el turismo como factor de desarrollo, confianza y felicidad para Bogotá Región"]
[null,null,38,"Recuperación y manejo de la Estructura Ecológica Principal"]
[null,null,39,"Ambiente sano para la equidad y disfrute del ciudadano"]
[null,null,40,"Gestión de la huella ambiental urbana"]
[null,null,41,"Desarrollo rural sostenible"]
[null,null,42,"Transparencia, gestión pública y servicio a la ciudadanía"]
[null,null,43,"Modernización institucional"]
[null,null,44,"Gobierno y ciudadanía digital"]
[null,null,45,"Gobernanza e influencia local, regional e internacional"]

{"sheet":"Tipo ","index":3,"n_rows":30,"n_cols":4,"rows_kept":30,"cut":false,"hidden":false,"merged":[[0,2,1,2]]}
[null,null,"Modalidad de Selección","afectacion"]
[1,"OBRA PÚBLICA",null,"Funcionamiento"]
[2,"CONSULTORÍA","Contratación directa","Inversión"]
[3,"INTERVENTORÍA","Contratación mínima cuantia ","Operación"]
[4,"CONTRATOS DE PRESTACIÓN DE SERVICIOS","Selección abreviada "]
[5,"CONTRATOS DE PRESTACIÓN DE SERVICIOS PROFESIONALES Y DE APOYO A LA GESTIÓN","Licitación pública"]
[6,"COMPRAVENTA DE BIENES MUEBLES","Régimen privado "]
[7,"COMPRAVENTA DE BIENES INMUEBLES","Regimen especial"]
[8,"ARRENDAMIENTO DE BIENES MUEBLES"]
[9,"ARRENDAMIENTO DE BIENES INMUEBLES"]
[10,"SEGUROS","selección abreviada"]
[11,"SUMINISTRO","Subasta inversa "]
[12,"EMPRESTITOS","Bolsas de productos"]
[13,"FIDUCIA MERCANTIL O ENCARGO FIDUCIARIO","Acuerdo marco de precios "]
[14,"CONCESIÓN ","Selección abreviada por menor cuantía "]
[15,"CONVENIOS DE COOPERACION"]
[16,"CONTRATOS INTERADMINISTRATIVOS","contratacion directa"]
[17,"CONVENIOS DE APOYO Y/O CONVENIOS DE ASOCIACIÓN ","Urgencia manifiesta"]
[18,"ASOCIACIONES PÚBLICO PRIVADAS","Contratación de empréstitos"]
[19,"OTROS","Contratos interadministrativos"]
[null,null,"Contratación de bienes y servicios en el sector Defensa y en el Departamento Administrativo de Seguridad, DAS"]
[null,null,"Contratos para el desarrollo de actividades científicas y tecnológicas"]
[null,null,"Contratos de encargo fiduciario que celebren las entidades territoriales cuando inician el Acuerdo de Reestructuración de Pasivos"]
[null,null,"Cuando no exista pluralidad de oferentes en el mercado"]
[null,null,"Prestación de servicios profesionales y de apoyo a la gestión, o para la ejecución de trabajos artísticos que sólo puedan encomendarse a determinadas personas naturales;"]
[null,null,"El arrendamiento o adquisición de inmuebles"]
[null,null,"Contratación de bienes y servicios de la Dirección Nacional de Inteligencia (DNI)"]
[null,null,"Decreto 777 de 1992"]
[null,null,"Decreto 92 de 2017"]
[null,null,"No aplica"]

{"sheet":"Hoja1","index":4,"n_rows":0,"n_cols":0,"rows_kept":0,"cut":false,"hidden":false,"merged":[]}