{"text_format":"1","workbook":"xlsx","n_sheets":11,"sheets":["Ctos suscrito x Trimestre","INVERSION","FUNCIONAMIENTO","CORRECCIONES A REALIZAR 1","1. INFORMACION ACUMULADA","2. PAA","3. CONSOLIDADO","4. INSTRUCTIVO","Proposito_programa","Tipo","Eje_Pilar_Prop1"],"not_rendered":{"charts":0,"images":1,"macros":1,"external_links":10,"defined_names":79,"comments":2,"pivot_tables":9},"unopened":[],"bounds":{"document_bytes":16777216,"sheet_cells":100000,"rows_first":2000,"rows_last":500,"rows_between":2000,"halvings":0,"cell_chars":16384,"cell_head_chars":4096},"cells_cut":0,"cells_raw":0,"read":"whole","date_system":"1900"}

{"sheet":"Ctos suscrito x Trimestre","index":0,"n_rows":102,"n_cols":5,"rows_kept":102,"cut":false,"hidden":false,"merged":[[1,4,3,11],[4,4,4,6]]}
[]
[null,"Contratos Suscritos en la vigencia 2021  (Inversion)",null,null,"Se toman solo los contratos de la vigencia por cuanto en las adiciones años anteriores algunas Entidades registraron la fecha en que se suscribio el contrato y no la adición."]
[null,"Afectación","Inversión"]
[null,"Tipo de contrato ","(Varios elementos)","No incluir \"otros gastos\""]
[null,"Año","(Todas)"]
[]
[null,"Suma de Cuenta contratos"]
[null,"Fecha de suscripción (DD/MM/AAAA)","Total"]
[null,44223,2]
[null,44225,3]
[null,44228,6]
[null,44229,1]
[null,44230,3]
[null,44232,3]
[null,44235,3]
[null,44236,2]
[null,44238,6]
[null,44239,2]
[null,44242,7]
[null,44244,1]
[null,44243,1]
[null,44249,1]
[null,44250,1]
[null,44253,1]
[null,44252,4]
[null,44257,3]
[null,44256,1]
[null,44264,1]
[null,44270,5]
[null,44271,1]
[null,44272,1]
[null,44273,1]
[null,44278,2]
[null,44279,4]
[null,44280,3]
[null,44286,2]
[null,44281,3]
[null,44298,1]
[null,44299,1]
[null,44300,3]
[null,44301,1]
[null,44307,1]
[null,44313,2]
[null,44314,1]
[null,44320,2]
[null,44327,2]
[null,44329,1]
[null,44358,1]
[null,44362,1]
[null,44364,1]
[null,44375,1]
[null,44391,2]
[null,44392,1]
[null,44405,1]
[null,44407,2]
[null,44417,1]
[null,44418,3]
[null,44419,1]
[null,44420,2]
[null,44421,2]
[null,44427,2]
[null,44431,1]
[null,44433,2]
[null,44434,7]
[null,44438,1]
[null,44440,3]
[null,44446,1]
[null,44445,2]
[null,44447,2]
[null,44449,1]
[null,44455,1]
[null,44461,6]
[null,44462,4]
[null,44463,2]
[null,44467,2]
[null,44480,1]
[null,44495,3]
[null,44490,1]
[null,44482,2]
[null,44541,1]
[null,44512,1]
[null,44505,5]
[null,44509,1]
[null,44517,2]
[null,44519,3]
[null,44526,1]
[null,44529,1]
[null,44531,1]
[null,44532,2]
[null,44537,1]
[null,44539,1]
[null,44543,2]
[null,44545,1]
[null,44547,7]
[null,44546,2]
[null,44550,1]
[null,44549,1]
[null,44551,1]
[null,44558,1]
[null,44559,3]
[null,44560,5]
[null,"Total general",196]

{"sheet":"INVERSION","index":1,"n_rows":84,"n_cols":59,"rows_kept":84,"cut":false,"hidden":false,"merged":[[0,1,0,2],[0,50,0,54],[74,1,74,2],[74,50,74,54]]}
[null,"INVERSION TIPO DE CONTRATO AÑO 2021 SE SUMO EL NUMERO DE CONTRATOS",null,null,null,null,null,null,null,null,null,null,null,null,null,null,null,null,null,null,null,null,null,null,null,null,null,null,null,null,null,null,null,null,null,null,null,null,null,null,null,null,null,null,null,null,null,null,null,null,"INVERSION POR MODALIDAD DE CONTRATO AÑO 2021 SE SUMO EL NUMERO DE CONTRATOS"]
[]
["Año",2021,null,null,null,null,null,null,null,null,null,null,null,null,null,null,null,null,null,null,null,null,null,null,null,null,null,null,null,null,null,null,null,null,null,null,null,null,null,null,null,null,null,null,null,null,null,null,null,null,"Año",2021]
["Afectación","Inversión",null,null,null,null,null,null,null,null,null,null,null,null,null,null,null,null,null,null,null,null,null,null,null,null,null,null,null,null,null,null,null,null,null,null,null,null,null,null,null,null,null,null,null,null,null,null,null,null,"Afectación","Inversión"]
[]
[null,null,null,"Valores",null,null,null,null,null,null,null,null,null,null,null,null,null,null,null,null,null,null,null,null,null,null,null,null,null,null,null,null,null,null,null,null,null,null,null,null,null,null,null,null,null,null,null,null,null,null,null,null,null,"Valores"]
["Tipo de contrato ","Propósito","Equivalencia número de programa","Suma de Valor Final ","Suma de Valor Final 2","Suma de Giros (Valor en pesos)","Suma de Giros (Valor en pesos)2","Suma de Cuenta contratos","Suma de Cuenta contratos2",null,null,null,null,null,null,null,null,null,null,null,null,null,null,null,null,null,null,null,null,null,null,null,null,null,null,null,null,null,null,null,null,null,null,null,null,null,null,null,null,null,"Modalidad de Selección","Propósito","Equivalencia número de programa","Suma de Valor Final ","Suma de Valor Final 2","Suma de Giros (Valor en pesos)","Suma de Giros (Valor en pesos)2","Suma de Cuenta contratos","Suma de Cuenta contratos2"]
["Compraventa de bienes muebles","Propósito 1: Hacer un nuevo contrato social para incrementar la inclusión social, productiva y política","Sistema Distrital de Cuidado",143477087,1.9416546823495671E-2,143477054,2.9783401469770963E-2,13,6.7010309278350513E-2,null,null,null,null,null,null,null,null,null,null,null,null,null,null,null,null,null,null,null,null,null,null,null,null,null,null,null,null,null,null,null,null,null,null,null,null,null,null,null,null,null,"Contratación directa","Propósito 1: Hacer un nuevo contrato social para incrementar la inclusión social, productiva y política","Bogotá región emprendedora e innovadora",169298285,2.2910892230757481E-2,129579117,2.6898425609640852E-2,14,7.2164948453608241E-2]
[null,null,"Creación y vida cotidiana: Apropiación ciudadana del arte, la cultura y el patrimonio, para la democracia cultural",411976839,5.5752230212474538E-2,0,0,6,3.0927835051546393E-2,null,null,null,null,null,null,null,null,null,null,null,null,null,null,null,null,null,null,null,null,null,null,null,null,null,null,null,null,null,null,null,null,null,null,null,null,null,null,null,null,null,null,null,"Creación y vida cotidiana: Apropiación ciudadana del arte, la cultura y el patrimonio, para la democracia cultural",119556266,1.617937668912461E-2,42025700,8.7238221043216668E-3,9,4.6391752577319589E-2]
[null,null,"Educación inicial: Bases sólidas para la vida.",72588416,9.8232854288948755E-3,0,0,5,2.5773195876288658E-2,null,null,null,null,null,null,null,null,null,null,null,null,null,null,null,null,null,null,null,null,null,null,null,null,null,null,null,null,null,null,null,null,null,null,null,null,null,null,null,null,null,null,null,"Educación inicial: Bases sólidas para la vida.",20448000,2.7671982875345073E-3,20448000,4.2446577781968999E-3,1,5.1546391752577319E-3]
[null,"Propósito 5: Construir Bogotá - Región con gobierno abierto, transparente y ciudadanía consciente","Gestión pública local",5229346,7.0767983646935766E-4,0,0,1,5.1546391752577319E-3,null,null,null,null,null,null,null,null,null,null,null,null,null,null,null,null,null,null,null,null,null,null,null,null,null,null,null,null,null,null,null,null,null,null,null,null,null,null,null,null,null,null,null,"Formación integral: más y mejor tiempo en los colegios",30672000,4.1507974313017611E-3,30672000,6.3669866672953499E-3,1,5.1546391752577319E-3]
[null,"Propósito 3: Inspirar confianza y legitimidad para vivir sin miedo y ser epicentro de cultura ciudadana, paz y reconciliación","Espacio público más seguro y construido colectivamente",38974244,5.2743281130062623E-3,0,0,2,1.0309278350515464E-2,null,null,null,null,null,null,null,null,null,null,null,null,null,null,null,null,null,null,null,null,null,null,null,null,null,null,null,null,null,null,null,null,null,null,null,null,null,null,null,null,null,null,null,"Jóvenes con capacidades: Proyecto de vida para la ciudadanía, la innovación y el trabajo del siglo XXI",860583000,0.11646145363269311,860583000,0.17864242589661691,2,1.0309278350515464E-2]
["Contratos de prestación de servicios","Propósito 1: Hacer un nuevo contrato social para incrementar la inclusión social, productiva y política","Sistema Distrital de Cuidado",211974142.09999999,2.8686154294831588E-2,3753166,7.7909356684096958E-4,4,2.0618556701030927E-2,null,null,null,null,null,null,null,null,null,null,null,null,null,null,null,null,null,null,null,null,null,null,null,null,null,null,null,null,null,null,null,null,null,null,null,null,null,null,null,null,null,null,null,"Sistema Distrital de Cuidado",691673968,9.3603238447857867E-2,436769730,9.066598355464886E-2,19,9.7938144329896906E-2]
[null,null,"Bogotá región emprendedora e innovadora",70919820,9.5974767437527145E-3,0,0,1,5.1546391752577319E-3,null,null,null,null,null,null,null,null,null,null,null,null,null,null,null,null,null,null,null,null,null,null,null,null,null,null,null,null,null,null,null,null,null,null,null,null,null,null,null,null,null,null,null,"Subsidios y transferencias para la equidad",146120600,1.9774289617249349E-2,140386600,2.9141875667283691E-2,6,3.0927835051546393E-2]
[null,null,"Creación y vida cotidiana: Apropiación ciudadana del arte, la cultura y el patrimonio, para la democracia cultural",313888237,4.2478041466335367E-2,63314206,1.3142954663940769E-2,1,5.1546391752577319E-3,null,null,null,null,null,null,null,null,null,null,null,null,null,null,null,null,null,null,null,null,null,null,null,null,null,null,null,null,null,null,null,null,null,null,null,null,null,null,null,null,null,null,"Propósito 5: Construir Bogotá - Región con gobierno abierto, transparente y ciudadanía consciente","Fortalecimiento de cultura ciudadana y su institucionalidad",147951600,2.0022076200997184E-2,125266300,2.6003157993004025E-2,6,3.0927835051546393E-2]
[null,null,"Educación inicial: Bases sólidas para la vida.",11128245,1.5059693127574551E-3,0,0,1,5.1546391752577319E-3,null,null,null,null,null,null,null,null,null,null,null,null,null,null,null,null,null,null,null,null,null,null,null,null,null,null,null,null,null,null,null,null,null,null,null,null,null,null,null,null,null,null,null,"Gestión pública local",1514593899,0.20496780338531947,1402862833,0.29121051622832494,61,0.31443298969072164]
[null,"Propósito 5: Construir Bogotá - Región con gobierno abierto, transparente y ciudadanía consciente","Fortalecimiento de cultura ciudadana y su institucionalidad",132256954,1.789814244049932E-2,24217039,5.0270463104581222E-3,1,5.1546391752577319E-3,null,null,null,null,null,null,null,null,null,null,null,null,null,null,null,null,null,null,null,null,null,null,null,null,null,null,null,null,null,null,null,null,null,null,null,null,null,null,null,null,null,null,"Propósito 2 : Cambiar Nuestros Hábitos de Vida para Reverdecer a Bogotá y Adaptarnos y Mitigar la Crisis Climática","Bogotá protectora de los animales",70253200,9.5072640225850567E-3,69136400,1.4351543330229467E-2,3,1.5463917525773196E-2]
[null,"Propósito 2 : Cambiar Nuestros Hábitos de Vida para Reverdecer a Bogotá y Adaptarnos y Mitigar la Crisis Climática","Bogotá protectora de los animales",77000000,1.0420298715774504E-2,63573046,1.3196685455182381E-2,1,5.1546391752577319E-3,null,null,null,null,null,null,null,null,null,null,null,null,null,null,null,null,null,null,null,null,null,null,null,null,null,null,null,null,null,null,null,null,null,null,null,null,null,null,null,null,null,null,"Propósito 4: Hacer de Bogotá Región un modelo de movilidad multimodal, incluyente y sostenible","Movilidad segura, sostenible y accesible",244239266,3.3052546881058541E-2,181375198,3.7650412997002287E-2,8,4.1237113402061855E-2]
[null,"Propósito 3: Inspirar confianza y legitimidad para vivir sin miedo y ser epicentro de cultura ciudadana, paz y reconciliación","Espacio público más seguro y construido colectivamente",250166192,3.3854629210750622E-2,0,0,1,5.1546391752577319E-3,null,null,null,null,null,null,null,null,null,null,null,null,null,null,null,null,null,null,null,null,null,null,null,null,null,null,null,null,null,null,null,null,null,null,null,null,null,null,null,null,null,null,"Propósito 3: Inspirar confianza y legitimidad para vivir sin miedo y ser epicentro de cultura ciudadana, paz y reconciliación","Cultura ciudadana para la confianza, la convivencia y la participación desde la vida cotidiana",188276666,2.5479209102988381E-2,175137330,3.6355537462692551E-2,9,4.6391752577319589E-2]
[null,null,"Más mujeres viven una vida libre de violencias, se sienten seguras y acceden con confianza al sistema de justicia",106603020,1.4426432628619269E-2,0,0,1,5.1546391752577319E-3,null,null,null,null,null,null,null,null,null,null,null,null,null,null,null,null,null,null,null,null,null,null,null,null,null,null,null,null,null,null,null,null,null,null,null,null,null,null,null,null,null,null,null,"Espacio público más seguro y construido colectivamente",128219559,1.735176761019316E-2,97008300,2.0137276757856922E-2,8,4.1237113402061855E-2]
["Contratos de prestación de servicios profesionales y de apoyo a la gestión","Propósito 1: Hacer un nuevo contrato social para incrementar la inclusión social, productiva y política","Subsidios y transferencias para la equidad",146120600,1.9774289617249349E-2,140386600,2.9141875667283691E-2,6,3.0927835051546393E-2,null,null,null,null,null,null,null,null,null,null,null,null,null,null,null,null,null,null,null,null,null,null,null,null,null,null,null,null,null,null,null,null,null,null,null,null,null,null,null,null,null,null,null,"Más mujeres viven una vida libre de violencias, se sienten seguras y acceden con confianza al sistema de justicia",92492600,1.2516889883099284E-2,47818400,9.9262883167513024E-3,2,1.0309278350515464E-2]
[null,null,"Sistema Distrital de Cuidado",502670099,6.8025618013869388E-2,412265633,8.5579348875035141E-2,18,9.2783505154639179E-2,null,null,null,null,null,null,null,null,null,null,null,null,null,null,null,null,null,null,null,null,null,null,null,null,null,null,null,null,null,null,null,null,null,null,null,null,null,null,null,null,null,"Contratación mínima cuantia","Propósito 1: Hacer un nuevo contrato social para incrementar la inclusión social, productiva y política","Educación inicial: Bases sólidas para la vida.",16399245,2.2192861248463824E-3,0,0,2,1.0309278350515464E-2]
[null,null,"Bogotá región emprendedora e innovadora",141952935,1.9210285536115864E-2,102233767,2.1221995025964377E-2,13,6.7010309278350513E-2,null,null,null,null,null,null,null,null,null,null,null,null,null,null,null,null,null,null,null,null,null,null,null,null,null,null,null,null,null,null,null,null,null,null,null,null,null,null,null,null,null,null,null,"Sistema Distrital de Cuidado",45104283.100000001,6.1038974449722037E-3,22153166,4.5986213015251909E-3,3,1.5463917525773196E-2]
[null,null,"Creación y vida cotidiana: Apropiación ciudadana del arte, la cultura y el patrimonio, para la democracia cultural",119556266,1.617937668912461E-2,42025700,8.7238221043216668E-3,9,4.6391752577319589E-2,null,null,null,null,null,null,null,null,null,null,null,null,null,null,null,null,null,null,null,null,null,null,null,null,null,null,null,null,null,null,null,null,null,null,null,null,null,null,null,null,null,null,"Propósito 5: Construir Bogotá - Región con gobierno abierto, transparente y ciudadanía consciente","Fortalecimiento de cultura ciudadana y su institucionalidad",13563360,1.8355099063582763E-3,1444075,2.9976546268826722E-4,1,5.1546391752577319E-3]
[null,null,"Educación inicial: Bases sólidas para la vida.",20448000,2.7671982875345073E-3,20448000,4.2446577781968999E-3,1,5.1546391752577319E-3,null,null,null,null,null,null,null,null,null,null,null,null,null,null,null,null,null,null,null,null,null,null,null,null,null,null,null,null,null,null,null,null,null,null,null,null,null,null,null,null,null,null,null,"Gestión pública local",8731346,1.1816004352049722E-3,3502000,7.2695576776435561E-4,2,1.0309278350515464E-2]
[null,null,"Formación integral: más y mejor tiempo en los colegios",30672000,4.1507974313017611E-3,30672000,6.3669866672953499E-3,1,5.1546391752577319E-3,null,null,null,null,null,null,null,null,null,null,null,null,null,null,null,null,null,null,null,null,null,null,null,null,null,null,null,null,null,null,null,null,null,null,null,null,null,null,null,null,null,null,"Propósito 3: Inspirar confianza y legitimidad para vivir sin miedo y ser epicentro de cultura ciudadana, paz y reconciliación","Espacio público más seguro y construido colectivamente",64374244,8.7116734036643446E-3,0,0,3,1.5463917525773196E-2]
[null,null,"Jóvenes con capacidades: Proyecto de vida para la ciudadanía, la innovación y el trabajo del siglo XXI",30672000,4.1507974313017611E-3,30672000,6.3669866672953499E-3,1,5.1546391752577319E-3,null,null,null,null,null,null,null,null,null,null,null,null,null,null,null,null,null,null,null,null,null,null,null,null,null,null,null,null,null,null,null,null,null,null,null,null,null,null,null,null,null,null,null,"Más mujeres viven una vida libre de violencias, se sienten seguras y acceden con confianza al sistema de justicia",1629550,2.2052464639338109E-4,0,0,0,0]
[null,"Propósito 5: Construir Bogotá - Región con gobierno abierto, transparente y ciudadanía consciente","Gestión pública local",1514593899,0.20496780338531947,1402862833,0.29121051622832494,61,0.31443298969072164,null,null,null,null,null,null,null,null,null,null,null,null,null,null,null,null,null,null,null,null,null,null,null,null,null,null,null,null,null,null,null,null,null,null,null,null,null,null,null,null,null,"Régimen especial","Propósito 1: Hacer un nuevo contrato social para incrementar la inclusión social, productiva y política","Sistema Distrital de Cuidado",807645195,0.10929745699038895,755000000,0.15672518693948842,1,5.1546391752577319E-3]
[null,null,"Fortalecimiento de cultura ciudadana y su institucionalidad",147951600,2.0022076200997184E-2,125266300,2.6003157993004025E-2,6,3.0927835051546393E-2,null,null,null,null,null,null,null,null,null,null,null,null,null,null,null,null,null,null,null,null,null,null,null,null,null,null,null,null,null,null,null,null,null,null,null,null,null,null,null,null,null,"Selección abreviada","Propósito 1: Hacer un nuevo contrato social para incrementar la inclusión social, productiva y política","Bogotá región emprendedora e innovadora",70919820,9.5974767437527145E-3,0,0,1,5.1546391752577319E-3]
[null,"Propósito 2 : Cambiar Nuestros Hábitos de Vida para Reverdecer a Bogotá y Adaptarnos y Mitigar la Crisis Climática","Bogotá protectora de los animales",70253200,9.5072640225850567E-3,69136400,1.4351543330229467E-2,3,1.5463917525773196E-2,null,null,null,null,null,null,null,null,null,null,null,null,null,null,null,null,null,null,null,null,null,null,null,null,null,null,null,null,null,null,null,null,null,null,null,null,null,null,null,null,null,null,null,"Creación y vida cotidiana: Apropiación ciudadana del arte, la cultura y el patrimonio, para la democracia cultural",725865076,9.8230271678809905E-2,63314206,1.3142954663940769E-2,7,3.608247422680412E-2]
[null,"Propósito 4: Hacer de Bogotá Región un modelo de movilidad multimodal, incluyente y sostenible","Movilidad segura, sostenible y accesible",244239266,3.3052546881058541E-2,181375198,3.7650412997002287E-2,8,4.1237113402061855E-2,null,null,null,null,null,null,null,null,null,null,null,null,null,null,null,null,null,null,null,null,null,null,null,null,null,null,null,null,null,null,null,null,null,null,null,null,null,null,null,null,null,null,null,"Educación inicial: Bases sólidas para la vida.",72588416,9.8232854288948755E-3,0,0,5,2.5773195876288658E-2]
[null,"Propósito 3: Inspirar confianza y legitimidad para vivir sin miedo y ser epicentro de cultura ciudadana, paz y reconciliación","Cultura ciudadana para la confianza, la convivencia y la participación desde la vida cotidiana",188276666,2.5479209102988381E-2,175137330,3.6355537462692551E-2,9,4.6391752577319589E-2,null,null,null,null,null,null,null,null,null,null,null,null,null,null,null,null,null,null,null,null,null,null,null,null,null,null,null,null,null,null,null,null,null,null,null,null,null,null,null,null,null,null,null,"Sistema Distrital de Cuidado",310346946,4.1998803673355053E-2,125077054,2.596387373508674E-2,14,7.2164948453608241E-2]
[null,null,"Espacio público más seguro y construido colectivamente",128219559,1.735176761019316E-2,97008300,2.0137276757856922E-2,8,4.1237113402061855E-2,null,null,null,null,null,null,null,null,null,null,null,null,null,null,null,null,null,null,null,null,null,null,null,null,null,null,null,null,null,null,null,null,null,null,null,null,null,null,null,null,null,null,"Propósito 5: Construir Bogotá - Región con gobierno abierto, transparente y ciudadanía consciente","Fortalecimiento de cultura ciudadana y su institucionalidad",132256954,1.789814244049932E-2,24217039,5.0270463104581222E-3,1,5.1546391752577319E-3]
[null,null,"Más mujeres viven una vida libre de violencias, se sienten seguras y acceden con confianza al sistema de justicia",64517600,8.7310735639591318E-3,47818400,9.9262883167513024E-3,2,1.0309278350515464E-2,null,null,null,null,null,null,null,null,null,null,null,null,null,null,null,null,null,null,null,null,null,null,null,null,null,null,null,null,null,null,null,null,null,null,null,null,null,null,null,null,null,null,"Propósito 2 : Cambiar Nuestros Hábitos de Vida para Reverdecer a Bogotá y Adaptarnos y Mitigar la Crisis Climática","Bogotá protectora de los animales",111422311,1.5078620314570485E-2,63573046,1.3196685455182381E-2,2,1.0309278350515464E-2]
["Contratos interadministrativos","Propósito 1: Hacer un nuevo contrato social para incrementar la inclusión social, productiva y política","Sistema Distrital de Cuidado",189003869,2.5577620433988476E-2,24504097,5.0866346796137191E-3,1,5.1546391752577319E-3,null,null,null,null,null,null,null,null,null,null,null,null,null,null,null,null,null,null,null,null,null,null,null,null,null,null,null,null,null,null,null,null,null,null,null,null,null,null,null,null,null,null,"Propósito 4: Hacer de Bogotá Región un modelo de movilidad multimodal, incluyente y sostenible","Movilidad segura, sostenible y accesible",229058163,3.099811015255282E-2,0,0,1,5.1546391752577319E-3]
[null,null,"Bogotá región emprendedora e innovadora",27345350,3.7006066946416146E-3,27345350,5.6764305836764766E-3,1,5.1546391752577319E-3,null,null,null,null,null,null,null,null,null,null,null,null,null,null,null,null,null,null,null,null,null,null,null,null,null,null,null,null,null,null,null,null,null,null,null,null,null,null,null,null,null,null,"Propósito 3: Inspirar confianza y legitimidad para vivir sin miedo y ser epicentro de cultura ciudadana, paz y reconciliación","Espacio público más seguro y construido colectivamente",250166192,3.3854629210750622E-2,0,0,1,5.1546391752577319E-3]
[null,null,"Jóvenes con capacidades: Proyecto de vida para la ciudadanía, la innovación y el trabajo del siglo XXI",829911000,0.11231065620139136,829911000,0.17227543922932156,1,5.1546391752577319E-3,null,null,null,null,null,null,null,null,null,null,null,null,null,null,null,null,null,null,null,null,null,null,null,null,null,null,null,null,null,null,null,null,null,null,null,null,null,null,null,null,null,null,null,"Más mujeres viven una vida libre de violencias, se sienten seguras y acceden con confianza al sistema de justicia",104973470,1.4205907982225889E-2,0,0,1,5.1546391752577319E-3]
[null,"Propósito 3: Inspirar confianza y legitimidad para vivir sin miedo y ser epicentro de cultura ciudadana, paz y reconciliación","Más mujeres viven una vida libre de violencias, se sienten seguras y acceden con confianza al sistema de justicia",27975000,3.7858163191401527E-3,0,0,0,0,null,null,null,null,null,null,null,null,null,null,null,null,null,null,null,null,null,null,null,null,null,null,null,null,null,null,null,null,null,null,null,null,null,null,null,null,null,null,null,null,null,"Total general",null,null,7389423480.1000004,1,4817349494,1,194,1]
["Obra pública","Propósito 4: Hacer de Bogotá Región un modelo de movilidad multimodal, incluyente y sostenible","Movilidad segura, sostenible y accesible",229058163,3.099811015255282E-2,0,0,1,5.1546391752577319E-3]
["Suministro","Propósito 1: Hacer un nuevo contrato social para incrementar la inclusión social, productiva y política","Educación inicial: Bases sólidas para la vida.",5271000,7.1331681208892743E-4,0,0,1,5.1546391752577319E-3]
[null,"Propósito 5: Construir Bogotá - Región con gobierno abierto, transparente y ciudadanía consciente","Gestión pública local",3502000,4.7392059873561444E-4,3502000,7.2695576776435561E-4,1,5.1546391752577319E-3]
[null,null,"Fortalecimiento de cultura ciudadana y su institucionalidad",13563360,1.8355099063582763E-3,1444075,2.9976546268826722E-4,1,5.1546391752577319E-3]
[null,"Propósito 2 : Cambiar Nuestros Hábitos de Vida para Reverdecer a Bogotá y Adaptarnos y Mitigar la Crisis Climática","Bogotá protectora de los animales",34422311,4.6583215987959815E-3,0,0,1,5.1546391752577319E-3]
[null,"Propósito 3: Inspirar confianza y legitimidad para vivir sin miedo y ser epicentro de cultura ciudadana, paz y reconciliación","Espacio público más seguro y construido colectivamente",25400000,3.4373452906580832E-3,0,0,1,5.1546391752577319E-3]
["Convenios de cooperacion","Propósito 1: Hacer un nuevo contrato social para incrementar la inclusión social, productiva y política","Sistema Distrital de Cuidado",807645195,0.10929745699038895,755000000,0.15672518693948842,1,5.1546391752577319E-3]
["Total general",null,null,7389423480.1000004,1,4817349494,1,194,1]
[]
[]
[]
[]
[]
[]
[]
[]
[]
[]
[]
[]
[]
[]
[]
[]
[]
[]
[]
[]
[]
[]
[]
[]
[]
[]
[]
[]
[null,"INVERSION TIPO DE CONTRATO AÑO ANTERIORES SE SUMO EL NUMERO DE ADICIONES",null,null,null,null,null,null,null,null,null,null,null,null,null,null,null,null,null,null,null,null,null,null,null,null,null,null,null,null,null,null,null,null,null,null,null,null,null,null,null,null,null,null,null,null,null,null,null,null,"INVERSION POR MODALIDAD DE CONTRATO AÑO ANTERIORES SE SUMO EL NUMERO DE ADICIONES "]
[]
["Año",2020,null,null,null,null,null,null,null,null,null,null,null,null,null,null,null,null,null,null,null,null,null,null,null,null,null,null,null,null,null,null,null,null,null,null,null,null,null,null,null,null,null,null,null,null,null,null,null,null,"Año",2020]
["Afectación","Inversión",null,null,null,null,null,null,null,null,null,null,null,null,null,null,null,null,null,null,null,null,null,null,null,null,null,null,null,null,null,null,null,null,null,null,null,null,null,null,null,null,null,null,null,null,null,null,null,null,"Afectación","Inversión"]
[]
[null,null,null,"Valores",null,null,null,null,null,null,null,null,null,null,null,null,null,null,null,null,null,null,null,null,null,null,null,null,null,null,null,null,null,null,null,null,null,null,null,null,null,null,null,null,null,null,null,null,null,null,null,null,null,"Valores"]
["Tipo de contrato ","Propósito","Equivalencia número de programa","Suma de Valor Final ","Suma de Valor Final 2","Suma de Giros (Valor en pesos)","Suma de Giros (Valor en pesos)2","Suma de Número de adiciones","Suma de Número de adiciones2",null,null,null,null,null,null,null,null,null,null,null,null,null,null,null,null,null,null,null,null,null,null,null,null,null,null,null,null,null,null,null,null,null,null,null,null,null,null,null,null,null,"Modalidad de Selección","Propósito","Equivalencia número de programa","Suma de Valor Final ","Suma de Valor Final 2","Suma de Giros (Valor en pesos)","Suma de Giros (Valor en pesos)2","Suma de Número de adiciones","Suma de Número de adiciones2"]
["Interventoría","Propósito 1: Hacer un nuevo contrato social para incrementar la inclusión social, productiva y política","Creación y vida cotidiana: Apropiación ciudadana del arte, la cultura y el patrimonio, para la democracia cultural",141092678,0.13218063279361084,103458760,0.11039704280402238,1,0.5,null,null,null,null,null,null,null,null,null,null,null,null,null,null,null,null,null,null,null,null,null,null,null,null,null,null,null,null,null,null,null,null,null,null,null,null,null,null,null,null,null,"Concurso de méritos","Propósito 1: Hacer un nuevo contrato social para incrementar la inclusión social, productiva y política","Creación y vida cotidiana: Apropiación ciudadana del arte, la cultura y el patrimonio, para la democracia cultural",141092678,0.13218063279361084,103458760,0.11039704280402238,1,0.5]
["Obra pública","Propósito 1: Hacer un nuevo contrato social para incrementar la inclusión social, productiva y política","Creación y vida cotidiana: Apropiación ciudadana del arte, la cultura y el patrimonio, para la democracia cultural",926330552,0.86781936720638919,833692792,0.8896029571959776,1,0.5,null,null,null,null,null,null,null,null,null,null,null,null,null,null,null,null,null,null,null,null,null,null,null,null,null,null,null,null,null,null,null,null,null,null,null,null,null,null,null,null,null,"Licitación pública","Propósito 1: Hacer un nuevo contrato social para incrementar la inclusión social, productiva y política","Creación y vida cotidiana: Apropiación ciudadana del arte, la cultura y el patrimonio, para la democracia cultural",926330552,0.86781936720638919,833692792,0.8896029571959776,1,0.5]
["Total general",null,null,1067423230,1,937151552,1,2,1,null,null,null,null,null,null,null,null,null,null,null,null,null,null,null,null,null,null,null,null,null,null,null,null,null,null,null,null,null,null,null,null,null,null,null,null,null,null,null,null,null,"Total general",null,null,1067423230,1,937151552,1,2,1]

{"sheet":"FUNCIONAMIENTO","index":2,"n_rows":37,"n_cols":21,"rows_kept":37,"cut":false,"hidden":false,"merged":[[0,1,0,4],[0,14,0,18],[27,1,27,4],[28,14,28,18]]}
[null,"FUNCIONAMIENTO TIPO DE CONTRATO AÑO 2021 SE SUMO EL NUMERO DE CONTRATOS",null,null,null,null,null,null,null,null,null,null,null,null,"FUNCIONAMIENTO POR MODALIDAD DE CONTRATO 2021"]
[]
["Año",2021,null,null,null,null,null,null,null,null,null,null,null,null,"Año",2021]
["Afectación","Funcionamiento",null,null,null,null,null,null,null,null,null,null,null,null,"Afectación","Funcionamiento"]
[]
[null,null,"Valores",null,null,null,null,null,null,null,null,null,null,null,null,"Valores"]
["Tipo de contrato ","Propósito","Suma de Valor Final ","Suma de Valor Final 2","Suma de Giros (Valor en pesos)","Suma de Giros (Valor en pesos)2","Suma de Cuenta contratos","Suma de Cuenta contratos2",null,null,null,null,null,null,"Modalidad de Selección","Suma de Valor Final ","Suma de Valor Final 2","Suma de Giros (Valor en pesos)","Suma de Giros (Valor en pesos)2","Suma de Cuenta contratos","Suma de Cuenta contratos2"]
["Compraventa de bienes muebles"," ",23099350,1.9414971877696759E-2,0,0,2,0.125,null,null,null,null,null,null,"Contratación directa",0,0,0,0,3,0.1875]
[null,"(en blanco)",11134656,9.3586630406408602E-3,0,0,1,6.25E-2,null,null,null,null,null,null,"Contratación mínima cuantia",124874833,0.10495712524062707,92264431,0.10136995931307864,7,0.4375]
["Contratos de prestación de servicios"," ",1046565506.8099999,0.87963686782890438,816928138,0.8975503475523422,6,0.375,null,null,null,null,null,null,"Régimen especial",804459085,0.67614675356807297,652196703,0.71656165361529223,1,6.25E-2]
["Contratos interadministrativos"," ",0,0,0,0,3,0.1875,null,null,null,null,null,null,"Selección abreviada",260436025.81,0.21889612119130006,165714145,0.18206838707162909,5,0.3125]
["Seguros"," ",77514931,6.5151192802680793E-2,77514931,8.5164838892531597E-2,2,0.125,null,null,null,null,null,null,"Total general",1189769943.8099999,1,910175279,1,16,1]
["Suministro"," ",31455500,2.6438304450077183E-2,15732210,1.7284813555126233E-2,2,0.125]
["Total general",null,1189769943.8099999,1,910175279,1,16,1]
[]
[]
[]
[]
[]
[]
[]
[]
[]
[]
[]
[]
[]
[null,"FUNCIONAMIENTO TIPO DE CONTRATO AÑO ANTERIORES SE SUMO EL NUMERO DE ADICIONES"]
[null,null,null,null,null,null,null,null,null,null,null,null,null,null,"FUNCIONAMIENTO POR MODALIDAD DE CONTRATO AÑOS ANTERIORES SE SUMO EL NUMERO DE ADICIONES"]
["Año",2020]
["Afectación","Funcionamiento",null,null,null,null,null,null,null,null,null,null,null,null,"Año",2020]
[null,null,null,null,null,null,null,null,null,null,null,null,null,null,"Afectación","Funcionamiento"]
[null,null,"Valores"]
["Tipo de contrato ","Propósito","Suma de Valor Final ","Suma de Valor Final 2","Suma de Giros (Valor en pesos)","Suma de Giros (Valor en pesos)2","Suma de Número de adiciones","Suma de Número de adiciones2",null,null,null,null,null,null,null,"Valores"]
["Contratos de prestación de servicios","(en blanco)",99361322,1,99361322,1,1,1,null,null,null,null,null,null,"Modalidad de Selección","Suma de Valor Final ","Suma de Valor Final 2","Suma de Giros (Valor en pesos)","Suma de Giros (Valor en pesos)2","Suma de Número de adiciones","Suma de Número de adiciones2"]
["Total general",null,99361322,1,99361322,1,1,1,null,null,null,null,null,null,"Licitación pública",99361322,1,99361322,1,1,1]
[null,null,null,null,null,null,null,null,null,null,null,null,null,null,"Total general",99361322,1,99361322,1,1,1]

{"sheet":"CORRECCIONES A REALIZAR 1","index":3,"n_rows":94,"n_cols":11,"rows_kept":94,"cut":false,"hidden":false,"merged":[[104,6,104,10],[105,6,105,10],[106,6,106,10],[107,6,107,10],[108,6,108,10],[109,6,109,10],[98,6,98,10],[99,6,99,10],[100,6,100,10],[101,6,101,10],[102,6,102,10],[103,6,103,10],[92,6,92,10],[93,6,93,10],[94,6,94,10],[95,6,95,10],[96,6,96,10],[97,6,97,10],[86,6,86,10],[87,6,87,10],[88,6,88,10],[89,6,89,10],[90,6,90,10],[91,6,91,10],[80,6,80,10],[81,6,81,10],[82,6,82,10],[83,6,83,10],[84,6,84,10],[85,6,85,10],[75,7,75,8],[75,9,75,10],[77,7,77,8],[77,9,77,10],[79,7,79,8],[79,9,79,10],[69,7,69,8],[69,9,69,10],[71,7,71,8],[71,9,71,10],[73,7,73,8],[73,9,73,10],[63,7,63,8],[63,9,63,10],[65,7,65,8],[65,9,65,10],[67,7,67,8],[67,9,67,10],[57,7,57,8],[57,9,57,10],[59,7,59,8],[59,9,59,10],[61,7,61,8],[61,9,61,10],[51,7,51,8],[51,9,51,10],[53,7,53,8],[53,9,53,10],[55,7,55,8],[55,9,55,10],[45,7,45,8],[45,9,45,10],[47,7,47,8],[47,9,47,10],[49,7,49,8],[49,9,49,10],[39,7,39,8],[39,9,39,10],[41,7,41,8],[41,9,41,10],[43,7,43,8],[43,9,43,10],[33,7,33,8],[33,9,33,10],[35,7,35,8],[35,9,35,10],[37,7,37,8],[37,9,37,10],[27,7,27,8],[27,9,27,10],[29,7,29,8],[29,9,29,10],[31,7,31,8],[31,9,31,10],[21,7,21,8],[21,9,21,10],[23,7,23,8],[23,9,23,10],[25,7,25,8],[25,9,25,10],[15,7,15,8],[15,9,15,10],[17,7,17,8],[17,9,17,10],[19,7,19,8],[19,9,19,10],[9,7,9,8],[9,9,9,10],[11,7,11,8],[11,9,11,10],[13,7,13,8],[13,9,13,10],[0,6,0,10],[3,7,3,8],[3,9,3,10],[5,7,5,8],[5,9,5,10],[7,7,7,8],[7,9,7,10],[398,0,398,4],[399,0,399,4],[400,0,400,4],[401,0,401,4],[402,0,402,4],[403,0,403,4],[392,0,392,4],[393,0,393,4],[394,0,394,4],[395,0,395,4],[396,0,396,4],[397,0,397,4],[386,0,386,4],[387,0,387,4],[388,0,388,4],[389,0,389,4],[390,0,390,4],[391,0,391,4],[380,0,380,4],[381,0,381,4],[382,0,382,4],[383,0,383,4],[384,0,384,4],[385,0,385,4],[374,0,374,4],[375,0,375,4],[376,0,376,4],[377,0,377,4],[378,0,378,4],[379,0,379,4],[368,0,368,4],[369,0,369,4],[370,0,370,4],[371,0,371,4],[372,0,372,4],[373,0,373,4],[362,0,362,4],[363,0,363,4],[364,0,364,4],[365,0,365,4],[366,0,366,4],[367,0,367,4],[356,0,356,4],[357,0,357,4],[358,0,358,4],[359,0,359,4],[360,0,360,4],[361,0,361,4],[350,0,350,4],[351,0,351,4],[352,0,352,4],[353,0,353,4],[354,0,354,4],[355,0,355,4],[344,0,344,4],[345,0,345,4],[346,0,346,4],[347,0,347,4],[348,0,348,4],[349,0,349,4],[338,0,338,4],[339,0,339,4],[340,0,340,4],[341,0,341,4],[342,0,342,4],[343,0,343,4],[332,0,332,4],[333,0,333,4],[334,0,334,4],[335,0,335,4],[336,0,336,4],[337,0,337,4],[326,0,326,4],[327,0,327,4],[328,0,328,4],[329,0,329,4],[330,0,330,4],[331,0,331,4],[320,0,320,4],[321,0,321,4],[322,0,322,4],[323,0,323,4],[324,0,324,4],[325,0,325,4],[314,0,314,4],[315,0,315,4],[316,0,316,4],[317,0,317,4],[318,0,318,4],[319,0,319,4],[308,0,308,4],[309,0,309,4],[310,0,310,4],[311,0,311,4],[312,0,312,4],[313,0,313,4],[302,0,302,4],[303,0,303,4],[304,0,304,4],[305,0,305,4],[306,0,306,4],[307,0,307,4],[296,0,296,4],[297,0,297,4],[298,0,298,4],[299,0,299,4],[300,0,300,4],[301,0,301,4],[290,0,290,4],[291,0,291,4],[292,0,292,4],[293,0,293,4],[294,0,294,4],[295,0,295,4],[284,0,284,4],[285,0,285,4],[286,0,286,4],[287,0,287,4],[288,0,288,4],[289,0,289,4],[278,0,278,4],[279,0,279,4],[280,0,280,4],[281,0,281,4],[282,0,282,4],[283,0,283,4],[272,0,272,4],[273,0,273,4],[274,0,274,4],[275,0,275,4],[276,0,276,4],[277,0,277,4],[266,0,266,4],[267,0,267,4],[268,0,268,4],[269,0,269,4],[270,0,270,4],[271,0,271,4],[260,0,260,4],[261,0,261,4],[262,0,262,4],[263,0,263,4],[264,0,264,4],[265,0,265,4],[254,0,254,4],[255,0,255,4],[256,0,256,4],[257,0,257,4],[258,0,258,4],[259,0,259,4],[248,0,248,4],[249,0,249,4],[250,0,250,4],[251,0,251,4],[252,0,252,4],[253,0,253,4],[242,0,242,4],[243,0,243,4],[244,0,244,4],[245,0,245,4],[246,0,246,4],[247,0,247,4],[236,0,236,4],[237,0,237,4],[238,0,238,4],[239,0,239,4],[240,0,240,4],[241,0,241,4],[230,0,230,4],[231,0,231,4],[232,0,232,4],[233,0,233,4],[234,0,234,4],[235,0,235,4],[224,0,224,4],[225,0,225,4],[226,0,226,4],[227,0,227,4],[228,0,228,4],[229,0,229,4],[218,0,218,4],[219,0,219,4],[220,0,220,4],[221,0,221,4],[222,0,222,4],[223,0,223,4],[212,0,212,4],[213,0,213,4],[214,0,214,4],[215,0,215,4],[216,0,216,4],[217,0,217,4],[206,0,206,4],[207,0,207,4],[208,0,208,4],[209,0,209,4],[210,0,210,4],[211,0,211,4],[200,0,200,4],[201,0,201,4],[202,0,202,4],[203,0,203,4],[204,0,204,4],[205,0,205,4],[194,0,194,4],[195,0,195,4],[196,0,196,4],[197,0,197,4],[198,0,198,4],[199,0,199,4],[188,0,188,4],[189,0,189,4],[190,0,190,4],[191,0,191,4],[192,0,192,4],[193,0,193,4],[182,0,182,4],[183,0,183,4],[184,0,184,4],[185,0,185,4],[186,0,186,4],[187,0,187,4],[176,0,176,4],[177,0,177,4],[178,0,178,4],[179,0,179,4],[180,0,180,4],[181,0,181,4],[170,0,170,4],[171,0,171,4],[172,0,172,4],[173,0,173,4],[174,0,174,4],[175,0,175,4],[164,0,164,4],[165,0,165,4],[166,0,166,4],[167,0,167,4],[168,0,168,4],[169,0,169,4],[158,0,158,4],[159,0,159,4],[160,0,160,4],[161,0,161,4],[162,0,162,4],[163,0,163,4],[152,0,152,4],[153,0,153,4],[154,0,154,4],[155,0,155,4],[156,0,156,4],[157,0,157,4],[146,0,146,4],[147,0,147,4],[148,0,148,4],[149,0,149,4],[150,0,150,4],[151,0,151,4],[140,0,140,4],[141,0,141,4],[142,0,142,4],[143,0,143,4],[144,0,144,4],[145,0,145,4],[134,0,134,4],[135,0,135,4],[136,0,136,4],[137,0,137,4],[138,0,138,4],[139,0,139,4],[128,0,128,4],[129,0,129,4],[130,0,130,4],[131,0,131,4],[132,0,132,4],[133,0,133,4],[122,0,122,4],[123,0,123,4],[124,0,124,4],[125,0,125,4],[126,0,126,4],[127,0,127,4],[116,0,116,4],[117,0,117,4],[118,0,118,4],[119,0,119,4],[120,0,120,4],[121,0,121,4],[110,0,110,4],[111,0,111,4],[112,0,112,4],[113,0,113,4],[114,0,114,4],[115,0,115,4],[104,0,104,4],[105,0,105,4],[106,0,106,4],[107,0,107,4],[108,0,108,4],[109,0,109,4],[98,0,98,4],[99,0,99,4],[100,0,100,4],[101,0,101,4],[102,0,102,4],[103,0,103,4],[92,0,92,4],[93,0,93,4],[94,0,94,4],[95,0,95,4],[96,0,96,4],[97,0,97,4],[86,0,86,4],[87,0,87,4],[88,0,88,4],[89,0,89,4],[90,0,90,4],[91,0,91,4],[80,0,80,4],[81,0,81,4],[82,0,82,4],[83,0,83,4],[84,0,84,4],[85,0,85,4],[75,1,75,2],[75,3,75,4],[77,1,77,2],[77,3,77,4],[79,1,79,2],[79,3,79,4],[69,1,69,2],[69,3,69,4],[71,1,71,2],[71,3,71,4],[73,1,73,2],[73,3,73,4],[63,1,63,2],[63,3,63,4],[65,1,65,2],[65,3,65,4],[67,1,67,2],[67,3,67,4],[57,1,57,2],[57,3,57,4],[59,1,59,2],[59,3,59,4],[61,1,61,2],[61,3,61,4],[51,1,51,2],[51,3,51,4],[53,1,53,2],[53,3,53,4],[55,1,55,2],[55,3,55,4],[45,1,45,2],[45,3,45,4],[47,1,47,2],[47,3,47,4],[49,1,49,2],[49,3,49,4],[39,1,39,2],[39,3,39,4],[41,1,41,2],[41,3,41,4],[43,1,43,2],[43,3,43,4],[33,1,33,2],[33,3,33,4],[35,1,35,2],[35,3,35,4],[37,1,37,2],[37,3,37,4],[27,1,27,2],[27,3,27,4],[29,1,29,2],[29,3,29,4],[31,1,31,2],[31,3,31,4],[21,1,21,2],[21,3,21,4],[23,1,23,2],[23,3,23,4],[25,1,25,2],[25,3,25,4],[17,1,17,2],[17,3,17,4],[19,1,19,2],[19,3,19,4],[9,1,9,2],[9,3,9,4],[11,1,11,2],[11,3,11,4],[13,1,13,2],[13,3,13,4],[0,0,0,4],[3,1,3,2],[3,3,3,4],[5,1,5,2],[5,3,5,4],[7,1,7,2],[7,3,7,4],[15,1,15,2],[15,3,15,4]]}
["INFORME BOG DATA VS INFORME ENVIADO POR ALCALDIA LOCAL DE CANDELARIA",null,null,null,null,null,"INFORME BOG DATA VS INFORME ENVIADO POR ALCALDIA LOCAL DE CANDELARIA"]
["CÓDIGO 17","VALOR FINAL BOGDATA","VALOR FINAL INFORMADOS","ACUMULADO GIROS BOG DATA","GIROS INFORMADOS",null,"CÓDIGO 17","VALOR FINAL BOGDATA","VALOR FINAL INFORMADOS","ACUMULADO GIROS BOG DATA","GIROS INFORMADOS"]
["FUNCIONAMIENTO",2447975677,1947043263,2158747427,1816422328,null,"FUNCIONAMIENTO",2447975677,2447975677,2158747427,2158747427]
["DIFERENCIAS",{"$f":"C3-B3","v":-500932414},null,{"$f":"E3-D3","v":-342325099},null,null,"DIFERENCIAS",{"$f":"I3-H3","v":0},null,{"$f":"K3-J3","v":0}]
["INVERSION",10392042514,10392042514,7688593159,7688593159,null,"INVERSION",10392042514,10392042514,7688593159,7688593159]
["DIFERENCIAS",{"$f":"C5-B5","v":0},null,{"$f":"E5-D5","v":0},null,null,"DIFERENCIAS",{"$f":"I5-H5","v":0},null,{"$f":"K5-J5","v":0}]
["PROPÓSITO 01:Hacer un nuevo contrato social con igualdad de oportunidades para la inclusión social, productiva y política",7076252834,7076252834,5483664938,5483664938,null,"PROPÓSITO 01:Hacer un nuevo contrato social con igualdad de oportunidades para la inclusión social, productiva y política",7076252834,7076252834,5483664938,5483664938]
["DIFERENCIAS",{"$f":"C7-B7","v":0},null,{"$f":"E7-D7","v":0},null,null,"DIFERENCIAS",{"$f":"I7-H7","v":0},null,{"$f":"K7-J7","v":0}]
["PROGRAMA 01:Subsidios y transferencias para la equidad",2064773304,2064773304,2057935613,2057935613,null,"PROGRAMA 01:Subsidios y transferencias para la equidad",2064773304,2064773304,2057935613,2057935613]
["DIFERENCIAS",{"$f":"C9-B9","v":0},null,{"$f":"E9-D9","v":0},null,null,"DIFERENCIAS",{"$f":"I9-H9","v":0},null,{"$f":"K9-J9","v":0}]
[1605,2064773304,2064773304,2057935613,2057935613,null,1605,2064773304,2064773304,2057935613,2057935613]
["DIFERENCIAS",{"$f":"C11-B11","v":0},null,{"$f":"E11-D11","v":0},null,null,"DIFERENCIAS",{"$f":"I11-H11","v":0},null,{"$f":"K11-J11","v":0}]
["PROGRAMA 06:Sistema Distrital del Cuidado",1855403192,1855403192,1339632750,1339632750,null,"PROGRAMA 06:Sistema Distrital del Cuidado",1855403192,1855403192,1339632750,1339632750]
["DIFERENCIAS",{"$f":"C13-B13","v":0},null,{"$f":"E13-D13","v":0},null,null,"DIFERENCIAS",{"$f":"I13-H13","v":0},null,{"$f":"K13-J13","v":0}]
["1628.",1215986631,1215986631,1106824335,1106824335,null,"1628.",1215986631,1215986631,1106824335,1106824335]
["DIFERENCIAS",{"$f":"C15-B15","v":0},null,{"$f":"E15-D15","v":0},null,null,"DIFERENCIAS",{"$f":"I15-H15","v":0},null,{"$f":"K15-J15","v":0}]
["1662.",292066166,292066166,158576118,158576118,null,"1662.",292066166,292066166,158576118,158576118]
["DIFERENCIAS",{"$f":"C17-B17","v":0},null,{"$f":"E17-D17","v":0},null,null,"DIFERENCIAS",{"$f":"I17-H17","v":0},null,{"$f":"K17-J17","v":0}]
["1663.",220404859,220404859,74232297,74232297,null,"1663.",220404859,220404859,74232297,74232297]
["DIFERENCIAS",{"$f":"C19-B19","v":0},null,{"$f":"E19-D19","v":0},null,null,"DIFERENCIAS",{"$f":"I19-H19","v":0},null,{"$f":"K19-J19","v":0}]
["1664.",126945536,126945536,0,0,null,"1664.",126945536,126945536,0,0]
["DIFERENCIAS ",{"$f":"C21-B21","v":0},null,{"$f":"E21-D21","v":0},null,null,"DIFERENCIAS ",{"$f":"I21-H21","v":0},null,{"$f":"K21-J21","v":0}]
["PROGRAMA 12:Educación inicial: Bases sólidas para la vida",109435661,109435661,20448000,20448000,null,"PROGRAMA 12:Educación inicial: Bases sólidas para la vida",109435661,109435661,20448000,20448000]
["DIFERENCIAS",{"$f":"C23-B23","v":0},null,{"$f":"E23-D23","v":0},null,null,"DIFERENCIAS",{"$f":"I23-H23","v":0},null,{"$f":"K23-J23","v":0}]
["1608.",109435661,109435661,20448000,20448000,null,"1608.",109435661,109435661,20448000,20448000]
["DIFERENCIAS",{"$f":"C25-B25","v":0},null,{"$f":"E25-D25","v":0},null,null,"DIFERENCIAS",{"$f":"I25-H25","v":0},null,{"$f":"K25-J25","v":0}]
["PROGRAMA 14:Formación integral: más y mejor tiempo en los colegios",30672000,30672000,30672000,30672000,null,"PROGRAMA 14:Formación integral: más y mejor tiempo en los colegios",30672000,30672000,30672000,30672000]
["DIFERENCIAS",{"$f":"C27-B27","v":0},null,{"$f":"E27-D27","v":0},null,null,"DIFERENCIAS",{"$f":"I27-H27","v":0},null,{"$f":"K27-J27","v":0}]
["1606.",30672000,30672000,30672000,30672000,null,"1606.",30672000,30672000,30672000,30672000]
["DIFERENCIAS ",{"$f":"C29-B29","v":0},null,0,null,null,"DIFERENCIAS ",{"$f":"I29-H29","v":0},null,0]
["PROGRAMA 17:Jóvenes con capacidades: Proyecto de vida para la ciudadanía, la innovación y el trabajo del siglo XXI",860583000,860583000,860583000,860583000,null,"PROGRAMA 17:Jóvenes con capacidades: Proyecto de vida para la ciudadanía, la innovación y el trabajo del siglo XXI",860583000,860583000,860583000,860583000]
["DIFERENCIAS",{"$f":"C31-B31","v":0},null,{"$f":"E31-D31","v":0},null,null,"DIFERENCIAS",{"$f":"I31-H31","v":0},null,{"$f":"K31-J31","v":0}]
["1607.",860583000,860583000,860583000,860583000,null,"1607.",860583000,860583000,860583000,860583000]
["DIFERENCIAS ",{"$f":"C33-B33","v":0},null,{"$f":"E33-D33","v":0},null,null,"DIFERENCIAS ",{"$f":"I33-H33","v":0},null,{"$f":"K33-J33","v":0}]
["PROGRAMA 21:Creación y vida cotidiana: Apropiación ciudadana del arte, la cultura y el patrimonio, para la democracia cultural",1912844572,1912844572,1042491458,1042491458,null,"PROGRAMA 21:Creación y vida cotidiana: Apropiación ciudadana del arte, la cultura y el patrimonio, para la democracia cultural",1912844572,1912844572,1042491458,1042491458]
["DIFERENCIAS ",{"$f":"C35-B35","v":0},null,{"$f":"E35-D35","v":0},null,null,"DIFERENCIAS ",{"$f":"I35-H35","v":0},null,{"$f":"K35-J35","v":0}]
["1625.",1912844572,1912844572,1042491458,1042491458,null,"1625.",1912844572,1912844572,1042491458,1042491458]
["DIFERENCIAS ",{"$f":"C37-B37","v":0},null,{"$f":"E37-D37","v":0},null,null,"DIFERENCIAS ",{"$f":"I37-H37","v":0},null,{"$f":"K37-J37","v":0}]
["PROGRAMA 24:Bogotá región emprendedora e innovadora",242541105,242541105,131902117,131902117,null,"PROGRAMA 24:Bogotá región emprendedora e innovadora",242541105,242541105,131902117,131902117]
["DIFERENCIAS ",{"$f":"C39-B39","v":0},null,{"$f":"E39-D39","v":0},null,null,"DIFERENCIAS ",{"$f":"I39-H39","v":0},null,{"$f":"K39-J39","v":0}]
["1626.",242541105,242541105,131902117,131902117,null,"1626.",242541105,242541105,131902117,131902117]
["DIFERENCIAS ",{"$f":"C41-B41","v":0},null,{"$f":"E41-D41","v":0},null,null,"DIFERENCIAS ",{"$f":"I41-H41","v":0},null,{"$f":"K41-J41","v":0}]
["PROPÓSITO 2:Cambiar nuestros hábitos de vida para reverdecer a Bogotá y adaptarnos y mitigar la crisis climática",182972000,182972000,134005935,134005935,null,"PROPÓSITO 2:Cambiar nuestros hábitos de vida para reverdecer a Bogotá y adaptarnos y mitigar la crisis climática",182972000,182972000,134005935,134005935]
["DIFERENCIAS",{"$f":"C43-B43","v":0},null,{"$f":"E43-D43","v":0},null,null,"DIFERENCIAS",{"$f":"I43-H43","v":0},null,{"$f":"K43-J43","v":0}]
["PROGRAMA 34:Bogotá protectora de los animales",182972000,182972000,134005935,134005935,null,"PROGRAMA 34:Bogotá protectora de los animales",182972000,182972000,134005935,134005935]
["DIFERENCIAS ",{"$f":"C45-B45","v":0},null,{"$f":"E45-D45","v":0},null,null,"DIFERENCIAS ",{"$f":"I45-H45","v":0},null,{"$f":"K45-J45","v":0}]
["1704.",182972000,182972000,134005935,134005935,null,"1704.",182972000,182972000,134005935,134005935]
["DIFERENCIAS",{"$f":"C47-B47","v":0},null,{"$f":"E47-D47","v":0},null,null,"DIFERENCIAS",{"$f":"I47-H47","v":0},null,{"$f":"K47-J47","v":0}]
["PROPÓSITO 03:Inspirar confianza y legitimidad para vivir sin miedo y ser epicentro de cultura ciudadana, paz y reconciliación",839468092,839468092,329299841,329299841,null,"PROPÓSITO 03:Inspirar confianza y legitimidad para vivir sin miedo y ser epicentro de cultura ciudadana, paz y reconciliación",839468092,839468092,329299841,329299841]
["DIFERENCIAS ",{"$f":"C49-B49","v":0},null,{"$f":"E49-D49","v":0},null,null,"DIFERENCIAS ",{"$f":"I49-H49","v":0},null,{"$f":"K49-J49","v":0}]
["PR0GRAMA 40:Más mujeres viven una vida libre de violencias, se sienten seguras y acceden con confianza al sistema de justicia",199095620,199095620,47818400,47818400,null,"PR0GRAMA 40:Más mujeres viven una vida libre de violencias, se sienten seguras y acceden con confianza al sistema de justicia",199095620,199095620,47818400,47818400]
["DIFERENCIAS ",{"$f":"C51-B51","v":0},null,{"$f":"E51-D51","v":0},null,null,"DIFERENCIAS ",{"$f":"I51-H51","v":0},null,{"$f":"K51-J51","v":0}]
["1781.",199095620,199095620,47818400,47818400,null,"1781.",199095620,199095620,47818400,47818400]
["DIFERENCIAS ",{"$f":"C53-B53","v":0},null,0,null,null,"DIFERENCIAS ",{"$f":"I53-H53","v":0},null,{"$f":"K53-J53","v":0}]
["PROGRAMA 43:Cultura ciudadana para la confianza, la convivencia y la participación desde la vida cotidiana",195166766,195166766,182027430,182027430,null,"PROGRAMA 43:Cultura ciudadana para la confianza, la convivencia y la participación desde la vida cotidiana",195166766,195166766,182027430,182027430]
["DIFERENCIAS",{"$f":"C55-B55","v":0},null,{"$f":"E55-D55","v":0},null,null,"DIFERENCIAS",{"$f":"I55-H55","v":0},null,{"$f":"K55-J55","v":0}]
["1785.",195166766,195166766,182027430,182027430,null,"1785.",195166766,195166766,182027430,182027430]
["DIFERENCIAS ",{"$f":"C57-B57","v":0},null,{"$f":"E57-D57","v":0},null,null,"DIFERENCIAS ",{"$f":"I57-H57","v":0},null,{"$f":"K57-J57","v":0}]
["PORGRAMA 45:Espacio público más seguro y construido colectivamente",445205706,445205706,99454011,99454011,null,"PORGRAMA 45:Espacio público más seguro y construido colectivamente",445205706,445205706,99454011,99454011]
["DIFERENCIAS ",{"$f":"C59-B59","v":0},null,0,null,null,"DIFERENCIAS ",{"$f":"I59-H59","v":0},null,0]
["1786.",445205706,445205706,99454011,99454011,null,"1786.",445205706,445205706,99454011,99454011]
["DIFERENCIAS ",{"$f":"C61-B61","v":0},null,{"$f":"E61-D61","v":0},null,null,"DIFERENCIAS ",{"$f":"I61-H61","v":0},null,{"$f":"K61-J61","v":0}]
["PROPÓSITO 04:Hacer de Bogotá Región un modelo de movilidad multimodal, incluyente y sostenible",473297429,473297429,181375198,181375198,null,"PROPÓSITO 04:Hacer de Bogotá Región un modelo de movilidad multimodal, incluyente y sostenible",473297429,473297429,181375198,181375198]
["DIFERENCIAS ",{"$f":"C63-B63","v":0},null,{"$f":"E63-D63","v":0},null,null,"DIFERENCIAS ",{"$f":"I63-H63","v":0},null,{"$f":"K63-J63","v":0}]
["PORGRAMA 49:Movilidad segura, sostenible y accesible",473297429,473297429,181375198,181375198,null,"PORGRAMA 49:Movilidad segura, sostenible y accesible",473297429,473297429,181375198,181375198]
["DIFERENCIAS ",{"$f":"C65-B65","v":0},null,{"$f":"E65-D65","v":0},null,null,"DIFERENCIAS ",{"$f":"I65-H65","v":0},null,{"$f":"K65-J65","v":0}]
["2020.",473297429,473297429,181375198,181375198,null,"2020.",473297429,473297429,181375198,181375198]
["DIFERENCIAS ",{"$f":"C67-B67","v":0},null,0,null,null,"DIFERENCIAS ",{"$f":"I67-H67","v":0},null,0]
["PROPÓSITO 05:Construir Bogotá Región con gobierno abierto, transparente y ciudadanía consciente",1820052159,1820052159,1560247247,1560247247,null,"PROPÓSITO 05:Construir Bogotá Región con gobierno abierto, transparente y ciudadanía consciente",1820052159,1820052159,1560247247,1560247247]
["DIFERENCIAS ",{"$f":"C69-B69","v":0},null,{"$f":"E69-D69","v":0},null,null,"DIFERENCIAS ",{"$f":"I69-H69","v":0},null,{"$f":"K69-J69","v":0}]
["PROGRAMA 55:Fortalecimiento de Cultura Ciudadana y su institucionalidad",293771914,293771914,150927414,150927414,null,"PROGRAMA 55:Fortalecimiento de Cultura Ciudadana y su institucionalidad",293771914,293771914,150927414,150927414]
["DIFERENCIAS ",{"$f":"C71-B71","v":0},null,{"$f":"E71-D71","v":0},null,null,"DIFERENCIAS ",{"$f":"I71-H71","v":0},null,{"$f":"K71-J71","v":0}]
["2019.",293771914,293771914,150927414,150927414,null,"2019.",293771914,293771914,150927414,150927414]
["DIFERENCIAS ",{"$f":"C73-B73","v":0},null,{"$f":"E73-D73","v":0},null,null,"DIFERENCIAS ",{"$f":"I73-H73","v":0},null,{"$f":"K73-J73","v":0}]
["PORGRAMA 57:Gestión Pública Local",1526280245,1526280245,1409319833,1409319833,null,"PORGRAMA 57:Gestión Pública Local",1526280245,1526280245,1409319833,1409319833]
["DIFERENCIAS ",{"$f":"C75-B75","v":0},null,{"$f":"E75-D75","v":0},null,null,"DIFERENCIAS ",{"$f":"I75-H75","v":0},null,{"$f":"K75-J75","v":0}]
["2021.",1058680046,1058680046,977144733,977144733,null,"2021.",1058680046,1058680046,977144733,977144733]
["DIFERENCIAS ",{"$f":"C77-B77","v":0},null,{"$f":"E77-D77","v":0},null,null,"DIFERENCIAS ",{"$f":"I77-H77","v":0},null,{"$f":"K77-J77","v":0}]
["2023.",467600199,467600199,432175100,432175100,null,"2023.",467600199,467600199,432175100,432175100]
["DIFERENCIAS ",{"$f":"C79-B79","v":0},null,{"$f":"E79-D79","v":0},null,null,"DIFERENCIAS ",{"$f":"I79-H79","v":0},null,{"$f":"K79-J79","v":0}]
["OBSERVACIONES PRESUPUESTALES",null,null,null,null,null,"PRESUPUESTO CUADRADO"]
["1. 1.La sumatoria del valor final de los contratos del rubro de Funcionamiento de acuerdo con el presupuesto comprometido no coincide  con la informacion registrada en BOG DATA, presenta una diferencia de 500.932.414 pesos de igual manera tampoco coinciden los giros efectuados a los contratos con la informacion registrada, presenta un diferencia de 342.325.099 pesos",null,null,null,null,null,"PAA AJUSTADO"]
["OBSERVACIONES PAA",null,null,null,null,null,"OBSERVACIONES GENERALES "]
["1. Cuál es el valor del presupuesto contratado y del programado (del 1 de septiembre al 31 de diciembre del 2021), ya que al hacer la suma da un valor distinto al que se relaciona en la página PAA, por favor, ajustar el valor correcto, para proceder a la verificación de la hoja CONSOLIDADO, si hay ajustes contracrtuales por favor diligenciarla de nuevo con las correcciones realizadas  ",null,null,null,null,null,"1. Faltan relacionar las fechas del contrato 407, estás son las del inicio, registro y terminación de la vigencia 2021"]
["OBSERVACIONES GENERALES (TIPOLOGIAS, MODALIDADES, CONTRATISTAS, Y OTROS)"]
["1. El contrato 407, cuyo proceso contractual se indica como contrato 117 de 2020, en el objeto contractual se especifica como adición, sin embargo, está señalado con el año 2021, de igual manera, tampoco se relacionan las fechas de la adición las cuales deben ser del año 2021, por favor verificar, y corregir tanto el número de proceso contractual tal como se hicieron los demás contratos, y tambien indicar el link correspondiente al contrato "]
["2. Es indispensable recalcar que para las adiciones de años anteriores,(como en el caso del contrato 407, anteriormente mencionado) se deben relacionar tal como lo dice el instructuvo, es decir, sin indicar el valor inicial del contrato, solamente las columnas número de adiciones y valor de adiciones. "]
["3. El contrato 77 y 76  cuyos números de procesos contractuales son: FDLC-CMA-024-2020 y FDLC-LP-023-2020 respectivamente, son adiciones de vigencias anteriores? Por favor de serlo, ver el instructivo y el punto 3 de este documento"]
["4. Los contratos de números: FDLC-CIA-002-2021, FDLC-ACI-001-2021, FDLC-CIA-005-2021, FDLC-CIA-006-2021, FDLC-CIA-007-2021, FDLC-CIA-008-2021, por favor en la columna Número de contrato, relacionar el número con el que se identificó cada contrato, lo relacionado por la entidad, es el número de proceso contractual. "]
["5. Las ordenes de compra: 83779,  83973,  83971,  83974, 83970,  y 83972 no tienen relacionado el tipo de contrato, por favor verificar."]
["6. Para los contratos cedidos sólo se debe diligenciar la fila del cesionario, ya que para esto se encuentra las columnas AI, AJ,AK y AL, no se admite el que se diligencie en filas distintas tanto para el cedente como cesionario."]
["7. Todos los contratos deben tener número de proponentes incluyendo el contrato 407 contrato 117 de 2020."]
["8.Todos los nombres de los contratistas deben ser en Mayúsculas"]
["Asi las cosas, informamos que la información recibida no puede ser tenida en cuenta y por ello requerimos se corrija y verifique en su totalidad, de acuerdo con las instrucciones contenidas en la matriz. Pedimos muy comedidamente que la información sea remitida, a más tardar, este MIERCOLES 23 de FEBRERO de 2022, teniendo en cuenta la necesidad de procesarla."]

{"sheet":"1. INFORMACION ACUMULADA","index":4,"n_rows":479,"n_cols":43,"rows_kept":479,"cut":false,"hidden":false,"merged":[[11,9,11,13],[11,16,11,21],[8,1,8,4],[8,7,8,8],[8,11,9,16],[9,6,9,8],[9,34,9,35],[5,1,5,4],[5,9,5,11],[5,34,5,35],[6,1,6,4],[6,9,6,11],[6,34,6,35],[1,1,1,38],[3,1,3,38],[4,1,4,4],[4,9,4,11],[4,15,4,16],[4,23,4,38],[447,20,448,20],[5,36,5,42],[6,36,6,42],[7,36,7,42],[8,36,8,42],[9,36,9,42],[7,34,7,35],[10,38,10,41],[11,38,11,41],[10,1,10,21],[10,22,10,27],[10,28,10,33],[10,34,10,37],[11,3,11,4],[8,34,8,35],[9,1,9,4]]}
[]
[null,"VEEDURIA DISTRITAL - INFORMACIÓN GESTION CONTRACTUAL"]
[]
[null,"DEL 1 DE ENERO AL 31 DE DICIEMBRE DE 2021"]
[null,"1. Entidad",null,null,null,"Alcaldía Local de La Candelaria",null,null,"2. Sector","Gobierno"]
[null,"3. Presupuesto Disponible Inversión Directa PREDIS (BOGDATA)",null,null,null,10868205855,null,null,"5. Presupuesto Disponible Funcionamiento PREDIS (BOGDATA)",2191985852,null,null,null,null,null,null,null,null,null,null,null,null,null,null,null,null,null,null,null,null,null,null,null,null,"9. Nombre de quien diligencia el formato",null,"Lilibeth Astrid Barrios-Paula Villota- Katherin Moreno Castañeda"]
[null,"4. Presupuesto Comprometido de Inversión Directa según PREDIS (BOGDATA)",null,null,null,10392042514,null,null,"6. Presupuesto Comprometido Funcionamiento según PREDIS (BOGDATA)",2115672185,null,null,null,null,null,null,null,null,null,null,null,null,null,null,null,null,null,null,null,null,null,null,null,null,"Cargo",null,"Profesional de Presupuesto-Auxiliar Contratación-Contratista Profesional Especializada Planeación"]
[null,null,null,null,null,null,null,null,null,null,null,null,null,null,null,null,null,null,null,null,null,null,null,null,null,null,null,null,null,null,null,null,null,null,"Dependencia",null,"Área de Gestión del Desarrollo Local"]
[null,"7. Presupuesto Disponible Operación (Régimen Privado)",null,null,null,null,null,null,null,null,null,null,null,null,null,null,null,null,null,null,null,null,null,null,null,null,null,null,null,null,null,null,null,null,"Teléfono",null,"3208951334-3143208836-3043754932"]
[null,"8. Presupuesto Comprometido Operación mediante contratos",null,null,null,null,null,null,null,null,null,null,null,null,null,null,null,null,null,null,null,null,null,null,null,null,null,null,null,null,null,null,null,null,"Correo Electrónico",null,"lilibeth.barrios@gobiernobogota.gov.co- paula.villota@gobiernobogota.gov.co-katherin.moreno@gobiernobogota.gov.co"]
[null,"1- INFORMACION GENERAL",null,null,null,null,null,null,null,null,null,null,null,null,null,null,null,null,null,null,null,null,"2- INFORMACION FINANCIERA",null,null,null,null,null,"3 - PLAZOS ",null,null,null,null,null,"4. CESION",null,null,null,"5. ESTADO",null,null,null,"6. %  Avance y/o cumplimiento"]
[null,null,2,3,null,4,5,6,7,8,null,null,null,null,9,10,11,null,null,null,null,null,12,13,14,15,null,null,18,19,20,21,22,23,24,25,26,27,28,null,null,null,29]
["Cuenta contratos","Número Contrato","Año","Número de proceso contractual \nSECOP","Link proceso SECOP","Tipo de contrato ","Modalidad de Selección","Procedimiento o causal","Objeto","Afectación","Plan de Desarrollo Distrital","Número Programa","Equivalencia número de programa","Propósito","Número Proyecto","Número de proponentes","Número  de Identificación del contratista\n(Cédula o NIT sin puntos, comas ni caracteres especiales y sin digito de verificación)","Nombre del contratista\n  (según el caso: nombres y apellidos o Razón social y Tipo societario)","Naturaleza Jurídica","Número  de Identificación del integrante del Consorcio o U.T.\n(Cédula o NIT sin puntos, comas ni caracteres especiales y sin digito de verificación)","Nombre del Integrante del Consorcio o U.T. y Tipo societario\n (Según el caso: nombres y apellidos o razón social y tipo societario)","% Participación (indicar solo el numero del porcentaje, sin caracteres especiales)","Valor Inicial del contrato","Valor total reducciones \n(En valor negativo)","Número de adiciones","Valor total de adiciones ","Valor Final ","Giros (Valor en pesos)","Fecha de suscripción (DD/MM/AAAA)","Fecha de inicio (DD/MM/AAAA)","Fecha de terminación (DD/MM/AAAA)","Plazo en días","Número de prórrogas","Prorroga en días","Número  de Identificación del cesionario\n(NIT sin digito de verificación)","Nombre cesionario","Fecha cesión\n(DD/MM/AAAA)","Valor cesión","Celebrado o por iniciar","En Ejecución","Terminado","Liquidado","% Avance y/o Cumplimiento"]
[1,1,2021,"FDLC-CPS-001-2021","https://community.secop.gov.co/Public/Tendering/OpportunityDetail/Index?noticeUID=CO1.NTC.1700943&isFromPublicArea=True&isModal=False","Contratos de prestación de servicios profesionales y de apoyo a la gestión","Contratación directa","Prestación de servicios profesionales y de apoyo a la gestión, o para la ejecución de trabajos artísticos que sólo puedan encomendarse a determinadas personas naturales;","PRESTAR SERVICIOS PROFESIONALES AL FONDO DE DESARROLLO LOCAL DE LA CANDELARIA EN LOS TRÁMITES RELACIONADOS CON LOS PROCESOS PRECONTRACTUALES, CONTRACTUALES Y POS CONTRACTUALES QUE SE ADELANTEN A TRAVÉS DE SECOP I Y II, ASÍ COMO LA ADQUISICIÓN DE BIENES Y SERVICIOS A TRAVÉS DE LA TIENDA VIRTUAL DEL ESTADO COLOMBIANO","Inversión","Un Nuevo Contrato Social y Ambiental para la Bogotá del Siglo XXI",57,{"$f":"IF(ISERROR(VLOOKUP(L14,Proposito_programa!$C$2:$E$59,2,FALSE)),\" \",VLOOKUP(L14,Proposito_programa!$C$2:$E$59,2,FALSE))","v":"Gestión pública local"},{"$f":"IF(ISERROR(VLOOKUP(L14,Proposito_programa!$C$2:$E$59,3,FALSE)),\" \",VLOOKUP(L14,Proposito_programa!$C$2:$E$59,3,FALSE))","v":"Propósito 5: Construir Bogotá - Región con gobierno abierto, transparente y ciudadanía consciente"},2021,1,1032363826,"PAOLA ANDREA PADILLA AYARZA","Persona Natural",null,null,null,44100000,-34020000,null,null,{"$f":"+W14+X14+Z14","v":10080000},10080000,44223,44223,44542,315,null,null,null,null,null,null,null,null,"X",null,{"$f":"IF(ISERROR(AB14/AA14),\"-\",(AB14/AA14))","v":1}]
[1,2,2021,"FDLC-CPS-002-2021","https://community.secop.gov.co/Public/Tendering/OpportunityDetail/Index?noticeUID=CO1.NTC.1700973&isFromPublicArea=True&isModal=False","Contratos de prestación de servicios profesionales y de apoyo a la gestión","Contratación directa","Prestación de servicios profesionales y de apoyo a la gestión, o para la ejecución de trabajos artísticos que sólo puedan encomendarse a determinadas personas naturales;","PRESTAR SERVICIOS PROFESIONALES AL FONDO DE DESARROLLO LOCAL DE LA CANDELARIA EN LOS TRÁMITES RELACIONADOS CON LOS PROCESOS PRECONTRACTUALES, CONTRACTUALES Y POS CONTRACTUALES QUE SE ADELANTEN A TRAVÉS DE SECOP I Y II, ASÍ COMO LA ADQUISICIÓN DE BIENES Y SERVICIOS A TRAVÉS DE LA TIENDA VIRTUAL DEL ESTADO COLOMBIANO","Inversión","Un Nuevo Contrato Social y Ambiental para la Bogotá del Siglo XXI",57,{"$f":"IF(ISERROR(VLOOKUP(L15,Proposito_programa!$C$2:$E$59,2,FALSE)),\" \",VLOOKUP(L15,Proposito_programa!$C$2:$E$59,2,FALSE))","v":"Gestión pública local"},{"$f":"IF(ISERROR(VLOOKUP(L15,Proposito_programa!$C$2:$E$59,3,FALSE)),\" \",VLOOKUP(L15,Proposito_programa!$C$2:$E$59,3,FALSE))","v":"Propósito 5: Construir Bogotá - Región con gobierno abierto, transparente y ciudadanía consciente"},2021,1,1015397944,"LAURA MARIA HERNANDEZ RESTREPO","Persona Natural",null,null,null,44100000,-14140000,null,null,29960000,29960000,44223,44223,44541,315,null,null,null,null,null,null,null,null,"X",null,1]
[1,3,2021,"FDLC-CPS-003-2021","https://community.secop.gov.co/Public/Tendering/OpportunityDetail/Index?noticeUID=CO1.NTC.1712345&isFromPublicArea=True&isModal=False","Contratos de prestación de servicios profesionales y de apoyo a la gestión","Contratación directa","Prestación de servicios profesionales y de apoyo a la gestión, o para la ejecución de trabajos artísticos que sólo puedan encomendarse a determinadas personas naturales;","PRESTAR SERVICIOS PROFESIONALES AL FONDO DE DESARROLLO LOCAL DE LA CANDELARIA COMO ADMINISTRADOR DE RED LOCAL, COMO ENLACE CON LA SECRETARIA DISTRITAL DE GOBIERNO Y BRINDANDO SOPORTE EN MATERIA DE SISTEMAS (SOFTWARE Y HARDWARE) A LOS USUARIOS INTERNOS Y EXTERNOS DE LAS DIFERENTES ÁREAS DE LA ENTIDAD","Inversión","Un Nuevo Contrato Social y Ambiental para la Bogotá del Siglo XXI",57,{"$f":"IF(ISERROR(VLOOKUP(L16,Proposito_programa!$C$2:$E$59,2,FALSE)),\" \",VLOOKUP(L16,Proposito_programa!$C$2:$E$59,2,FALSE))","v":"Gestión pública local"},{"$f":"IF(ISERROR(VLOOKUP(L16,Proposito_programa!$C$2:$E$59,3,FALSE)),\" \",VLOOKUP(L16,Proposito_programa!$C$2:$E$59,3,FALSE))","v":"Propósito 5: Construir Bogotá - Región con gobierno abierto, transparente y ciudadanía consciente"},2021,1,79814029,"AGUSTIN LARA BELTRAN","Persona Natural",null,null,null,41880000,null,1,4467200,{"$f":"+W16+X16+Z16","v":46347200},42159200,44225,44225,44560,300,1,32,null,null,null,null,null,null,"X",null,0.90963855421686746]
[1,4,2021,"FDLC-CPS-004-2021","https://community.secop.gov.co/Public/Tendering/OpportunityDetail/Index?noticeUID=CO1.NTC.1713931&isFromPublicArea=True&isModal=False","Contratos de prestación de servicios profesionales y de apoyo a la gestión","Contratación directa","Prestación de servicios profesionales y de apoyo a la gestión, o para la ejecución de trabajos artísticos que sólo puedan encomendarse a determinadas personas naturales;","PRESTAR SERVICIOS PROFESIONALES PARA EL SEGUIMIENTO JURÍDICO DE LOS PROYECTOS DE INFRAESTRUCTURA, ASÍ COMO LOS DEMÁS ASUNTOS CONTRACTUALES QUE SE REQUIERAN","Inversión","Un Nuevo Contrato Social y Ambiental para la Bogotá del Siglo XXI",49,{"$f":"IF(ISERROR(VLOOKUP(L17,Proposito_programa!$C$2:$E$59,2,FALSE)),\" \",VLOOKUP(L17,Proposito_programa!$C$2:$E$59,2,FALSE))","v":"Movilidad segura, sostenible y accesible"},{"$f":"IF(ISERROR(VLOOKUP(L17,Proposito_programa!$C$2:$E$59,3,FALSE)),\" \",VLOOKUP(L17,Proposito_programa!$C$2:$E$59,3,FALSE))","v":"Propósito 4: Hacer de Bogotá Región un modelo de movilidad multimodal, incluyente y sostenible"},2020,1,1016016829,"JUAN DAVID CARDENAS CABEZA","Persona Natural",null,null,null,68200000,-42986667,null,null,{"$f":"+W17+X17+Z17","v":25213333},19013333,44225,44225,44558,330,null,null,null,null,null,null,null,null,"X",null,0.75409835740479059]
[1,5,2021,"FDLC-CPS-005-2021","https://community.secop.gov.co/Public/Tendering/OpportunityDetail/Index?noticeUID=CO1.NTC.1714143&isFromPublicArea=True&isModal=False","Contratos de prestación de servicios profesionales y de apoyo a la gestión","Contratación directa","Prestación de servicios profesionales y de apoyo a la gestión, o para la ejecución de trabajos artísticos que sólo puedan encomendarse a determinadas personas naturales;","PRESTAR SERVICIOS PROFESIONALES AL FONDO DE DESARROLLO LOCAL DE LA CANDELARIA PARA APOYAR EN LA IMPLEMENTACIÓN, CARGA, MANEJO, VALIDACIÓN Y ACTUALIZACIÓN DE LA INFORMACIÓN REQUERIDA EN EL APLICATIVO SIPSE LOCAL","Inversión","Un Nuevo Contrato Social y Ambiental para la Bogotá del Siglo XXI",57,{"$f":"IF(ISERROR(VLOOKUP(L18,Proposito_programa!$C$2:$E$59,2,FALSE)),\" \",VLOOKUP(L18,Proposito_programa!$C$2:$E$59,2,FALSE))","v":"Gestión pública local"},{"$f":"IF(ISERROR(VLOOKUP(L18,Proposito_programa!$C$2:$E$59,3,FALSE)),\" \",VLOOKUP(L18,Proposito_programa!$C$2:$E$59,3,FALSE))","v":"Propósito 5: Construir Bogotá - Región con gobierno abierto, transparente y ciudadanía consciente"},2021,1,1010198763,"CARLOS MAURICIO PALOMAR COVALEDA","Persona Natural",null,null,null,40710000,null,null,null,40710000,40710000,44225,44225,44528,300,null,null,null,null,null,null,null,null,"X",null,1]
[1,6,2021,"FDLC-CPS-006-2021","https://community.secop.gov.co/Public/Tendering/OpportunityDetail/Index?noticeUID=CO1.NTC.1720756&isFromPublicArea=True&isModal=False","Contratos de prestación de servicios profesionales y de apoyo a la gestión","Contratación directa","Prestación de servicios profesionales y de apoyo a la gestión, o para la ejecución de trabajos artísticos que sólo puedan encomendarse a determinadas personas naturales;","PRESTAR SERVICIOS TÉCNICOS ADMINISTRATIVOS EN LAS DISTINTAS ETAPAS DE LOS PROCESOS CONTRACTUALES DE COMPETENCIA DE LA ALCALDIA LOCAL DE LA CANDELARIA.”","Inversión","Un Nuevo Contrato Social y Ambiental para la Bogotá del Siglo XXI",57,{"$f":"IF(ISERROR(VLOOKUP(L19,Proposito_programa!$C$2:$E$59,2,FALSE)),\" \",VLOOKUP(L19,Proposito_programa!$C$2:$E$59,2,FALSE))","v":"Gestión pública local"},{"$f":"IF(ISERROR(VLOOKUP(L19,Proposito_programa!$C$2:$E$59,3,FALSE)),\" \",VLOOKUP(L19,Proposito_programa!$C$2:$E$59,3,FALSE))","v":"Propósito 5: Construir Bogotá - Región con gobierno abierto, transparente y ciudadanía consciente"},2021,1,52305372,"ELCY JEANETH PULIDO AMORTEGUI","Persona Natural",null,null,null,32067000,-12521400,null,null,19545600,19545600,44228,44228,44545,315,null,null,null,null,null,null,null,null,"X",null,1]
[1,7,2021,"FDLC-CPS-007-2021","https://community.secop.gov.co/Public/Tendering/OpportunityDetail/Index?noticeUID=CO1.NTC.1722655&isFromPublicArea=True&isModal=False","Contratos de prestación de servicios profesionales y de apoyo a la gestión","Contratación directa","Prestación de servicios profesionales y de apoyo a la gestión, o para la ejecución de trabajos artísticos que sólo puedan encomendarse a determinadas personas naturales;","PRESTAR SERVICIOS PROFESIONALES PARA REALIZAR LA COORDINACION TÉCNICA DEL SEGUIMIENTO DE PLANES, POLÍTICAS, PROGRAMAS Y PROYECTOS DE INFRAESTRUCTURA Y OBRAS CIVILES QUE DESARROLLE LA ALCALDÍA LOCAL DE LA CANDELARIA","Inversión","Un Nuevo Contrato Social y Ambiental para la Bogotá del Siglo XXI",49,{"$f":"IF(ISERROR(VLOOKUP(L20,Proposito_programa!$C$2:$E$59,2,FALSE)),\" \",VLOOKUP(L20,Proposito_programa!$C$2:$E$59,2,FALSE))","v":"Movilidad segura, sostenible y accesible"},{"$f":"IF(ISERROR(VLOOKUP(L20,Proposito_programa!$C$2:$E$59,3,FALSE)),\" \",VLOOKUP(L20,Proposito_programa!$C$2:$E$59,3,FALSE))","v":"Propósito 4: Hacer de Bogotá Región un modelo de movilidad multimodal, incluyente y sostenible"},2020,1,80166444,"YERNEY ROLANDO RODRIGUEZ AVILA","Persona Natural",null,null,null,65142000,null,1,3948000,69090000,59220000,44228,44228,44581,330,null,20,null,null,null,null,null,null,"X",null,0.8571428571428571]
[1,8,2021,"FDLC-CPS-008-2021","https://community.secop.gov.co/Public/Tendering/OpportunityDetail/Index?noticeUID=CO1.NTC.1722174&isFromPublicArea=True&isModal=False","Contratos de prestación de servicios profesionales y de apoyo a la gestión","Contratación directa","Prestación de servicios profesionales y de apoyo a la gestión, o para la ejecución de trabajos artísticos que sólo puedan encomendarse a determinadas personas naturales;","PRESTAR SERVICIOS PROFESIONALES AL FONDO DE DESARROLLO LOCAL DE LA CANDELARIA COMO ABOGADO DE APOYO AL DESPACHO ALCALDESA LOCAL, EN LAS DIFERENTES ACTIVIDADES Y FUNCIONES QUE LE COMPETEN A ESTA DEPENDENCIA","Inversión","Un Nuevo Contrato Social y Ambiental para la Bogotá del Siglo XXI",57,{"$f":"IF(ISERROR(VLOOKUP(L21,Proposito_programa!$C$2:$E$59,2,FALSE)),\" \",VLOOKUP(L21,Proposito_programa!$C$2:$E$59,2,FALSE))","v":"Gestión pública local"},{"$f":"IF(ISERROR(VLOOKUP(L21,Proposito_programa!$C$2:$E$59,3,FALSE)),\" \",VLOOKUP(L21,Proposito_programa!$C$2:$E$59,3,FALSE))","v":"Propósito 5: Construir Bogotá - Región con gobierno abierto, transparente y ciudadanía consciente"},2021,1,52314352,"CONSTANZA DEL PILAR LEYTON RICO","Persona Natural",null,null,null,43050000,-15498000,null,null,{"$f":"+W21+X21+Z21","v":27552000},27552000,44228,44228,44530,300,null,null,null,null,null,null,null,null,"X",null,1]
[1,9,2021,"FDL-009-2021","https://community.secop.gov.co/Public/Tendering/OpportunityDetail/Index?noticeUID=CO1.NTC.1722408&isFromPublicArea=True&isModal=False","Contratos de prestación de servicios profesionales y de apoyo a la gestión","Contratación directa","Prestación de servicios profesionales y de apoyo a la gestión, o para la ejecución de trabajos artísticos que sólo puedan encomendarse a determinadas personas naturales;","PRESTAR SERVICIOS PROFESIONALES AL FONDO DE DESARROLLO LOCAL DE LA CANDELARIA PARA APOYAR Y FORTALECER LAS GESTIONES RELACIONADAS CON LA OFICINA DE CONTABILIDAD DE LA ENTIDAD.","Inversión","Un Nuevo Contrato Social y Ambiental para la Bogotá del Siglo XXI",57,{"$f":"IF(ISERROR(VLOOKUP(L22,Proposito_programa!$C$2:$E$59,2,FALSE)),\" \",VLOOKUP(L22,Proposito_programa!$C$2:$E$59,2,FALSE))","v":"Gestión pública local"},{"$f":"IF(ISERROR(VLOOKUP(L22,Proposito_programa!$C$2:$E$59,3,FALSE)),\" \",VLOOKUP(L22,Proposito_programa!$C$2:$E$59,3,FALSE))","v":"Propósito 5: Construir Bogotá - Región con gobierno abierto, transparente y ciudadanía consciente"},2021,1,52520044,"PAOLA ANDREA OYUELA VARGAS","Persona Natural",null,null,null,41880000,null,1,4188000,46068000,41880000,44228,44228,44560,300,null,30,null,null,null,null,null,null,"X",null,0.90909090909090906]
[1,10,2021,"FDLC-CPS-010-2021","https://community.secop.gov.co/Public/Tendering/OpportunityDetail/Index?noticeUID=CO1.NTC.1722666&isFromPublicArea=True&isModal=False","Contratos de prestación de servicios profesionales y de apoyo a la gestión","Contratación directa","Prestación de servicios profesionales y de apoyo a la gestión, o para la ejecución de trabajos artísticos que sólo puedan encomendarse a determinadas personas naturales;","PRESTAR SERVICIOS DE APOYO ADMINISTRATIVO Y ASISTENCIAL AL FONDO DE DESARROLLO LOCAL DE LA CANDELARIA, EN EL CENTRO DE INFORMACIÓN Y DOCUMENTACIÓN (CDI), PARA LA NOTIFICACIÓN DE CORRESPONDENCIA DE LA ENTIDAD.","Inversión","Un Nuevo Contrato Social y Ambiental para la Bogotá del Siglo XXI",57,{"$f":"IF(ISERROR(VLOOKUP(L23,Proposito_programa!$C$2:$E$59,2,FALSE)),\" \",VLOOKUP(L23,Proposito_programa!$C$2:$E$59,2,FALSE))","v":"Gestión pública local"},{"$f":"IF(ISERROR(VLOOKUP(L23,Proposito_programa!$C$2:$E$59,3,FALSE)),\" \",VLOOKUP(L23,Proposito_programa!$C$2:$E$59,3,FALSE))","v":"Propósito 5: Construir Bogotá - Región con gobierno abierto, transparente y ciudadanía consciente"},2021,1,1121855155,"HERNAN EDUARDO RODRIGUEZ BEDOYA","Persona Natural",null,null,null,18868500,null,null,null,18868500,18868500,44228,44228,44545,315,null,null,null,null,null,null,null,null,"X",null,1]
[1,11,2021,"FDLC-CPS-011-2021-SEN","https://community.secop.gov.co/Public/Tendering/OpportunityDetail/Index?noticeUID=CO1.NTC.1726322&isFromPublicArea=True&isModal=False\n","Contratos de prestación de servicios profesionales y de apoyo a la gestión","Contratación directa","Prestación de servicios profesionales y de apoyo a la gestión, o para la ejecución de trabajos artísticos que sólo puedan encomendarse a determinadas personas naturales;","PRESTAR SERVICIOS PROFESIONALES COMO ABOGADO DE APOYO A LA IDENTIFICACIÓN, ANÁLISIS, REPARTO Y SEGUIMIENTO DE EXPEDIENTES PROCESALES EN EL ÁREA DE GESTIÓN POLICIVA DE LA ALCALDÍA LOCAL DE LA CANDELARIA","Inversión","Un Nuevo Contrato Social y Ambiental para la Bogotá del Siglo XXI",57,{"$f":"IF(ISERROR(VLOOKUP(L24,Proposito_programa!$C$2:$E$59,2,FALSE)),\" \",VLOOKUP(L24,Proposito_programa!$C$2:$E$59,2,FALSE))","v":"Gestión pública local"},{"$f":"IF(ISERROR(VLOOKUP(L24,Proposito_programa!$C$2:$E$59,3,FALSE)),\" \",VLOOKUP(L24,Proposito_programa!$C$2:$E$59,3,FALSE))","v":"Propósito 5: Construir Bogotá - Región con gobierno abierto, transparente y ciudadanía consciente"},2023,1,1022973767,"CAROLINA ROJAS CARVAJAL","Persona Natural",null,null,null,25128000,null,null,null,25128000,25128000,44229,44229,44409,180,null,null,null,null,null,null,null,null,"X",null,1]
[1,12,2021,"FDLC-CPS-012-2021","https://community.secop.gov.co/Public/Tendering/OpportunityDetail/Index?noticeUID=CO1.NTC.1723117&isFromPublicArea=True&isModal=False","Contratos de prestación de servicios profesionales y de apoyo a la gestión","Contratación directa","Prestación de servicios profesionales y de apoyo a la gestión, o para la ejecución de trabajos artísticos que sólo puedan encomendarse a determinadas personas naturales;","PRESTAR SERVICIOS DE APOYO AL FONDO DE DESARROLLO LOCAL DE LA CANDELARIA COMO CONDUCTOR(A) DE LOS VEHICULOS A CARGO DE LA ENTIDAD","Inversión","Un Nuevo Contrato Social y Ambiental para la Bogotá del Siglo XXI",57,{"$f":"IF(ISERROR(VLOOKUP(L25,Proposito_programa!$C$2:$E$59,2,FALSE)),\" \",VLOOKUP(L25,Proposito_programa!$C$2:$E$59,2,FALSE))","v":"Gestión pública local"},{"$f":"IF(ISERROR(VLOOKUP(L25,Proposito_programa!$C$2:$E$59,3,FALSE)),\" \",VLOOKUP(L25,Proposito_programa!$C$2:$E$59,3,FALSE))","v":"Propósito 5: Construir Bogotá - Región con gobierno abierto, transparente y ciudadanía consciente"},2021,1,93086512,"BLADIMIR OVIEDO RUIZ","Persona Natural",null,null,null,18868500,null,1,1557400,20425900,17970000,44228,44228,44571,315,1,26,null,null,null,null,null,null,"X",null,0.87976539589442815]
[1,13,2021,"FDLC-CPS-013-2021","https://community.secop.gov.co/Public/Tendering/OpportunityDetail/Index?noticeUID=CO1.NTC.1729115&isFromPublicArea=True&isModal=False","Contratos de prestación de servicios profesionales y de apoyo a la gestión","Contratación directa","Prestación de servicios profesionales y de apoyo a la gestión, o para la ejecución de trabajos artísticos que sólo puedan encomendarse a determinadas personas naturales;","PRESTAR SERVICIOS PROFESIONALES AL FONDO DE DESARROLLO LOCAL DE LA CANDELARIA PARA APOYAR LA ARTICULACIÓN ENTRE EL DESPACHO DE LA ALCALDESA LOCAL Y LAS OFICINAS DE CONTRATACIÓN Y PLANEACIÓN EN LOS ASUNTOS PRIORITARIOS Y ESTRATÉGICOS PARA LA GESTIÓN CONTRACTUAL","Inversión","Un Nuevo Contrato Social y Ambiental para la Bogotá del Siglo XXI",57,{"$f":"IF(ISERROR(VLOOKUP(L26,Proposito_programa!$C$2:$E$59,2,FALSE)),\" \",VLOOKUP(L26,Proposito_programa!$C$2:$E$59,2,FALSE))","v":"Gestión pública local"},{"$f":"IF(ISERROR(VLOOKUP(L26,Proposito_programa!$C$2:$E$59,3,FALSE)),\" \",VLOOKUP(L26,Proposito_programa!$C$2:$E$59,3,FALSE))","v":"Propósito 5: Construir Bogotá - Región con gobierno abierto, transparente y ciudadanía consciente"},2021,1,1032470720,"YAISIR MARIA VIDAL SANCHEZ","Persona Natural",null,null,null,62181000,-53495400,null,null,{"$f":"+W26+X26+Z26","v":8685600},8685600,44230,44230,44547,315,null,null,null,null,null,null,null,null,"X",null,1]
[1,14,2021,"FDLC-CPS-014-2021","https://community.secop.gov.co/Public/Tendering/OpportunityDetail/Index?noticeUID=CO1.NTC.1729718&isFromPublicArea=True&isModal=False","Contratos de prestación de servicios profesionales y de apoyo a la gestión","Contratación directa","Prestación de servicios profesionales y de apoyo a la gestión, o para la ejecución de trabajos artísticos que sólo puedan encomendarse a determinadas personas naturales;","PRESTAR SERVICIOS PROFESIONALES PARA APOYAR TÉCNICAMENTE LAS DISTINTAS ETAPAS DE LOS PROCESOS DE COMPETENCIA DE LA ALCALDÍA LOCAL PARA LA DEPURACIÓN DE ACTUACIONES ADMINITRATIVAS","Inversión","Un Nuevo Contrato Social y Ambiental para la Bogotá del Siglo XXI",57,{"$f":"IF(ISERROR(VLOOKUP(L27,Proposito_programa!$C$2:$E$59,2,FALSE)),\" \",VLOOKUP(L27,Proposito_programa!$C$2:$E$59,2,FALSE))","v":"Gestión pública local"},{"$f":"IF(ISERROR(VLOOKUP(L27,Proposito_programa!$C$2:$E$59,3,FALSE)),\" \",VLOOKUP(L27,Proposito_programa!$C$2:$E$59,3,FALSE))","v":"Propósito 5: Construir Bogotá - Región con gobierno abierto, transparente y ciudadanía consciente"},2023,1,79507928,"FRANCISCO JAVIER HIGUERA NOVA","Persona Natural",null,null,null,25128000,null,null,null,25128000,25128000,44230,44230,44410,180,null,null,null,null,null,null,null,null,"X",null,1]
[1,15,2021,"FDLC-CPS-015-2021","https://community.secop.gov.co/Public/Tendering/OpportunityDetail/Index?noticeUID=CO1.NTC.1730110&isFromPublicArea=True&isModal=False","Contratos de prestación de servicios profesionales y de apoyo a la gestión","Contratación directa","Prestación de servicios profesionales y de apoyo a la gestión, o para la ejecución de trabajos artísticos que sólo puedan encomendarse a determinadas personas naturales;","“PRESTAR SERVICIOS DE APOYO A LA GESTIÓN DEL FONDO DE DESARROLLO LOCAL DE LA CANDELARIA, EN EL CENTRO DE INFORMACIÓN Y DOCUMENTACIÓN (CDI), PARA EL MANEJO Y PROCESO DE DISTRIBUCIÓN DE CORRESPONDENCIA EN GENERAL","Inversión","Un Nuevo Contrato Social y Ambiental para la Bogotá del Siglo XXI",57,{"$f":"IF(ISERROR(VLOOKUP(L28,Proposito_programa!$C$2:$E$59,2,FALSE)),\" \",VLOOKUP(L28,Proposito_programa!$C$2:$E$59,2,FALSE))","v":"Gestión pública local"},{"$f":"IF(ISERROR(VLOOKUP(L28,Proposito_programa!$C$2:$E$59,3,FALSE)),\" \",VLOOKUP(L28,Proposito_programa!$C$2:$E$59,3,FALSE))","v":"Propósito 5: Construir Bogotá - Región con gobierno abierto, transparente y ciudadanía consciente"},2021,1,1010227910,"CARLOS ARMANDO GONZÁLEZ RASGO","Persona Natural",null,null,null,18868500,null,null,null,18868500,16053200,44230,44230,44547,315,null,null,null,null,null,null,null,null,"X",null,0.85079365079365077]
[1,16,2021,"FDLC-CPS-016-2021","https://community.secop.gov.co/Public/Tendering/OpportunityDetail/Index?noticeUID=CO1.NTC.1737436&isFromPublicArea=True&isModal=False","Contratos de prestación de servicios profesionales y de apoyo a la gestión","Contratación directa","Prestación de servicios profesionales y de apoyo a la gestión, o para la ejecución de trabajos artísticos que sólo puedan encomendarse a determinadas personas naturales;","PRESTAR SERVICIOS DE APOYO AL FONDO DE DESARROLLO LOCAL DE LA CANDELARIA COMO CONDUCTOR(A) DE LOS VEHICULOS A CARGO DE LA ENTIDAD","Inversión","Un Nuevo Contrato Social y Ambiental para la Bogotá del Siglo XXI",57,{"$f":"IF(ISERROR(VLOOKUP(L29,Proposito_programa!$C$2:$E$59,2,FALSE)),\" \",VLOOKUP(L29,Proposito_programa!$C$2:$E$59,2,FALSE))","v":"Gestión pública local"},{"$f":"IF(ISERROR(VLOOKUP(L29,Proposito_programa!$C$2:$E$59,3,FALSE)),\" \",VLOOKUP(L29,Proposito_programa!$C$2:$E$59,3,FALSE))","v":"Propósito 5: Construir Bogotá - Región con gobierno abierto, transparente y ciudadanía consciente"},2021,1,79594412,"FABIO ALBERTO MOLINA GUTIERREZ","Persona Natural",null,null,null,18868500,null,1,1317800,20186300,17730400,44232,44232,44571,315,null,22,null,null,null,null,null,null,"X",null,0.87833827893175076]
[1,17,2021,"FDLC-CPS-017-2021","https://community.secop.gov.co/Public/Tendering/OpportunityDetail/Index?noticeUID=CO1.NTC.1738039&isFromPublicArea=True&isModal=False","Contratos de prestación de servicios profesionales y de apoyo a la gestión","Contratación directa","Prestación de servicios profesionales y de apoyo a la gestión, o para la ejecución de trabajos artísticos que sólo puedan encomendarse a determinadas personas naturales;","PRESTAR SERVICIOS DE APOYO ASISTENCIAL Y ADMINIISTRATIVO AL DESPACHO DE LA ALCALDESA LOCAL DE LA CANDELARIA","Inversión","Un Nuevo Contrato Social y Ambiental para la Bogotá del Siglo XXI",57,{"$f":"IF(ISERROR(VLOOKUP(L30,Proposito_programa!$C$2:$E$59,2,FALSE)),\" \",VLOOKUP(L30,Proposito_programa!$C$2:$E$59,2,FALSE))","v":"Gestión pública local"},{"$f":"IF(ISERROR(VLOOKUP(L30,Proposito_programa!$C$2:$E$59,3,FALSE)),\" \",VLOOKUP(L30,Proposito_programa!$C$2:$E$59,3,FALSE))","v":"Propósito 5: Construir Bogotá - Región con gobierno abierto, transparente y ciudadanía consciente"},2021,1,51838961,"MARIA ADELAIDA LUNA BUENAVENTURA","Persona Natural",null,null,null,8985000,null,null,null,8985000,8985000,44232,44232,44381,150,null,null,null,null,null,null,null,null,"X",null,1]
[1,18,2021,"FDLC-CPS-018-2021","https://community.secop.gov.co/Public/Tendering/OpportunityDetail/Index?noticeUID=CO1.NTC.1739111&isFromPublicArea=True&isModal=False","Contratos de prestación de servicios profesionales y de apoyo a la gestión","Contratación directa","Prestación de servicios profesionales y de apoyo a la gestión, o para la ejecución de trabajos artísticos que sólo puedan encomendarse a determinadas personas naturales;","PRESTAR SERVICIOS TÉCNICOS PARA APOYAR AL FONDO DE DESARROLLO LOCAL DE LA CANDELARIA EN LAS TAREAS OPERATIVAS DE CARÁCTER ARCHIVÍSTICO DESARROLLADAS, PARA GARANTIZAR LA APLICACIÓN CORRECTA DE LOS PROCEDIMIENTOS TÉCNICOS.","Inversión","Un Nuevo Contrato Social y Ambiental para la Bogotá del Siglo XXI",57,{"$f":"IF(ISERROR(VLOOKUP(L31,Proposito_programa!$C$2:$E$59,2,FALSE)),\" \",VLOOKUP(L31,Proposito_programa!$C$2:$E$59,2,FALSE))","v":"Gestión pública local"},{"$f":"IF(ISERROR(VLOOKUP(L31,Proposito_programa!$C$2:$E$59,3,FALSE)),\" \",VLOOKUP(L31,Proposito_programa!$C$2:$E$59,3,FALSE))","v":"Propósito 5: Construir Bogotá - Región con gobierno abierto, transparente y ciudadanía consciente"},2021,1,1010175770,"TEOFILO LEONARDO RAMIREZ HERNANDEZ","Persona Natural",null,null,null,15270000,null,null,null,15270000,15270000,44232,44232,44381,150,null,null,null,null,null,null,null,null,"X",null,1]
[1,19,2021,"FDLC-CPS-019-2021","https://community.secop.gov.co/Public/Tendering/OpportunityDetail/Index?noticeUID=CO1.NTC.1744580&isFromPublicArea=True&isModal=False","Contratos de prestación de servicios profesionales y de apoyo a la gestión","Contratación directa","Prestación de servicios profesionales y de apoyo a la gestión, o para la ejecución de trabajos artísticos que sólo puedan encomendarse a determinadas personas naturales;","PRESTAR SERVICIOS DE APOYO ADMINISTRATIVO Y ASISTENCIAL EN LA GESTIÓN DOCUMENTAL DE LA ALCALDÍA LOCAL DE LA CANDELARIA, ACOMPAÑANDO AL EQUIPO JURÍDICO DE DEPURACIÓN EN LAS LABORES OPERATIVAS QUE GENERA EL PROCESO DE IMPULSO DE LAS ACTUACIONES ADMINISTRATIVAS","Inversión","Un Nuevo Contrato Social y Ambiental para la Bogotá del Siglo XXI",57,{"$f":"IF(ISERROR(VLOOKUP(L32,Proposito_programa!$C$2:$E$59,2,FALSE)),\" \",VLOOKUP(L32,Proposito_programa!$C$2:$E$59,2,FALSE))","v":"Gestión pública local"},{"$f":"IF(ISERROR(VLOOKUP(L32,Proposito_programa!$C$2:$E$59,3,FALSE)),\" \",VLOOKUP(L32,Proposito_programa!$C$2:$E$59,3,FALSE))","v":"Propósito 5: Construir Bogotá - Región con gobierno abierto, transparente y ciudadanía consciente"},2023,1,49729700,"NEREIDA HERNANDEZ FLOREZ","Persona Natural",null,null,null,14166000,null,null,null,14166000,14166000,44235,44235,44415,180,null,null,null,null,null,null,null,null,"X",null,1]
[1,20,2021,"FDLC-CPS-020-2021","https://community.secop.gov.co/Public/Tendering/OpportunityDetail/Index?noticeUID=CO1.NTC.1744391&isFromPublicArea=True&isModal=False","Contratos de prestación de servicios profesionales y de apoyo a la gestión","Contratación directa","Prestación de servicios profesionales y de apoyo a la gestión, o para la ejecución de trabajos artísticos que sólo puedan encomendarse a determinadas personas naturales;","PRESTACIÓN DE SERVICIOS DE APOYO TÉCNICO AL FONDO DE DESARROLLO LOCAL DE LA CANDELARIA EN LOS ASUNTOS RELACIONADOS CON LA OFICINA DEL ALMACEN DE LA ENTIDAD","Inversión","Un Nuevo Contrato Social y Ambiental para la Bogotá del Siglo XXI",57,{"$f":"IF(ISERROR(VLOOKUP(L33,Proposito_programa!$C$2:$E$59,2,FALSE)),\" \",VLOOKUP(L33,Proposito_programa!$C$2:$E$59,2,FALSE))","v":"Gestión pública local"},{"$f":"IF(ISERROR(VLOOKUP(L33,Proposito_programa!$C$2:$E$59,3,FALSE)),\" \",VLOOKUP(L33,Proposito_programa!$C$2:$E$59,3,FALSE))","v":"Propósito 5: Construir Bogotá - Región con gobierno abierto, transparente y ciudadanía consciente"},2021,1,12139994,"JUAN CARLOS PUENTES NARVAEZ","Persona Natural",null,null,null,29070000,null,1,3197700,32267700,31298700,44235,44235,44571,300,1,33,null,null,null,null,null,null,"X",null,0.96996996996996998]
[1,21,2021,"FDLC-CPS-021-2021","https://community.secop.gov.co/Public/Tendering/OpportunityDetail/Index?noticeUID=CO1.NTC.1745290&isFromPublicArea=True&isModal=False","Contratos de prestación de servicios profesionales y de apoyo a la gestión","Contratación directa","Prestación de servicios profesionales y de apoyo a la gestión, o para la ejecución de trabajos artísticos que sólo puedan encomendarse a determinadas personas naturales;","PRESTACIÓN DE SERVICIOS DE APOYO ADMINISTRATIVO Y ASISTENCIAL A LA GESTION DE LA JUNTA ADMINISTRADORA LOCAL DE LA CANDELARIA","Inversión","Un Nuevo Contrato Social y Ambiental para la Bogotá del Siglo XXI",57,{"$f":"IF(ISERROR(VLOOKUP(L34,Proposito_programa!$C$2:$E$59,2,FALSE)),\" \",VLOOKUP(L34,Proposito_programa!$C$2:$E$59,2,FALSE))","v":"Gestión pública local"},{"$f":"IF(ISERROR(VLOOKUP(L34,Proposito_programa!$C$2:$E$59,3,FALSE)),\" \",VLOOKUP(L34,Proposito_programa!$C$2:$E$59,3,FALSE))","v":"Propósito 5: Construir Bogotá - Región con gobierno abierto, transparente y ciudadanía consciente"},2021,1,51879946,"ISABEL CRISTINA BULLA RODRIGUEZ","Persona Natural",null,null,null,20880000,null,1,2088000,22968000,22480800,44235,44235,44568,300,1,30,null,null,null,null,null,null,"X",null,0.97878787878787876]
[1,22,2021,"FDL-CPS-022-2021","https://community.secop.gov.co/Public/Tendering/OpportunityDetail/Index?noticeUID=CO1.NTC.1747862&isFromPublicArea=True&isModal=False","Contratos de prestación de servicios profesionales y de apoyo a la gestión","Contratación directa","Prestación de servicios profesionales y de apoyo a la gestión, o para la ejecución de trabajos artísticos que sólo puedan encomendarse a determinadas personas naturales;","PRESTAR SERVICIOS PROFESIONALES AL FONDO DE DESARROLLO LOCAL DE LA CANDELARIA PARA APOYAR EN LA FORMULACION, PRESENTACIÓN, EVALUACION Y SEGUIMIENTO DE LOS PROYECTOS SOCIALES Y DE SALUD EN LA LOCALIDAD","Inversión","Un Nuevo Contrato Social y Ambiental para la Bogotá del Siglo XXI",1,{"$f":"IF(ISERROR(VLOOKUP(L35,Proposito_programa!$C$2:$E$59,2,FALSE)),\" \",VLOOKUP(L35,Proposito_programa!$C$2:$E$59,2,FALSE))","v":"Subsidios y transferencias para la equidad"},{"$f":"IF(ISERROR(VLOOKUP(L35,Proposito_programa!$C$2:$E$59,3,FALSE)),\" \",VLOOKUP(L35,Proposito_programa!$C$2:$E$59,3,FALSE))","v":"Propósito 1: Hacer un nuevo contrato social para incrementar la inclusión social, productiva y política"},1605,1,1033749239,"AZUCENA SALAZAR GIRALDO","Persona Natural",null,null,null,40896000,null,1,17380800,58276800,54868800,44236,44236,44581,240,1,102,null,null,null,null,null,null,"X",null,0.94152046783625731]
[1,23,2021,"FDL-CPS-023-2021","https://community.secop.gov.co/Public/Tendering/OpportunityDetail/Index?noticeUID=CO1.NTC.1747848&isFromPublicArea=True&isModal=False","Contratos de prestación de servicios profesionales y de apoyo a la gestión","Contratación directa","Prestación de servicios profesionales y de apoyo a la gestión, o para la ejecución de trabajos artísticos que sólo puedan encomendarse a determinadas personas naturales;","PRESTAR SERVICIOS PROFESIONALES PARA APOYAR JURÍDICAMENTE LA EJECUCIÓN DE LAS ACCIONES REQUERIDAS PARA LA DEPURACIÓN DE LAS ACTUACIONES ADMINISTRATIVAS QUE CURSAN EN LA ALCALDÍA LOCAL DE LA CANDELARIA ASÍ COMO EL SEGUIMIENTO AL CIERRE DE LOS RESPECTIVOS EXPEDIENTE","Inversión","Un Nuevo Contrato Social y Ambiental para la Bogotá del Siglo XXI",57,{"$f":"IF(ISERROR(VLOOKUP(L36,Proposito_programa!$C$2:$E$59,2,FALSE)),\" \",VLOOKUP(L36,Proposito_programa!$C$2:$E$59,2,FALSE))","v":"Gestión pública local"},{"$f":"IF(ISERROR(VLOOKUP(L36,Proposito_programa!$C$2:$E$59,3,FALSE)),\" \",VLOOKUP(L36,Proposito_programa!$C$2:$E$59,3,FALSE))","v":"Propósito 5: Construir Bogotá - Región con gobierno abierto, transparente y ciudadanía consciente"},2023,1,1032356337,"ANDRES FERNANDO RIVERA SOLINA","Persona Natural",null,null,null,35532000,null,null,null,35532000,35532000,44236,44236,44416,180,null,null,null,null,null,null,null,null,"X",null,1]
[1,24,2021,"FDLC-CPS-024-2021","https://community.secop.gov.co/Public/Tendering/OpportunityDetail/Index?noticeUID=CO1.NTC.1756774&isFromPublicArea=True&isModal=False","Contratos de prestación de servicios profesionales y de apoyo a la gestión","Contratación directa","Prestación de servicios profesionales y de apoyo a la gestión, o para la ejecución de trabajos artísticos que sólo puedan encomendarse a determinadas personas naturales;","RESTAR SERVICIOS PROFESIONALES AL FONDO DE DESARROLLO LOCAL DE LA CANDELARIA PARA APOYAR TÉCNICAMENTE A LOS RESPONSABLES E INTEGRANTES DE LOS PROCESOS EN LA IMPLEMENTACIÓN DE HERRAMIENTAS DE GESTIÓN, SIGUIENDO LOS LINEAMIENTOS METODOLÓGICOS ESTABLECIDOS POR LA OFICINA ASESORA DE PLANEACIÓN DE LA SECRETARÍA DISTRITAL DE GOBIERNO","Inversión","Un Nuevo Contrato Social y Ambiental para la Bogotá del Siglo XXI",57,{"$f":"IF(ISERROR(VLOOKUP(L37,Proposito_programa!$C$2:$E$59,2,FALSE)),\" \",VLOOKUP(L37,Proposito_programa!$C$2:$E$59,2,FALSE))","v":"Gestión pública local"},{"$f":"IF(ISERROR(VLOOKUP(L37,Proposito_programa!$C$2:$E$59,3,FALSE)),\" \",VLOOKUP(L37,Proposito_programa!$C$2:$E$59,3,FALSE))","v":"Propósito 5: Construir Bogotá - Región con gobierno abierto, transparente y ciudadanía consciente"},2021,1,1026266066,"KATHERIN JOHANA MORENO CASTAÑEDA","Persona Natural",null,null,null,51120000,null,1,5120000,56240000,54528000,44238,44238,44571,300,1,30,null,null,null,null,null,null,"X",null,0.96955903271692745]
[1,25,2021,"FDLC-CPS-025-2021","https://community.secop.gov.co/Public/Tendering/OpportunityDetail/Index?noticeUID=CO1.NTC.1757061&isFromPublicArea=True&isModal=False","Contratos de prestación de servicios profesionales y de apoyo a la gestión","Contratación directa","Prestación de servicios profesionales y de apoyo a la gestión, o para la ejecución de trabajos artísticos que sólo puedan encomendarse a determinadas personas naturales;","COORDINA, LIDERA Y ASESORA LOS PLANES Y ESTRATEGIAS DE COMUNICACIÓN INTERNA Y EXTERNA PARA LA DIVULGACIÓN DE LOS PROGRAMAS, PROYECTOS Y ACTIVIDADES DE LA ALCALDÍA LOCAL","Inversión","Un Nuevo Contrato Social y Ambiental para la Bogotá del Siglo XXI",57,{"$f":"IF(ISERROR(VLOOKUP(L38,Proposito_programa!$C$2:$E$59,2,FALSE)),\" \",VLOOKUP(L38,Proposito_programa!$C$2:$E$59,2,FALSE))","v":"Gestión pública local"},{"$f":"IF(ISERROR(VLOOKUP(L38,Proposito_programa!$C$2:$E$59,3,FALSE)),\" \",VLOOKUP(L38,Proposito_programa!$C$2:$E$59,3,FALSE))","v":"Propósito 5: Construir Bogotá - Región con gobierno abierto, transparente y ciudadanía consciente"},2021,1,1020729068,"VALENTINA OCHOA MAYORGA","Persona Natural",null,null,null,62181000,null,null,null,62181000,57246000,44238,44238,44555,315,null,null,null,null,null,null,null,null,"X",null,0.92063492063492058]
[1,26,2021,"FDLC-CPS-026-2021","https://community.secop.gov.co/Public/Tendering/OpportunityDetail/Index?noticeUID=CO1.NTC.1757354&isFromPublicArea=True&isModal=False","Contratos de prestación de servicios profesionales y de apoyo a la gestión","Contratación directa","Prestación de servicios profesionales y de apoyo a la gestión, o para la ejecución de trabajos artísticos que sólo puedan encomendarse a determinadas personas naturales;","PRESTAR SERVICIOS PROFESIONALES PARA APOYAR JURÍDICAMENTE LA EJECUCIÓN DE LAS ACCIONES REQUERIDAS PARA LA DEPURACIÓN DE LAS ACTUACIONES ADMINISTRATIVAS QUE CURSAN EN LA ALCALDÍA LOCAL DE LA CANDELARIA","Inversión","Un Nuevo Contrato Social y Ambiental para la Bogotá del Siglo XXI",57,{"$f":"IF(ISERROR(VLOOKUP(L39,Proposito_programa!$C$2:$E$59,2,FALSE)),\" \",VLOOKUP(L39,Proposito_programa!$C$2:$E$59,2,FALSE))","v":"Gestión pública local"},{"$f":"IF(ISERROR(VLOOKUP(L39,Proposito_programa!$C$2:$E$59,3,FALSE)),\" \",VLOOKUP(L39,Proposito_programa!$C$2:$E$59,3,FALSE))","v":"Propósito 5: Construir Bogotá - Región con gobierno abierto, transparente y ciudadanía consciente"},2023,1,51875915,"LUZ SOFIA AMAYA CASTAÑEDA","Persona Natural",null,null,null,25128000,null,null,null,25128000,25128000,44238,44238,44418,180,null,null,null,null,null,null,null,null,"X",null,1]
[1,27,2021,"FDLC-CPS-027-2021","https://community.secop.gov.co/Public/Tendering/OpportunityDetail/Index?noticeUID=CO1.NTC.1757240&isFromPublicArea=True&isModal=False","Contratos de prestación de servicios profesionales y de apoyo a la gestión","Contratación directa","Prestación de servicios profesionales y de apoyo a la gestión, o para la ejecución de trabajos artísticos que sólo puedan encomendarse a determinadas personas naturales;","PRESTAR SERVICIOS DE APOYO ADMINISTRATIVO Y ASISTENCIAL EN LA GESTIÓN DE LA ALCALDÍA LOCAL DE LA CANDELARIA EN EL TRÁMITE DE LOS COMPARENDOS Y QUERELLAS, DE CONFORMIDAD CON EL CODIGO NACIONAL DE POLICIA-LEY 1801 DE 2016","Inversión","Un Nuevo Contrato Social y Ambiental para la Bogotá del Siglo XXI",57,{"$f":"IF(ISERROR(VLOOKUP(L40,Proposito_programa!$C$2:$E$59,2,FALSE)),\" \",VLOOKUP(L40,Proposito_programa!$C$2:$E$59,2,FALSE))","v":"Gestión pública local"},{"$f":"IF(ISERROR(VLOOKUP(L40,Proposito_programa!$C$2:$E$59,3,FALSE)),\" \",VLOOKUP(L40,Proposito_programa!$C$2:$E$59,3,FALSE))","v":"Propósito 5: Construir Bogotá - Región con gobierno abierto, transparente y ciudadanía consciente"},2023,1,1022956077,"JARRY EMERSON RIAÑO DELGADO","Persona Natural",null,null,null,10782000,null,null,null,10782000,10782000,44238,44238,44418,180,null,null,null,null,null,null,null,null,"X",null,1]
[1,28,2021,"FDLC-CPS-028-2021","https://community.secop.gov.co/Public/Tendering/OpportunityDetail/Index?noticeUID=CO1.NTC.1756768&isFromPublicArea=True&isModal=true&asPopupView=true","Contratos de prestación de servicios profesionales y de apoyo a la gestión","Contratación directa","Prestación de servicios profesionales y de apoyo a la gestión, o para la ejecución de trabajos artísticos que sólo puedan encomendarse a determinadas personas naturales;","PRESTAR SERVICIOS PROFESIONALES PARA APOYAR AL FONDO DE DESARROLLO LOCAL DE LA CANDELARIA EN LA PROMOCIÓN, ACOMPAÑAMIENTO, COORDINACIÓN Y ATENCIÓN DE LAS INSTANCIAS DE COORDINACIÓN INTERINSTITUCIONALES Y LAS INSTANCIAS DE PARTICIPACIÓN LOCALES, ASÍ COMO LOS PROCESOS COMUNITARIOS EN LA LOCALIDAD","Inversión","Un Nuevo Contrato Social y Ambiental para la Bogotá del Siglo XXI",55,{"$f":"IF(ISERROR(VLOOKUP(L41,Proposito_programa!$C$2:$E$59,2,FALSE)),\" \",VLOOKUP(L41,Proposito_programa!$C$2:$E$59,2,FALSE))","v":"Fortalecimiento de cultura ciudadana y su institucionalidad"},{"$f":"IF(ISERROR(VLOOKUP(L41,Proposito_programa!$C$2:$E$59,3,FALSE)),\" \",VLOOKUP(L41,Proposito_programa!$C$2:$E$59,3,FALSE))","v":"Propósito 5: Construir Bogotá - Región con gobierno abierto, transparente y ciudadanía consciente"},2019,1,1106786140,"MONICA ANDREA LEAL DIAZ","Persona Natural",null,null,null,43050000,null,1,4305000,47355000,37310000,44238,44238,44571,300,null,30,null,null,null,null,null,null,"X",null,0.78787878787878785]
[1,29,2021,"FDLC-CPS-029-2021","https://community.secop.gov.co/Public/Tendering/OpportunityDetail/Index?noticeUID=CO1.NTC.1757627&isFromPublicArea=True&isModal=true&asPopupView=true","Contratos de prestación de servicios profesionales y de apoyo a la gestión","Contratación directa","Prestación de servicios profesionales y de apoyo a la gestión, o para la ejecución de trabajos artísticos que sólo puedan encomendarse a determinadas personas naturales;","PRESTAR SERVICIOS PROFESIONALES AL FONDO DE DESARROLLO LOCAL DE LA CANDELARIA PARA LA OPERACIÓN, PRESTACIÓN, SEGUIMIENTO Y CUMPLIMIENTO DE LOS PROCEDIMIENTOS ADMINISTRATIVOS, OPERATIVOS Y PROGRAMÁTICOS DEL SERVICIO APOYO ECONÓMICO TIPO C, QUE CONTRIBUYAN A LA GARANTÍA DE LOS DERECHOS DE LA POBLACIÓN MAYOR EN EL MARCO DE LA POLÍTICA PÚBLICA SOCIAL PARA EL ENVEJECIMIENTO Y LA VEJEZ EN EL DISTRITO CAPITAL A CARGO DE LA ALCALDIA LOCAL","Inversión","Un Nuevo Contrato Social y Ambiental para la Bogotá del Siglo XXI",1,{"$f":"IF(ISERROR(VLOOKUP(L42,Proposito_programa!$C$2:$E$59,2,FALSE)),\" \",VLOOKUP(L42,Proposito_programa!$C$2:$E$59,2,FALSE))","v":"Subsidios y transferencias para la equidad"},{"$f":"IF(ISERROR(VLOOKUP(L42,Proposito_programa!$C$2:$E$59,3,FALSE)),\" \",VLOOKUP(L42,Proposito_programa!$C$2:$E$59,3,FALSE))","v":"Propósito 1: Hacer un nuevo contrato social para incrementar la inclusión social, productiva y política"},1605,1,1010190450,"VIVIANA LIZETH MONROY RAMIREZ","Persona Natural",null,null,null,25128000,null,null,null,25128000,25128000,44238,44238,44418,180,null,null,null,null,null,null,null,null,"X",null,1]
[1,30,2021,"FDLC-CPS-030-2021","https://community.secop.gov.co/Public/Tendering/OpportunityDetail/Index?noticeUID=CO1.NTC.1762749&isFromPublicArea=True&isModal=true&asPopupView=true","Contratos de prestación de servicios profesionales y de apoyo a la gestión","Contratación directa","Prestación de servicios profesionales y de apoyo a la gestión, o para la ejecución de trabajos artísticos que sólo puedan encomendarse a determinadas personas naturales;","PRESTAR SERVICIOS PROFESIONALES PARA APOYAR AL ALCALDE LOCAL DE LA CANDELARIA, EN LA GESTIÓN DE LOS ASUNTOS RELACIONADOS CON SEGURIDAD CIUDADANA, CONVIVENCIA Y PREVENCIÓN DE CONFLICTIVIDADES, VIOLENCIAS Y DELITOS EN LA LOCALIDAD, DE CONFORMIDAD CON EL MARCO NORMATIVO APLICABLE EN LA MATERIA.","Inversión","Un Nuevo Contrato Social y Ambiental para la Bogotá del Siglo XXI",43,{"$f":"IF(ISERROR(VLOOKUP(L43,Proposito_programa!$C$2:$E$59,2,FALSE)),\" \",VLOOKUP(L43,Proposito_programa!$C$2:$E$59,2,FALSE))","v":"Cultura ciudadana para la confianza, la convivencia y la participación desde la vida cotidiana"},{"$f":"IF(ISERROR(VLOOKUP(L43,Proposito_programa!$C$2:$E$59,3,FALSE)),\" \",VLOOKUP(L43,Proposito_programa!$C$2:$E$59,3,FALSE))","v":"Propósito 3: Inspirar confianza y legitimidad para vivir sin miedo y ser epicentro de cultura ciudadana, paz y reconciliación"},1785,1,80239278,"JOHN FREDY PULIDO RINCON","Persona Natural",null,null,null,59220000,null,1,5922000,65142000,63168000,44239,44239,44571,300,null,30,1102807537,"JOSE MARIA CONDE AREVALO",44418,24082800,null,null,"X",null,{"$f":"IF(ISERROR(AB43/AA43),\"-\",(AB43/AA43))","v":0.96969696969696972}]
[1,31,2021,"FDLC-CPS-031-2021","https://community.secop.gov.co/Public/Tendering/OpportunityDetail/Index?noticeUID=CO1.NTC.1762293&isFromPublicArea=True&isModal=true&asPopupView=true","Contratos de prestación de servicios profesionales y de apoyo a la gestión","Contratación directa","Prestación de servicios profesionales y de apoyo a la gestión, o para la ejecución de trabajos artísticos que sólo puedan encomendarse a determinadas personas naturales;","PRESTAR SERVICIOS PROFESIONALES PARA APOYAR JURÍDICAMENTE LA EJECUCIÓN DE LAS ACCIONES REQUERIDAS PARA EL TRÁMITE E IMPULSO PROCESAL DE LAS ACTUACIONES CONTRAVENCIONALES Y/O QUERELLAS QUE CURSEN EN LAS INSPECCIONES DE POLICÍA DE LA LOCALIDAD DE LA CANDELARIA.","Inversión","Un Nuevo Contrato Social y Ambiental para la Bogotá del Siglo XXI",57,{"$f":"IF(ISERROR(VLOOKUP(L44,Proposito_programa!$C$2:$E$59,2,FALSE)),\" \",VLOOKUP(L44,Proposito_programa!$C$2:$E$59,2,FALSE))","v":"Gestión pública local"},{"$f":"IF(ISERROR(VLOOKUP(L44,Proposito_programa!$C$2:$E$59,3,FALSE)),\" \",VLOOKUP(L44,Proposito_programa!$C$2:$E$59,3,FALSE))","v":"Propósito 5: Construir Bogotá - Región con gobierno abierto, transparente y ciudadanía consciente"},2023,1,1018443671,"JOSE RICARDO PULGARIN ALVAREZ","Persona Natural",null,null,null,25128000,null,null,null,25128000,25128000,44239,44239,44419,180,null,null,null,null,null,null,null,null,"X",null,1]
[1,32,2021,"FDLC-CPS-032-2021","https://community.secop.gov.co/Public/Tendering/OpportunityDetail/Index?noticeUID=CO1.NTC.1769023&isFromPublicArea=True&isModal=true&asPopupView=true","Contratos de prestación de servicios profesionales y de apoyo a la gestión","Contratación directa","Prestación de servicios profesionales y de apoyo a la gestión, o para la ejecución de trabajos artísticos que sólo puedan encomendarse a determinadas personas naturales;","PRESTAR SERVICIOS PROFESIONALES AL FONDO DE DESARROLLO LOCAL DE LA CANDELARIA EN LA ESTRUCTURACIÓN DE LOS PROCESOS, ASÍ COMO LA FORMULACIÓN, SEGUIMIENTO Y EVALUACIÓN DE LOS PROYECTOS DE LA ENTIDAD","Inversión","Un Nuevo Contrato Social y Ambiental para la Bogotá del Siglo XXI",6,{"$f":"IF(ISERROR(VLOOKUP(L45,Proposito_programa!$C$2:$E$59,2,FALSE)),\" \",VLOOKUP(L45,Proposito_programa!$C$2:$E$59,2,FALSE))","v":"Sistema Distrital de Cuidado"},{"$f":"IF(ISERROR(VLOOKUP(L45,Proposito_programa!$C$2:$E$59,3,FALSE)),\" \",VLOOKUP(L45,Proposito_programa!$C$2:$E$59,3,FALSE))","v":"Propósito 1: Hacer un nuevo contrato social para incrementar la inclusión social, productiva y política"},1628,1,79712875,"NELSON JAVIER GARAVITO CASTILLO","Persona Natural",null,null,null,51120000,null,null,null,51120000,43622400,44242,44242,44544,300,null,null,null,null,null,null,null,null,"X",null,0.85333333333333339]
[1,33,2021,"FDLC-CPS-033-2021","https://community.secop.gov.co/Public/Tendering/OpportunityDetail/Index?noticeUID=CO1.NTC.1768603&isFromPublicArea=True&isModal=true&asPopupView=true","Contratos de prestación de servicios profesionales y de apoyo a la gestión","Contratación directa","Prestación de servicios profesionales y de apoyo a la gestión, o para la ejecución de trabajos artísticos que sólo puedan encomendarse a determinadas personas naturales;","PRESTAR SERVICIOS PROFESIONALES EN MATERIA JURÍDICA AL FONDO DE DESARROLLO LOCAL","Inversión","Un Nuevo Contrato Social y Ambiental para la Bogotá del Siglo XXI",6,{"$f":"IF(ISERROR(VLOOKUP(L46,Proposito_programa!$C$2:$E$59,2,FALSE)),\" \",VLOOKUP(L46,Proposito_programa!$C$2:$E$59,2,FALSE))","v":"Sistema Distrital de Cuidado"},{"$f":"IF(ISERROR(VLOOKUP(L46,Proposito_programa!$C$2:$E$59,3,FALSE)),\" \",VLOOKUP(L46,Proposito_programa!$C$2:$E$59,3,FALSE))","v":"Propósito 1: Hacer un nuevo contrato social para incrementar la inclusión social, productiva y política"},1628,1,1118545389,"DIEGO FERNANDO ARDILA PLAZAS","Persona Natural",null,null,null,59220000,null,null,null,{"$f":"+W46+X46+Z46","v":59220000},59220000,44242,44242,44544,300,null,null,null,null,null,null,null,null,"X",null,{"$f":"IF(ISERROR(AB46/AA46),\"-\",(AB46/AA46))","v":1}]
[1,34,2021,"FDLC-CPS-034-2021","https://community.secop.gov.co/Public/Tendering/OpportunityDetail/Index?noticeUID=CO1.NTC.1769097&isFromPublicArea=True&isModal=true&asPopupView=true","Contratos de prestación de servicios profesionales y de apoyo a la gestión","Contratación directa","Prestación de servicios profesionales y de apoyo a la gestión, o para la ejecución de trabajos artísticos que sólo puedan encomendarse a determinadas personas naturales;","PRESTAR SERVICIOS PROFESIONALES AL ÁREA DE GESTIÓN DE DESARROLLO LOCAL DE LA ALCALDÍA LOCAL PARA EL SEGUIMIENTO E IMPLEMENTACIÓN DE LAS MEDIDAS ESTABLECIDAS Y QUE SE ESTABLEZCAN POR PARTE DEL GOBIERNO NACIONAL Y DISTRITAL EN RELACIÓN CON LA REACTIVACION ECONOMICA EN LA LOCALIDAD","Inversión","Un Nuevo Contrato Social y Ambiental para la Bogotá del Siglo XXI",6,{"$f":"IF(ISERROR(VLOOKUP(L47,Proposito_programa!$C$2:$E$59,2,FALSE)),\" \",VLOOKUP(L47,Proposito_programa!$C$2:$E$59,2,FALSE))","v":"Sistema Distrital de Cuidado"},{"$f":"IF(ISERROR(VLOOKUP(L47,Proposito_programa!$C$2:$E$59,3,FALSE)),\" \",VLOOKUP(L47,Proposito_programa!$C$2:$E$59,3,FALSE))","v":"Propósito 1: Hacer un nuevo contrato social para incrementar la inclusión social, productiva y política"},1628,1,80236435,"JORGE ELIECER GARCÍA NEVA","Persona Natural",null,null,null,41880000,-837600,1,2233600,43276000,39925600,44242,44242,44560,300,null,16,null,null,null,null,null,null,"X",null,0.92258064516129035]
[1,35,2021,"FDLC-CPS-035-2021","https://community.secop.gov.co/Public/Tendering/OpportunityDetail/Index?noticeUID=CO1.NTC.1769204&isFromPublicArea=True&isModal=true&asPopupView=true","Contratos de prestación de servicios profesionales y de apoyo a la gestión","Contratación directa","Prestación de servicios profesionales y de apoyo a la gestión, o para la ejecución de trabajos artísticos que sólo puedan encomendarse a determinadas personas naturales;","PRESTAR SERVICIOS PROFESIONALES AL FONDO DE DESARROLLO LOCAL DE LA CANDELARIA PARA APOYAR LAS GESTIONES RELACIONADAS CON LA OFICINA DE PRESUPUESTO DE LA ENTIDAD","Inversión","Un Nuevo Contrato Social y Ambiental para la Bogotá del Siglo XXI",57,{"$f":"IF(ISERROR(VLOOKUP(L48,Proposito_programa!$C$2:$E$59,2,FALSE)),\" \",VLOOKUP(L48,Proposito_programa!$C$2:$E$59,2,FALSE))","v":"Gestión pública local"},{"$f":"IF(ISERROR(VLOOKUP(L48,Proposito_programa!$C$2:$E$59,3,FALSE)),\" \",VLOOKUP(L48,Proposito_programa!$C$2:$E$59,3,FALSE))","v":"Propósito 5: Construir Bogotá - Región con gobierno abierto, transparente y ciudadanía consciente"},2021,1,50875779,"ISABELA RAQUEL FERNANDEZ PEREZ","Persona Natural",null,null,null,41880000,null,1,3769200,45649200,44253200,44242,44242,44571,300,1,27,null,null,null,null,null,null,"X",null,0.96941896024464835]
[1,36,2021,"FDLC-CPS-036-2021","https://community.secop.gov.co/Public/Tendering/OpportunityDetail/Index?noticeUID=CO1.NTC.1769205&isFromPublicArea=True&isModal=true&asPopupView=true","Contratos de prestación de servicios profesionales y de apoyo a la gestión","Contratación directa","Prestación de servicios profesionales y de apoyo a la gestión, o para la ejecución de trabajos artísticos que sólo puedan encomendarse a determinadas personas naturales;","PRESTAR SERVICIOS PROFESIONALES PARA APOYAR EL SEGUIMIENTO A LA EJECUCIÓN DE LOS PROYECTOS DE OBRA E INFRAESTRUCTURA DE LA LOCALIDAD","Inversión","Un Nuevo Contrato Social y Ambiental para la Bogotá del Siglo XXI",49,{"$f":"IF(ISERROR(VLOOKUP(L49,Proposito_programa!$C$2:$E$59,2,FALSE)),\" \",VLOOKUP(L49,Proposito_programa!$C$2:$E$59,2,FALSE))","v":"Movilidad segura, sostenible y accesible"},{"$f":"IF(ISERROR(VLOOKUP(L49,Proposito_programa!$C$2:$E$59,3,FALSE)),\" \",VLOOKUP(L49,Proposito_programa!$C$2:$E$59,3,FALSE))","v":"Propósito 4: Hacer de Bogotá Región un modelo de movilidad multimodal, incluyente y sostenible"},2020,1,3023764906,"PAOLA ANDREA RANGEL MARTINEZ","Persona Natural",null,null,null,20355000,null,null,null,20355000,20355000,44242,44242,44391,150,null,null,null,null,null,null,null,null,"X",null,1]
[1,37,2021,"FDLC-CPS-037-2021","https://community.secop.gov.co/Public/Tendering/OpportunityDetail/Index?noticeUID=CO1.NTC.1769077&isFromPublicArea=True&isModal=true&asPopupView=true","Contratos de prestación de servicios profesionales y de apoyo a la gestión","Contratación directa","Prestación de servicios profesionales y de apoyo a la gestión, o para la ejecución de trabajos artísticos que sólo puedan encomendarse a determinadas personas naturales;","PRESTAR SERVICIOS PROFESIONALES AL FONDO DE DESARROLLO LOCAL DE LA CANDELARIA EN ASUNTOS RELACIONADOS CON PLANEACIÓN, PRESENTACIÓN, EJECUCIÓN Y SEGUIMIENTO DE LOS PROYECTOS ENCAMINADOS A LA GESTIÓN DE RIESGOS Y CAMBIO CLIMÁTICO EN LA LOCALIDAD","Inversión","Un Nuevo Contrato Social y Ambiental para la Bogotá del Siglo XXI",57,{"$f":"IF(ISERROR(VLOOKUP(L50,Proposito_programa!$C$2:$E$59,2,FALSE)),\" \",VLOOKUP(L50,Proposito_programa!$C$2:$E$59,2,FALSE))","v":"Gestión pública local"},{"$f":"IF(ISERROR(VLOOKUP(L50,Proposito_programa!$C$2:$E$59,3,FALSE)),\" \",VLOOKUP(L50,Proposito_programa!$C$2:$E$59,3,FALSE))","v":"Propósito 5: Construir Bogotá - Región con gobierno abierto, transparente y ciudadanía consciente"},2021,1,1024482565,"SANDRA MILENA SANCHEZ GAMBA","Persona Natural",null,null,null,41880000,null,1,3769200,{"$f":"+W50+X50+Z50","v":45649200},44113600,44242,44242,44571,300,null,27,null,null,null,null,null,null,"X",null,0.96636085626911317]
[1,38,2021,"FDLC-CPS-038-2021","https://community.secop.gov.co/Public/Tendering/OpportunityDetail/Index?noticeUID=CO1.NTC.1769630&isFromPublicArea=True&isModal=true&asPopupView=true","Contratos de prestación de servicios profesionales y de apoyo a la gestión","Contratación directa","Prestación de servicios profesionales y de apoyo a la gestión, o para la ejecución de trabajos artísticos que sólo puedan encomendarse a determinadas personas naturales;","PRESTAR SERVICIOS PROFESIONALES AL FONDO DE DESARROLLO LOCAL DE LA CANDELARIA PARA APOYAR LA FORMULACIÓN, GESTIÓN Y SEGUIMIENTO DE ACTIVIDADES ENFOCADAS A LA GESTIÓN AMBIENTAL EXTERNA, ENCAMINADAS A LA MITIGACIÓN DE LOS DIFERENTES IMPACTOS AMBIENTALES Y LA CONSERVACIÓN DE LOS RECURSOS NATURALES DE LA LOCALIDAD","Inversión","Un Nuevo Contrato Social y Ambiental para la Bogotá del Siglo XXI",24,{"$f":"IF(ISERROR(VLOOKUP(L51,Proposito_programa!$C$2:$E$59,2,FALSE)),\" \",VLOOKUP(L51,Proposito_programa!$C$2:$E$59,2,FALSE))","v":"Bogotá región emprendedora e innovadora"},{"$f":"IF(ISERROR(VLOOKUP(L51,Proposito_programa!$C$2:$E$59,3,FALSE)),\" \",VLOOKUP(L51,Proposito_programa!$C$2:$E$59,3,FALSE))","v":"Propósito 1: Hacer un nuevo contrato social para incrementar la inclusión social, productiva y política"},1626,1,80194800,"PEDRO ANDRES BARRERA ALVARADO","Persona Natural",null,null,null,51120000,null,1,4600800,{"$f":"+W51+X51+Z51","v":55720800},48734400,44242,44242,44571,300,1,27,null,null,null,null,null,null,"X",null,0.87461773700305812]
[1,39,2021,"FDLC-CPS-039-2021","https://community.secop.gov.co/Public/Tendering/OpportunityDetail/Index?noticeUID=CO1.NTC.1776427&isFromPublicArea=True&isModal=true&asPopupView=true","Contratos de prestación de servicios profesionales y de apoyo a la gestión","Contratación directa","Prestación de servicios profesionales y de apoyo a la gestión, o para la ejecución de trabajos artísticos que sólo puedan encomendarse a determinadas personas naturales;","PRESTAR SERVICIOS TECNICOS DE APOYO EN LA VISIBILIZACION DE LA GESTIÓN TURISTICA Y CULTURAL DE LA CANDELARIA EN EL MARCO DEL PLAN DE REACTIVACIÓN ECONOMICA","Inversión","Un Nuevo Contrato Social y Ambiental para la Bogotá del Siglo XXI",45,{"$f":"IF(ISERROR(VLOOKUP(L52,Proposito_programa!$C$2:$E$59,2,FALSE)),\" \",VLOOKUP(L52,Proposito_programa!$C$2:$E$59,2,FALSE))","v":"Espacio público más seguro y construido colectivamente"},{"$f":"IF(ISERROR(VLOOKUP(L52,Proposito_programa!$C$2:$E$59,3,FALSE)),\" \",VLOOKUP(L52,Proposito_programa!$C$2:$E$59,3,FALSE))","v":"Propósito 3: Inspirar confianza y legitimidad para vivir sin miedo y ser epicentro de cultura ciudadana, paz y reconciliación"},1786,1,80249660,"JHONNATAN ACOSTA HERRADA","Persona Natural",null,null,null,30540000,null,1,2443200,32983200,28809400,44244,44244,44571,300,null,24,null,null,null,null,null,null,"X",null,0.87345679012345678]
[1,40,2021,"FDLC-CPS-040-2021","https://community.secop.gov.co/Public/Tendering/OpportunityDetail/Index?noticeUID=CO1.NTC.1772731&isFromPublicArea=True&isModal=true&asPopupView=true","Contratos de prestación de servicios profesionales y de apoyo a la gestión","Contratación directa","Prestación de servicios profesionales y de apoyo a la gestión, o para la ejecución de trabajos artísticos que sólo puedan encomendarse a determinadas personas naturales;","PRESTACION DE SERVICIOS PROFESIONALES DE APOYO EN LA ADMINISTRACION DEL PUNTO VIVE DIGITAL DE LA LOCALIDAD LA CANDELARIA PARA FOMENTAR EN LA COMUNIDAD LAS TICS","Inversión","Un Nuevo Contrato Social y Ambiental para la Bogotá del Siglo XXI",6,{"$f":"IF(ISERROR(VLOOKUP(L53,Proposito_programa!$C$2:$E$59,2,FALSE)),\" \",VLOOKUP(L53,Proposito_programa!$C$2:$E$59,2,FALSE))","v":"Sistema Distrital de Cuidado"},{"$f":"IF(ISERROR(VLOOKUP(L53,Proposito_programa!$C$2:$E$59,3,FALSE)),\" \",VLOOKUP(L53,Proposito_programa!$C$2:$E$59,3,FALSE))","v":"Propósito 1: Hacer un nuevo contrato social para incrementar la inclusión social, productiva y política"},1628,1,79322403,"EDGAR YESID SILVA BUSTOS","Persona Natural",null,null,null,41880000,null,null,null,41880000,34760400,44243,44243,44545,300,null,null,null,null,null,null,null,null,"X",null,0.83]
[1,41,2021,"FDLC-CPS-041-2021","https://community.secop.gov.co/Public/Tendering/OpportunityDetail/Index?noticeUID=CO1.NTC.1789927&isFromPublicArea=True&isModal=true&asPopupView=true\n","Contratos de prestación de servicios profesionales y de apoyo a la gestión","Contratación directa","Prestación de servicios profesionales y de apoyo a la gestión, o para la ejecución de trabajos artísticos que sólo puedan encomendarse a determinadas personas naturales;","PRESTAR SERVICIOS PROFESIONALES ESPECIALIZADOS AL FONDO DE DESARROLLO LOCAL DE LA CANDELARIA PARA APOYAR LA COORDINACIÓN DE LA GESTIÓN CONTRACTUAL DE LA ENTIDAD Y DEMÁS ASUNTOS QUE SE REQUIERAN","Inversión","Un Nuevo Contrato Social y Ambiental para la Bogotá del Siglo XXI",57,{"$f":"IF(ISERROR(VLOOKUP(L54,Proposito_programa!$C$2:$E$59,2,FALSE)),\" \",VLOOKUP(L54,Proposito_programa!$C$2:$E$59,2,FALSE))","v":"Gestión pública local"},{"$f":"IF(ISERROR(VLOOKUP(L54,Proposito_programa!$C$2:$E$59,3,FALSE)),\" \",VLOOKUP(L54,Proposito_programa!$C$2:$E$59,3,FALSE))","v":"Propósito 5: Construir Bogotá - Región con gobierno abierto, transparente y ciudadanía consciente"},2021,1,63538593,"SANDRA JOHANNA YARA DELGADO","Persona Natural",null,null,null,85000000,-31450000,null,null,{"$f":"+W54+X54+Z54","v":53550000},53550000,44249,44249,44551,300,null,null,null,null,null,null,null,null,"X",null,1]
[1,42,2021,"FDLC-CPS-042-2021","https://community.secop.gov.co/Public/Tendering/OpportunityDetail/Index?noticeUID=CO1.NTC.1792587&isFromPublicArea=True&isModal=true&asPopupView=true","Contratos de prestación de servicios profesionales y de apoyo a la gestión","Contratación directa","Prestación de servicios profesionales y de apoyo a la gestión, o para la ejecución de trabajos artísticos que sólo puedan encomendarse a determinadas personas naturales;","PRESTAR SERVICIOS PROFESIONALES AL FONDO DE DESARROLLO LOCAL DE LA CANDELARIA PARA APOYAR AL EQUIPO DE PRENSA Y COMUNICACIONES DE LA ALCALDÍA LOCAL DE LA CANDELARIA EN LA REALIZACIÓN Y PUBLICACIÓN DE CONTENIDOS DE REDES SOCIALES Y CANALES DE DIVULGACIÓN DIGITAL (SITIO WEB) DE LA ENTIDAD.","Inversión","Un Nuevo Contrato Social y Ambiental para la Bogotá del Siglo XXI",57,{"$f":"IF(ISERROR(VLOOKUP(L55,Proposito_programa!$C$2:$E$59,2,FALSE)),\" \",VLOOKUP(L55,Proposito_programa!$C$2:$E$59,2,FALSE))","v":"Gestión pública local"},{"$f":"IF(ISERROR(VLOOKUP(L55,Proposito_programa!$C$2:$E$59,3,FALSE)),\" \",VLOOKUP(L55,Proposito_programa!$C$2:$E$59,3,FALSE))","v":"Propósito 5: Construir Bogotá - Región con gobierno abierto, transparente y ciudadanía consciente"},2021,1,1033731738,"NATALIA ANDREA RUBIANO FORERO","Persona Natural",null,null,null,41880000,null,1,1116800,42996800,38808800,44250,44250,44560,300,1,8,null,null,null,null,null,null,"X",null,0.90259740259740262]
[1,43,2021,"FDLC-CPS-043-2021","https://community.secop.gov.co/Public/Tendering/OpportunityDetail/Index?noticeUID=CO1.NTC.1800513&isFromPublicArea=True&isModal=true&asPopupView=true","Contratos de prestación de servicios profesionales y de apoyo a la gestión","Contratación directa","Prestación de servicios profesionales y de apoyo a la gestión, o para la ejecución de trabajos artísticos que sólo puedan encomendarse a determinadas personas naturales;","PRESTAR SERVICIOS DE APOYO TÉCNICO AL FONDO DE DESARROLLO LOCAL DE LA CANDELARIA EN LA ADMINISTRACIÓN DE UNA DE LAS CASAS COMUNITARIAS DE LA LOCALIDAD DE LA CANDELARIA, DE CONFORMIDAD CON EL ACUERDO LOCAL 006 DE 2013.","Inversión","Un Nuevo Contrato Social y Ambiental para la Bogotá del Siglo XXI",24,{"$f":"IF(ISERROR(VLOOKUP(L56,Proposito_programa!$C$2:$E$59,2,FALSE)),\" \",VLOOKUP(L56,Proposito_programa!$C$2:$E$59,2,FALSE))","v":"Bogotá región emprendedora e innovadora"},{"$f":"IF(ISERROR(VLOOKUP(L56,Proposito_programa!$C$2:$E$59,3,FALSE)),\" \",VLOOKUP(L56,Proposito_programa!$C$2:$E$59,3,FALSE))","v":"Propósito 1: Hacer un nuevo contrato social para incrementar la inclusión social, productiva y política"},1626,1,52709184,"LUZ ANGELA ORTIZ SANTOS","Persona Natural",null,null,null,29070000,null,null,null,29070000,26647500,44253,44253,44554,300,null,null,null,null,null,null,null,null,"X",null,0.91666666666666663]
[1,44,2021,"FDLC-CPS-044-2021","https://community.secop.gov.co/Public/Tendering/OpportunityDetail/Index?noticeUID=CO1.NTC.1801014&isFromPublicArea=True&isModal=true&asPopupView=true","Contratos de prestación de servicios profesionales y de apoyo a la gestión","Contratación directa","Prestación de servicios profesionales y de apoyo a la gestión, o para la ejecución de trabajos artísticos que sólo puedan encomendarse a determinadas personas naturales;","PRESTAR SERVICIOS PROFESIONALES AL FONDO DE DESARROLLO LOCAL DE LA CANDELARIA PARA COORDINAR LA ARTICULACIÓN, ASISTENCIA Y ACOMPAÑAMIENTO DE LOS PROCESOS DE PLANEACIÓN LOCAL, PARA LA PROMOCIÓN DE LA PARTICIPACIÓN DE LAS MUJERES Y DE LA EQUIDAD DE GÉNERO, PARA MATERIALIZAR EN LA LOCALIDAD LAS ESTRATEGIAS DE TERRITORIALIZACIÓN Y TRANSVERSALIZACIÓN DE LA POLÍTICA PUBLICA DE MUJERES Y EQUIDAD DE GÉNERO, PPMYEG.","Inversión","Un Nuevo Contrato Social y Ambiental para la Bogotá del Siglo XXI",40,{"$f":"IF(ISERROR(VLOOKUP(L57,Proposito_programa!$C$2:$E$59,2,FALSE)),\" \",VLOOKUP(L57,Proposito_programa!$C$2:$E$59,2,FALSE))","v":"Más mujeres viven una vida libre de violencias, se sienten seguras y acceden con confianza al sistema de justicia"},{"$f":"IF(ISERROR(VLOOKUP(L57,Proposito_programa!$C$2:$E$59,3,FALSE)),\" \",VLOOKUP(L57,Proposito_programa!$C$2:$E$59,3,FALSE))","v":"Propósito 3: Inspirar confianza y legitimidad para vivir sin miedo y ser epicentro de cultura ciudadana, paz y reconciliación"},1781,1,1023898352,"ADRIANA ISABEL RINCON MARTINEZ","Persona Natural",null,null,null,51120000,null,null,null,{"$f":"+W57+X57+Z57","v":51120000},41918400,44252,44252,44554,300,null,null,1018440881,"ZULEIMY YAZMIN TERREROS BOGOTA",44273,47030400,null,null,"X",null,0.82]
[1,45,2021,"FDLC-CPS-045-2021","https://community.secop.gov.co/Public/Tendering/OpportunityDetail/Index?noticeUID=CO1.NTC.1800956&isFromPublicArea=True&isModal=true&asPopupView=true","Contratos de prestación de servicios profesionales y de apoyo a la gestión","Contratación directa","Prestación de servicios profesionales y de apoyo a la gestión, o para la ejecución de trabajos artísticos que sólo puedan encomendarse a determinadas personas naturales;","PRESTAR SERVICIOS PROFESIONALES COMO ABOGADO COBRO PERSUASIVO EN EL ÁREA DE GESTIÓN POLICIVA Y JURÍDICA DE LA ALCALDIA LOCAL DE LA CANDELARIA","Inversión","Un Nuevo Contrato Social y Ambiental para la Bogotá del Siglo XXI",57,{"$f":"IF(ISERROR(VLOOKUP(L58,Proposito_programa!$C$2:$E$59,2,FALSE)),\" \",VLOOKUP(L58,Proposito_programa!$C$2:$E$59,2,FALSE))","v":"Gestión pública local"},{"$f":"IF(ISERROR(VLOOKUP(L58,Proposito_programa!$C$2:$E$59,3,FALSE)),\" \",VLOOKUP(L58,Proposito_programa!$C$2:$E$59,3,FALSE))","v":"Propósito 5: Construir Bogotá - Región con gobierno abierto, transparente y ciudadanía consciente"},2023,1,32645897,"MIRYAM ESTHER LOPEZ RODRIGUEZ","Persona Natural",null,null,null,25128000,null,null,null,25128000,25128000,44252,44252,44432,180,null,null,null,null,null,null,null,null,"X",null,1]
[1,46,2021,"FDLC-CPS-046-2021","https://community.secop.gov.co/Public/Tendering/OpportunityDetail/Index?noticeUID=CO1.NTC.1801305&isFromPublicArea=True&isModal=true&asPopupView=true","Contratos de prestación de servicios profesionales y de apoyo a la gestión","Contratación directa","Prestación de servicios profesionales y de apoyo a la gestión, o para la ejecución de trabajos artísticos que sólo puedan encomendarse a determinadas personas naturales;","APOYAR A LA ALCALDESA LOCAL EN LA PROMOCIÓN, ARTICULACIÓN, ACOMPAÑAMIENTO Y SEGUIMIENTO PARA LA ATENCIÓN Y PROTECCIÓN DE LOS ANIMALES DOMÉSTICOS Y SILVESTRES DE LA LOCALIDAD.","Inversión","Un Nuevo Contrato Social y Ambiental para la Bogotá del Siglo XXI",34,{"$f":"IF(ISERROR(VLOOKUP(L59,Proposito_programa!$C$2:$E$59,2,FALSE)),\" \",VLOOKUP(L59,Proposito_programa!$C$2:$E$59,2,FALSE))","v":"Bogotá protectora de los animales"},{"$f":"IF(ISERROR(VLOOKUP(L59,Proposito_programa!$C$2:$E$59,3,FALSE)),\" \",VLOOKUP(L59,Proposito_programa!$C$2:$E$59,3,FALSE))","v":"Propósito 2 : Cambiar Nuestros Hábitos de Vida para Reverdecer a Bogotá y Adaptarnos y Mitigar la Crisis Climática"},1704,1,1026255127,"DELIO ALCIBIADES LADINO PEÑA","Persona Natural",null,null,null,41880000,null,1,2373200,44253200,43136400,44252,44252,44571,300,null,17,null,null,null,null,null,null,"X",null,0.97476340694006314]
[1,47,2021,"FDLC-CPS-047-2021","https://community.secop.gov.co/Public/Tendering/OpportunityDetail/Index?noticeUID=CO1.NTC.1813377&isFromPublicArea=True&isModal=true&asPopupView=true","Contratos de prestación de servicios profesionales y de apoyo a la gestión","Contratación directa","Prestación de servicios profesionales y de apoyo a la gestión, o para la ejecución de trabajos artísticos que sólo puedan encomendarse a determinadas personas naturales;","PRESTAR SERVICIOS DE APOYO TÉCNICO AL FONDO DE DESARROLLO LOCAL DE LA CANDELARIA EN LA ADMINISTRACIÓN DE LAS CASAS COMUNITARIAS DE LA LOCALIDAD DE LA CANDELARIA, DE CONFORMIDAD CON EL ACUERDO LOCAL 006 DE 2013","Inversión","Un Nuevo Contrato Social y Ambiental para la Bogotá del Siglo XXI",6,{"$f":"IF(ISERROR(VLOOKUP(L60,Proposito_programa!$C$2:$E$59,2,FALSE)),\" \",VLOOKUP(L60,Proposito_programa!$C$2:$E$59,2,FALSE))","v":"Sistema Distrital de Cuidado"},{"$f":"IF(ISERROR(VLOOKUP(L60,Proposito_programa!$C$2:$E$59,3,FALSE)),\" \",VLOOKUP(L60,Proposito_programa!$C$2:$E$59,3,FALSE))","v":"Propósito 1: Hacer un nuevo contrato social para incrementar la inclusión social, productiva y política"},1662,1,41503480,"AURA ALICIA ZAMBRANO LOPEZ","Persona Natural",null,null,null,27616500,null,null,null,27616500,26066100,44257,44257,44546,285,null,null,null,null,null,null,null,null,"X",null,0.94385964912280707]
[1,48,2021,"FDLC-CPS-048-2021","https://community.secop.gov.co/Public/Tendering/OpportunityDetail/Index?noticeUID=CO1.NTC.1801020&isFromPublicArea=True&isModal=true&asPopupView=true","Contratos de prestación de servicios profesionales y de apoyo a la gestión","Contratación directa","Prestación de servicios profesionales y de apoyo a la gestión, o para la ejecución de trabajos artísticos que sólo puedan encomendarse a determinadas personas naturales;","PRESTAR SERVICIOS DE APOYO TÉCNICO AL FONDO DE DESARROLLO LOCAL DE LA CANDELARIA EN LA ADMINISTRACIÓN DE UNA DE LAS CASAS COMUNITARIAS DE LA LOCALIDAD DE LA CANDELARIA, DE CONFORMIDAD CON EL ACUERDO LOCAL 006 DE BELEN","Inversión","Un Nuevo Contrato Social y Ambiental para la Bogotá del Siglo XXI",6,{"$f":"IF(ISERROR(VLOOKUP(L61,Proposito_programa!$C$2:$E$59,2,FALSE)),\" \",VLOOKUP(L61,Proposito_programa!$C$2:$E$59,2,FALSE))","v":"Sistema Distrital de Cuidado"},{"$f":"IF(ISERROR(VLOOKUP(L61,Proposito_programa!$C$2:$E$59,3,FALSE)),\" \",VLOOKUP(L61,Proposito_programa!$C$2:$E$59,3,FALSE))","v":"Propósito 1: Hacer un nuevo contrato social para incrementar la inclusión social, productiva y política"},1663,1,52219649,"INDIRA BETANCOURT MACUASE","Persona Natural",null,null,null,29070000,null,null,null,29070000,26744400,44252,44252,44554,300,null,null,null,null,null,null,null,null,"X",null,0.92]
[1,49,2021,"FDLC-CPS-049-2021","https://community.secop.gov.co/Public/Tendering/OpportunityDetail/Index?noticeUID=CO1.NTC.1810181&isFromPublicArea=True&isModal=true&asPopupView=true\n","Contratos de prestación de servicios profesionales y de apoyo a la gestión","Contratación directa","Prestación de servicios profesionales y de apoyo a la gestión, o para la ejecución de trabajos artísticos que sólo puedan encomendarse a determinadas personas naturales;","PRESTAR SERVICIOS PROFESIONALES PARA APOYAR JURÍDICAMENTE LA EJECUCIÓN DE LAS ACCIONES REQUERIDAS PARA LA DEPURACIÓN DE LAS ACTUACIONES ADMINISTRATIVAS QUE CURSAN EN LA ALCALDÍA LOCAL DE LA CANDELARIA","Inversión","Un Nuevo Contrato Social y Ambiental para la Bogotá del Siglo XXI",57,{"$f":"IF(ISERROR(VLOOKUP(L62,Proposito_programa!$C$2:$E$59,2,FALSE)),\" \",VLOOKUP(L62,Proposito_programa!$C$2:$E$59,2,FALSE))","v":"Gestión pública local"},{"$f":"IF(ISERROR(VLOOKUP(L62,Proposito_programa!$C$2:$E$59,3,FALSE)),\" \",VLOOKUP(L62,Proposito_programa!$C$2:$E$59,3,FALSE))","v":"Propósito 5: Construir Bogotá - Región con gobierno abierto, transparente y ciudadanía consciente"},2023,1,22463659,"DIGNORA LOPEZ MONCADA","Persona Natural",null,null,null,25128000,null,null,null,25128000,25128000,44256,44256,44439,180,null,null,null,null,null,null,null,null,"X",null,1]
[1,50,2021,"FDLC-CPS-050-2021","https://community.secop.gov.co/Public/Tendering/OpportunityDetail/Index?noticeUID=CO1.NTC.1813103&isFromPublicArea=True&isModal=true&asPopupView=true","Contratos de prestación de servicios profesionales y de apoyo a la gestión","Contratación directa","Prestación de servicios profesionales y de apoyo a la gestión, o para la ejecución de trabajos artísticos que sólo puedan encomendarse a determinadas personas naturales;","PRESTAR SERVICIOS DE APOYO ADMINISTRATIVO Y ASISTENCIAL AL FONDO DE DESARROLLO LOCAL DE LA CANDELARIA, EN EL CENTRO DE INFORMACIÓN Y DOCUMENTACIÓN (CDI), PARA LA NOTIFICACIÓN DE CORRESPONDENCIA DE LA ENTIDAD.","Inversión","Un Nuevo Contrato Social y Ambiental para la Bogotá del Siglo XXI",57,{"$f":"IF(ISERROR(VLOOKUP(L63,Proposito_programa!$C$2:$E$59,2,FALSE)),\" \",VLOOKUP(L63,Proposito_programa!$C$2:$E$59,2,FALSE))","v":"Gestión pública local"},{"$f":"IF(ISERROR(VLOOKUP(L63,Proposito_programa!$C$2:$E$59,3,FALSE)),\" \",VLOOKUP(L63,Proposito_programa!$C$2:$E$59,3,FALSE))","v":"Propósito 5: Construir Bogotá - Región con gobierno abierto, transparente y ciudadanía consciente"},2021,1,80845714,"EDWARD FERNANDO GUZMAN FRANCO","Persona Natural",null,null,null,17071500,null,null,null,17071500,16113100,44257,44257,44546,285,null,null,null,null,null,null,null,null,"X",null,0.94385964912280707]
[1,51,2021,"FDLC-CPS-051-2021","https://community.secop.gov.co/Public/Tendering/OpportunityDetail/Index?noticeUID=CO1.NTC.1813570&isFromPublicArea=True&isModal=true&asPopupView=true","Contratos de prestación de servicios profesionales y de apoyo a la gestión","Contratación directa","Prestación de servicios profesionales y de apoyo a la gestión, o para la ejecución de trabajos artísticos que sólo puedan encomendarse a determinadas personas naturales;","PRESTAR SERVICIOS PROFESIONALES AL FONDO DE DESARROLLO LOCAL DE LA CANDELARIA EN EL DESPACHO DE LA ALCALDESA LOCAL PARA BRINDAR LINEAMIENTOS JURIDICOS, EVALUAR Y ORIENTAR TEMAS PRIORITARIOS DE LA ENTIDAD","Inversión","Un Nuevo Contrato Social y Ambiental para la Bogotá del Siglo XXI",57,{"$f":"IF(ISERROR(VLOOKUP(L64,Proposito_programa!$C$2:$E$59,2,FALSE)),\" \",VLOOKUP(L64,Proposito_programa!$C$2:$E$59,2,FALSE))","v":"Gestión pública local"},{"$f":"IF(ISERROR(VLOOKUP(L64,Proposito_programa!$C$2:$E$59,3,FALSE)),\" \",VLOOKUP(L64,Proposito_programa!$C$2:$E$59,3,FALSE))","v":"Propósito 5: Construir Bogotá - Región con gobierno abierto, transparente y ciudadanía consciente"},2021,1,79340141,"JORGE ARLEY QUINTERO CASTILLO","Persona Natural",null,null,null,34020000,null,null,null,34020000,26989200,44257,44257,44409,150,null,null,null,null,null,null,null,null,"X",null,0.79333333333333333]
[1,52,2021,"FDLC-CPS-052-2021","https://community.secop.gov.co/Public/Tendering/OpportunityDetail/Index?noticeUID=CO1.NTC.1830861&isFromPublicArea=True&isModal=true&asPopupView=true","Contratos de prestación de servicios profesionales y de apoyo a la gestión","Contratación directa","Prestación de servicios profesionales y de apoyo a la gestión, o para la ejecución de trabajos artísticos que sólo puedan encomendarse a determinadas personas naturales;","PRESTAR SERVICIOS TÉCNICOS PARA APOYAR AL FONDO DE DESARROLLO LOCAL DE LA CANDELARIA EN LAS TAREAS OPERATIVAS DE CARÁCTER ARCHIVÍSTICO DESARROLLADAS, PARA GARANTIZAR LA APLICACIÓN CORRECTA DE LOS PROCEDIMIENTOS TÉCNICOS","Inversión","Un Nuevo Contrato Social y Ambiental para la Bogotá del Siglo XXI",57,{"$f":"IF(ISERROR(VLOOKUP(L65,Proposito_programa!$C$2:$E$59,2,FALSE)),\" \",VLOOKUP(L65,Proposito_programa!$C$2:$E$59,2,FALSE))","v":"Gestión pública local"},{"$f":"IF(ISERROR(VLOOKUP(L65,Proposito_programa!$C$2:$E$59,3,FALSE)),\" \",VLOOKUP(L65,Proposito_programa!$C$2:$E$59,3,FALSE))","v":"Propósito 5: Construir Bogotá - Región con gobierno abierto, transparente y ciudadanía consciente"},2021,1,52496566,"SONIA MORENO SALGUERO","Persona Natural",null,null,null,15270000,null,null,null,15270000,15270000,44264,44264,44416,150,null,null,null,null,null,null,null,null,"X",null,1]
[1,53,2021,"FDLC-SAMC-001-2021","https://community.secop.gov.co/Public/Tendering/OpportunityDetail/Index?noticeUID=CO1.NTC.1781620&isFromPublicArea=True&isModal=true&asPopupView=true","Seguros","Contratación mínima cuantia","No aplica","CONTRATAR LOS SEGUROS QUE AMPAREN LOS INTERESES PATRIMONIALES ACTUALES Y FUTUROS, ASÍ COMO LOS BIENES DE PROPIEDAD DE LA ALCALDIA LOCAL DE LA CANDELARIA, QUE ESTÉN BAJO SU RESPONSABILIDAD Y CUSTODIA Y AQUELLOS QUE SEAN ADQUIRIDOS PARA DESARROLLAR LAS FUNCIONES INHERENTES A SU ACTIVIDAD, ASI COMO CUALQUIER OTRA PÓLIZA DE SEGUROS QUE REQUIERA LA ENTIDAD EN EL DESARROLLO DE SU ACTIVIDAD”, GRUPO 1 -TODO RIESGO DAÑO MATERIAL Y OTROS y GRUPO 2. - RESPONSABILIDAD CIVIL SERVIDORES PÚBLICOS","Funcionamiento","Un Nuevo Contrato Social y Ambiental para la Bogotá del Siglo XXI","No aplica",{"$f":"IF(ISERROR(VLOOKUP(L66,Proposito_programa!$C$2:$E$59,2,FALSE)),\" \",VLOOKUP(L66,Proposito_programa!$C$2:$E$59,2,FALSE))","v":" "},{"$f":"IF(ISERROR(VLOOKUP(L66,Proposito_programa!$C$2:$E$59,3,FALSE)),\" \",VLOOKUP(L66,Proposito_programa!$C$2:$E$59,3,FALSE))","v":" "},"N/A",3,860524654,"ASEGURADORA SOLIDARIA DE COLOMBIA","Persona Jurídica",null,null,null,67525352,null,null,null,67525352,67525352,44266,44266,44889,623,null,null,null,null,null,null,null,null,"X",null,1]
[1,54,2021,"FDLC-SAMC-001-2021","https://community.secop.gov.co/Public/Tendering/OpportunityDetail/Index?noticeUID=CO1.NTC.1794112&isFromPublicArea=True&isModal=true&asPopupView=true","Seguros","Contratación mínima cuantia","No aplica","CONTRATAR LOS SEGUROS QUE AMPAREN LOS INTERESES PATRIMONIALES ACTUALES Y FUTUROS, ASÍ COMO LOS BIENES DE PROPIEDAD DE LA ALCALDIA LOCAL DE LA CANDELARIA, QUE ESTÉN BAJO SU RESPONSABILIDAD Y CUSTODIA Y AQUELLOS QUE SEAN ADQUIRIDOS PARA DESARROLLAR LAS FUNCIONES INHERENTES A SU ACTIVIDAD, ASI COMO CUALQUIER OTRA PÓLIZA DE SEGUROS QUE REQUIERA LA ENTIDAD EN EL DESARROLLO DE SU ACTIVIDAD” GRUPO 3.","Funcionamiento","Un Nuevo Contrato Social y Ambiental para la Bogotá del Siglo XXI","No aplica",{"$f":"IF(ISERROR(VLOOKUP(L67,Proposito_programa!$C$2:$E$59,2,FALSE)),\" \",VLOOKUP(L67,Proposito_programa!$C$2:$E$59,2,FALSE))","v":" "},{"$f":"IF(ISERROR(VLOOKUP(L67,Proposito_programa!$C$2:$E$59,3,FALSE)),\" \",VLOOKUP(L67,Proposito_programa!$C$2:$E$59,3,FALSE))","v":" "},"N/A",3,860011153,"POSITIVA COMPAÑIA DE SEGUROS SA","Persona Jurídica",null,null,null,9989579,null,null,null,9989579,9989579,44266,44266,44889,623,null,null,null,null,null,null,null,null,"X",null,1]
[1,55,2021,"FDLC-CPS-055-2021","https://community.secop.gov.co/Public/Tendering/OpportunityDetail/Index?noticeUID=CO1.NTC.1846079&isFromPublicArea=True&isModal=true&asPopupView=true","Contratos de prestación de servicios profesionales y de apoyo a la gestión","Contratación directa","Prestación de servicios profesionales y de apoyo a la gestión, o para la ejecución de trabajos artísticos que sólo puedan encomendarse a determinadas personas naturales;","PRESTAR SERVICIOS PROFESIONALES PARA LA PLANEACIÓN, IMPLEMENTACIÓN Y FORTALECIMIENTO DE PROYECTOS RELACIONADOS CON LAS ACTIVIDADES DEL TURISMO LOCAL, A TRAVÉS DE LA GESTIÓN, ARTICULACIÓN E INTERLOCUCIÓN CON CIUDADANÍA Y ENTIDADES PÚBLICAS Y PRIVADAS.","Inversión","Un Nuevo Contrato Social y Ambiental para la Bogotá del Siglo XXI",6,{"$f":"IF(ISERROR(VLOOKUP(L68,Proposito_programa!$C$2:$E$59,2,FALSE)),\" \",VLOOKUP(L68,Proposito_programa!$C$2:$E$59,2,FALSE))","v":"Sistema Distrital de Cuidado"},{"$f":"IF(ISERROR(VLOOKUP(L68,Proposito_programa!$C$2:$E$59,3,FALSE)),\" \",VLOOKUP(L68,Proposito_programa!$C$2:$E$59,3,FALSE))","v":"Propósito 1: Hacer un nuevo contrato social para incrementar la inclusión social, productiva y política"},1628,1,78036035,"JAIME MANUEL PINEDA MENDEZ","Persona Natural",null,null,null,37692000,null,null,null,37692000,14658000,44270,44270,44544,270,null,null,null,null,null,null,null,null,"X",null,0.3888888888888889]
[1,56,2021,"FDLC-CPS-056-2021","https://community.secop.gov.co/Public/Tendering/OpportunityDetail/Index?noticeUID=CO1.NTC.1845942&isFromPublicArea=True&isModal=true&asPopupView=true","Contratos de prestación de servicios profesionales y de apoyo a la gestión","Contratación directa","Prestación de servicios profesionales y de apoyo a la gestión, o para la ejecución de trabajos artísticos que sólo puedan encomendarse a determinadas personas naturales;","PRESTAR SERVICIOS DE APOYO TÉCNICO AL FONDO DE DESARROLLO LOCAL DE LA CANDELARIA PARA LA OPERACIÓN, SEGUIMIENTO Y CUMPLIMIENTO DE LOS PROCESOS Y PROCEDIMIENTOS NECESARIOS EN LA PRESTACIÓN DE SERVICIOS SOCIALES EN LA LOCALIDAD DE LA CANDELARIA GARANTIZANDO EL OPORTUNO Y ADECUADO REGISTRO, CRUCE, REPORTE Y SEGUIMIENTO DE INFORMACIÓN","Inversión","Un Nuevo Contrato Social y Ambiental para la Bogotá del Siglo XXI",1,{"$f":"IF(ISERROR(VLOOKUP(L69,Proposito_programa!$C$2:$E$59,2,FALSE)),\" \",VLOOKUP(L69,Proposito_programa!$C$2:$E$59,2,FALSE))","v":"Subsidios y transferencias para la equidad"},{"$f":"IF(ISERROR(VLOOKUP(L69,Proposito_programa!$C$2:$E$59,3,FALSE)),\" \",VLOOKUP(L69,Proposito_programa!$C$2:$E$59,3,FALSE))","v":"Propósito 1: Hacer un nuevo contrato social para incrementar la inclusión social, productiva y política"},1605,1,80263860,"PEDRO SIERRA GARCIA","Persona Natural",null,null,null,16740000,null,null,null,16740000,16740000,44270,44270,44453,180,null,null,null,null,null,null,null,null,"X",null,1]
[1,57,2021,"FDLC-CPS-057-2021","https://community.secop.gov.co/Public/Tendering/OpportunityDetail/Index?noticeUID=CO1.NTC.1846092&isFromPublicArea=True&isModal=true&asPopupView=true\n","Contratos de prestación de servicios profesionales y de apoyo a la gestión","Contratación directa","Prestación de servicios profesionales y de apoyo a la gestión, o para la ejecución de trabajos artísticos que sólo puedan encomendarse a determinadas personas naturales;","PRESTAR SERVICIOS PROFESIONALES PARA APOYAR AL FONDO DE DESARROLLO LOCAL DE LA CANDELARIA EN EL SEGUIMIENTO A LAS INSTANCIAS Y PROCESOS DE PARTICIPACIÓN LOCALES","Inversión","Un Nuevo Contrato Social y Ambiental para la Bogotá del Siglo XXI",55,{"$f":"IF(ISERROR(VLOOKUP(L70,Proposito_programa!$C$2:$E$59,2,FALSE)),\" \",VLOOKUP(L70,Proposito_programa!$C$2:$E$59,2,FALSE))","v":"Fortalecimiento de cultura ciudadana y su institucionalidad"},{"$f":"IF(ISERROR(VLOOKUP(L70,Proposito_programa!$C$2:$E$59,3,FALSE)),\" \",VLOOKUP(L70,Proposito_programa!$C$2:$E$59,3,FALSE))","v":"Propósito 5: Construir Bogotá - Región con gobierno abierto, transparente y ciudadanía consciente"},2019,1,36313634,"LINA MARIA COLLAZOS BOTACHE","Persona Natural",null,null,null,36639000,null,1,3528200,40167200,34603500,44270,44270,44571,270,null,26,null,null,null,null,null,null,"X",null,0.86148648648648651]
[1,58,2021,"FDLC-CPS-058-2021","https://community.secop.gov.co/Public/Tendering/OpportunityDetail/Index?noticeUID=CO1.NTC.1845950&isFromPublicArea=True&isModal=true&asPopupView=true","Contratos de prestación de servicios profesionales y de apoyo a la gestión","Contratación directa","Prestación de servicios profesionales y de apoyo a la gestión, o para la ejecución de trabajos artísticos que sólo puedan encomendarse a determinadas personas naturales;","PRESTAR SERVICIOS DE APOYO TÉCNICO AL FONDO DE DESARROLLO LOCAL DE LA CANDELARIA EN LA ADMINISTRACIÓN DE LAS CASAS COMUNITARIAS DE LA LOCALIDAD DE LA CANDELARIA, DE CONFORMIDAD CON EL ACUERDO LOCAL 006 DE 2013","Inversión","Un Nuevo Contrato Social y Ambiental para la Bogotá del Siglo XXI",6,{"$f":"IF(ISERROR(VLOOKUP(L71,Proposito_programa!$C$2:$E$59,2,FALSE)),\" \",VLOOKUP(L71,Proposito_programa!$C$2:$E$59,2,FALSE))","v":"Sistema Distrital de Cuidado"},{"$f":"IF(ISERROR(VLOOKUP(L71,Proposito_programa!$C$2:$E$59,3,FALSE)),\" \",VLOOKUP(L71,Proposito_programa!$C$2:$E$59,3,FALSE))","v":"Propósito 1: Hacer un nuevo contrato social para incrementar la inclusión social, productiva y política"},1662,1,52059942,"RUTH NAYIBE ALVINO BARBOSA","Persona Natural",null,null,null,27616500,null,null,null,27616500,24709500,44270,44270,44544,270,null,null,null,null,null,null,null,null,"X",null,0.89473684210526316]
[1,59,2021,"FDLC-CPS-059-2021","https://community.secop.gov.co/Public/Tendering/OpportunityDetail/Index?noticeUID=CO1.NTC.1845970&isFromPublicArea=True&isModal=true&asPopupView=true","Contratos de prestación de servicios profesionales y de apoyo a la gestión","Contratación directa","Prestación de servicios profesionales y de apoyo a la gestión, o para la ejecución de trabajos artísticos que sólo puedan encomendarse a determinadas personas naturales;","PRESTACIÓN DE SERVICIOS DE APOYO LOGÍSTICO EN LOS EVENTOS Y ACTIVIDADES DE LA ADMINISTRACIÓN LOCAL DE LA LOCALIDAD DE LA CANDELARIA","Inversión","Un Nuevo Contrato Social y Ambiental para la Bogotá del Siglo XXI",6,{"$f":"IF(ISERROR(VLOOKUP(L72,Proposito_programa!$C$2:$E$59,2,FALSE)),\" \",VLOOKUP(L72,Proposito_programa!$C$2:$E$59,2,FALSE))","v":"Sistema Distrital de Cuidado"},{"$f":"IF(ISERROR(VLOOKUP(L72,Proposito_programa!$C$2:$E$59,3,FALSE)),\" \",VLOOKUP(L72,Proposito_programa!$C$2:$E$59,3,FALSE))","v":"Propósito 1: Hacer un nuevo contrato social para incrementar la inclusión social, productiva y política"},1628,1,1085280532,"DEIVIS ARAVIT GORDILLO GUTIERREZ","Persona Natural",null,null,null,16335000,-544500,1,1815000,{"$f":"+W72+X72+Z72","v":17605500},15427500,44270,44270,44220,270,1,30,null,null,null,null,null,null,"X",null,0.87628865979381443]
[1,60,2021,"FDLC-CPS-060-2021","https://community.secop.gov.co/Public/Tendering/OpportunityDetail/Index?noticeUID=CO1.NTC.1851221&isFromPublicArea=True&isModal=true&asPopupView=true","Contratos de prestación de servicios profesionales y de apoyo a la gestión","Contratación directa","Prestación de servicios profesionales y de apoyo a la gestión, o para la ejecución de trabajos artísticos que sólo puedan encomendarse a determinadas personas naturales;","PRESTAR SERVICIOS DE APOYO TÉCNICO AL FONDO DE DESARROLLO LOCAL DE LA CANDELARIA EN LOS PROCEDIMIENTOS ADMINISTRATIVOS DERIVADOS DE LOS PROYECTOS SOCIALES Y DE SALUD EN LA LOCALIDAD","Inversión","Un Nuevo Contrato Social y Ambiental para la Bogotá del Siglo XXI",1,{"$f":"IF(ISERROR(VLOOKUP(L73,Proposito_programa!$C$2:$E$59,2,FALSE)),\" \",VLOOKUP(L73,Proposito_programa!$C$2:$E$59,2,FALSE))","v":"Subsidios y transferencias para la equidad"},{"$f":"IF(ISERROR(VLOOKUP(L73,Proposito_programa!$C$2:$E$59,3,FALSE)),\" \",VLOOKUP(L73,Proposito_programa!$C$2:$E$59,3,FALSE))","v":"Propósito 1: Hacer un nuevo contrato social para incrementar la inclusión social, productiva y política"},1605,1,79907754,"JUAN ANGEL LOPEZ ARDILA","Persona Natural",null,null,null,15876000,null,null,null,15876000,15876000,44271,44271,44454,180,null,null,null,null,null,null,null,null,"X",null,1]
[1,61,2021,"ORDEN DE COMPRA 65329","https://colombiacompra.gov.co/tienda-virtual-del-estado-colombiano/ordenes-compra/65329","Contratos de prestación de servicios","Selección abreviada","Acuerdo marco de precios ","PRESTAR EL SERVICIO INTEGRAL DE ASEO Y CAFETERIA PARA LAS INSTALACIONES DE PROPIEDAD DEL FONDO DE DESARROLLO LOCAL DE LA ALCALDIA LOCAL DE LA CANDELARIA","Funcionamiento","Un Nuevo Contrato Social y Ambiental para la Bogotá del Siglo XXI","No aplica",{"$f":"IF(ISERROR(VLOOKUP(L74,Proposito_programa!$C$2:$E$59,2,FALSE)),\" \",VLOOKUP(L74,Proposito_programa!$C$2:$E$59,2,FALSE))","v":" "},{"$f":"IF(ISERROR(VLOOKUP(L74,Proposito_programa!$C$2:$E$59,3,FALSE)),\" \",VLOOKUP(L74,Proposito_programa!$C$2:$E$59,3,FALSE))","v":" "},"N/A",1,900427788,"LIMPIEZA INSTITUCIONAL LASU S.A.S","Persona Jurídica",null,null,null,181395838.81,null,1,21604161,202999999.81,150080984,44264,44264,44613,350,1,40,null,null,null,null,null,null,"X",null,0.73931519281019653]
[1,62,2021,"ORDEN DE COMPRA 64891","https://colombiacompra.gov.co/tienda-virtual-del-estado-colombiano/ordenes-compra/64891","Suministro","Selección abreviada","Acuerdo marco de precios ","Suministrar a mont o agotable los combustible s gasolina y diésel para los vehículos de propiedad del Fondo de Desarrollo Local de La Candelaria\n","Funcionamiento","Un Nuevo Contrato Social y Ambiental para la Bogotá del Siglo XXI","No aplica",{"$f":"IF(ISERROR(VLOOKUP(L75,Proposito_programa!$C$2:$E$59,2,FALSE)),\" \",VLOOKUP(L75,Proposito_programa!$C$2:$E$59,2,FALSE))","v":" "},{"$f":"IF(ISERROR(VLOOKUP(L75,Proposito_programa!$C$2:$E$59,3,FALSE)),\" \",VLOOKUP(L75,Proposito_programa!$C$2:$E$59,3,FALSE))","v":" "},"N/A",1,900459737,"GRUPO EDS AUTOGAS S.A.S","Persona Jurídica",null,null,null,25000000,null,null,null,25000000,9276710,44253,44253,44632,379,null,null,null,null,null,null,null,"X",null,null,0.37106840000000002]
[null,null,2021,null,null,"Otros gastos","Otros gastos","Otros gastos","ABONOS A LOS ADULTOS MAYORES BENEFICIARIOS DEL PROGRAMA APOYO SUBSIDIO ECONÓMICO TIPO C. VIGENCIA ENERO A JUNIO 2021","Inversión","Un Nuevo Contrato Social y Ambiental para la Bogotá del Siglo XXI",1,{"$f":"IF(ISERROR(VLOOKUP(L76,Proposito_programa!$C$2:$E$59,2,FALSE)),\" \",VLOOKUP(L76,Proposito_programa!$C$2:$E$59,2,FALSE))","v":"Subsidios y transferencias para la equidad"},{"$f":"IF(ISERROR(VLOOKUP(L76,Proposito_programa!$C$2:$E$59,3,FALSE)),\" \",VLOOKUP(L76,Proposito_programa!$C$2:$E$59,3,FALSE))","v":"Propósito 1: Hacer un nuevo contrato social para incrementar la inclusión social, productiva y política"},1605,1,860066942,"CAJA DE COMPENSACION FAMILIAR COMPENSAR","Persona Jurídica",null,null,null,322875000,null,null,null,322875000,322875000,44221,44221,44561,365,null,null,null,null,null,null,null,null,null,null,1]
[1,64,2021,"FDLC-CPS-064-2021","https://community.secop.gov.co/Public/Tendering/OpportunityDetail/Index?noticeUID=CO1.NTC.1853093&isFromPublicArea=True&isModal=False","Contratos de prestación de servicios profesionales y de apoyo a la gestión","Contratación directa","Prestación de servicios profesionales y de apoyo a la gestión, o para la ejecución de trabajos artísticos que sólo puedan encomendarse a determinadas personas naturales;","PRESTAR SERVICIOS PROFESIONALES PARA APOYAR JURÍDICAMENTE LA ATENCIÓN DE PETICIONES, REQUERIMIENTOS, ACCIONES CONSTITUCIONALES Y COMISIONES JUDICIALES","Inversión","Un Nuevo Contrato Social y Ambiental para la Bogotá del Siglo XXI",57,{"$f":"IF(ISERROR(VLOOKUP(L77,Proposito_programa!$C$2:$E$59,2,FALSE)),\" \",VLOOKUP(L77,Proposito_programa!$C$2:$E$59,2,FALSE))","v":"Gestión pública local"},{"$f":"IF(ISERROR(VLOOKUP(L77,Proposito_programa!$C$2:$E$59,3,FALSE)),\" \",VLOOKUP(L77,Proposito_programa!$C$2:$E$59,3,FALSE))","v":"Propósito 5: Construir Bogotá - Región con gobierno abierto, transparente y ciudadanía consciente"},2023,1,1026291962,"MARIA FERNANDA VACA FLOREZ","Persona Natural",null,null,null,25128000,null,1,12564000,37692000,35318800,44272,44272,44546,180,1,90,null,null,null,null,null,null,"X",null,0.937037037037037]
[1,65,2021,"FDLC-CPS-065-2021","https://community.secop.gov.co/Public/Tendering/OpportunityDetail/Index?noticeUID=CO1.NTC.1857352&isFromPublicArea=True&isModal=true&asPopupView=true","Contratos de prestación de servicios profesionales y de apoyo a la gestión","Contratación directa","Prestación de servicios profesionales y de apoyo a la gestión, o para la ejecución de trabajos artísticos que sólo puedan encomendarse a determinadas personas naturales;","PRESTAR SERVICIOS PROFESIONALES A LA ALCALDÍA LOCAL DE LA CANDELARIA PARA LA FORMULACIÓN Y SEGUIMIENTO DE PLANES, POLITICAS, PROGRAMAS Y PROYECTOS ENMARCADOS EN ACTIVIDADES DE APOYO A PROCESOS DE REACTIVACION ECONOMICA EN LA LOCALIDAD","Inversión","Un Nuevo Contrato Social y Ambiental para la Bogotá del Siglo XXI",6,{"$f":"IF(ISERROR(VLOOKUP(L78,Proposito_programa!$C$2:$E$59,2,FALSE)),\" \",VLOOKUP(L78,Proposito_programa!$C$2:$E$59,2,FALSE))","v":"Sistema Distrital de Cuidado"},{"$f":"IF(ISERROR(VLOOKUP(L78,Proposito_programa!$C$2:$E$59,3,FALSE)),\" \",VLOOKUP(L78,Proposito_programa!$C$2:$E$59,3,FALSE))","v":"Propósito 1: Hacer un nuevo contrato social para incrementar la inclusión social, productiva y política"},1628,1,79443949,"JORGE ERNESTO MONTOYA URIBE","Persona Natural",null,null,null,46008000,-1192800,1,2215200,47030400,43111200,44273,44273,44560,270,null,13,null,null,null,null,null,null,"X",null,0.91666666666666663]
[1,66,2021,"FDLC-SABM-001-2021","https://community.secop.gov.co/Public/Tendering/OpportunityDetail/Index?noticeUID=CO1.NTC.1866696&isFromPublicArea=True&isModal=False","Contratos de prestación de servicios","Régimen especial","Decreto 92 de 2017","LA SCB ACTUANDO EN NOMBRE PROPIO PERO POR CUENTA DE LA  ENTIDAD,QUIEN EN VIRTUD DE ESTE CONTRATO DE COMISION OSTENTA LA CALIDAD DE COMISIONISTA  COMPRADOR, ADQUIRIRÁ EN EL MERCADO DE COMPRAS PUBLICAS (MCP), \"CONTRATAR EL SERVICIO DE VIGILANCIA Y SEGURIDAD PRIVADA INTEGRAL PERMANENTE PARA TODOS LOS BIENES MUEBLES E INMUEBLES DE PROPIEDAD DE LA ENTIDAD Y DE LOS QUE ES LEGALMENTE O LLEGARA A SER RESPONSABLE, EL FONDO DE DESARROLLO LOCAL DE LA CANDELARIA","Funcionamiento","Un Nuevo Contrato Social y Ambiental para la Bogotá del Siglo XXI","No aplica",{"$f":"IF(ISERROR(VLOOKUP(L79,Proposito_programa!$C$2:$E$59,2,FALSE)),\" \",VLOOKUP(L79,Proposito_programa!$C$2:$E$59,2,FALSE))","v":" "},{"$f":"IF(ISERROR(VLOOKUP(L79,Proposito_programa!$C$2:$E$59,3,FALSE)),\" \",VLOOKUP(L79,Proposito_programa!$C$2:$E$59,3,FALSE))","v":" "},null,1,830103828,"AGROBOLSA","Persona Jurídica",null,null,null,804459085,null,null,null,804459085,652196703,44278,44287,44581,294,null,null,null,null,null,null,null,null,"X",null,{"$f":"IF(ISERROR(AB79/AA79),\"-\",(AB79/AA79))","v":0.81072700297741063}]
[1,67,2021,"FDLC-CPS-067-2021","https://community.secop.gov.co/Public/Tendering/OpportunityDetail/Index?noticeUID=CO1.NTC.1867014&isFromPublicArea=True&isModal=False","Contratos de prestación de servicios profesionales y de apoyo a la gestión","Contratación directa","Prestación de servicios profesionales y de apoyo a la gestión, o para la ejecución de trabajos artísticos que sólo puedan encomendarse a determinadas personas naturales;","PRESTAR SERVICIOS PROFESIONALES AL FONDO DE DESARROLLO LOCAL DE LA CANDELARIA PARA LA FORMULACIÓN Y SEGUIMIENTO DE PLANES, POLITICAS PROGRAMAS Y PROYECTOS RELACIONADOS CON LA ESTRATEGIA DE CUIDADO, PREVENCIÓN DE VIOLENCIAS Y PROYECTOS CON ENFOQUE DE GÉNERO DEL PLAN DE DESARROLLO LOCAL","Inversión","Un Nuevo Contrato Social y Ambiental para la Bogotá del Siglo XXI",6,{"$f":"IF(ISERROR(VLOOKUP(L80,Proposito_programa!$C$2:$E$59,2,FALSE)),\" \",VLOOKUP(L80,Proposito_programa!$C$2:$E$59,2,FALSE))","v":"Sistema Distrital de Cuidado"},{"$f":"IF(ISERROR(VLOOKUP(L80,Proposito_programa!$C$2:$E$59,3,FALSE)),\" \",VLOOKUP(L80,Proposito_programa!$C$2:$E$59,3,FALSE))","v":"Propósito 1: Hacer un nuevo contrato social para incrementar la inclusión social, productiva y política"},1663,1,1032470720,"YAISIR MARIA VIDAL SANCHEZ","Persona Natural",null,null,null,30672000,null,1,15336000,{"$f":"+W80+X80+Z80","v":46008000},37147200,44278,44278,44552,180,null,90,51857380,"LUZ MIREYA ROMERO",44520,5282400,null,null,"X",null,0.80740740740740746]
[1,68,2021,"FDLC-CPS-068-2021","https://community.secop.gov.co/Public/Tendering/OpportunityDetail/Index?noticeUID=CO1.NTC.1866852&isFromPublicArea=True&isModal=False","Contratos de prestación de servicios profesionales y de apoyo a la gestión","Contratación directa","Prestación de servicios profesionales y de apoyo a la gestión, o para la ejecución de trabajos artísticos que sólo puedan encomendarse a determinadas personas naturales;","PRESTAR SERVICIOS DE APOYO TÉCNICO AL ONDO DE DESARROLLO LOCAL DE LA CANDELARIA EN LAS GESTIONES ADMINISTRATIVAS RELACIONADAS CON EL CONJUNTO DE ACTIVIDADES PARA EL DESARROLLO DE LOS EJERCICIOS DE PARTICIPACIÓN E INTERLOCUCIÓN CON LA COMUNIDAD DE LA LOCALIDAD","Inversión","Un Nuevo Contrato Social y Ambiental para la Bogotá del Siglo XXI",55,{"$f":"IF(ISERROR(VLOOKUP(L81,Proposito_programa!$C$2:$E$59,2,FALSE)),\" \",VLOOKUP(L81,Proposito_programa!$C$2:$E$59,2,FALSE))","v":"Fortalecimiento de cultura ciudadana y su institucionalidad"},{"$f":"IF(ISERROR(VLOOKUP(L81,Proposito_programa!$C$2:$E$59,3,FALSE)),\" \",VLOOKUP(L81,Proposito_programa!$C$2:$E$59,3,FALSE))","v":"Propósito 5: Construir Bogotá - Región con gobierno abierto, transparente y ciudadanía consciente"},2019,1,1010223608,"LAURA CAMILA QUIROGA MILLAN","Persona Natural",null,null,null,25002000,null,1,1759400,26761400,22964800,44278,44278,44571,270,null,19,null,null,null,null,null,null,"X",null,0.8581314878892734]
[1,69,2021,"FDLC-CPS-069-2021","https://community.secop.gov.co/Public/Tendering/OpportunityDetail/Index?noticeUID=CO1.NTC.1869283&isFromPublicArea=True&isModal=true&asPopupView=true","Contratos de prestación de servicios profesionales y de apoyo a la gestión","Contratación directa","Prestación de servicios profesionales y de apoyo a la gestión, o para la ejecución de trabajos artísticos que sólo puedan encomendarse a determinadas personas naturales;","PRESTAR SERVICIOS DE APOYO EN LAS ACTIVIDADES DE SEGURIDAD Y CONVIVENCIA CIUDADANA, DE ACUERDO A LAS NECESIDADES Y ESTRATEGIAS DE LA ALCALDIA LOCAL DE LA CANDELARIA","Inversión","Un Nuevo Contrato Social y Ambiental para la Bogotá del Siglo XXI",43,{"$f":"IF(ISERROR(VLOOKUP(L82,Proposito_programa!$C$2:$E$59,2,FALSE)),\" \",VLOOKUP(L82,Proposito_programa!$C$2:$E$59,2,FALSE))","v":"Cultura ciudadana para la confianza, la convivencia y la participación desde la vida cotidiana"},{"$f":"IF(ISERROR(VLOOKUP(L82,Proposito_programa!$C$2:$E$59,3,FALSE)),\" \",VLOOKUP(L82,Proposito_programa!$C$2:$E$59,3,FALSE))","v":"Propósito 3: Inspirar confianza y legitimidad para vivir sin miedo y ser epicentro de cultura ciudadana, paz y reconciliación"},1785,1,52060667,"NELLY CONTRERAS ROJAS","Persona Natural",null,null,null,14220000,null,1,1211333,15431333,14641333,44279,44279,44576,270,null,23,null,null,null,null,null,null,"X",null,0.9488054596449963]
[1,70,2021,"FDLC-CPS-070-2021","https://community.secop.gov.co/Public/Tendering/OpportunityDetail/Index?noticeUID=CO1.NTC.1869240&isFromPublicArea=True&isModal=true&asPopupView=true","Contratos de prestación de servicios profesionales y de apoyo a la gestión","Contratación directa","Prestación de servicios profesionales y de apoyo a la gestión, o para la ejecución de trabajos artísticos que sólo puedan encomendarse a determinadas personas naturales;","PRESTAR SERVICIOS DE APOYO EN LAS ACTIVIDADES DE SEGURIDAD Y CONVIVENCIA CIUDADANA, DE ACUERDO A LAS NECESIDADES Y ESTRATEGIAS DE LA ALCALDIA LOCAL DE LA CANDELARIA","Inversión","Un Nuevo Contrato Social y Ambiental para la Bogotá del Siglo XXI",43,{"$f":"IF(ISERROR(VLOOKUP(L83,Proposito_programa!$C$2:$E$59,2,FALSE)),\" \",VLOOKUP(L83,Proposito_programa!$C$2:$E$59,2,FALSE))","v":"Cultura ciudadana para la confianza, la convivencia y la participación desde la vida cotidiana"},{"$f":"IF(ISERROR(VLOOKUP(L83,Proposito_programa!$C$2:$E$59,3,FALSE)),\" \",VLOOKUP(L83,Proposito_programa!$C$2:$E$59,3,FALSE))","v":"Propósito 3: Inspirar confianza y legitimidad para vivir sin miedo y ser epicentro de cultura ciudadana, paz y reconciliación"},1785,1,1010203707,"MICHAEL FELIPE RAMIREZ GARCIA","Persona Natural",null,null,null,14220000,null,1,1211333,15431333,14641333,44279,44279,44576,270,null,23,null,null,null,null,null,null,"X",null,0.9488054596449963]
[1,71,2021,"FDLC-CPS-071-2021","https://community.secop.gov.co/Public/Tendering/OpportunityDetail/Index?noticeUID=CO1.NTC.1869239&isFromPublicArea=True&isModal=true&asPopupView=true","Contratos de prestación de servicios profesionales y de apoyo a la gestión","Contratación directa","Prestación de servicios profesionales y de apoyo a la gestión, o para la ejecución de trabajos artísticos que sólo puedan encomendarse a determinadas personas naturales;","PRESTAR SERVICIOS DE APOYO EN LAS ACTIVIDADES DE SEGURIDAD Y CONVIVENCIA CIUDADANA, DE ACUERDO A LAS NECESIDADES Y ESTRATEGIAS DE LA ALCALDIA LOCAL DE LA CANDELARIA","Inversión","Un Nuevo Contrato Social y Ambiental para la Bogotá del Siglo XXI",43,{"$f":"IF(ISERROR(VLOOKUP(L84,Proposito_programa!$C$2:$E$59,2,FALSE)),\" \",VLOOKUP(L84,Proposito_programa!$C$2:$E$59,2,FALSE))","v":"Cultura ciudadana para la confianza, la convivencia y la participación desde la vida cotidiana"},{"$f":"IF(ISERROR(VLOOKUP(L84,Proposito_programa!$C$2:$E$59,3,FALSE)),\" \",VLOOKUP(L84,Proposito_programa!$C$2:$E$59,3,FALSE))","v":"Propósito 3: Inspirar confianza y legitimidad para vivir sin miedo y ser epicentro de cultura ciudadana, paz y reconciliación"},1785,1,1051654292,"TITO JOSÉ MUTIS VALEST ","Persona Natural",null,null,null,14220000,null,1,1211333,15431333,14641333,44279,44279,44576,270,null,23,null,null,null,null,null,null,"X",null,0.9488054596449963]
[1,72,2021,"FDLC-CPS-072-2021","https://community.secop.gov.co/Public/Tendering/OpportunityDetail/Index?noticeUID=CO1.NTC.1868886&isFromPublicArea=True&isModal=False","Contratos de prestación de servicios profesionales y de apoyo a la gestión","Contratación directa","Prestación de servicios profesionales y de apoyo a la gestión, o para la ejecución de trabajos artísticos que sólo puedan encomendarse a determinadas personas naturales;","PRESTAR SERVICIOS DE APOYO EN LAS ACTIVIDADES DE SEGURIDAD Y CONVIVENCIA CIUDADANA, DE ACUERDO A LAS NECESIDADES Y ESTRATEGIAS DE LA ALCALDIA LOCAL DE LA CANDELARIA","Inversión","Un Nuevo Contrato Social y Ambiental para la Bogotá del Siglo XXI",43,{"$f":"IF(ISERROR(VLOOKUP(L85,Proposito_programa!$C$2:$E$59,2,FALSE)),\" \",VLOOKUP(L85,Proposito_programa!$C$2:$E$59,2,FALSE))","v":"Cultura ciudadana para la confianza, la convivencia y la participación desde la vida cotidiana"},{"$f":"IF(ISERROR(VLOOKUP(L85,Proposito_programa!$C$2:$E$59,3,FALSE)),\" \",VLOOKUP(L85,Proposito_programa!$C$2:$E$59,3,FALSE))","v":"Propósito 3: Inspirar confianza y legitimidad para vivir sin miedo y ser epicentro de cultura ciudadana, paz y reconciliación"},1785,1,1010236602,"IVAN FELIPE SIERRA SANCHEZ","Persona Natural",null,null,null,14220000,null,1,1211333,15431333,13008667,44279,44279,44576,240,1,23,null,null,null,null,null,null,"X",null,0.84300345278013245]
[1,73,2021,"FDLC-CPS-073-2021","https://community.secop.gov.co/Public/Tendering/OpportunityDetail/Index?noticeUID=CO1.NTC.1872316&isFromPublicArea=True&isModal=true&asPopupView=true","Contratos de prestación de servicios profesionales y de apoyo a la gestión","Contratación directa","Prestación de servicios profesionales y de apoyo a la gestión, o para la ejecución de trabajos artísticos que sólo puedan encomendarse a determinadas personas naturales;","PRESTAR SERVICIOS DE APOYO EN LAS ACTIVIDADES DE SEGURIDAD Y CONVIVENCIA CIUDADANA, DE ACUERDO A LAS NECESIDADES Y ESTRATEGIAS DE LA ALCALDIA LOCAL DE LA CANDELARIA","Inversión","Un Nuevo Contrato Social y Ambiental para la Bogotá del Siglo XXI",43,{"$f":"IF(ISERROR(VLOOKUP(L86,Proposito_programa!$C$2:$E$59,2,FALSE)),\" \",VLOOKUP(L86,Proposito_programa!$C$2:$E$59,2,FALSE))","v":"Cultura ciudadana para la confianza, la convivencia y la participación desde la vida cotidiana"},{"$f":"IF(ISERROR(VLOOKUP(L86,Proposito_programa!$C$2:$E$59,3,FALSE)),\" \",VLOOKUP(L86,Proposito_programa!$C$2:$E$59,3,FALSE))","v":"Propósito 3: Inspirar confianza y legitimidad para vivir sin miedo y ser epicentro de cultura ciudadana, paz y reconciliación"},1785,1,10101195092,"MAYRA LIZETH DELGADO ACERO","Persona Natural",null,null,null,14220000,null,1,1158667,{"$f":"+W86+X86+Z86","v":15378667},11376000,44280,44280,44576,270,null,22,79579031,"WILSON  QUIROGA QUIROGA",44530,1264000,null,null,"X",null,0.73972601136366367]
[1,74,2021,"FDLC-CPS-074-2021","https://community.secop.gov.co/Public/Tendering/OpportunityDetail/Index?noticeUID=CO1.NTC.1871988&isFromPublicArea=True&isModal=true&asPopupView=true","Contratos de prestación de servicios profesionales y de apoyo a la gestión","Contratación directa","Prestación de servicios profesionales y de apoyo a la gestión, o para la ejecución de trabajos artísticos que sólo puedan encomendarse a determinadas personas naturales;","PRESTAR SERVICIOS DE APOYO EN LAS ACTIVIDADES DE SEGURIDAD Y CONVIVENCIA CIUDADANA, DE ACUERDO A LAS NECESIDADES Y ESTRATEGIAS DE LA ALCALDIA LOCAL DE LA CANDELARIA","Inversión","Un Nuevo Contrato Social y Ambiental para la Bogotá del Siglo XXI",43,{"$f":"IF(ISERROR(VLOOKUP(L87,Proposito_programa!$C$2:$E$59,2,FALSE)),\" \",VLOOKUP(L87,Proposito_programa!$C$2:$E$59,2,FALSE))","v":"Cultura ciudadana para la confianza, la convivencia y la participación desde la vida cotidiana"},{"$f":"IF(ISERROR(VLOOKUP(L87,Proposito_programa!$C$2:$E$59,3,FALSE)),\" \",VLOOKUP(L87,Proposito_programa!$C$2:$E$59,3,FALSE))","v":"Propósito 3: Inspirar confianza y legitimidad para vivir sin miedo y ser epicentro de cultura ciudadana, paz y reconciliación"},1785,1,79914457,"TARCISIO TORO ZAMBRANO","Persona Natural",null,null,null,14220000,null,1,1158667,{"$f":"+W87+X87+Z87","v":15378667},14588666,44280,44280,44576,270,null,22,null,null,null,null,null,null,"X",null,0.9486300730746039]
[1,75,2021,"FDLC-CPS-075-2021","https://community.secop.gov.co/Public/Tendering/OpportunityDetail/Index?noticeUID=CO1.NTC.1871987&isFromPublicArea=True&isModal=true&asPopupView=true","Contratos de prestación de servicios profesionales y de apoyo a la gestión","Contratación directa","Prestación de servicios profesionales y de apoyo a la gestión, o para la ejecución de trabajos artísticos que sólo puedan encomendarse a determinadas personas naturales;","PRESTAR SERVICIOS PROFESIONALES AL FONDO DE DESARROLLO LOCAL PARA APOYAR LA FORMULACIÓN, EJECUCIÓN, SEGUIMIENTO Y MEJORA CONTINUA DE LAS HERRAMIENTAS QUE CONFORMAN LA GESTIÓN AMBIENTAL INSTITUCIONAL DE LA ALCALDIA LOCAL","Inversión","Un Nuevo Contrato Social y Ambiental para la Bogotá del Siglo XXI",57,{"$f":"IF(ISERROR(VLOOKUP(L88,Proposito_programa!$C$2:$E$59,2,FALSE)),\" \",VLOOKUP(L88,Proposito_programa!$C$2:$E$59,2,FALSE))","v":"Gestión pública local"},{"$f":"IF(ISERROR(VLOOKUP(L88,Proposito_programa!$C$2:$E$59,3,FALSE)),\" \",VLOOKUP(L88,Proposito_programa!$C$2:$E$59,3,FALSE))","v":"Propósito 5: Construir Bogotá - Región con gobierno abierto, transparente y ciudadanía consciente"},2021,1,53032345,"SULY PAOLA CONTRERAS CRUZ","Persona Natural",null,null,null,33504000,null,1,5025600,38529600,34341600,44280,44280,44560,240,null,36,null,null,null,null,null,null,"X",null,0.89130434782608692]
[1,76,2020,"FDLC-LP-023-2020","https://community.secop.gov.co/Public/Tendering/OpportunityDetail/Index?noticeUID=CO1.NTC.1608090&isFromPublicArea=True&isModal=true&asPopupView=true","Obra pública","Licitación pública","No aplica","REALIZAR A PRECIOS UNITARIOS FIJOS LA FASE DE AJUSTES Y OBRA, NECESARIAS PARA LA TERMINACIÓN DE LA CONSTRUCCIÓN DE LA “CASA CULTURAL DEL ZIPA” UBICADA EN LA CALLE 9 N° 3-37 DEL FONDO DE DESARROLLO LOCAL DE LA CANDELARIA","Inversión","Un Nuevo Contrato Social y Ambiental para la Bogotá del Siglo XXI",21,{"$f":"IF(ISERROR(VLOOKUP(L89,Proposito_programa!$C$2:$E$59,2,FALSE)),\" \",VLOOKUP(L89,Proposito_programa!$C$2:$E$59,2,FALSE))","v":"Creación y vida cotidiana: Apropiación ciudadana del arte, la cultura y el patrimonio, para la democracia cultural"},{"$f":"IF(ISERROR(VLOOKUP(L89,Proposito_programa!$C$2:$E$59,3,FALSE)),\" \",VLOOKUP(L89,Proposito_programa!$C$2:$E$59,3,FALSE))","v":"Propósito 1: Hacer un nuevo contrato social para incrementar la inclusión social, productiva y política"},1625,11,901468887,"UNIÓN TEMPORAL RESTAURACIÓN ZIPA","Unión Temporal",800011687,"INCIVIAS S.A.S","50%",838211596,null,1,88118956,926330552,833692792,44286,44315,44513,193,1,30,null,null,null,null,null,null,"X",null,0.89999492103548795]
[0,76,2020,"FDLC-LP-023-2020","https://community.secop.gov.co/Public/Tendering/OpportunityDetail/Index?noticeUID=CO1.NTC.1608090&isFromPublicArea=True&isModal=true&asPopupView=true","Obra pública","Licitación pública","No aplica","REALIZAR A PRECIOS UNITARIOS FIJOS LA FASE DE AJUSTES Y OBRA, NECESARIAS PARA LA TERMINACIÓN DE LA CONSTRUCCIÓN DE LA “CASA CULTURAL DEL ZIPA” UBICADA EN LA CALLE 9 N° 3-37 DEL FONDO DE DESARROLLO LOCAL DE LA CANDELARIA","Inversión","Un Nuevo Contrato Social y Ambiental para la Bogotá del Siglo XXI",21,{"$f":"IF(ISERROR(VLOOKUP(L90,Proposito_programa!$C$2:$E$59,2,FALSE)),\" \",VLOOKUP(L90,Proposito_programa!$C$2:$E$59,2,FALSE))","v":"Creación y vida cotidiana: Apropiación ciudadana del arte, la cultura y el patrimonio, para la democracia cultural"},{"$f":"IF(ISERROR(VLOOKUP(L90,Proposito_programa!$C$2:$E$59,3,FALSE)),\" \",VLOOKUP(L90,Proposito_programa!$C$2:$E$59,3,FALSE))","v":"Propósito 1: Hacer un nuevo contrato social para incrementar la inclusión social, productiva y política"},1625,11,901468887,"UNIÓN TEMPORAL RESTAURACIÓN ZIPA","Unión Temporal",900388354,"VAREGO SOCIEDAD POR ACCIONES SIMPLIFICADA O VAREGO S.A.S","50%",0,null,null,null,0,0,44286,44315,44513,193,null,null,null,null,null,null,null,null,null,null,"-"]
[1,77,2020,"FDLC-CMA-024-2020","https://community.secop.gov.co/Public/Tendering/OpportunityDetail/Index?noticeUID=CO1.NTC.1618547&isFromPublicArea=True&isModal=true&asPopupView=true","Interventoría","Concurso de méritos","No aplica","INTERVENTORIA TECNICA, ADMINISTRATIVA, LEGAL, AMBIENTAL, SST Y SOCIAL PARA REALIZAR A PRECIOS UNITARIOS FIJOS LA FASE DE AJUSTES Y OBRA, NECESARIAS PARA LA TERMINACIÓN DE LA CONSTRUCCIÓN DE LA “CASA CULTURAL DEL ZIPA” UBICADA EN LA CALLE 9 N° 3-93 DEL FONDO DE DESARROLLO LOCAL DE LA CANDELARIA","Inversión","Un Nuevo Contrato Social y Ambiental para la Bogotá del Siglo XXI",21,{"$f":"IF(ISERROR(VLOOKUP(L91,Proposito_programa!$C$2:$E$59,2,FALSE)),\" \",VLOOKUP(L91,Proposito_programa!$C$2:$E$59,2,FALSE))","v":"Creación y vida cotidiana: Apropiación ciudadana del arte, la cultura y el patrimonio, para la democracia cultural"},{"$f":"IF(ISERROR(VLOOKUP(L91,Proposito_programa!$C$2:$E$59,3,FALSE)),\" \",VLOOKUP(L91,Proposito_programa!$C$2:$E$59,3,FALSE))","v":"Propósito 1: Hacer un nuevo contrato social para incrementar la inclusión social, productiva y política"},1625,2,901465521,"CONSORCIO EMUNARKING","Consorcio",901200185,"EMUNAH SAS","50%",119515360,null,1,21577318,{"$f":"+W91+X91+Z91","v":141092678},103458760,44286,44315,44513,193,1,30,null,null,null,null,null,null,"X",null,0.73326810056011549]
[0,77,2020,"FDLC-CMA-024-2020","https://community.secop.gov.co/Public/Tendering/OpportunityDetail/Index?noticeUID=CO1.NTC.1618547&isFromPublicArea=True&isModal=true&asPopupView=true","Interventoría","Concurso de méritos","No aplica","INTERVENTORIA TECNICA, ADMINISTRATIVA, LEGAL, AMBIENTAL, SST Y SOCIAL PARA REALIZAR A PRECIOS UNITARIOS FIJOS LA FASE DE AJUSTES Y OBRA, NECESARIAS PARA LA TERMINACIÓN DE LA CONSTRUCCIÓN DE LA “CASA CULTURAL DEL ZIPA” UBICADA EN LA CALLE 9 N° 3-93 DEL FONDO DE DESARROLLO LOCAL DE LA CANDELARIA","Inversión","Un Nuevo Contrato Social y Ambiental para la Bogotá del Siglo XXI",21,{"$f":"IF(ISERROR(VLOOKUP(L92,Proposito_programa!$C$2:$E$59,2,FALSE)),\" \",VLOOKUP(L92,Proposito_programa!$C$2:$E$59,2,FALSE))","v":"Creación y vida cotidiana: Apropiación ciudadana del arte, la cultura y el patrimonio, para la democracia cultural"},{"$f":"IF(ISERROR(VLOOKUP(L92,Proposito_programa!$C$2:$E$59,3,FALSE)),\" \",VLOOKUP(L92,Proposito_programa!$C$2:$E$59,3,FALSE))","v":"Propósito 1: Hacer un nuevo contrato social para incrementar la inclusión social, productiva y política"},1625,2,901465521,"CONSORCIO EMUNARKING","Consorcio",901368055,"ARKING OBRAS Y CONSULTORÍAS SAS","50%",0,null,null,null,0,0,44286,44315,44513,193,1,30,null,null,null,null,null,null,null,null,"-"]
[1,78,2021,"FDLC-CPS-078-2021","https://community.secop.gov.co/Public/Tendering/OpportunityDetail/Index?noticeUID=CO1.NTC.1875707&isFromPublicArea=True&isModal=true&asPopupView=true\n","Contratos de prestación de servicios profesionales y de apoyo a la gestión","Contratación directa","Prestación de servicios profesionales y de apoyo a la gestión, o para la ejecución de trabajos artísticos que sólo puedan encomendarse a determinadas personas naturales;","PRESTAR SERVICIOS DE APOYO EN LAS ACTIVIDADES DE SEGURIDAD Y CONVIVENCIA CIUDADANA, DE ACUERDO A LAS NECESIDADES Y ESTRATEGIAS DE LA ALCALDIA LOCAL DE LA CANDELARIA","Inversión","Un Nuevo Contrato Social y Ambiental para la Bogotá del Siglo XXI",43,{"$f":"IF(ISERROR(VLOOKUP(L93,Proposito_programa!$C$2:$E$59,2,FALSE)),\" \",VLOOKUP(L93,Proposito_programa!$C$2:$E$59,2,FALSE))","v":"Cultura ciudadana para la confianza, la convivencia y la participación desde la vida cotidiana"},{"$f":"IF(ISERROR(VLOOKUP(L93,Proposito_programa!$C$2:$E$59,3,FALSE)),\" \",VLOOKUP(L93,Proposito_programa!$C$2:$E$59,3,FALSE))","v":"Propósito 3: Inspirar confianza y legitimidad para vivir sin miedo y ser epicentro de cultura ciudadana, paz y reconciliación"},1785,1,39781586,"ALEXI NORVEI OSORIO RUIZ","Persona Natural",null,null,null,14220000,null,1,1106000,{"$f":"+W93+X93+Z93","v":15326000},14535999,44281,44281,44576,270,null,21,null,null,null,null,null,null,"X",null,0.94845354299882556]
[1,79,2021,"FDLC-CPS-079-2021","https://community.secop.gov.co/Public/Tendering/OpportunityDetail/Index?noticeUID=CO1.NTC.1875488&isFromPublicArea=True&isModal=true&asPopupView=true","Contratos de prestación de servicios profesionales y de apoyo a la gestión","Contratación directa","Prestación de servicios profesionales y de apoyo a la gestión, o para la ejecución de trabajos artísticos que sólo puedan encomendarse a determinadas personas naturales;","PRESTAR SERVICIOS DE APOYO EN LAS ACTIVIDADES DE SEGURIDAD Y CONVIVENCIA CIUDADANA, DE ACUERDO A LAS NECESIDADES Y ESTRATEGIAS DE LA ALCALDIA LOCAL DE LA CANDELARIA","Inversión","Un Nuevo Contrato Social y Ambiental para la Bogotá del Siglo XXI",43,{"$f":"IF(ISERROR(VLOOKUP(L94,Proposito_programa!$C$2:$E$59,2,FALSE)),\" \",VLOOKUP(L94,Proposito_programa!$C$2:$E$59,2,FALSE))","v":"Cultura ciudadana para la confianza, la convivencia y la participación desde la vida cotidiana"},{"$f":"IF(ISERROR(VLOOKUP(L94,Proposito_programa!$C$2:$E$59,3,FALSE)),\" \",VLOOKUP(L94,Proposito_programa!$C$2:$E$59,3,FALSE))","v":"Propósito 3: Inspirar confianza y legitimidad para vivir sin miedo y ser epicentro de cultura ciudadana, paz y reconciliación"},1785,1,79984961,"JOHN STEVE TIMBERLAKE OSORIO","Persona Natural",null,null,null,14220000,null,1,1106000,{"$f":"+W94+X94+Z94","v":15326000},14535999,44281,44281,44576,270,null,21,null,null,null,null,null,null,"X",null,0.94845354299882556]
[1,80,2021,"FDLC-CPS-080-2021","https://community.secop.gov.co/Public/Tendering/OpportunityDetail/Index?noticeUID=CO1.NTC.1875724&isFromPublicArea=True&isModal=true&asPopupView=true","Contratos de prestación de servicios profesionales y de apoyo a la gestión","Contratación directa","Prestación de servicios profesionales y de apoyo a la gestión, o para la ejecución de trabajos artísticos que sólo puedan encomendarse a determinadas personas naturales;","PRESTAR SERVICIOS PROFESIONALES AL FONDO DE DESARROLLO LOCAL DE LA CANDELARIA PARA APOYAR LA GESTION DE LOS ASUNTOS RELACIONADOS CON SEGURIDAD CIUDADANA Y CONVIVENCIA EN EL ESPACIO PÚBLICO DE LA LOCALIDAD","Inversión","Un Nuevo Contrato Social y Ambiental para la Bogotá del Siglo XXI",45,{"$f":"IF(ISERROR(VLOOKUP(L95,Proposito_programa!$C$2:$E$59,2,FALSE)),\" \",VLOOKUP(L95,Proposito_programa!$C$2:$E$59,2,FALSE))","v":"Espacio público más seguro y construido colectivamente"},{"$f":"IF(ISERROR(VLOOKUP(L95,Proposito_programa!$C$2:$E$59,3,FALSE)),\" \",VLOOKUP(L95,Proposito_programa!$C$2:$E$59,3,FALSE))","v":"Propósito 3: Inspirar confianza y legitimidad para vivir sin miedo y ser epicentro de cultura ciudadana, paz y reconciliación"},1786,1,65588590,"LILIANA CECILIA OJEDA TIRADO","Persona Natural",null,null,null,37692000,null,1,16752000,54444000,34202000,44281,44281,44676,270,1,120,"\n12005600"," \nANDRES FELIPE RODRIGUEZ VERDUGO",44469,44951200,null,null,"X",null,0.62820512820512819]
[1,81,2021,"FDLC-CPS-081-2021","https://community.secop.gov.co/Public/Tendering/OpportunityDetail/Index?noticeUID=CO1.NTC.1907560&isFromPublicArea=True&isModal=true&asPopupView=true","Contratos de prestación de servicios profesionales y de apoyo a la gestión","Contratación directa","Prestación de servicios profesionales y de apoyo a la gestión, o para la ejecución de trabajos artísticos que sólo puedan encomendarse a determinadas personas naturales;","PRESTAR SERVICIOS PROFESIONALES AL FONDO DE DESARROLLO LOCAL DE LA CANDELARIA PARA APOYAR LA ARTICULACIÓN ENTRE EL DESPACHO DE LA ALCALDESA LOCAL CON LOS PROCESOS DE CONTRATACIÓN Y PLANEACIÓN EN LOS ASUNTOS PRIORITARIOS Y ESTRATÉGICOS PARA LA GESTIÓN CONTRACTUAL","Inversión","Un Nuevo Contrato Social y Ambiental para la Bogotá del Siglo XXI",57,{"$f":"IF(ISERROR(VLOOKUP(L96,Proposito_programa!$C$2:$E$59,2,FALSE)),\" \",VLOOKUP(L96,Proposito_programa!$C$2:$E$59,2,FALSE))","v":"Gestión pública local"},{"$f":"IF(ISERROR(VLOOKUP(L96,Proposito_programa!$C$2:$E$59,3,FALSE)),\" \",VLOOKUP(L96,Proposito_programa!$C$2:$E$59,3,FALSE))","v":"Propósito 5: Construir Bogotá - Región con gobierno abierto, transparente y ciudadanía consciente"},2021,1,1032363826,"PAOLA ANDREA PADILLA AYARZA","Persona Natural",null,null,null,43350000,null,1,4080000,47430000,44200000,44298,44298,44580,255,null,24,null,null,null,null,null,null,"X",null,0.93189964157706096]
[1,82,2021,"FDLC-CPS-082-2021","https://community.secop.gov.co/Public/Tendering/OpportunityDetail/Index?noticeUID=CO1.NTC.1910126&isFromPublicArea=True&isModal=true&asPopupView=true","Contratos de prestación de servicios profesionales y de apoyo a la gestión","Contratación directa","Prestación de servicios profesionales y de apoyo a la gestión, o para la ejecución de trabajos artísticos que sólo puedan encomendarse a determinadas personas naturales;","PRESTAR SERVICIOS PROFESIONALES AL FONDO DE DESARROLLO LOCAL DE LA CANDELARIA EN LOS TRÁMITES RELACIONADOS CON LOS PROCESOS PRECONTRACTUALES, CONTRACTUALES Y POS CONTRACTUALES, ASÍ COMO LA ADQUISICIÓN DE BIENES Y SERVICIOS A TRAVÉS DE LA TIENDA VIRTUAL DEL ESTADO COLOMBIANO","Inversión","Un Nuevo Contrato Social y Ambiental para la Bogotá del Siglo XXI",57,{"$f":"IF(ISERROR(VLOOKUP(L97,Proposito_programa!$C$2:$E$59,2,FALSE)),\" \",VLOOKUP(L97,Proposito_programa!$C$2:$E$59,2,FALSE))","v":"Gestión pública local"},{"$f":"IF(ISERROR(VLOOKUP(L97,Proposito_programa!$C$2:$E$59,3,FALSE)),\" \",VLOOKUP(L97,Proposito_programa!$C$2:$E$59,3,FALSE))","v":"Propósito 5: Construir Bogotá - Región con gobierno abierto, transparente y ciudadanía consciente"},2021,1,91519052,"HELBERTH ANTONIO LOPEZ PEDRAZA","Persona Natural",null,null,null,42456000,-18043800,null,null,24412200,24412200,44299,44299,44542,240,null,null,null,null,null,null,null,null,"X",null,1]
[1,83,2021,"FDLC-CPS-083-2021","https://community.secop.gov.co/Public/Tendering/OpportunityDetail/Index?noticeUID=CO1.NTC.1912063&isFromPublicArea=True&isModal=true&asPopupView=true","Contratos de prestación de servicios profesionales y de apoyo a la gestión","Contratación directa","Prestación de servicios profesionales y de apoyo a la gestión, o para la ejecución de trabajos artísticos que sólo puedan encomendarse a determinadas personas naturales;","PRESTAR SERVICIOS PROFESIONALES AL FONDO DE DESARROLLO LOCAL DE LA CANDELARIA PARA LA FORMULACIÓN Y SEGUIMIENTO A LA EJECUCIÓN DE PLANES, POLÍTICAS PROGRAMAS Y PROYECTOS RELACIONADOS CON DOTACIÓN DE COLEGIOS Y PROGRAMAS RELACIONADOS CON EDUCACIÓN Y DESARROLLO INTEGRAL","Inversión","Un Nuevo Contrato Social y Ambiental para la Bogotá del Siglo XXI",12,{"$f":"IF(ISERROR(VLOOKUP(L98,Proposito_programa!$C$2:$E$59,2,FALSE)),\" \",VLOOKUP(L98,Proposito_programa!$C$2:$E$59,2,FALSE))","v":"Educación inicial: Bases sólidas para la vida."},{"$f":"IF(ISERROR(VLOOKUP(L98,Proposito_programa!$C$2:$E$59,3,FALSE)),\" \",VLOOKUP(L98,Proposito_programa!$C$2:$E$59,3,FALSE))","v":"Propósito 1: Hacer un nuevo contrato social para incrementar la inclusión social, productiva y política"},1608,1,41648295,"ISABEL SANCHEZ RODRIGUEZ","Persona Natural",null,null,null,20448000,null,null,null,20448000,20448000,44300,44300,44421,120,null,null,null,null,null,null,null,null,"X",null,1]
[1,84,2021,"FDLC-CPS-084-2021","https://community.secop.gov.co/Public/Tendering/OpportunityDetail/Index?noticeUID=CO1.NTC.1912533&isFromPublicArea=True&isModal=true&asPopupView=true","Contratos de prestación de servicios profesionales y de apoyo a la gestión","Contratación directa","Prestación de servicios profesionales y de apoyo a la gestión, o para la ejecución de trabajos artísticos que sólo puedan encomendarse a determinadas personas naturales;","PRESTAR SERVICIOS PROFESIONALES AL FONDO DE DESARROLLO LOCAL DE LA CANDELARIA PARA LA FORMULACIÓN Y SEGUIMIENTO A LA EJECUCIÓN DE PLANES, POLÍTICAS PROGRAMAS Y PROYECTOS RELACIONADOS CON DOTACIÓN DE COLEGIOS Y PROGRAMAS RELACIONADOS CON EDUCACIÓN Y DESARROLLO INTEGRAL","Inversión","Un Nuevo Contrato Social y Ambiental para la Bogotá del Siglo XXI",14,{"$f":"IF(ISERROR(VLOOKUP(L99,Proposito_programa!$C$2:$E$59,2,FALSE)),\" \",VLOOKUP(L99,Proposito_programa!$C$2:$E$59,2,FALSE))","v":"Formación integral: más y mejor tiempo en los colegios"},{"$f":"IF(ISERROR(VLOOKUP(L99,Proposito_programa!$C$2:$E$59,3,FALSE)),\" \",VLOOKUP(L99,Proposito_programa!$C$2:$E$59,3,FALSE))","v":"Propósito 1: Hacer un nuevo contrato social para incrementar la inclusión social, productiva y política"},1606,1,1032451555,"CRISTHIAN BRAINER PEÑA ORTIZ","Persona Natural",null,null,null,30672000,null,null,null,30672000,30672000,44300,44300,44482,180,null,null,null,null,null,null,null,null,"X",null,1]
[1,85,2021,"FDLC-CPS-085-2021","https://community.secop.gov.co/Public/Tendering/OpportunityDetail/Index?noticeUID=CO1.NTC.1912286&isFromPublicArea=True&isModal=true&asPopupView=true","Contratos de prestación de servicios profesionales y de apoyo a la gestión","Contratación directa","Prestación de servicios profesionales y de apoyo a la gestión, o para la ejecución de trabajos artísticos que sólo puedan encomendarse a determinadas personas naturales;","PRESTAR SERVICIOS PROFESIONALES AL FONDO DE DESARROLLO LOCAL DE LA CANDELARIA PARA LA FORMULACIÓN Y APOYO TÉCNICO EN EL SEGUIMIENTO DE PLANES, POLÍTICAS PROGRAMAS Y PROYECTOS ENMARCADOS ACTIVIDADES APOYO A PROCESOS EDUCATIVOS ASÍ COMO PROGRAMAS DE ACCESO A LA EDUCACION SUPERIOR","Inversión","Un Nuevo Contrato Social y Ambiental para la Bogotá del Siglo XXI",17,{"$f":"IF(ISERROR(VLOOKUP(L100,Proposito_programa!$C$2:$E$59,2,FALSE)),\" \",VLOOKUP(L100,Proposito_programa!$C$2:$E$59,2,FALSE))","v":"Jóvenes con capacidades: Proyecto de vida para la ciudadanía, la innovación y el trabajo del siglo XXI"},{"$f":"IF(ISERROR(VLOOKUP(L100,Proposito_programa!$C$2:$E$59,3,FALSE)),\" \",VLOOKUP(L100,Proposito_programa!$C$2:$E$59,3,FALSE))","v":"Propósito 1: Hacer un nuevo contrato social para incrementar la inclusión social, productiva y política"},1607,1,40020996,"ANA MERCEDES PEDROZA ARIAS","Persona Natural",null,null,null,30672000,null,null,null,30672000,30672000,44300,44300,44482,180,null,null,null,null,null,null,null,null,"X",null,1]
[1,86,2021,"FDLC-CPS-086-2021","https://community.secop.gov.co/Public/Tendering/OpportunityDetail/Index?noticeUID=CO1.NTC.1915471&isFromPublicArea=True&isModal=true&asPopupView=true","Contratos de prestación de servicios profesionales y de apoyo a la gestión","Contratación directa","Prestación de servicios profesionales y de apoyo a la gestión, o para la ejecución de trabajos artísticos que sólo puedan encomendarse a determinadas personas naturales;","PRESTAR SERVICIOS PROFESIONALES PARA APOYAR AL FONDO DE DESARROLLO LOCAL DE LA CANDELARIA EN LA FORMULACIÓN,IMPLEMENTACIÓN Y SEGUIMIENTO DE LOS PROYECTOS Y ACTIVIDADES ARTÍSTICAS,CULTURALES, MUSICALES Y DEPORTIVAS DE COMPETENCIA DE LA ENTIDAD","Inversión","Un Nuevo Contrato Social y Ambiental para la Bogotá del Siglo XXI",21,{"$f":"IF(ISERROR(VLOOKUP(L101,Proposito_programa!$C$2:$E$59,2,FALSE)),\" \",VLOOKUP(L101,Proposito_programa!$C$2:$E$59,2,FALSE))","v":"Creación y vida cotidiana: Apropiación ciudadana del arte, la cultura y el patrimonio, para la democracia cultural"},{"$f":"IF(ISERROR(VLOOKUP(L101,Proposito_programa!$C$2:$E$59,3,FALSE)),\" \",VLOOKUP(L101,Proposito_programa!$C$2:$E$59,3,FALSE))","v":"Propósito 1: Hacer un nuevo contrato social para incrementar la inclusión social, productiva y política"},1625,1,79201995,"FREDDY ALFONSO PAREJA PESCA","Persona Natural",null,null,null,40896000,null,null,null,40896000,0,44301,44301,44544,240,null,null,79505441,"GABRIEL ALBERTO MARTIN QUESADA GOERNITZ",44398,24537600,null,null,"X",null,0]
[1,87,2021,"FDLC-CPS-087-2021","https://community.secop.gov.co/Public/Tendering/OpportunityDetail/Index?noticeUID=CO1.NTC.1928640&isFromPublicArea=True&isModal=true&asPopupView=true","Contratos de prestación de servicios profesionales y de apoyo a la gestión","Contratación directa","Prestación de servicios profesionales y de apoyo a la gestión, o para la ejecución de trabajos artísticos que sólo puedan encomendarse a determinadas personas naturales;","PRESTAR SERVICIOS DE APOYO LOGÍSTICO EN LOS EVENTOS Y ACTIVIDADES DE LA ADMINISTRACIÓN LOCAL DE LA LOCALIDAD DE LA CANDELARIA","Inversión","Un Nuevo Contrato Social y Ambiental para la Bogotá del Siglo XXI",45,{"$f":"IF(ISERROR(VLOOKUP(L102,Proposito_programa!$C$2:$E$59,2,FALSE)),\" \",VLOOKUP(L102,Proposito_programa!$C$2:$E$59,2,FALSE))","v":"Espacio público más seguro y construido colectivamente"},{"$f":"IF(ISERROR(VLOOKUP(L102,Proposito_programa!$C$2:$E$59,3,FALSE)),\" \",VLOOKUP(L102,Proposito_programa!$C$2:$E$59,3,FALSE))","v":"Propósito 3: Inspirar confianza y legitimidad para vivir sin miedo y ser epicentro de cultura ciudadana, paz y reconciliación"},1786,1,80741660,"OCTAVIO JIMENEZ GUTIERREZ","Persona Natural",null,null,null,14520000,null,null,null,14520000,14520000,44307,44307,44550,240,null,null,null,null,null,null,null,null,"X",null,1]
[1,88,2021,"FDLC-CPS-088-2021","https://community.secop.gov.co/Public/Tendering/OpportunityDetail/Index?noticeUID=CO1.NTC.1941073&isFromPublicArea=True&isModal=true&asPopupView=true","Contratos de prestación de servicios profesionales y de apoyo a la gestión","Contratación directa","Prestación de servicios profesionales y de apoyo a la gestión, o para la ejecución de trabajos artísticos que sólo puedan encomendarse a determinadas personas naturales;","PRESTACIÓN DE SERVICIOS PROFESIONALES EN LA IMPLEMENTACIÓN DE ACCIONES Y ESTRATEGIAS CULTURALES, MUSICALES Y ARTÍSTICAS ENFOCADAS A LAS INSTANCIAS DE PARTICIPACIÓN DE LA LOCALIDAD LA CANDELARIA, DE ACUERDO AL PROYECTO 1625 \"LA CANDELARIA CULTURAL, ARTISTICA Y PATRIMONIAL","Inversión","Un Nuevo Contrato Social y Ambiental para la Bogotá del Siglo XXI",21,{"$f":"IF(ISERROR(VLOOKUP(L103,Proposito_programa!$C$2:$E$59,2,FALSE)),\" \",VLOOKUP(L103,Proposito_programa!$C$2:$E$59,2,FALSE))","v":"Creación y vida cotidiana: Apropiación ciudadana del arte, la cultura y el patrimonio, para la democracia cultural"},{"$f":"IF(ISERROR(VLOOKUP(L103,Proposito_programa!$C$2:$E$59,3,FALSE)),\" \",VLOOKUP(L103,Proposito_programa!$C$2:$E$59,3,FALSE))","v":"Propósito 1: Hacer un nuevo contrato social para incrementar la inclusión social, productiva y política"},1625,1,1010207254,"ELY DAVID MURILLO CORDOBA","Persona Natural",null,null,null,16284000,null,null,null,16284000,16284000,44313,44313,44434,120,null,null,null,null,null,null,null,null,"X",null,1]
[1,89,2021,"FDLC-CPS-089-2021","https://community.secop.gov.co/Public/Tendering/OpportunityDetail/Index?noticeUID=CO1.NTC.1941076&isFromPublicArea=True&isModal=true&asPopupView=true","Contratos de prestación de servicios profesionales y de apoyo a la gestión","Contratación directa","Prestación de servicios profesionales y de apoyo a la gestión, o para la ejecución de trabajos artísticos que sólo puedan encomendarse a determinadas personas naturales;","PRESTAR SERVICIOS DE APOYO EN LA EMISORA A CARGO DEL FONDO DE DESARROLLO LOCAL LA CANDELARIA","Inversión","Un Nuevo Contrato Social y Ambiental para la Bogotá del Siglo XXI",21,{"$f":"IF(ISERROR(VLOOKUP(L104,Proposito_programa!$C$2:$E$59,2,FALSE)),\" \",VLOOKUP(L104,Proposito_programa!$C$2:$E$59,2,FALSE))","v":"Creación y vida cotidiana: Apropiación ciudadana del arte, la cultura y el patrimonio, para la democracia cultural"},{"$f":"IF(ISERROR(VLOOKUP(L104,Proposito_programa!$C$2:$E$59,3,FALSE)),\" \",VLOOKUP(L104,Proposito_programa!$C$2:$E$59,3,FALSE))","v":"Propósito 1: Hacer un nuevo contrato social para incrementar la inclusión social, productiva y política"},1625,1,14250858,"RICARDO ABEL ROLDAN CORREA","Persona Natural",null,null,null,9800000,null,null,null,9800000,9800000,44313,44313,44434,120,null,null,null,null,null,null,null,null,"X",null,1]
[1,90,2021,"FDLC-CPS-090-2021","https://community.secop.gov.co/Public/Tendering/OpportunityDetail/Index?noticeUID=CO1.NTC.1942383&isFromPublicArea=True&isModal=true&asPopupView=true","Contratos de prestación de servicios profesionales y de apoyo a la gestión","Contratación directa","Prestación de servicios profesionales y de apoyo a la gestión, o para la ejecución de trabajos artísticos que sólo puedan encomendarse a determinadas personas naturales;","PRESTAR SERVICIOS DE APOYO ADMINISTRATIVO Y ASISTENCIAL AL ÁREA DE GESTIÓN DE DESARROLLO LOCAL, EN LOS PROCESOS DE COMPETENCIA RELACIONADOS CON LA PLANEACIÓN DE LA ALCALDÍA LOCAL DE LA CANDELARIA","Inversión","Un Nuevo Contrato Social y Ambiental para la Bogotá del Siglo XXI",57,{"$f":"IF(ISERROR(VLOOKUP(L105,Proposito_programa!$C$2:$E$59,2,FALSE)),\" \",VLOOKUP(L105,Proposito_programa!$C$2:$E$59,2,FALSE))","v":"Gestión pública local"},{"$f":"IF(ISERROR(VLOOKUP(L105,Proposito_programa!$C$2:$E$59,3,FALSE)),\" \",VLOOKUP(L105,Proposito_programa!$C$2:$E$59,3,FALSE))","v":"Propósito 5: Construir Bogotá - Región con gobierno abierto, transparente y ciudadanía consciente"},2021,1,1001281981,"YEISON ESMIK GOMEZ HERNANDEZ","Persona Natural",null,null,null,6000000,null,null,null,6000000,6000000,44314,44314,44435,120,null,null,null,null,null,null,null,null,"X",null,1]
[1,91,2021,"FDLC-CPS-091-2021","https://community.secop.gov.co/Public/Tendering/OpportunityDetail/Index?noticeUID=CO1.NTC.1955027&isFromPublicArea=True&isModal=true&asPopupView=true","Contratos de prestación de servicios profesionales y de apoyo a la gestión","Contratación directa","Prestación de servicios profesionales y de apoyo a la gestión, o para la ejecución de trabajos artísticos que sólo puedan encomendarse a determinadas personas naturales;","PRESTAR SERVICIOS PROFESIONALES AL FONDO DE DESARROLLO LOCAL DE LA CANDELARIA PARA APOYAR EL SEGUIMIENTO Y EJECUCION DE LOS PROGRAMAS AMBIENTALES Y DE AGRICULTURA URBANA EN LA LOCALIDAD","Inversión","Un Nuevo Contrato Social y Ambiental para la Bogotá del Siglo XXI",24,{"$f":"IF(ISERROR(VLOOKUP(L106,Proposito_programa!$C$2:$E$59,2,FALSE)),\" \",VLOOKUP(L106,Proposito_programa!$C$2:$E$59,2,FALSE))","v":"Bogotá región emprendedora e innovadora"},{"$f":"IF(ISERROR(VLOOKUP(L106,Proposito_programa!$C$2:$E$59,3,FALSE)),\" \",VLOOKUP(L106,Proposito_programa!$C$2:$E$59,3,FALSE))","v":"Propósito 1: Hacer un nuevo contrato social para incrementar la inclusión social, productiva y política"},1626,1,1013628927,"DAISSY TATIANA FAJARDO VELASCO","Persona Natural",null,null,null,16752000,null,null,null,16752000,16752000,44320,44320,44442,120,null,null,null,null,null,null,null,null,"X",null,1]
[1,92,2021,"FDLC-CPS-092-2021","https://community.secop.gov.co/Public/Tendering/OpportunityDetail/Index?noticeUID=CO1.NTC.1956135&isFromPublicArea=True&isModal=true&asPopupView=true","Contratos de prestación de servicios profesionales y de apoyo a la gestión","Contratación directa","Prestación de servicios profesionales y de apoyo a la gestión, o para la ejecución de trabajos artísticos que sólo puedan encomendarse a determinadas personas naturales;","PRESTAR SERVICIOS PROFESIONALES AL FONDO DE DESARROLLO LOCAL DE LA CANDELARIA PARA LA FORMULACIÓN Y SEGUIMIENTO A LA EJECUCIÓN DE PLANES, POLÍTICAS PROGRAMAS Y PROYECTOS RELACIONADOS CON LOS PROCESOS COMUNITARIOS Y DE PARTICIPACIÓN CIUDADANA EN LA LOCALIDAD","Inversión","Un Nuevo Contrato Social y Ambiental para la Bogotá del Siglo XXI",55,{"$f":"IF(ISERROR(VLOOKUP(L107,Proposito_programa!$C$2:$E$59,2,FALSE)),\" \",VLOOKUP(L107,Proposito_programa!$C$2:$E$59,2,FALSE))","v":"Fortalecimiento de cultura ciudadana y su institucionalidad"},{"$f":"IF(ISERROR(VLOOKUP(L107,Proposito_programa!$C$2:$E$59,3,FALSE)),\" \",VLOOKUP(L107,Proposito_programa!$C$2:$E$59,3,FALSE))","v":"Propósito 5: Construir Bogotá - Región con gobierno abierto, transparente y ciudadanía consciente"},2019,1,1067813377,"DANIELA LUCIA OÑATE LOPEZ","Persona Natural",null,null,null,20448000,null,null,null,20448000,20448000,44320,44320,44442,120,null,null,null,null,null,null,null,null,"X",null,1]
[1,93,2021,"FDLC-CPS-093-2021","https://community.secop.gov.co/Public/Tendering/OpportunityDetail/Index?noticeUID=CO1.NTC.1969054&isFromPublicArea=True&isModal=False","Contratos de prestación de servicios profesionales y de apoyo a la gestión","Contratación directa","Prestación de servicios profesionales y de apoyo a la gestión, o para la ejecución de trabajos artísticos que sólo puedan encomendarse a determinadas personas naturales;","PRESTAR SERVICIOS DE APOYO TÉCNICO AL FONDO DE DESARROLLO LOCAL DE LA CANDELARIA PARA APOYAR LA GESTION DE LOS ASUNTOS RELACIONADOS CON SEGURIDAD CIUDADANA Y CONVIVENCIA EN EL ESPACIO PÚBLICO DE LA LOCALIDAD","Inversión","Un Nuevo Contrato Social y Ambiental para la Bogotá del Siglo XXI",45,{"$f":"IF(ISERROR(VLOOKUP(L108,Proposito_programa!$C$2:$E$59,2,FALSE)),\" \",VLOOKUP(L108,Proposito_programa!$C$2:$E$59,2,FALSE))","v":"Espacio público más seguro y construido colectivamente"},{"$f":"IF(ISERROR(VLOOKUP(L108,Proposito_programa!$C$2:$E$59,3,FALSE)),\" \",VLOOKUP(L108,Proposito_programa!$C$2:$E$59,3,FALSE))","v":"Propósito 3: Inspirar confianza y legitimidad para vivir sin miedo y ser epicentro de cultura ciudadana, paz y reconciliación"},1786,1,53121023,"NUBIA ALEJANDRA TOVAR NUÑEZ","Persona Natural",null,null,null,14535000,null,1,7267500,21802500,19476900,44327,44327,44479,150,null,null,null,null,null,null,null,null,"X",null,0.89333333333333331]
[1,94,2021,"FDLC-CPS-094-2021","https://community.secop.gov.co/Public/Tendering/OpportunityDetail/Index?noticeUID=CO1.NTC.1969456&isFromPublicArea=True&isModal=true&asPopupView=true","Contratos de prestación de servicios profesionales y de apoyo a la gestión","Contratación directa","Prestación de servicios profesionales y de apoyo a la gestión, o para la ejecución de trabajos artísticos que sólo puedan encomendarse a determinadas personas naturales;","PRESTAR SERVICIOS PROFESIONALES PARA APOYAR AL FONDO DE DESARROLLO LOCAL DE LA CANDELARIA EN EL SEGUIMIENTO Y VISUALIZACION DE LA GESTION REALIZADA, EN DESARROLLO DE LOS PROGRAMAS DE ATENCIÓN Y PROTECCIÓN A LOS ANIMALES EN LA LOCALIDAD","Inversión","Un Nuevo Contrato Social y Ambiental para la Bogotá del Siglo XXI",34,{"$f":"IF(ISERROR(VLOOKUP(L109,Proposito_programa!$C$2:$E$59,2,FALSE)),\" \",VLOOKUP(L109,Proposito_programa!$C$2:$E$59,2,FALSE))","v":"Bogotá protectora de los animales"},{"$f":"IF(ISERROR(VLOOKUP(L109,Proposito_programa!$C$2:$E$59,3,FALSE)),\" \",VLOOKUP(L109,Proposito_programa!$C$2:$E$59,3,FALSE))","v":"Propósito 2 : Cambiar Nuestros Hábitos de Vida para Reverdecer a Bogotá y Adaptarnos y Mitigar la Crisis Climática"},1704,1,1072707755,"NICOLLE SELESTE ROJAS CAMACHO","Persona Natural",null,null,null,12000000,null,null,null,12000000,12000000,44327,44327,44418,90,null,null,null,null,null,null,null,null,"X",null,1]
[1,95,2021,"FDLC-CPS-095-2021","https://community.secop.gov.co/Public/Tendering/OpportunityDetail/Index?noticeUID=CO1.NTC.1974903&isFromPublicArea=True&isModal=true&asPopupView=true","Contratos de prestación de servicios profesionales y de apoyo a la gestión","Contratación directa","Prestación de servicios profesionales y de apoyo a la gestión, o para la ejecución de trabajos artísticos que sólo puedan encomendarse a determinadas personas naturales;","PRESTAR SERVICIOS PROFESIONALES PARA APOYAR EL SEGUIMIENTO JURÍDICO DE LOS PROYECTOS DE INFRAESTRUCTURA Y OBRA, ASÍ COMO LOS DEMÁS ASUNTOS CONTRACTUALES QUE SE REQUIERAN","Inversión","Un Nuevo Contrato Social y Ambiental para la Bogotá del Siglo XXI",49,{"$f":"IF(ISERROR(VLOOKUP(L110,Proposito_programa!$C$2:$E$59,2,FALSE)),\" \",VLOOKUP(L110,Proposito_programa!$C$2:$E$59,2,FALSE))","v":"Movilidad segura, sostenible y accesible"},{"$f":"IF(ISERROR(VLOOKUP(L110,Proposito_programa!$C$2:$E$59,3,FALSE)),\" \",VLOOKUP(L110,Proposito_programa!$C$2:$E$59,3,FALSE))","v":"Propósito 4: Hacer de Bogotá Región un modelo de movilidad multimodal, incluyente y sostenible"},2020,1,86009829,"ANDRES FERNANDO PINTO CALDERON","Persona Natural",null,null,null,25560000,null,1,12780000,38340000,38340000,44329,44329,44557,150,{"$f":"+AD110+AF110+AH110","v":44554},75,null,null,null,null,null,null,"X",null,1]
[1,96,2021,"FDLC-CPS-096-2021","https://community.secop.gov.co/Public/Tendering/OpportunityDetail/Index?noticeUID=CO1.NTC.2030451&isFromPublicArea=True&isModal=False","Contratos de prestación de servicios profesionales y de apoyo a la gestión","Contratación directa","Prestación de servicios profesionales y de apoyo a la gestión, o para la ejecución de trabajos artísticos que sólo puedan encomendarse a determinadas personas naturales;","PRESTAR SERVICIOS PROFESIONALES PARA EL SEGUIMIENTO JURÍDICO DE LOS PROYECTOS DE INFRAESTRUCTURA, ASÍ COMO LOS DEMÁS ASUNTOS CONTRACTUALES QUE SE REQUIERAN.","Inversión","Un Nuevo Contrato Social y Ambiental para la Bogotá del Siglo XXI",49,{"$f":"IF(ISERROR(VLOOKUP(L111,Proposito_programa!$C$2:$E$59,2,FALSE)),\" \",VLOOKUP(L111,Proposito_programa!$C$2:$E$59,2,FALSE))","v":"Movilidad segura, sostenible y accesible"},{"$f":"IF(ISERROR(VLOOKUP(L111,Proposito_programa!$C$2:$E$59,3,FALSE)),\" \",VLOOKUP(L111,Proposito_programa!$C$2:$E$59,3,FALSE))","v":"Propósito 4: Hacer de Bogotá Región un modelo de movilidad multimodal, incluyente y sostenible"},2020,1,1102807537,"JOSE MARIA CONDE AREVALO","Persona Natural",null,null,null,33000000,null,1,7333333,40333333,20166665,44358,44358,44581,180,null,40," \n93236642","EDGAR FERNANDO SANDOVAL BOCANEGRA",44525,28183335,null,null,"X",null,{"$f":"IF(ISERROR(AB111/AA111),\"-\",(AB111/AA111))","v":0.49999996280991704}]
[1,97,2021,"FDLC-CPS-097-2021","https://community.secop.gov.co/Public/Tendering/OpportunityDetail/Index?noticeUID=CO1.NTC.2034687&isFromPublicArea=True&isModal=true&asPopupView=true","Contratos de prestación de servicios profesionales y de apoyo a la gestión","Contratación directa","Prestación de servicios profesionales y de apoyo a la gestión, o para la ejecución de trabajos artísticos que sólo puedan encomendarse a determinadas personas naturales;","PRESTAR SERVICIOS DE APOYO ADMINISTRATIVO Y ASISTENCIAL AL FONDO DE DESARROLLO LOCAL, EN LOS PROCESOS RELACIONADOS CON LA PARTICIPACION DE LAS JUVENTUDES EN LA LOCALIDAD","Inversión","Un Nuevo Contrato Social y Ambiental para la Bogotá del Siglo XXI",55,{"$f":"IF(ISERROR(VLOOKUP(L112,Proposito_programa!$C$2:$E$59,2,FALSE)),\" \",VLOOKUP(L112,Proposito_programa!$C$2:$E$59,2,FALSE))","v":"Fortalecimiento de cultura ciudadana y su institucionalidad"},{"$f":"IF(ISERROR(VLOOKUP(L112,Proposito_programa!$C$2:$E$59,3,FALSE)),\" \",VLOOKUP(L112,Proposito_programa!$C$2:$E$59,3,FALSE))","v":"Propósito 5: Construir Bogotá - Región con gobierno abierto, transparente y ciudadanía consciente"},2019,1,1000222737,"VALENTINA BELLO CIFUENTES","Persona Natural",null,null,null,4500000,null,null,null,4500000,4500000,44362,44362,44454,90,null,null,null,null,null,null,null,null,"X",null,{"$f":"IF(ISERROR(AB112/AA112),\"-\",(AB112/AA112))","v":1}]
[1,98,2021,"FDLC-IMC-001-2021","https://community.secop.gov.co/Public/Tendering/OpportunityDetail/Index?noticeUID=CO1.NTC.1996707&isFromPublicArea=True&isModal=true&asPopupView=true","Contratos de prestación de servicios","Contratación mínima cuantia","No aplica","CONTRATAR LOS SERVICIOS DE UN OPERADOR QUE REALICE TALLERES DE FORMACIÓN EMPRESARIAL Y UNA FERIA EMPRESARIAL PARA EMPRENDIMIENTOS Y/O MIPYMES DE LA POBLACIÓN AFRODESCENDIENTE DE LA LOCALIDAD DE LA CANDELARIA","Inversión","Un Nuevo Contrato Social y Ambiental para la Bogotá del Siglo XXI",6,{"$f":"IF(ISERROR(VLOOKUP(L113,Proposito_programa!$C$2:$E$59,2,FALSE)),\" \",VLOOKUP(L113,Proposito_programa!$C$2:$E$59,2,FALSE))","v":"Sistema Distrital de Cuidado"},{"$f":"IF(ISERROR(VLOOKUP(L113,Proposito_programa!$C$2:$E$59,3,FALSE)),\" \",VLOOKUP(L113,Proposito_programa!$C$2:$E$59,3,FALSE))","v":"Propósito 1: Hacer un nuevo contrato social para incrementar la inclusión social, productiva y política"},1628,1,80085650,"JORGE AURELIO MONTERROZA BARRIOS","Persona Natural",null,null,null,7506333.0999999996,null,null,null,7506333.0999999996,3753166,44364,44416,44660,137,3,107,null,null,null,null,null,null,"X",null,0.4999999267285381]
[1,99,2021,"FDLC-IMC-002-2021","https://community.secop.gov.co/Public/Tendering/OpportunityDetail/Index?noticeUID=CO1.NTC.1998758&isFromPublicArea=True&isModal=true&asPopupView=true","Contratos de prestación de servicios","Contratación mínima cuantia","No aplica","ADQUISICIÓN DEL SERVICIO DE MANTENIMIENTO PREVENTIVO Y CORRECTIVO INTEGRAL CON SUMINISTRO DE REPUESTOS Y MANO DE OBRA PARA EL VEHÍCULO NISSAN X-TRAIL QUE HACE PARTE DEL PARQUE AUTOMOTOR DEL FONDO DE DESARROLLO LOCAL DE LA CANDELARIA.","Funcionamiento","Un Nuevo Contrato Social y Ambiental para la Bogotá del Siglo XXI","No aplica",{"$f":"IF(ISERROR(VLOOKUP(L114,Proposito_programa!$C$2:$E$59,2,FALSE)),\" \",VLOOKUP(L114,Proposito_programa!$C$2:$E$59,2,FALSE))","v":" "},{"$f":"IF(ISERROR(VLOOKUP(L114,Proposito_programa!$C$2:$E$59,3,FALSE)),\" \",VLOOKUP(L114,Proposito_programa!$C$2:$E$59,3,FALSE))","v":" "},"N/A",1,900274811,"EYM COMPANY SAS","Persona Jurídica",null,null,null,5011752,null,1,2000000,7011752,0,44364,44371,44581,120,1,90,null,null,null,null,null,null,"X",null,0]
[1,"FDLC-CIA-001-2021",2021,"FDLC-CIA-001-2021","https://community.secop.gov.co/Public/Tendering/OpportunityDetail/Index?noticeUID=CO1.NTC.2037525&isFromPublicArea=True&isModal=False","Contratos interadministrativos","Contratación directa","Contratos interadministrativos","AUNAR ESFUERZOS TÉCNICOS, ADMINISTRATIVOS, LOGÍSTICOS ENTRE LA ALCALDÍA LOCAL DE LA CANDELARIA Y LA ORQUESTA FILARMÓNICA DE BOGOTÁ PARA LA CONTINUIDAD Y DESARROLLO DEL CENTRO FILARMÓNICO LOCAL, COMO UN ESPACIO PARA EL PROCESO DE FORMACIÓN MUSICAL IMPLEMENTADO POR LA ORQUESTA Y DIRIGIDO A LA LOCALIDAD, LAS CUALES SE DESARROLLARAN DE MANERA VIRTUAL, TENIENDO EN CUENTA LA SITUACION ACTUAL DE PANDEMIA NACIONAL QUE SUFRE EL PAIS","Funcionamiento","Un Nuevo Contrato Social y Ambiental para la Bogotá del Siglo XXI","No aplica",{"$f":"IF(ISERROR(VLOOKUP(L115,Proposito_programa!$C$2:$E$59,2,FALSE)),\" \",VLOOKUP(L115,Proposito_programa!$C$2:$E$59,2,FALSE))","v":" "},{"$f":"IF(ISERROR(VLOOKUP(L115,Proposito_programa!$C$2:$E$59,3,FALSE)),\" \",VLOOKUP(L115,Proposito_programa!$C$2:$E$59,3,FALSE))","v":" "},null,1,899999282,"ORQUESTA FILARMONICA DE BOGOTA","Persona Jurídica",null,null,null,0,null,null,null,0,0,44363,44363,44560,194,null,null,null,null,null,null,null,null,"X",null,"-"]
[1,"FDLC-CIA-002-2021",2021,"FDLC-CIA-002-2021","https://www.contratos.gov.co/consultas/detalleProceso.do?numConstancia=21-22-27172&g-recaptcha-response=03AGdBq24G2MbM6GvdZgPmlfggKKXrEMuOLQ_si5bgDMntMj0xfmUpfrRLlaYO2eOPSU2oQDgOVCZaS6cYR8Nu-JAUqwGxKh9WDfkC0RgWZLHKfxiFsBL6EgW-7H41grTKF26PUaT0r_eHWeI5-01j3b21DfUx30M0tnWZrw2EXdUClvBXCmG7K_Q2W61c6hyrHXdaNTgn4Mo9lHuAYZCPhrnhy3JNR3eyuCv4w3uM4jKUOX_9InEVbNAiUkQwICW9bx9wxBrJYRfyqZYSZlYS6W1RIDfNQKWw4DJvE-Adm2h_HzQE9ef6KM6S1ib-RFU0T4InghfTKjD_kKSA8Z6EzfIOam2LDKKGK13hn1PBQ4IxC9iPLkRD2qpEZzu61zxyqBLtIjLKY1NhFJeJ3t1yAcghAF0ri3Vc17ly5qcaj1iRt8O-0Eko64H_x8SianQvpSa7EFgNQCLKs2vfCCvJSN6ySoHogKrUww","Contratos interadministrativos","Contratación directa","Contratos interadministrativos","Aunar esfuerzos técnicos, administrativos, juridicos y financieros entre la Secretaria de Educacn del Distrito y los Fondos de Desarrollo Local que hacen parte del Distrito Capital, para la implementación de un nuevo modelo inclusivo, eficiente y flexible para el acceso y la permanencia de las y los jóvenes egresados de instituciones de educación media a programas de educación superior.","Inversión","Un Nuevo Contrato Social y Ambiental para la Bogotá del Siglo XXI",17,{"$f":"IF(ISERROR(VLOOKUP(L116,Proposito_programa!$C$2:$E$59,2,FALSE)),\" \",VLOOKUP(L116,Proposito_programa!$C$2:$E$59,2,FALSE))","v":"Jóvenes con capacidades: Proyecto de vida para la ciudadanía, la innovación y el trabajo del siglo XXI"},{"$f":"IF(ISERROR(VLOOKUP(L116,Proposito_programa!$C$2:$E$59,3,FALSE)),\" \",VLOOKUP(L116,Proposito_programa!$C$2:$E$59,3,FALSE))","v":"Propósito 1: Hacer un nuevo contrato social para incrementar la inclusión social, productiva y política"},1607,1,899999061,"SECRETARIA DISTRITAL DE EDUCACION","Persona Jurídica",null,null,null,829911000,null,null,null,829911000,829911000,44375,44383,46568,2160,null,null,null,null,null,null,null,"X",null,null,1]
[1,100,2021,"ORDEN DE COMPRA 71252","https://colombiacompra.gov.co/tienda-virtual-del-estado-colombiano/ordenes-compra/71252","Contratos de prestación de servicios","Selección abreviada","Acuerdo marco de precios ","ADQUIRIR EL SERVICIO DE MANTENIMIENTO PREVENTIVO Y CORRECTIVO INTEGRAL CON SUMINISTRO DE REPUESTOS, MANO DE OBRA Y EL SERVICIO DE REVISIÓN TÉCNICO MECÁNICA Y DE EMISIONES CONTAMINANTES PARA LOS VEHÍCULOS QUE CONFORMAN EL PARQUE AUTOMOTOR DEL FONDO DE DESARROLLO LOCAL DE LA CANDELARIA","Funcionamiento","Un Nuevo Contrato Social y Ambiental para la Bogotá del Siglo XXI","No aplica",{"$f":"IF(ISERROR(VLOOKUP(L117,Proposito_programa!$C$2:$E$59,2,FALSE)),\" \",VLOOKUP(L117,Proposito_programa!$C$2:$E$59,2,FALSE))","v":" "},{"$f":"IF(ISERROR(VLOOKUP(L117,Proposito_programa!$C$2:$E$59,3,FALSE)),\" \",VLOOKUP(L117,Proposito_programa!$C$2:$E$59,3,FALSE))","v":" "},"N/A",1,900355181,"AUTOSERVICIO MECANICO S.A.S","Persona Jurídica",null,null,null,6362004,null,1,2000000,{"$f":"+W117+X117+Z117","v":8362004},6356451,44383,44383,44651,268,1,90,null,null,null,null,null,null,"X",null,0.76015880882142606]
[1,101,2021,"ORDEN DE COMPRA 71251","https://colombiacompra.gov.co/tienda-virtual-del-estado-colombiano/ordenes-compra/71251","Contratos de prestación de servicios","Selección abreviada","Acuerdo marco de precios ","ADQUIRIR EL SERVICIO DE MANTENIMIENTO PREVENTIVO Y CORRECTIVO INTEGRAL CON SUMINISTRO DE REPUESTOS, MANO DE OBRA Y EL SERVICIO DE REVISIÓN TÉCNICO MECÁNICA Y DE EMISIONES CONTAMINANTES PARA LOS VEHÍCULOS QUE CONFORMAN EL PARQUE AUTOMOTOR DEL FONDO DE DESARROLLO LOCAL DE LA CANDELARIA","Funcionamiento","Un Nuevo Contrato Social y Ambiental para la Bogotá del Siglo XXI","No aplica",{"$f":"IF(ISERROR(VLOOKUP(L118,Proposito_programa!$C$2:$E$59,2,FALSE)),\" \",VLOOKUP(L118,Proposito_programa!$C$2:$E$59,2,FALSE))","v":" "},{"$f":"IF(ISERROR(VLOOKUP(L118,Proposito_programa!$C$2:$E$59,3,FALSE)),\" \",VLOOKUP(L118,Proposito_programa!$C$2:$E$59,3,FALSE))","v":" "},"N/A",1,800020006,"AUTOINVERCOL S.A.","Persona Jurídica",null,null,null,8626244,null,1,4313122,12939366,0,44383,44383,44650,267,1,90,null,null,null,null,null,null,"X",null,0]
[1,102,2021,"FDLC-CPS-102-2021","https://community.secop.gov.co/Public/Tendering/OpportunityDetail/Index?noticeUID=CO1.NTC.2100313&isFromPublicArea=True&isModal=true&asPopupView=true","Contratos de prestación de servicios profesionales y de apoyo a la gestión","Contratación directa","Prestación de servicios profesionales y de apoyo a la gestión, o para la ejecución de trabajos artísticos que sólo puedan encomendarse a determinadas personas naturales;","PRESTAR SERVICIOS PROFESIONALES PARA LA PLANEACIÓN, IMPLEMENTACIÓN Y FORTALECIMIENTO DE PROYECTOS RELACIONADOS CON LAS ACTIVIDADES DEL TURISMO LOCAL, A TRAVÉS DE LA GESTIÓN, ARTICULACIÓN E INTERLOCUCIÓN CON CIUDADANÍA Y ENTIDADES PÚBLICAS Y PRIVADAS","Inversión","Un Nuevo Contrato Social y Ambiental para la Bogotá del Siglo XXI",6,{"$f":"IF(ISERROR(VLOOKUP(L119,Proposito_programa!$C$2:$E$59,2,FALSE)),\" \",VLOOKUP(L119,Proposito_programa!$C$2:$E$59,2,FALSE))","v":"Sistema Distrital de Cuidado"},{"$f":"IF(ISERROR(VLOOKUP(L119,Proposito_programa!$C$2:$E$59,3,FALSE)),\" \",VLOOKUP(L119,Proposito_programa!$C$2:$E$59,3,FALSE))","v":"Propósito 1: Hacer un nuevo contrato social para incrementar la inclusión social, productiva y política"},1628,1,1085290304,"MARIA CAMILA CEBALLOS CAICEDO","Persona Natural",null,null,null,21805000,null,null,null,21805000,19769866,44391,44392,44544,150,null,null,null,null,null,null,null,null,"X",null,0.90666663609263931]
[1,103,2021,"FDLC-CPS-103-2021","https://community.secop.gov.co/Public/Tendering/OpportunityDetail/Index?noticeUID=CO1.NTC.2100224&isFromPublicArea=True&isModal=true&asPopupView=true","Contratos de prestación de servicios profesionales y de apoyo a la gestión","Contratación directa","Prestación de servicios profesionales y de apoyo a la gestión, o para la ejecución de trabajos artísticos que sólo puedan encomendarse a determinadas personas naturales;","PRESTAR SERVICIOS TÉCNICOS PARA APOYAR AL FONDO DE DESARROLLO LOCAL DE LA CANDELARIA EN LAS TAREAS OPERATIVAS DE CARÁCTER ARCHIVÍSTICO DESARROLLADAS, PARA GARANTIZAR LA APLICACIÓN CORRECTA DE LOS PROCEDIMIENTOS TÉCNICOS","Inversión","Un Nuevo Contrato Social y Ambiental para la Bogotá del Siglo XXI",57,{"$f":"IF(ISERROR(VLOOKUP(L120,Proposito_programa!$C$2:$E$59,2,FALSE)),\" \",VLOOKUP(L120,Proposito_programa!$C$2:$E$59,2,FALSE))","v":"Gestión pública local"},{"$f":"IF(ISERROR(VLOOKUP(L120,Proposito_programa!$C$2:$E$59,3,FALSE)),\" \",VLOOKUP(L120,Proposito_programa!$C$2:$E$59,3,FALSE))","v":"Propósito 5: Construir Bogotá - Región con gobierno abierto, transparente y ciudadanía consciente"},2021,1,1010175770,"TEOFILO LEONARDO RAMIREZ HERNANDEZ","Persona Natural",null,null,null,15495000,null,null,null,15495000,14048800,44391,44391,44544,150,null,null,null,null,null,null,null,null,"X",null,0.90666666666666662]
[1,104,2021,"\tFDLC-CPS-104-2021","https://community.secop.gov.co/Public/Tendering/OpportunityDetail/Index?noticeUID=CO1.NTC.2102860&isFromPublicArea=True&isModal=true&asPopupView=true","Contratos de prestación de servicios profesionales y de apoyo a la gestión","Contratación directa","Prestación de servicios profesionales y de apoyo a la gestión, o para la ejecución de trabajos artísticos que sólo puedan encomendarse a determinadas personas naturales;","PRESTAR SERVICIOS DE APOYO ASISTENCIAL Y ADMINIISTRATIVO AL DESPACHO DE LA ALCALDESA LOCAL DE LA CANDELARIA","Inversión","Un Nuevo Contrato Social y Ambiental para la Bogotá del Siglo XXI",57,{"$f":"IF(ISERROR(VLOOKUP(L121,Proposito_programa!$C$2:$E$59,2,FALSE)),\" \",VLOOKUP(L121,Proposito_programa!$C$2:$E$59,2,FALSE))","v":"Gestión pública local"},{"$f":"IF(ISERROR(VLOOKUP(L121,Proposito_programa!$C$2:$E$59,3,FALSE)),\" \",VLOOKUP(L121,Proposito_programa!$C$2:$E$59,3,FALSE))","v":"Propósito 5: Construir Bogotá - Región con gobierno abierto, transparente y ciudadanía consciente"},2021,1,51838961,"MARIA ADELAIDA LUNA BUENAVENTURA","Persona Natural",null,null,null,11750000,null,null,null,11750000,11750000,44392,44392,44545,150,null,null,null,null,null,null,null,null,"X",null,1]
[1,105,2021,"FDLC-CPS-105-2021","https://community.secop.gov.co/Public/Tendering/OpportunityDetail/Index?noticeUID=CO1.NTC.2131832&isFromPublicArea=True&isModal=False","Contratos de prestación de servicios profesionales y de apoyo a la gestión","Contratación directa","Prestación de servicios profesionales y de apoyo a la gestión, o para la ejecución de trabajos artísticos que sólo puedan encomendarse a determinadas personas naturales;","PRESTAR SERVICIOS PROFESIONALES PARA REALIZAR LA COORDINACION TÉCNICA DEL SEGUIMIENTO DE PLANES, POLÍTICAS, PROGRAMAS Y PROYECTOS DE INFRAESTRUCTURA Y OBRAS CIVILES QUE DESARROLLE LA ALCALDÍA LOCAL DE LA CANDELARIA","Inversión","Un Nuevo Contrato Social y Ambiental para la Bogotá del Siglo XXI",49,{"$f":"IF(ISERROR(VLOOKUP(L122,Proposito_programa!$C$2:$E$59,2,FALSE)),\" \",VLOOKUP(L122,Proposito_programa!$C$2:$E$59,2,FALSE))","v":"Movilidad segura, sostenible y accesible"},{"$f":"IF(ISERROR(VLOOKUP(L122,Proposito_programa!$C$2:$E$59,3,FALSE)),\" \",VLOOKUP(L122,Proposito_programa!$C$2:$E$59,3,FALSE))","v":"Propósito 4: Hacer de Bogotá Región un modelo de movilidad multimodal, incluyente y sostenible"},2020,1,79952565,"RAFAEL LEONARDO OLMOS ROMERO","Persona Natural",null,null,null,29610000,null,1,11844000,41454000,24280200,44405,44405,44254,211,1,60,null,null,null,null,null,null,"X",null,0.58571428571428574]
[1,106,2021,"FDLC-SAMC-002-2021","https://community.secop.gov.co/Public/Tendering/OpportunityDetail/Index?noticeUID=CO1.NTC.2076161&isFromPublicArea=True&isModal=true&asPopupView=true","Contratos de prestación de servicios","Selección abreviada","Selección abreviada por menor cuantía ","PRESTAR SERVICIOS PARA FORTALECER LAS ORGANIZACIONES SOCIALES, COMUNALES E INSTANCIAS DE PARTICIPACIÓN DE LA LOCALIDAD DE LA CANDELARIA CON FUNDAMENTO EN EL PROYECTO N 2019 DENOMÍNADO “LA CANDELARIA PARTICIPATIVA”","Inversión","Un Nuevo Contrato Social y Ambiental para la Bogotá del Siglo XXI",55,{"$f":"IF(ISERROR(VLOOKUP(L123,Proposito_programa!$C$2:$E$59,2,FALSE)),\" \",VLOOKUP(L123,Proposito_programa!$C$2:$E$59,2,FALSE))","v":"Fortalecimiento de cultura ciudadana y su institucionalidad"},{"$f":"IF(ISERROR(VLOOKUP(L123,Proposito_programa!$C$2:$E$59,3,FALSE)),\" \",VLOOKUP(L123,Proposito_programa!$C$2:$E$59,3,FALSE))","v":"Propósito 5: Construir Bogotá - Región con gobierno abierto, transparente y ciudadanía consciente"},2019,1,900843188,"FUNDACION G3","Persona Jurídica",null,null,null,132256954,null,null,null,132256954,24217039,44407,44418,44539,120,null,null,null,null,null,null,null,null,"X",null,0.18310597868449321]
[1,107,2021,"FDLC-SAMC-004-2021","https://community.secop.gov.co/Public/Tendering/OpportunityDetail/Index?noticeUID=CO1.NTC.2090852&isFromPublicArea=True&isModal=true&asPopupView=true","Contratos de prestación de servicios","Selección abreviada","Selección abreviada por menor cuantía ","\tPRESTAR SERVICIOS DE ESTERILIZACION Y ATENCION EN BRIGADAS Y URGENCIAS MEDICAS VETERINARIAS A LOS CANINOS Y FELINOS VULNERABLES DE LA LOCALIDAD DE LA CANDELARIA CONFORME AL PROYECTO DE INVERSION NÚMERO 1704 LA CANDELARIA ANIMALISTA","Inversión","Un Nuevo Contrato Social y Ambiental para la Bogotá del Siglo XXI",34,{"$f":"IF(ISERROR(VLOOKUP(L124,Proposito_programa!$C$2:$E$59,2,FALSE)),\" \",VLOOKUP(L124,Proposito_programa!$C$2:$E$59,2,FALSE))","v":"Bogotá protectora de los animales"},{"$f":"IF(ISERROR(VLOOKUP(L124,Proposito_programa!$C$2:$E$59,3,FALSE)),\" \",VLOOKUP(L124,Proposito_programa!$C$2:$E$59,3,FALSE))","v":"Propósito 2 : Cambiar Nuestros Hábitos de Vida para Reverdecer a Bogotá y Adaptarnos y Mitigar la Crisis Climática"},1704,1,900359095,"FUNDACION ECODES","Persona Jurídica",null,null,null,77000000,null,null,null,77000000,63573046,44407,44410,44560,150,null,null,null,null,null,null,null,null,"X",null,0.82562397402597398]
[1,108,2021,"FDLC-IMC-003-2021","https://community.secop.gov.co/Public/Tendering/OpportunityDetail/Index?noticeUID=CO1.NTC.2078615&isFromPublicArea=True&isModal=true&asPopupView=true","Contratos de prestación de servicios","Contratación mínima cuantia","No aplica","Prestar el servicio demantenimiento preventivo y correctivo, incluyendo repuestos, para las impresoras, fotocopiadoras, sistema ininterrumpido de potencia (ups), aire acondicionado y plotter de propiedad del fondo de desarrollo local de la Alcaldía Local de la Candelaria","Funcionamiento","Un Nuevo Contrato Social y Ambiental para la Bogotá del Siglo XXI","No aplica",{"$f":"IF(ISERROR(VLOOKUP(L125,Proposito_programa!$C$2:$E$59,2,FALSE)),\" \",VLOOKUP(L125,Proposito_programa!$C$2:$E$59,2,FALSE))","v":" "},{"$f":"IF(ISERROR(VLOOKUP(L125,Proposito_programa!$C$2:$E$59,3,FALSE)),\" \",VLOOKUP(L125,Proposito_programa!$C$2:$E$59,3,FALSE))","v":" "},"N/A",1,19322393,"JAMES RIVEROS TELLEZ","Persona Natural",null,null,null,10793300,null,null,null,{"$f":"+W125+X125+Z125","v":10793300},8294000,44407,44413,44777,360,null,null,null,null,null,null,null,null,"X",null,0.76843968017195852]
[1,109,2021,"\tFDLC-CPS-109-2021","https://community.secop.gov.co/Public/Tendering/OpportunityDetail/Index?noticeUID=CO1.NTC.2160856&isFromPublicArea=True&isModal=true&asPopupView=true","Contratos de prestación de servicios profesionales y de apoyo a la gestión","Contratación directa","Prestación de servicios profesionales y de apoyo a la gestión, o para la ejecución de trabajos artísticos que sólo puedan encomendarse a determinadas personas naturales;","\tPRESTAR SERVICIOS TÉCNICOS PARA APOYAR AL FONDO DE DESARROLLO LOCAL DE LA CANDELARIA EN LAS TAREAS OPERATIVAS DE CARÁCTER ARCHIVÍSTICO DESARROLLADAS, PARA GARANTIZAR LA APLICACIÓN CORRECTA DE LOS PROCEDIMIENTOS TÉCNICOS","Inversión","Un Nuevo Contrato Social y Ambiental para la Bogotá del Siglo XXI",57,{"$f":"IF(ISERROR(VLOOKUP(L126,Proposito_programa!$C$2:$E$59,2,FALSE)),\" \",VLOOKUP(L126,Proposito_programa!$C$2:$E$59,2,FALSE))","v":"Gestión pública local"},{"$f":"IF(ISERROR(VLOOKUP(L126,Proposito_programa!$C$2:$E$59,3,FALSE)),\" \",VLOOKUP(L126,Proposito_programa!$C$2:$E$59,3,FALSE))","v":"Propósito 5: Construir Bogotá - Región con gobierno abierto, transparente y ciudadanía consciente"},2021,1,52496566,"SONIA MORENO SALGUERO","Persona Natural",null,null,null,14771900,null,null,null,14771900,11569600,44417,44417,44560,143,null,null,null,null,null,null,null,null,"X",null,0.78321678321678323]
[1,110,2021,"FDLC-CPS-110-2021","https://community.secop.gov.co/Public/Tendering/OpportunityDetail/Index?noticeUID=CO1.NTC.2164957&isFromPublicArea=True&isModal=true&asPopupView=true","Contratos de prestación de servicios profesionales y de apoyo a la gestión","Contratación directa","Prestación de servicios profesionales y de apoyo a la gestión, o para la ejecución de trabajos artísticos que sólo puedan encomendarse a determinadas personas naturales;","PRESTAR SERVICIOS PROFESIONALES COMO ABOGADO DE APOYO A LA IDENTIFICACIÓN, ANÁLISIS, REPARTO Y SEGUIMIENTO DE EXPEDIENTES PROCESALES EN EL ÁREA DE GESTIÓN POLICIVA DE LA ALCALDÍA LOCAL DE LA CANDELARI","Inversión","Un Nuevo Contrato Social y Ambiental para la Bogotá del Siglo XXI",57,{"$f":"IF(ISERROR(VLOOKUP(L127,Proposito_programa!$C$2:$E$59,2,FALSE)),\" \",VLOOKUP(L127,Proposito_programa!$C$2:$E$59,2,FALSE))","v":"Gestión pública local"},{"$f":"IF(ISERROR(VLOOKUP(L127,Proposito_programa!$C$2:$E$59,3,FALSE)),\" \",VLOOKUP(L127,Proposito_programa!$C$2:$E$59,3,FALSE))","v":"Propósito 5: Construir Bogotá - Región con gobierno abierto, transparente y ciudadanía consciente"},2023,1,1022973767,"CAROLINA ROJAS CARVAJAL","Persona Natural",null,null,null,18100000,null,1,4675833,22775833,21267500,44418,44418,44571,120,1,31,null,null,null,null,null,null,"X",null,0.93377484810325051]
[1,111,2021,"FDLC-CPS-111-2021","https://community.secop.gov.co/Public/Tendering/OpportunityDetail/Index?noticeUID=CO1.NTC.2165243&isFromPublicArea=True&isModal=true&asPopupView=true","Contratos de prestación de servicios profesionales y de apoyo a la gestión","Contratación directa","Prestación de servicios profesionales y de apoyo a la gestión, o para la ejecución de trabajos artísticos que sólo puedan encomendarse a determinadas personas naturales;","PRESTAR SERVICIOS DE APOYO ADMINISTRATIVO Y ASISTENCIAL EN LA GESTIÓN DOCUMENTAL DE LA ALCALDÍA LOCAL DE LA CANDELARIA, ACOMPAÑANDO AL EQUIPO JURÍDICO DE DEPURACIÓN EN LAS LABORES OPERATIVAS QUE GENERA EL PROCESO DE IMPULSO DE LAS ACTUACIONES ADMINISTRATIVAS","Inversión","Un Nuevo Contrato Social y Ambiental para la Bogotá del Siglo XXI",57,{"$f":"IF(ISERROR(VLOOKUP(L128,Proposito_programa!$C$2:$E$59,2,FALSE)),\" \",VLOOKUP(L128,Proposito_programa!$C$2:$E$59,2,FALSE))","v":"Gestión pública local"},{"$f":"IF(ISERROR(VLOOKUP(L128,Proposito_programa!$C$2:$E$59,3,FALSE)),\" \",VLOOKUP(L128,Proposito_programa!$C$2:$E$59,3,FALSE))","v":"Propósito 5: Construir Bogotá - Región con gobierno abierto, transparente y ciudadanía consciente"},2023,1,49729700,"NEREIDA HERNANDEZ FLOREZ","Persona Natural",null,null,null,10340000,null,1,3532833,13872833,12149500,44418,44418,44571,120,null,31,null,null,null,null,null,null,"X",null,0.87577641855848765]
[1,112,2021,"FDLC-CPS-112-2021","https://community.secop.gov.co/Public/Tendering/OpportunityDetail/Index?noticeUID=CO1.NTC.2165098&isFromPublicArea=True&isModal=true&asPopupView=true\n","Contratos de prestación de servicios profesionales y de apoyo a la gestión","Contratación directa","Prestación de servicios profesionales y de apoyo a la gestión, o para la ejecución de trabajos artísticos que sólo puedan encomendarse a determinadas personas naturales;","PRESTAR SERVICIOS PROFESIONALES ESPECIALIZADOS AL FONDO DE DESARROLLO LOCAL DE LA CANDELARIA EN EL DESPACHO DE LA ALCALDESA LOCAL PARA BRINDAR LINEAMIENTOS JURIDICOS, EVALUAR Y ORIENTAR TEMAS PRIORITARIOS DE LA ENTIDAD","Inversión","Un Nuevo Contrato Social y Ambiental para la Bogotá del Siglo XXI",57,{"$f":"IF(ISERROR(VLOOKUP(L129,Proposito_programa!$C$2:$E$59,2,FALSE)),\" \",VLOOKUP(L129,Proposito_programa!$C$2:$E$59,2,FALSE))","v":"Gestión pública local"},{"$f":"IF(ISERROR(VLOOKUP(L129,Proposito_programa!$C$2:$E$59,3,FALSE)),\" \",VLOOKUP(L129,Proposito_programa!$C$2:$E$59,3,FALSE))","v":"Propósito 5: Construir Bogotá - Región con gobierno abierto, transparente y ciudadanía consciente"},2021,1,80239278,"JOHN FREDY PULIDO RINCON","Persona Natural",null,null,null,35100000,null,1,3120000,38220000,28860000,44418,44418,44566,135,null,12,null,null,null,null,null,null,"X",null,0.75510204081632648]
[1,114,2021,"\tFDLC-CPS-114-2021","https://community.secop.gov.co/Public/Tendering/OpportunityDetail/Index?noticeUID=CO1.NTC.2167163&isFromPublicArea=True&isModal=true&asPopupView=true","Contratos de prestación de servicios profesionales y de apoyo a la gestión","Contratación directa","Prestación de servicios profesionales y de apoyo a la gestión, o para la ejecución de trabajos artísticos que sólo puedan encomendarse a determinadas personas naturales;","PRESTAR SERVICIOS PROFESIONALES PARA APOYAR JURÍDICAMENTE LA EJECUCIÓN DE LAS ACCIONES REQUERIDAS PARA LA DEPURACIÓN DE LAS ACTUACIONES ADMINISTRATIVAS QUE CURSAN EN LA ALCALDÍA LOCAL DE LA CANDELARIA","Inversión","Un Nuevo Contrato Social y Ambiental para la Bogotá del Siglo XXI",57,{"$f":"IF(ISERROR(VLOOKUP(L130,Proposito_programa!$C$2:$E$59,2,FALSE)),\" \",VLOOKUP(L130,Proposito_programa!$C$2:$E$59,2,FALSE))","v":"Gestión pública local"},{"$f":"IF(ISERROR(VLOOKUP(L130,Proposito_programa!$C$2:$E$59,3,FALSE)),\" \",VLOOKUP(L130,Proposito_programa!$C$2:$E$59,3,FALSE))","v":"Propósito 5: Construir Bogotá - Región con gobierno abierto, transparente y ciudadanía consciente"},2023,1,51875915,"LUZ SOFIA AMAYA CASTAÑEDA","Persona Natural",null,null,null,18100000,null,1,4525000,22625000,21116667,44419,44419,44571,120,null,30,null,null,null,null,null,null,"X",null,0.93333334806629831]
[1,115,2021,"FDLC-CPS-115-2021","https://community.secop.gov.co/Public/Tendering/OpportunityDetail/Index?noticeUID=CO1.NTC.2171123&isFromPublicArea=True&isModal=true&asPopupView=true","Contratos de prestación de servicios profesionales y de apoyo a la gestión","Contratación directa","Prestación de servicios profesionales y de apoyo a la gestión, o para la ejecución de trabajos artísticos que sólo puedan encomendarse a determinadas personas naturales;","PRESTAR SERVICIOS PROFESIONALES PARA APOYAR TÉCNICAMENTE LAS DISTINTAS ETAPAS DE LOS PROCESOS DE COMPETENCIA DE LA ALCALDÍA LOCAL PARA LA DEPURACIÓN DE ACTUACIONES ADMINITRATIVAS","Inversión","Un Nuevo Contrato Social y Ambiental para la Bogotá del Siglo XXI",57,{"$f":"IF(ISERROR(VLOOKUP(L131,Proposito_programa!$C$2:$E$59,2,FALSE)),\" \",VLOOKUP(L131,Proposito_programa!$C$2:$E$59,2,FALSE))","v":"Gestión pública local"},{"$f":"IF(ISERROR(VLOOKUP(L131,Proposito_programa!$C$2:$E$59,3,FALSE)),\" \",VLOOKUP(L131,Proposito_programa!$C$2:$E$59,3,FALSE))","v":"Propósito 5: Construir Bogotá - Región con gobierno abierto, transparente y ciudadanía consciente"},2023,1,79507928,"FRANCISCO JAVIER HIGUERA NOVA","Persona Natural",null,null,null,19988000,null,null,null,19988000,19988000,44420,44420,44541,120,null,null,null,null,null,null,null,null,"X",null,1]
[1,116,2021,"\tFDLC-CPS-116-2021","https://community.secop.gov.co/Public/Tendering/OpportunityDetail/Index?noticeUID=CO1.NTC.2171605&isFromPublicArea=True&isModal=False","Contratos de prestación de servicios profesionales y de apoyo a la gestión","Contratación directa","Prestación de servicios profesionales y de apoyo a la gestión, o para la ejecución de trabajos artísticos que sólo puedan encomendarse a determinadas personas naturales;","PRESTAR SERVICIOS PROFESIONALES PARA APOYAR JURÍDICAMENTE LA EJECUCIÓN DE LAS ACCIONES REQUERIDAS PARA EL TRÁMITE E IMPULSO PROCESAL DE LAS ACTUACIONES CONTRAVENCIONALES Y/O QUERELLAS QUE CURSEN EN LAS INSPECCIONES DE POLICÍA DE LA LOCALIDAD DE LA CANDELARIA","Inversión","Un Nuevo Contrato Social y Ambiental para la Bogotá del Siglo XXI",57,{"$f":"IF(ISERROR(VLOOKUP(L132,Proposito_programa!$C$2:$E$59,2,FALSE)),\" \",VLOOKUP(L132,Proposito_programa!$C$2:$E$59,2,FALSE))","v":"Gestión pública local"},{"$f":"IF(ISERROR(VLOOKUP(L132,Proposito_programa!$C$2:$E$59,3,FALSE)),\" \",VLOOKUP(L132,Proposito_programa!$C$2:$E$59,3,FALSE))","v":"Propósito 5: Construir Bogotá - Región con gobierno abierto, transparente y ciudadanía consciente"},2023,1,1018443671,"JOSE RICARDO PULGARIN ALVAREZ","Persona Natural",null,null,null,18100000,null,1,4525000,22625000,16440833,44420,44420,44572,151,1,30,null,null,null,null,null,null,"X",null,0.72666665193370161]
[1,117,2021,"\tFDLC-CPS-117-2021","https://community.secop.gov.co/Public/Tendering/OpportunityDetail/Index?noticeUID=CO1.NTC.2174358&isFromPublicArea=True&isModal=true&asPopupView=true","Contratos de prestación de servicios profesionales y de apoyo a la gestión","Contratación directa","Prestación de servicios profesionales y de apoyo a la gestión, o para la ejecución de trabajos artísticos que sólo puedan encomendarse a determinadas personas naturales;","PRESTAR SERVICIOS TÉCNICOS ADMINISTRATIVOS EN LAS DISTINTAS ETAPAS DE LOS PROCESOS CONTRACTUALES DE COMPETENCIA DE LA ALCALDIA LOCAL DE LA CANDELARIA","Inversión","Un Nuevo Contrato Social y Ambiental para la Bogotá del Siglo XXI",57,{"$f":"IF(ISERROR(VLOOKUP(L133,Proposito_programa!$C$2:$E$59,2,FALSE)),\" \",VLOOKUP(L133,Proposito_programa!$C$2:$E$59,2,FALSE))","v":"Gestión pública local"},{"$f":"IF(ISERROR(VLOOKUP(L133,Proposito_programa!$C$2:$E$59,3,FALSE)),\" \",VLOOKUP(L133,Proposito_programa!$C$2:$E$59,3,FALSE))","v":"Propósito 5: Construir Bogotá - Región con gobierno abierto, transparente y ciudadanía consciente"},2021,1,52305372,"ELCY JEANETH PULIDO AMORTEGUI","Persona Natural",null,null,null,14000000,null,1,3266667,17266667,16216667,44421,44421,44570,120,1,28,null,null,null,null,null,null,"X",null,0.93918919036314308]
[1,118,2021,"FDLC-CPS-118-2021","https://community.secop.gov.co/Public/Tendering/OpportunityDetail/Index?noticeUID=CO1.NTC.2174188&isFromPublicArea=True&isModal=true&asPopupView=true","Contratos de prestación de servicios profesionales y de apoyo a la gestión","Contratación directa","Prestación de servicios profesionales y de apoyo a la gestión, o para la ejecución de trabajos artísticos que sólo puedan encomendarse a determinadas personas naturales;","PRESTAR SERVICIOS PROFESIONALES AL FONDO DE DESARROLLO LOCAL DE LA CANDELARIA COMO ABOGADO DE APOYO AL DESPACHO DE LA ALCALDESA LOCAL, EN LAS DIFERENTES ACTIVIDADES Y FUNCIONES QUE LE COMPETEN A ESTA DEPENDENCIA","Inversión","Un Nuevo Contrato Social y Ambiental para la Bogotá del Siglo XXI",57,{"$f":"IF(ISERROR(VLOOKUP(L134,Proposito_programa!$C$2:$E$59,2,FALSE)),\" \",VLOOKUP(L134,Proposito_programa!$C$2:$E$59,2,FALSE))","v":"Gestión pública local"},{"$f":"IF(ISERROR(VLOOKUP(L134,Proposito_programa!$C$2:$E$59,3,FALSE)),\" \",VLOOKUP(L134,Proposito_programa!$C$2:$E$59,3,FALSE))","v":"Propósito 5: Construir Bogotá - Región con gobierno abierto, transparente y ciudadanía consciente"},2021,1,52314352,"CONSTANZA DEL PILAR LEYTON RICO","Persona Natural",null,null,null,20000000,null,1,4833333,24833333,23166666,44421,44421,44571,120,null,29,null,null,null,null,null,null,"X",null,0.9328858917165892]
[1,119,2021,"FDLC-CPS-119-2021","https://community.secop.gov.co/Public/Tendering/OpportunityDetail/Index?noticeUID=CO1.NTC.2185019&isFromPublicArea=True&isModal=true&asPopupView=true","Contratos de prestación de servicios profesionales y de apoyo a la gestión","Contratación directa","Prestación de servicios profesionales y de apoyo a la gestión, o para la ejecución de trabajos artísticos que sólo puedan encomendarse a determinadas personas naturales;","PRESTAR SERVICIOS PROFESIONALES PARA APOYAR JURÍDICAMENTE LA EJECUCIÓN DE LAS ACCIONES REQUERIDAS PARA LA DEPURACIÓN DE LAS ACTUACIONES ADMINISTRATIVAS QUE CURSAN EN LA ALCALDÍA LOCAL DE LA CANDELARIA ASÍ COMO EL SEGUIMIENTO AL CIERRE DE LOS RESPECTIVOS EXPEDIENTES","Inversión","Un Nuevo Contrato Social y Ambiental para la Bogotá del Siglo XXI",57,{"$f":"IF(ISERROR(VLOOKUP(L135,Proposito_programa!$C$2:$E$59,2,FALSE)),\" \",VLOOKUP(L135,Proposito_programa!$C$2:$E$59,2,FALSE))","v":"Gestión pública local"},{"$f":"IF(ISERROR(VLOOKUP(L135,Proposito_programa!$C$2:$E$59,3,FALSE)),\" \",VLOOKUP(L135,Proposito_programa!$C$2:$E$59,3,FALSE))","v":"Propósito 5: Construir Bogotá - Región con gobierno abierto, transparente y ciudadanía consciente"},2023,1,1032356337,"ANDRES FERNANDO RIVERA SOLINA","Persona Natural",null,null,null,22000000,null,null,null,22000000,22000000,44427,44427,44548,120,null,null,null,null,null,null,null,null,"X",null,1]
[1,120,2021,"FDLC-CPS-120-2021","https://community.secop.gov.co/Public/Tendering/OpportunityDetail/Index?noticeUID=CO1.NTC.2185512&isFromPublicArea=True&isModal=true&asPopupView=true","Contratos de prestación de servicios profesionales y de apoyo a la gestión","Contratación directa","Prestación de servicios profesionales y de apoyo a la gestión, o para la ejecución de trabajos artísticos que sólo puedan encomendarse a determinadas personas naturales;","PRESTAR SERVICIOS PROFESIONALES AL FONDO DE DESARROLLO LOCAL DE LA CANDELARIA PARA LA OPERACIÓN, PRESTACIÓN, SEGUIMIENTO Y CUMPLIMIENTO DE LOS PROCEDIMIENTOS ADMINISTRATIVOS, OPERATIVOS Y PROGRAMÁTICOS DEL SERVICIO APOYO ECONÓMICO TIPO C, QUE CONTRIBUYAN A LA GARANTÍA DE LOS DERECHOS DE LA POBLACIÓN MAYOR EN EL MARCO DE LA POLÍTICA PÚBLICA SOCIAL PARA EL ENVEJECIMIENTO Y LA VEJEZ EN EL DISTRITO CAPITAL A CARGO DE LA ALCALDÍA LOCAL","Inversión","Un Nuevo Contrato Social y Ambiental para la Bogotá del Siglo XXI",1,{"$f":"IF(ISERROR(VLOOKUP(L136,Proposito_programa!$C$2:$E$59,2,FALSE)),\" \",VLOOKUP(L136,Proposito_programa!$C$2:$E$59,2,FALSE))","v":"Subsidios y transferencias para la equidad"},{"$f":"IF(ISERROR(VLOOKUP(L136,Proposito_programa!$C$2:$E$59,3,FALSE)),\" \",VLOOKUP(L136,Proposito_programa!$C$2:$E$59,3,FALSE))","v":"Propósito 1: Hacer un nuevo contrato social para incrementar la inclusión social, productiva y política"},1605,1,1010190450,"VIVIANA LIZETH MONROY RAMIREZ","Persona Natural",null,null,null,16752000,null,1,3210800,{"$f":"+W136+X136+Z136","v":19962800},18566800,44427,44427,44571,120,1,23,null,null,null,null,null,null,"X",null,0.93006993006993011]
[1,"FDLC-ACI-001-2021",2021,"FDLC-ACI-001-2021","https://community.secop.gov.co/Public/Tendering/OpportunityDetail/Index?noticeUID=CO1.NTC.2222582&isFromPublicArea=True&isModal=False","Convenios de cooperacion","Régimen especial","Decreto 92 de 2017","“Aunar esfuerzos para la cooperación administrativa, técnica y económica, entre el Programa para las Naciones Unidas para el Desarrollo  (PNUD) y El Fondo de Desarrollo Local, con el fin de fortalecer a los emprendimientos de la economía popular de la localidad de la Candelaria y las unidades productivas y/o poblaciones dedicadas a actividades tradicionales que permiten generar ingresos (autoempleo), así́ como de las micro y pequeñas empresas locales, a través de un proceso de acompañamiento especializado y de entrega de incentivos, que permita el mejoramiento de las competencias de los emprendedores, empresarios y las condiciones de sus negocios”","Inversión","Un Nuevo Contrato Social y Ambiental para la Bogotá del Siglo XXI",6,{"$f":"IF(ISERROR(VLOOKUP(L137,Proposito_programa!$C$2:$E$59,2,FALSE)),\" \",VLOOKUP(L137,Proposito_programa!$C$2:$E$59,2,FALSE))","v":"Sistema Distrital de Cuidado"},{"$f":"IF(ISERROR(VLOOKUP(L137,Proposito_programa!$C$2:$E$59,3,FALSE)),\" \",VLOOKUP(L137,Proposito_programa!$C$2:$E$59,3,FALSE))","v":"Propósito 1: Hacer un nuevo contrato social para incrementar la inclusión social, productiva y política"},1628,1,800091076,"PROGRAMA DE LAS NACIONES UNIDAS PARA EL DESARROLLO PNUD","Persona Jurídica",null,null,null,755000000,null,1,52645195,807645195,755000000,44431,44431,44585,150,null,null,null,null,null,null,null,null,"X",null,0.9348164326044186]
[1,121,2021,"FDLC-CPS-121-2021","https://community.secop.gov.co/Public/Tendering/OpportunityDetail/Index?noticeUID=CO1.NTC.2200428&isFromPublicArea=True&isModal=true&asPopupView=true","Contratos de prestación de servicios profesionales y de apoyo a la gestión","Contratación directa","Prestación de servicios profesionales y de apoyo a la gestión, o para la ejecución de trabajos artísticos que sólo puedan encomendarse a determinadas personas naturales;","PRESTAR SERVICIOS PROFESIONALES COMO ABOGADO COBRO PERSUASIVO - EN EL ÁREA DE GESTIÓN POLICIVA Y JURÍDICA DE LA ALCALDIA LOCAL DE LA CANDELARIA","Inversión","Un Nuevo Contrato Social y Ambiental para la Bogotá del Siglo XXI",57,{"$f":"IF(ISERROR(VLOOKUP(L138,Proposito_programa!$C$2:$E$59,2,FALSE)),\" \",VLOOKUP(L138,Proposito_programa!$C$2:$E$59,2,FALSE))","v":"Gestión pública local"},{"$f":"IF(ISERROR(VLOOKUP(L138,Proposito_programa!$C$2:$E$59,3,FALSE)),\" \",VLOOKUP(L138,Proposito_programa!$C$2:$E$59,3,FALSE))","v":"Propósito 5: Construir Bogotá - Región con gobierno abierto, transparente y ciudadanía consciente"},2023,1,32645897,"MIRYAM ESTHER LOPEZ RODRIGUEZ","Persona Natural",null,null,null,18100000,null,null,null,18100000,12670000,44433,44433,44554,120,null,null,41794885,"TERESA HERREÑO SOLANO",44467,13122500,null,null,"X",null,0.7]
[1,122,2021,"FDLC-CPS-122-2021","https://community.secop.gov.co/Public/Tendering/OpportunityDetail/Index?noticeUID=CO1.NTC.2199943&isFromPublicArea=True&isModal=true&asPopupView=true","Contratos de prestación de servicios profesionales y de apoyo a la gestión","Contratación directa","Prestación de servicios profesionales y de apoyo a la gestión, o para la ejecución de trabajos artísticos que sólo puedan encomendarse a determinadas personas naturales;","PRESTAR SERVICIOS PROFESIONALES PARA APOYAR JURÍDICAMENTE LA EJECUCIÓN DE LAS ACCIONES REQUERIDAS PARA LA DEPURACIÓN DE LAS ACTUACIONES ADMINISTRATIVAS QUE CURSAN EN LA ALCALDÍA LOCAL DE LA CANDELARIA","Inversión","Un Nuevo Contrato Social y Ambiental para la Bogotá del Siglo XXI",57,{"$f":"IF(ISERROR(VLOOKUP(L139,Proposito_programa!$C$2:$E$59,2,FALSE)),\" \",VLOOKUP(L139,Proposito_programa!$C$2:$E$59,2,FALSE))","v":"Gestión pública local"},{"$f":"IF(ISERROR(VLOOKUP(L139,Proposito_programa!$C$2:$E$59,3,FALSE)),\" \",VLOOKUP(L139,Proposito_programa!$C$2:$E$59,3,FALSE))","v":"Propósito 5: Construir Bogotá - Región con gobierno abierto, transparente y ciudadanía consciente"},2023,1,53166387,"DIANA MARCELA ORTIZ DUQUE","Persona Natural",null,null,null,18100000,null,null,null,18100000,14480000,44433,44433,44554,120,null,null,null,null,null,null,null,null,"X",null,0.8]
[1,123,2021,"FDLC-CPS-123-2021","https://community.secop.gov.co/Public/Tendering/OpportunityDetail/Index?noticeUID=CO1.NTC.2201647&isFromPublicArea=True&isModal=true&asPopupView=true","Contratos de prestación de servicios profesionales y de apoyo a la gestión","Contratación directa","Prestación de servicios profesionales y de apoyo a la gestión, o para la ejecución de trabajos artísticos que sólo puedan encomendarse a determinadas personas naturales;","PRESTAR SERVICIOS DE APOYO ADMINISTRATIVO Y ASISTENCIAL EN LA GESTIÓN DE LA ALCALDÍA LOCAL DE LA CANDELARIA EN EL TRÁMITE DE LOS COMPARENDOS Y QUERELLAS, DE CONFORMIDAD CON EL CODIGO NACIONAL DE POLICIA-LEY 1801 DE 2016","Inversión","Un Nuevo Contrato Social y Ambiental para la Bogotá del Siglo XXI",57,{"$f":"IF(ISERROR(VLOOKUP(L140,Proposito_programa!$C$2:$E$59,2,FALSE)),\" \",VLOOKUP(L140,Proposito_programa!$C$2:$E$59,2,FALSE))","v":"Gestión pública local"},{"$f":"IF(ISERROR(VLOOKUP(L140,Proposito_programa!$C$2:$E$59,3,FALSE)),\" \",VLOOKUP(L140,Proposito_programa!$C$2:$E$59,3,FALSE))","v":"Propósito 5: Construir Bogotá - Región con gobierno abierto, transparente y ciudadanía consciente"},2023,1,1022973767,"JARRY EMERSON RIAÑO DELGADO","Persona Natural",null,null,null,8800000,null,1,1173333,9973333,9240000,44434,44434,44571,120,null,16,null,null,null,null,null,null,"X",null,0.92647061920022122]
[1,124,2021,"FDLC-IMC-004-2021","https://community.secop.gov.co/Public/Tendering/OpportunityDetail/Index?noticeUID=CO1.NTC.2180137&isFromPublicArea=True&isModal=true&asPopupView=true","Compraventa de bienes muebles","Contratación mínima cuantia","No aplica","ADQUISICIÓN DE MESAS MÓVILES PLEGABLES PARA EL USO DE ACTIVIDADES INSTITUCIONALES, DE CONFORMIDAD CON LAS ESPECIFICACIONES TÉCNICAS ","Inversión","Un Nuevo Contrato Social y Ambiental para la Bogotá del Siglo XXI",6,{"$f":"IF(ISERROR(VLOOKUP(L141,Proposito_programa!$C$2:$E$59,2,FALSE)),\" \",VLOOKUP(L141,Proposito_programa!$C$2:$E$59,2,FALSE))","v":"Sistema Distrital de Cuidado"},{"$f":"IF(ISERROR(VLOOKUP(L141,Proposito_programa!$C$2:$E$59,3,FALSE)),\" \",VLOOKUP(L141,Proposito_programa!$C$2:$E$59,3,FALSE))","v":"Propósito 1: Hacer un nuevo contrato social para incrementar la inclusión social, productiva y política"},1628,1,900007203,"MARKETGROUP SAS","Persona Jurídica",null,null,null,18400000,null,null,null,18400000,18400000,44438,44440,44469,30,null,null,null,null,null,null,null,null,"X",null,1]
[1,125,2021,"FDLC-CPS-125-2021","https://community.secop.gov.co/Public/Tendering/OpportunityDetail/Index?noticeUID=CO1.NTC.2216056&isFromPublicArea=True&isModal=true&asPopupView=true","Contratos de prestación de servicios profesionales y de apoyo a la gestión","Contratación directa","Prestación de servicios profesionales y de apoyo a la gestión, o para la ejecución de trabajos artísticos que sólo puedan encomendarse a determinadas personas naturales;","PRESTAR SERVICIOS DE APOYO ADMINISTRATIVO Y ASISTENCIAL EN LOS PROCESOS EFECTUADOS POR EL EQUIPO JURÍDICO DE LA ALCALDÍA LOCAL DE LA CANDELRIA","Inversión","Un Nuevo Contrato Social y Ambiental para la Bogotá del Siglo XXI",57,{"$f":"IF(ISERROR(VLOOKUP(L142,Proposito_programa!$C$2:$E$59,2,FALSE)),\" \",VLOOKUP(L142,Proposito_programa!$C$2:$E$59,2,FALSE))","v":"Gestión pública local"},{"$f":"IF(ISERROR(VLOOKUP(L142,Proposito_programa!$C$2:$E$59,3,FALSE)),\" \",VLOOKUP(L142,Proposito_programa!$C$2:$E$59,3,FALSE))","v":"Propósito 5: Construir Bogotá - Región con gobierno abierto, transparente y ciudadanía consciente"},2023,1,43904066,"MARIA NATHALIE INFANTE GOMEZ","Persona Natural",null,null,null,6800000,null,null,null,6800000,5100000,44440,44440,44560,120,null,null,null,null,null,null,null,null,"X",null,0.75]
[1,126,2021,"FDLC-CPS-126- 2021","https://community.secop.gov.co/Public/Tendering/OpportunityDetail/Index?noticeUID=CO1.NTC.2217420&isFromPublicArea=True&isModal=true&asPopupView=true","Contratos de prestación de servicios profesionales y de apoyo a la gestión","Contratación directa","Prestación de servicios profesionales y de apoyo a la gestión, o para la ejecución de trabajos artísticos que sólo puedan encomendarse a determinadas personas naturales;","PRESTAR SERVICIOS PROFESIONALES PARA APOYAR JURÍDICAMENTE LA EJECUCIÓN DE LAS ACCIONES REQUERIDAS PARA LA DEPURACIÓN DE LAS ACTUACIONES ADMINISTRATIVAS QUE CURSAN EN LA ALCALDÍA LOCAL DE LA CANDELARIA","Inversión","Un Nuevo Contrato Social y Ambiental para la Bogotá del Siglo XXI",57,{"$f":"IF(ISERROR(VLOOKUP(L143,Proposito_programa!$C$2:$E$59,2,FALSE)),\" \",VLOOKUP(L143,Proposito_programa!$C$2:$E$59,2,FALSE))","v":"Gestión pública local"},{"$f":"IF(ISERROR(VLOOKUP(L143,Proposito_programa!$C$2:$E$59,3,FALSE)),\" \",VLOOKUP(L143,Proposito_programa!$C$2:$E$59,3,FALSE))","v":"Propósito 5: Construir Bogotá - Región con gobierno abierto, transparente y ciudadanía consciente"},2023,1,22463659,"DIGNORA LOPEZ MONCADA","Persona Natural",null,null,null,18100000,null,null,null,18100000,13575000,44440,44440,44560,120,null,null,null,null,null,null,null,null,"X",null,{"$f":"IF(ISERROR(AB143/AA143),\"-\",(AB143/AA143))","v":0.75}]
[1,127,2021,"FDLC-IMC-005-2021","https://community.secop.gov.co/Public/Tendering/OpportunityDetail/Index?noticeUID=CO1.NTC.2188244&isFromPublicArea=True&isModal=False","Suministro","Contratación mínima cuantia","No aplica","SUMINISTRO DE REFRIGERIOS, A PRECIOS UNITARIOS Y A MONTO AGOTABLE PARA FORTALECER LA PARTICIPACIÓN EN EL PROCESO DE RENDICION DE CUENTAS PARA EL FORTALECIMIENTO INSITUCIONAL","Inversión","Un Nuevo Contrato Social y Ambiental para la Bogotá del Siglo XXI",57,{"$f":"IF(ISERROR(VLOOKUP(L144,Proposito_programa!$C$2:$E$59,2,FALSE)),\" \",VLOOKUP(L144,Proposito_programa!$C$2:$E$59,2,FALSE))","v":"Gestión pública local"},{"$f":"IF(ISERROR(VLOOKUP(L144,Proposito_programa!$C$2:$E$59,3,FALSE)),\" \",VLOOKUP(L144,Proposito_programa!$C$2:$E$59,3,FALSE))","v":"Propósito 5: Construir Bogotá - Región con gobierno abierto, transparente y ciudadanía consciente"},2021,1,800081700,"FRUPYS LTDA","Persona Jurídica",null,null,null,3502000,null,null,null,3502000,3502000,44440,44441,44621,180,null,null,null,null,null,null,null,"X",null,null,1]
[0,127,2021,"FDLC-IMC-005-2021","https://community.secop.gov.co/Public/Tendering/OpportunityDetail/Index?noticeUID=CO1.NTC.2188244&isFromPublicArea=True&isModal=False","Suministro","Contratación mínima cuantia","No aplica","SUMINISTRO DE REFRIGERIOS, A PRECIOS UNITARIOS Y A MONTO AGOTABLE PARA FORTALECER LA PARTICIPACIÓN EN EL PROCESO DE RENDICION DE CUENTAS PARA EL FORTALECIMIENTO INSITUCIONAL","Inversión","Un Nuevo Contrato Social y Ambiental para la Bogotá del Siglo XXI",55,{"$f":"IF(ISERROR(VLOOKUP(L145,Proposito_programa!$C$2:$E$59,2,FALSE)),\" \",VLOOKUP(L145,Proposito_programa!$C$2:$E$59,2,FALSE))","v":"Fortalecimiento de cultura ciudadana y su institucionalidad"},{"$f":"IF(ISERROR(VLOOKUP(L145,Proposito_programa!$C$2:$E$59,3,FALSE)),\" \",VLOOKUP(L145,Proposito_programa!$C$2:$E$59,3,FALSE))","v":"Propósito 5: Construir Bogotá - Región con gobierno abierto, transparente y ciudadanía consciente"},2019,1,800081700,"FRUPYS LTDA","Persona Jurídica",null,null,null,1444075,null,null,null,{"$f":"+W145+X145+Z145","v":1444075},1444075,44440,44441,44621,180,null,null,null,null,null,null,null,"X",null,null,{"$f":"IF(ISERROR(AB145/AA145),\"-\",(AB145/AA145))","v":1}]
[1,128,2021,"FDLC-SAMC-005-2021","https://community.secop.gov.co/Public/Tendering/OpportunityDetail/Index?noticeUID=CO1.NTC.2174560&isFromPublicArea=True&isModal=False","Contratos de prestación de servicios","Selección abreviada","Selección abreviada por menor cuantía ","PRESTAR SERVICIOS PARA REALIZAR LAS ACTIVIDADES QUE PROMUEVAN EL RECONOCIMIENTO Y PROTECCIÓN DE LOS DERECHOS DE LAS MUJERES CANDELARIAS EN EL MARCO DEL PROYECTO 1781 “LA CANDELARIA SEGURA: MUJERES LIBRES DE VIOLENCIAS","Inversión","Un Nuevo Contrato Social y Ambiental para la Bogotá del Siglo XXI",40,{"$f":"IF(ISERROR(VLOOKUP(L146,Proposito_programa!$C$2:$E$59,2,FALSE)),\" \",VLOOKUP(L146,Proposito_programa!$C$2:$E$59,2,FALSE))","v":"Más mujeres viven una vida libre de violencias, se sienten seguras y acceden con confianza al sistema de justicia"},{"$f":"IF(ISERROR(VLOOKUP(L146,Proposito_programa!$C$2:$E$59,3,FALSE)),\" \",VLOOKUP(L146,Proposito_programa!$C$2:$E$59,3,FALSE))","v":"Propósito 3: Inspirar confianza y legitimidad para vivir sin miedo y ser epicentro de cultura ciudadana, paz y reconciliación"},1781,1,901071739,"ONNIX PRODUCCIONES SAS","Persona Jurídica",null,null,null,104973470,null,null,null,104973470,0,44446,44447,44599,150,null,null,null,null,null,null,null,"X",null,null,0]
[1,129,2021,"FDLC-CPS-129-2021","https://community.secop.gov.co/Public/Tendering/OpportunityDetail/Index?noticeUID=CO1.NTC.2227880&isFromPublicArea=True&isModal=False","Contratos de prestación de servicios profesionales y de apoyo a la gestión","Contratación directa","Prestación de servicios profesionales y de apoyo a la gestión, o para la ejecución de trabajos artísticos que sólo puedan encomendarse a determinadas personas naturales;","PRESTAR SERVICIOS PROFESIONALES PARA REALIZAR LA COORDINACION TÉCNICA DEL SEGUIMIENTO DE PLANES, POLÍTICAS, PROGRAMAS Y PROYECTOS DE INFRAESTRUCTURA Y OBRAS CIVILES QUE DESARROLLE LA ALCALDÍA LOCAL DE LA CANDELARIA","Inversión","Un Nuevo Contrato Social y Ambiental para la Bogotá del Siglo XXI",57,{"$f":"IF(ISERROR(VLOOKUP(L147,Proposito_programa!$C$2:$E$59,2,FALSE)),\" \",VLOOKUP(L147,Proposito_programa!$C$2:$E$59,2,FALSE))","v":"Gestión pública local"},{"$f":"IF(ISERROR(VLOOKUP(L147,Proposito_programa!$C$2:$E$59,3,FALSE)),\" \",VLOOKUP(L147,Proposito_programa!$C$2:$E$59,3,FALSE))","v":"Propósito 5: Construir Bogotá - Región con gobierno abierto, transparente y ciudadanía consciente"},2023,1,17951133,"FABIAN ENRIQUE SIERRA CHIRINO","Persona Natural",null,null,null,22898400,null,null,null,22898400,16779000,44445,44445,44561,116,null,null,null,null,null,null,null,null,"X",null,0.73275862068965514]
[1,130,2021,"FDLC-CPS-130-2021","https://community.secop.gov.co/Public/Tendering/OpportunityDetail/Index?noticeUID=CO1.NTC.2228059&isFromPublicArea=True&isModal=False","Contratos de prestación de servicios profesionales y de apoyo a la gestión","Contratación directa","Prestación de servicios profesionales y de apoyo a la gestión, o para la ejecución de trabajos artísticos que sólo puedan encomendarse a determinadas personas naturales;","\nPRESTAR SERVICIOS PROFESIONALES AL FONDO DE DESARROLLO LOCAL DE LA CANDELARIA EN LOS TRÁMITES RELACIONADOS CON LOS PROCESOS PRECONTRACTUALES, CONTRACTUALES Y POS CONTRACTUALES QUE SE ADELANTEN A TRAVÉS DE SECOP I Y II, ASÍ COMO LA ADQUISICIÓN DE BIENES Y SERVICIOS A TRAVÉS DE LA TIENDA VIRTUAL DEL ESTADO COLOMBIANO.","Inversión","Un Nuevo Contrato Social y Ambiental para la Bogotá del Siglo XXI",57,{"$f":"IF(ISERROR(VLOOKUP(L148,Proposito_programa!$C$2:$E$59,2,FALSE)),\" \",VLOOKUP(L148,Proposito_programa!$C$2:$E$59,2,FALSE))","v":"Gestión pública local"},{"$f":"IF(ISERROR(VLOOKUP(L148,Proposito_programa!$C$2:$E$59,3,FALSE)),\" \",VLOOKUP(L148,Proposito_programa!$C$2:$E$59,3,FALSE))","v":"Propósito 5: Construir Bogotá - Región con gobierno abierto, transparente y ciudadanía consciente"},2021,1,1049634530,"NELLYR NATHALIA JIMENEZ SANCHEZ","Persona Natural",null,null,null,16333200,null,null,null,16333200,11866000,44445,44445,44561,116,null,null,null,null,null,null,null,null,"X",null,0.72649572649572647]
[1,131,2021,"FDLC-CPS-131-2021","https://community.secop.gov.co/Public/Tendering/OpportunityDetail/Index?noticeUID=CO1.NTC.2233177&isFromPublicArea=True&isModal=False","Contratos de prestación de servicios profesionales y de apoyo a la gestión","Contratación directa","Prestación de servicios profesionales y de apoyo a la gestión, o para la ejecución de trabajos artísticos que sólo puedan encomendarse a determinadas personas naturales;","PRESTAR SERVICIOS PROFESIONALES PARA APOYAR AL FONDO DE DESARROLLO LOCAL DE LA CANDELARIA EN EL SEGUIMIENTO Y VISUALIZACION DE LA GESTION REALIZADA, EN DESARROLLO DE LOS PROGRAMAS DE ATENCIÓN Y PROTECCIÓN A LOS ANIMALES EN LA LOCALIDAD","Inversión","Un Nuevo Contrato Social y Ambiental para la Bogotá del Siglo XXI",34,{"$f":"IF(ISERROR(VLOOKUP(L149,Proposito_programa!$C$2:$E$59,2,FALSE)),\" \",VLOOKUP(L149,Proposito_programa!$C$2:$E$59,2,FALSE))","v":"Bogotá protectora de los animales"},{"$f":"IF(ISERROR(VLOOKUP(L149,Proposito_programa!$C$2:$E$59,3,FALSE)),\" \",VLOOKUP(L149,Proposito_programa!$C$2:$E$59,3,FALSE))","v":"Propósito 2 : Cambiar Nuestros Hábitos de Vida para Reverdecer a Bogotá y Adaptarnos y Mitigar la Crisis Climática"},1704,1,1072707755,"NICOLLE SELESTE ROJAS CAMACHO","Persona Natural",null,null,null,14000000,null,null,null,14000000,14000000,44447,44447,44552,105,null,null,null,null,null,null,null,null,"X",null,1]
[1,132,2021,"FDLC-CPS-132-2021","https://community.secop.gov.co/Public/Tendering/ContractNoticePhases/View?PPI=CO1.PPI.14974147&isFromPublicArea=True&isModal=False","Contratos de prestación de servicios profesionales y de apoyo a la gestión","Contratación directa","Prestación de servicios profesionales y de apoyo a la gestión, o para la ejecución de trabajos artísticos que sólo puedan encomendarse a determinadas personas naturales;","PRESTAR SERVICIOS PROFESIONALES AL FONDO DE DESARROLLO LOCAL DE LA CANDELARIA EN LOS TRÁMITES RELACIONADOS CON LOS PROCESOS PRECONTRACTUALES, CONTRACTUALES Y POS CONTRACTUALES, ASÍ COMO LA ADQUISICIÓN DE BIENES Y SERVICIOS A TRAVÉS DE LA TIENDA VIRTUAL DEL ESTADO COLOMBIANO","Inversión","Un Nuevo Contrato Social y Ambiental para la Bogotá del Siglo XXI",57,{"$f":"IF(ISERROR(VLOOKUP(L150,Proposito_programa!$C$2:$E$59,2,FALSE)),\" \",VLOOKUP(L150,Proposito_programa!$C$2:$E$59,2,FALSE))","v":"Gestión pública local"},{"$f":"IF(ISERROR(VLOOKUP(L150,Proposito_programa!$C$2:$E$59,3,FALSE)),\" \",VLOOKUP(L150,Proposito_programa!$C$2:$E$59,3,FALSE))","v":"Propósito 5: Construir Bogotá - Región con gobierno abierto, transparente y ciudadanía consciente"},2021,1,1032456470,"DIANA CATHERINE GONZALEZ MOLANO","Persona Natural",null,null,null,17600000,null,1,3360000,20960000,18240000,44447,44447,44578,110,null,21,null,null,null,null,null,null,"X",null,0.87022900763358779]
[1,133,2021,"FDLC-CPS-133-2021","https://community.secop.gov.co/Public/Tendering/OpportunityDetail/Index?noticeUID=CO1.NTC.2239377&isFromPublicArea=True&isModal=False","Contratos de prestación de servicios profesionales y de apoyo a la gestión","Contratación directa","Prestación de servicios profesionales y de apoyo a la gestión, o para la ejecución de trabajos artísticos que sólo puedan encomendarse a determinadas personas naturales;","PRESTACIÓN DE SERVICIOS PROFESIONALES EN LA IMPLEMENTACIÓN DE ACCIONES Y ESTRATEGIAS CULTURALES, MUSICALES Y ARTÍSTICAS ENFOCADAS A LAS INSTANCIAS DE PARTICIPACIÓN DE LA LOCALIDAD LA CANDELARIA, DE ACUERDO AL PROYECTO 1625 \"LA CANDELARIA CULTURAL, ARTISTICA Y PATRIMONIAL","Inversión","Un Nuevo Contrato Social y Ambiental para la Bogotá del Siglo XXI",21,{"$f":"IF(ISERROR(VLOOKUP(L151,Proposito_programa!$C$2:$E$59,2,FALSE)),\" \",VLOOKUP(L151,Proposito_programa!$C$2:$E$59,2,FALSE))","v":"Creación y vida cotidiana: Apropiación ciudadana del arte, la cultura y el patrimonio, para la democracia cultural"},{"$f":"IF(ISERROR(VLOOKUP(L151,Proposito_programa!$C$2:$E$59,3,FALSE)),\" \",VLOOKUP(L151,Proposito_programa!$C$2:$E$59,3,FALSE))","v":"Propósito 1: Hacer un nuevo contrato social para incrementar la inclusión social, productiva y política"},1625,1,1010207254,"ELY DAVID MURILLO CORDOBA","Persona Natural",null,null,null,14927000,null,1,2985400,17912400,6920700,44449,44449,44581,110,1,22,null,null,null,null,null,null,"X",null,0.38636363636363635]
[1,134,2021,"FDLC-SAMC-006-2021","https://community.secop.gov.co/Public/Tendering/OpportunityDetail/Index?noticeUID=CO1.NTC.2195033&isFromPublicArea=True&isModal=False","Contratos de prestación de servicios","Selección abreviada","Selección abreviada por menor cuantía ","PRESTAR SERVICIOS PARA REALIZAR ACTIVIDADES QUE PROMUEVAN LA RESIGNIFICACIÓN DEL TRABAJO DE CUIDADO, ASÍ COMO GENERAR ESPACIOS DE RESPIRO PARA LAS PERSONAS CUIDADORAS EN LA LOCALIDAD, EN EL MARCO DEL PROYECTO 1663 “LA CANDELARIA REDISTRIBUTIVA: DEMOCRATIZANDO EL TRABAJO DE CUIDADO","Inversión","Un Nuevo Contrato Social y Ambiental para la Bogotá del Siglo XXI",6,{"$f":"IF(ISERROR(VLOOKUP(L152,Proposito_programa!$C$2:$E$59,2,FALSE)),\" \",VLOOKUP(L152,Proposito_programa!$C$2:$E$59,2,FALSE))","v":"Sistema Distrital de Cuidado"},{"$f":"IF(ISERROR(VLOOKUP(L152,Proposito_programa!$C$2:$E$59,3,FALSE)),\" \",VLOOKUP(L152,Proposito_programa!$C$2:$E$59,3,FALSE))","v":"Propósito 1: Hacer un nuevo contrato social para incrementar la inclusión social, productiva y política"},1663,1,900175374,"ASOCIACION DE HOGARES SI A LA VIDA","Persona Jurídica",null,null,null,79573859,null,null,null,79573859,0,44455,44460,44581,120,null,null,null,null,null,null,null,null,"X",null,0]
[1,135,2021,"ORDEN DE COMPRA 75024","https://colombiacompra.gov.co/tienda-virtual-del-estado-colombiano/ordenes-compra/75024","Compraventa de bienes muebles","Selección abreviada","Acuerdo marco de precios ","ADQUISICIÓN A TRAVES DE ACUERDO MARCO DE ELEMENTOS DIDÁCTICOS, ARTÍSTICOS, DEPORTIVOS Y DE AUDIOVISUALES NECESARIOS PARA DOTACIÓN DE CENTRO AMAR UBICADO EN LA LOCALIDAD LA CANDELARIA","Inversión","Un Nuevo Contrato Social y Ambiental para la Bogotá del Siglo XXI",6,{"$f":"IF(ISERROR(VLOOKUP(L153,Proposito_programa!$C$2:$E$59,2,FALSE)),\" \",VLOOKUP(L153,Proposito_programa!$C$2:$E$59,2,FALSE))","v":"Sistema Distrital de Cuidado"},{"$f":"IF(ISERROR(VLOOKUP(L153,Proposito_programa!$C$2:$E$59,3,FALSE)),\" \",VLOOKUP(L153,Proposito_programa!$C$2:$E$59,3,FALSE))","v":"Propósito 1: Hacer un nuevo contrato social para incrementar la inclusión social, productiva y política"},1662,1,900552715,"GRUPO EMPRESARIAL MADEX S A S","Persona Jurídica",null,null,null,761300,null,null,null,761300,761299,44434,44438,44469,30,null,null,null,null,null,null,null,null,"X",null,0.99999868645737555]
[1,136,2021,"ORDEN DE COMPRA 75025","https://colombiacompra.gov.co/tienda-virtual-del-estado-colombiano/ordenes-compra/75025","Compraventa de bienes muebles","Selección abreviada","Acuerdo marco de precios ","ADQUISICIÓN A TRAVES DE ACUERDO MARCO DE ELEMENTOS DIDÁCTICOS, ARTÍSTICOS, DEPORTIVOS Y DE AUDIOVISUALES NECESARIOS PARA DOTACIÓN DE CENTRO AMAR UBICADO EN LA LOCALIDAD LA CANDELARIA","Inversión","Un Nuevo Contrato Social y Ambiental para la Bogotá del Siglo XXI",6,{"$f":"IF(ISERROR(VLOOKUP(L154,Proposito_programa!$C$2:$E$59,2,FALSE)),\" \",VLOOKUP(L154,Proposito_programa!$C$2:$E$59,2,FALSE))","v":"Sistema Distrital de Cuidado"},{"$f":"IF(ISERROR(VLOOKUP(L154,Proposito_programa!$C$2:$E$59,3,FALSE)),\" \",VLOOKUP(L154,Proposito_programa!$C$2:$E$59,3,FALSE))","v":"Propósito 1: Hacer un nuevo contrato social para incrementar la inclusión social, productiva y política"},1662,1,900838665,"ABOVE SAS","Persona Jurídica",null,null,null,5656506,null,null,null,{"$f":"+W154+X154+Z154","v":5656506},5656506,44434,44459,44511,30,null,23,null,null,null,null,null,null,"X",null,1]
[1,137,2021,"ORDEN DE COMPRA 75026","https://colombiacompra.gov.co/tienda-virtual-del-estado-colombiano/ordenes-compra/75026","Compraventa de bienes muebles","Selección abreviada","Acuerdo marco de precios ","ADQUISICIÓN A TRAVES DE ACUERDO MARCO DE ELEMENTOS DIDÁCTICOS, ARTÍSTICOS, DEPORTIVOS Y DE AUDIOVISUALES NECESARIOS PARA DOTACIÓN DE CENTRO AMAR UBICADO EN LA LOCALIDAD LA CANDELARIA","Inversión","Un Nuevo Contrato Social y Ambiental para la Bogotá del Siglo XXI",6,{"$f":"IF(ISERROR(VLOOKUP(L155,Proposito_programa!$C$2:$E$59,2,FALSE)),\" \",VLOOKUP(L155,Proposito_programa!$C$2:$E$59,2,FALSE))","v":"Sistema Distrital de Cuidado"},{"$f":"IF(ISERROR(VLOOKUP(L155,Proposito_programa!$C$2:$E$59,3,FALSE)),\" \",VLOOKUP(L155,Proposito_programa!$C$2:$E$59,3,FALSE))","v":"Propósito 1: Hacer un nuevo contrato social para incrementar la inclusión social, productiva y política"},1662,1,900353659,"JM GRUPO EMPRESARIAL SAS","Persona Jurídica",null,null,null,368186,null,null,null,{"$f":"+W155+X155+Z155","v":368186},368186,44434,44438,44469,30,null,null,null,null,null,null,null,null,"X",null,{"$f":"IF(ISERROR(AB155/AA155),\"-\",(AB155/AA155))","v":1}]
[1,138,2021,"ORDEN DE COMPRA 75027","https://colombiacompra.gov.co/tienda-virtual-del-estado-colombiano/ordenes-compra/75027","Compraventa de bienes muebles","Selección abreviada","Acuerdo marco de precios ","ADQUISICIÓN A TRAVES DE ACUERDO MARCO DE ELEMENTOS DIDÁCTICOS, ARTÍSTICOS, DEPORTIVOS Y DE AUDIOVISUALES NECESARIOS PARA DOTACIÓN DE CENTRO AMAR UBICADO EN LA LOCALIDAD LA CANDELARIA","Inversión","Un Nuevo Contrato Social y Ambiental para la Bogotá del Siglo XXI",6,{"$f":"IF(ISERROR(VLOOKUP(L156,Proposito_programa!$C$2:$E$59,2,FALSE)),\" \",VLOOKUP(L156,Proposito_programa!$C$2:$E$59,2,FALSE))","v":"Sistema Distrital de Cuidado"},{"$f":"IF(ISERROR(VLOOKUP(L156,Proposito_programa!$C$2:$E$59,3,FALSE)),\" \",VLOOKUP(L156,Proposito_programa!$C$2:$E$59,3,FALSE))","v":"Propósito 1: Hacer un nuevo contrato social para incrementar la inclusión social, productiva y política"},1662,1,52430291,"NELLY CARMENSA FIGUEROA ANACONA","Persona Natural",null,null,null,546172,null,null,null,546172,546171,44434,44438,44469,30,null,null,null,null,null,null,null,null,"X",null,0.99999816907494343]
[1,139,2021,"ORDEN DE COMPRA 75028","https://colombiacompra.gov.co/tienda-virtual-del-estado-colombiano/ordenes-compra/75028","Compraventa de bienes muebles","Selección abreviada","Acuerdo marco de precios ","ADQUISICIÓN A TRAVES DE ACUERDO MARCO DE ELEMENTOS DIDÁCTICOS, ARTÍSTICOS, DEPORTIVOS Y DE AUDIOVISUALES NECESARIOS PARA DOTACIÓN DE CENTRO AMAR UBICADO EN LA LOCALIDAD LA CANDELARIA","Inversión","Un Nuevo Contrato Social y Ambiental para la Bogotá del Siglo XXI",6,{"$f":"IF(ISERROR(VLOOKUP(L157,Proposito_programa!$C$2:$E$59,2,FALSE)),\" \",VLOOKUP(L157,Proposito_programa!$C$2:$E$59,2,FALSE))","v":"Sistema Distrital de Cuidado"},{"$f":"IF(ISERROR(VLOOKUP(L157,Proposito_programa!$C$2:$E$59,3,FALSE)),\" \",VLOOKUP(L157,Proposito_programa!$C$2:$E$59,3,FALSE))","v":"Propósito 1: Hacer un nuevo contrato social para incrementar la inclusión social, productiva y política"},1662,1,830037278,"NUEVA ERA SOLUCIONES SAS","Persona Jurídica",null,null,null,4258248,null,null,null,4258248,4258248,44434,44438,44469,30,null,null,null,null,null,null,null,null,"X",null,1]
[1,140,2021,"ORDEN DE COMPRA 75029","https://colombiacompra.gov.co/tienda-virtual-del-estado-colombiano/ordenes-compra/75029","Compraventa de bienes muebles","Selección abreviada","Acuerdo marco de precios ","ADQUISICIÓN A TRAVES DE ACUERDO MARCO DE ELEMENTOS DIDÁCTICOS, ARTÍSTICOS, DEPORTIVOS Y DE AUDIOVISUALES NECESARIOS PARA DOTACIÓN DE CENTRO AMAR UBICADO EN LA LOCALIDAD LA CANDELARIA","Inversión","Un Nuevo Contrato Social y Ambiental para la Bogotá del Siglo XXI",6,{"$f":"IF(ISERROR(VLOOKUP(L158,Proposito_programa!$C$2:$E$59,2,FALSE)),\" \",VLOOKUP(L158,Proposito_programa!$C$2:$E$59,2,FALSE))","v":"Sistema Distrital de Cuidado"},{"$f":"IF(ISERROR(VLOOKUP(L158,Proposito_programa!$C$2:$E$59,3,FALSE)),\" \",VLOOKUP(L158,Proposito_programa!$C$2:$E$59,3,FALSE))","v":"Propósito 1: Hacer un nuevo contrato social para incrementar la inclusión social, productiva y política"},1662,1,901495650,"UNIÓN TEMPORAL PEDAGÓGICOS 2021","Unión Temporal",860403480,"IMDICOL LTDA",0.5,5940480,null,null,null,5940480,5940480,44434,44438,44469,30,null,null,null,null,null,null,null,null,"X",null,1]
[0,140,2021,"ORDEN DE COMPRA 75029","https://colombiacompra.gov.co/tienda-virtual-del-estado-colombiano/ordenes-compra/75029","Compraventa de bienes muebles","Selección abreviada","Acuerdo marco de precios ","ADQUISICIÓN A TRAVES DE ACUERDO MARCO DE ELEMENTOS DIDÁCTICOS, ARTÍSTICOS, DEPORTIVOS Y DE AUDIOVISUALES NECESARIOS PARA DOTACIÓN DE CENTRO AMAR UBICADO EN LA LOCALIDAD LA CANDELARIA","Inversión","Un Nuevo Contrato Social y Ambiental para la Bogotá del Siglo XXI",6,{"$f":"IF(ISERROR(VLOOKUP(L159,Proposito_programa!$C$2:$E$59,2,FALSE)),\" \",VLOOKUP(L159,Proposito_programa!$C$2:$E$59,2,FALSE))","v":"Sistema Distrital de Cuidado"},{"$f":"IF(ISERROR(VLOOKUP(L159,[10]Proposito_programa!$C$2:$E$59,3,FALSE)),\" \",VLOOKUP(L159,[10]Proposito_programa!$C$2:$E$59,3,FALSE))","v":"Propósito 1: Hacer un nuevo contrato social para incrementar la inclusión social, productiva y política"},1662,1,901495650,"UNIÓN TEMPORAL PEDAGÓGICOS 2021","Unión Temporal",900488496,"BUSSINES SAS",0.5,0,null,null,null,0,0,44434,44438,44469,30,null,null,null,null,null,null,null,null,"X",null,"-"]
[1,141,2021,"FDLC-SASI-001-2021","https://community.secop.gov.co/Public/Tendering/OpportunityDetail/Index?noticeUID=CO1.NTC.2174927&isFromPublicArea=True&isModal=False\n","Compraventa de bienes muebles","Selección abreviada","Subasta inversa ","ADQUISICIÓN DE ELEMENTOS DIDÁCTICOS, ARTÍSTICOS, DEPORTIVOS Y DE AUDIOVISUALES NECESARIOS PARA DOTACIÓN DE CENTRO AMAR UBICADO EN LA LOCALIDAD LA CANDELARIA- (LOTE 1)","Inversión","Un Nuevo Contrato Social y Ambiental para la Bogotá del Siglo XXI",6,{"$f":"IF(ISERROR(VLOOKUP(L160,Proposito_programa!$C$2:$E$59,2,FALSE)),\" \",VLOOKUP(L160,Proposito_programa!$C$2:$E$59,2,FALSE))","v":"Sistema Distrital de Cuidado"},{"$f":"IF(ISERROR(VLOOKUP(L160,Proposito_programa!$C$2:$E$59,3,FALSE)),\" \",VLOOKUP(L160,Proposito_programa!$C$2:$E$59,3,FALSE))","v":"Propósito 1: Hacer un nuevo contrato social para incrementar la inclusión social, productiva y política"},1662,7,830084135,"DIDACTICOS SIMBOLOS Y SIGNOS S EN C","Persona Jurídica",null,null,null,28000000,null,null,null,28000000,28000000,44461,44461,44491,30,null,null,null,null,null,null,null,null,"X",null,1]
[1,142,2021,"FDLC-SASI-001-2021","https://community.secop.gov.co/Public/Tendering/OpportunityDetail/Index?noticeUID=CO1.NTC.2174927&isFromPublicArea=True&isModal=False\n","Compraventa de bienes muebles","Selección abreviada","Subasta inversa ","ADQUISICIÓN DE ELEMENTOS DIDÁCTICOS, ARTÍSTICOS, DEPORTIVOS Y DE AUDIOVISUALES NECESARIOS PARA DOTACIÓN DE CENTRO AMAR UBICADO EN LA LOCALIDAD LA CANDELARIA- (LOTE 2)","Inversión","Un Nuevo Contrato Social y Ambiental para la Bogotá del Siglo XXI",6,{"$f":"IF(ISERROR(VLOOKUP(L161,Proposito_programa!$C$2:$E$59,2,FALSE)),\" \",VLOOKUP(L161,Proposito_programa!$C$2:$E$59,2,FALSE))","v":"Sistema Distrital de Cuidado"},{"$f":"IF(ISERROR(VLOOKUP(L161,Proposito_programa!$C$2:$E$59,3,FALSE)),\" \",VLOOKUP(L161,Proposito_programa!$C$2:$E$59,3,FALSE))","v":"Propósito 1: Hacer un nuevo contrato social para incrementar la inclusión social, productiva y política"},1662,7,830084135,"DIDACTICOS SIMBOLOS Y SIGNOS S EN C","Persona Jurídica",null,null,null,11985792,null,null,null,11985792,11985792,44461,44461,44491,30,null,null,null,null,null,null,null,null,"X",null,1]
[1,143,2021,"FDLC-SASI-001-2021","https://community.secop.gov.co/Public/Tendering/OpportunityDetail/Index?noticeUID=CO1.NTC.2174927&isFromPublicArea=True&isModal=False\n","Compraventa de bienes muebles","Selección abreviada","Subasta inversa ","ADQUISICIÓN DE ELEMENTOS DIDÁCTICOS, ARTÍSTICOS, DEPORTIVOS Y DE AUDIOVISUALES NECESARIOS PARA DOTACIÓN DE CENTRO AMAR UBICADO EN LA LOCALIDAD LA CANDELARIA- (LOTE 1)","Inversión","Un Nuevo Contrato Social y Ambiental para la Bogotá del Siglo XXI",6,{"$f":"IF(ISERROR(VLOOKUP(L162,Proposito_programa!$C$2:$E$59,2,FALSE)),\" \",VLOOKUP(L162,Proposito_programa!$C$2:$E$59,2,FALSE))","v":"Sistema Distrital de Cuidado"},{"$f":"IF(ISERROR(VLOOKUP(L162,Proposito_programa!$C$2:$E$59,3,FALSE)),\" \",VLOOKUP(L162,Proposito_programa!$C$2:$E$59,3,FALSE))","v":"Propósito 1: Hacer un nuevo contrato social para incrementar la inclusión social, productiva y política"},1662,7,830084135,"DIDACTICOS SIMBOLOS Y SIGNOS S EN C","Persona Jurídica",null,null,null,25000000,null,null,null,25000000,25000000,44461,44461,44491,30,null,null,null,null,null,null,null,null,"X",null,1]
[1,144,2021,"FDLC-SASI-001-2021","https://community.secop.gov.co/Public/Tendering/OpportunityDetail/Index?noticeUID=CO1.NTC.2174927&isFromPublicArea=True&isModal=False\n","Compraventa de bienes muebles","Selección abreviada","Subasta inversa ","ADQUISICIÓN DE ELEMENTOS DIDÁCTICOS, ARTÍSTICOS, DEPORTIVOS Y DE AUDIOVISUALES NECESARIOS PARA DOTACIÓN DE CENTRO AMAR UBICADO EN LA LOCALIDAD LA CANDELARIA- (LOTE 1)","Inversión","Un Nuevo Contrato Social y Ambiental para la Bogotá del Siglo XXI",6,{"$f":"IF(ISERROR(VLOOKUP(L163,Proposito_programa!$C$2:$E$59,2,FALSE)),\" \",VLOOKUP(L163,Proposito_programa!$C$2:$E$59,2,FALSE))","v":"Sistema Distrital de Cuidado"},{"$f":"IF(ISERROR(VLOOKUP(L163,Proposito_programa!$C$2:$E$59,3,FALSE)),\" \",VLOOKUP(L163,Proposito_programa!$C$2:$E$59,3,FALSE))","v":"Propósito 1: Hacer un nuevo contrato social para incrementar la inclusión social, productiva y política"},1662,7,830084135,"DIDACTICOS SIMBOLOS Y SIGNOS S EN C","Persona Jurídica",null,null,null,6522000,null,null,null,6522000,6522000,44461,44461,44491,30,null,null,null,null,null,null,null,null,"X",null,1]
[1,145,2021,"FDLC-SASI-001-2021","https://community.secop.gov.co/Public/Tendering/OpportunityDetail/Index?noticeUID=CO1.NTC.2174927&isFromPublicArea=True&isModal=False\n","Compraventa de bienes muebles","Selección abreviada","Subasta inversa ","ADQUISICIÓN DE ELEMENTOS DIDÁCTICOS, ARTÍSTICOS, DEPORTIVOS Y DE AUDIOVISUALES NECESARIOS PARA DOTACIÓN DE CENTRO AMAR UBICADO EN LA LOCALIDAD LA CANDELARIA- (LOTE 1)","Inversión","Un Nuevo Contrato Social y Ambiental para la Bogotá del Siglo XXI",6,{"$f":"IF(ISERROR(VLOOKUP(L164,Proposito_programa!$C$2:$E$59,2,FALSE)),\" \",VLOOKUP(L164,Proposito_programa!$C$2:$E$59,2,FALSE))","v":"Sistema Distrital de Cuidado"},{"$f":"IF(ISERROR(VLOOKUP(L164,Proposito_programa!$C$2:$E$59,3,FALSE)),\" \",VLOOKUP(L164,Proposito_programa!$C$2:$E$59,3,FALSE))","v":"Propósito 1: Hacer un nuevo contrato social para incrementar la inclusión social, productiva y política"},1662,7,900125810,"INVERSIONES RIME S A S","Persona Jurídica",null,null,null,4410000,null,null,null,4410000,4409969,44461,44461,44491,30,null,null,null,null,null,null,null,null,"X",null,0.9999929705215419]
[1,146,2021,"FDLC-CPS-146- 2021","https://community.secop.gov.co/Public/Tendering/OpportunityDetail/Index?noticeUID=CO1.NTC.2270546&isFromPublicArea=True&isModal=False","Contratos de prestación de servicios profesionales y de apoyo a la gestión","Contratación directa","Prestación de servicios profesionales y de apoyo a la gestión, o para la ejecución de trabajos artísticos que sólo puedan encomendarse a determinadas personas naturales;","PRESTAR SERVICIOS DE APOYO TÉCNICO AL FONDO DE DESARROLLO LOCAL DE LA CANDELARIA EN LOS PROCEDIMIENTOS ADMINISTRATIVOS DERIVADOS DE LOS PROYECTOS SOCIALES Y DE SALUD EN LA LOCALIDAD","Inversión","Un Nuevo Contrato Social y Ambiental para la Bogotá del Siglo XXI",6,{"$f":"IF(ISERROR(VLOOKUP(L165,Proposito_programa!$C$2:$E$59,2,FALSE)),\" \",VLOOKUP(L165,Proposito_programa!$C$2:$E$59,2,FALSE))","v":"Sistema Distrital de Cuidado"},{"$f":"IF(ISERROR(VLOOKUP(L165,Proposito_programa!$C$2:$E$59,3,FALSE)),\" \",VLOOKUP(L165,Proposito_programa!$C$2:$E$59,3,FALSE))","v":"Propósito 1: Hacer un nuevo contrato social para incrementar la inclusión social, productiva y política"},1662,1,79907754,"JUAN ANGEL LOPEZ ARDILA","Persona Natural",null,null,null,8643600,null,null,null,8643600,5997600,44462,44462,44560,98,null,null,null,null,null,null,null,null,"X",null,0.69387755102040816]
[1,147,2021,"FDLC-CPS-147-2021","https://community.secop.gov.co/Public/Tendering/OpportunityDetail/Index?noticeUID=CO1.NTC.2271123&isFromPublicArea=True&isModal=False","Contratos de prestación de servicios profesionales y de apoyo a la gestión","Contratación directa","Prestación de servicios profesionales y de apoyo a la gestión, o para la ejecución de trabajos artísticos que sólo puedan encomendarse a determinadas personas naturales;","PRESTACIÓN DE SERVICIOS PROFESIONALES AL FONDO DE DESARROLLO LOCAL DE LA CANDELARIA PARA APOYAR EL SEGUIMIENTO, EJECUCION Y VISUALIZACIÓN DE LA GESTIÓN, RELACIONADOS CON LOS PROYECTOS DE MUJERES, EQUIDAD DE GÉNERO, VIOLENCIA INTRAFAMILIAR, CUIDADORAS Y CUIDADORES.","Inversión","Un Nuevo Contrato Social y Ambiental para la Bogotá del Siglo XXI",6,{"$f":"IF(ISERROR(VLOOKUP(L166,Proposito_programa!$C$2:$E$59,2,FALSE)),\" \",VLOOKUP(L166,Proposito_programa!$C$2:$E$59,2,FALSE))","v":"Sistema Distrital de Cuidado"},{"$f":"IF(ISERROR(VLOOKUP(L166,Proposito_programa!$C$2:$E$59,3,FALSE)),\" \",VLOOKUP(L166,Proposito_programa!$C$2:$E$59,3,FALSE))","v":"Propósito 1: Hacer un nuevo contrato social para incrementar la inclusión social, productiva y política"},1662,1,52962137,"DIANA CAROLINA BLANCO LADINO","Persona Natural",null,null,null,5900000,null,null,null,5900000,1376667,44462,44462,44552,90,null,null,null,null,null,null,null,null,"X",null,0.23333338983050847]
[0,147,2021,"FDLC-CPS-147-2021","https://community.secop.gov.co/Public/Tendering/OpportunityDetail/Index?noticeUID=CO1.NTC.2271123&isFromPublicArea=True&isModal=False","Contratos de prestación de servicios profesionales y de apoyo a la gestión","Contratación directa","Prestación de servicios profesionales y de apoyo a la gestión, o para la ejecución de trabajos artísticos que sólo puedan encomendarse a determinadas personas naturales;","PRESTACIÓN DE SERVICIOS PROFESIONALES AL FONDO DE DESARROLLO LOCAL DE LA CANDELARIA PARA APOYAR EL SEGUIMIENTO, EJECUCION Y VISUALIZACIÓN DE LA GESTIÓN, RELACIONADOS CON LOS PROYECTOS DE MUJERES, EQUIDAD DE GÉNERO, VIOLENCIA INTRAFAMILIAR, CUIDADORAS Y CUIDADORES.","Inversión","Un Nuevo Contrato Social y Ambiental para la Bogotá del Siglo XXI",6,{"$f":"IF(ISERROR(VLOOKUP(L167,Proposito_programa!$C$2:$E$59,2,FALSE)),\" \",VLOOKUP(L167,Proposito_programa!$C$2:$E$59,2,FALSE))","v":"Sistema Distrital de Cuidado"},{"$f":"IF(ISERROR(VLOOKUP(L167,Proposito_programa!$C$2:$E$59,3,FALSE)),\" \",VLOOKUP(L167,Proposito_programa!$C$2:$E$59,3,FALSE))","v":"Propósito 1: Hacer un nuevo contrato social para incrementar la inclusión social, productiva y política"},1663,1,52962137,"DIANA CAROLINA BLANCO LADINO","Persona Natural",null,null,null,5900000,null,null,null,{"$f":"+W167+X167+Z167","v":5900000},5900000,44462,44462,44552,90,null,null,null,null,null,null,null,null,"X",null,{"$f":"IF(ISERROR(AB167/AA167),\"-\",(AB167/AA167))","v":1}]
[0,147,2021,"FDLC-CPS-147-2021","https://community.secop.gov.co/Public/Tendering/OpportunityDetail/Index?noticeUID=CO1.NTC.2271123&isFromPublicArea=True&isModal=False","Contratos de prestación de servicios profesionales y de apoyo a la gestión","Contratación directa","Prestación de servicios profesionales y de apoyo a la gestión, o para la ejecución de trabajos artísticos que sólo puedan encomendarse a determinadas personas naturales;","PRESTACIÓN DE SERVICIOS PROFESIONALES AL FONDO DE DESARROLLO LOCAL DE LA CANDELARIA PARA APOYAR EL SEGUIMIENTO, EJECUCION Y VISUALIZACIÓN DE LA GESTIÓN, RELACIONADOS CON LOS PROYECTOS DE MUJERES, EQUIDAD DE GÉNERO, VIOLENCIA INTRAFAMILIAR, CUIDADORAS Y CUIDADORES.","Inversión","Un Nuevo Contrato Social y Ambiental para la Bogotá del Siglo XXI",40,{"$f":"IF(ISERROR(VLOOKUP(L168,Proposito_programa!$C$2:$E$59,2,FALSE)),\" \",VLOOKUP(L168,Proposito_programa!$C$2:$E$59,2,FALSE))","v":"Más mujeres viven una vida libre de violencias, se sienten seguras y acceden con confianza al sistema de justicia"},{"$f":"IF(ISERROR(VLOOKUP(L168,Proposito_programa!$C$2:$E$59,3,FALSE)),\" \",VLOOKUP(L168,Proposito_programa!$C$2:$E$59,3,FALSE))","v":"Propósito 3: Inspirar confianza y legitimidad para vivir sin miedo y ser epicentro de cultura ciudadana, paz y reconciliación"},1781,1,52962137,"DIANA CAROLINA BLANCO LADINO","Persona Natural",null,null,null,5900000,null,null,null,5900000,5900000,44462,44462,44552,90,null,null,null,null,null,null,null,null,"X",null,1]
[1,148,2021,"FDLC CPS 148-2021","https://community.secop.gov.co/Public/Tendering/OpportunityDetail/Index?noticeUID=CO1.NTC.2270917&isFromPublicArea=True&isModal=False","Contratos de prestación de servicios profesionales y de apoyo a la gestión","Contratación directa","Prestación de servicios profesionales y de apoyo a la gestión, o para la ejecución de trabajos artísticos que sólo puedan encomendarse a determinadas personas naturales;","PRESTAR SERVICIOS DE APOYO ADMINISTRATIVO Y ASISTENCIAL AL FONDO DE DESARROLLO LOCAL, EN LOS PROCESOS RELACIONADOS CON LA PARTICIPACION DE LAS JUVENTUDES EN LA LOCALIDAD.","Inversión","Un Nuevo Contrato Social y Ambiental para la Bogotá del Siglo XXI",55,{"$f":"IF(ISERROR(VLOOKUP(L169,Proposito_programa!$C$2:$E$59,2,FALSE)),\" \",VLOOKUP(L169,Proposito_programa!$C$2:$E$59,2,FALSE))","v":"Fortalecimiento de cultura ciudadana y su institucionalidad"},{"$f":"IF(ISERROR(VLOOKUP(L169,Proposito_programa!$C$2:$E$59,3,FALSE)),\" \",VLOOKUP(L169,Proposito_programa!$C$2:$E$59,3,FALSE))","v":"Propósito 5: Construir Bogotá - Región con gobierno abierto, transparente y ciudadanía consciente"},2019,1,1000222737,"VALENTINA BELLO CIFUENTES","Persona Natural",null,null,null,7840000,null,1,880000,8720000,5440000,44462,44462,44571,98,null,11,null,null,null,null,null,null,"X",null,0.62385321100917435]
[1,149,2021,"FDLC-IMC-007-2021","https://community.secop.gov.co/Public/Tendering/OpportunityDetail/Index?noticeUID=CO1.NTC.2278880&isFromPublicArea=True&isModal=False","Suministro","Contratación mínima cuantia","No aplica","Contratar el suministro de refrigerios y alimentos calientes, así como suministro de bonos canjeables para el desarrollo de las actividades denominadas tertulia historia familiar y estaciones literarias de la Institución Educativa Distrital Escuela Nacional de Comercio en el marco del proyecto denominado La Candelaria pedagógica bases sólidas para la vida","Inversión","Un Nuevo Contrato Social y Ambiental para la Bogotá del Siglo XXI",12,{"$f":"IF(ISERROR(VLOOKUP(L170,Proposito_programa!$C$2:$E$59,2,FALSE)),\" \",VLOOKUP(L170,Proposito_programa!$C$2:$E$59,2,FALSE))","v":"Educación inicial: Bases sólidas para la vida."},{"$f":"IF(ISERROR(VLOOKUP(L170,Proposito_programa!$C$2:$E$59,3,FALSE)),\" \",VLOOKUP(L170,Proposito_programa!$C$2:$E$59,3,FALSE))","v":"Propósito 1: Hacer un nuevo contrato social para incrementar la inclusión social, productiva y política"},1608,11,800081700,"FRUPYS LTDA","Persona Jurídica",null,null,null,5271000,null,null,null,5271000,0,44461,44462,44643,90,null,null,null,null,null,null,null,null,"X",null,0]
[1,150,2021,"FLDC-CPS-150-2021","https://community.secop.gov.co/Public/Tendering/OpportunityDetail/Index?noticeUID=CO1.NTC.2271005&isFromPublicArea=True&isModal=False","Contratos de prestación de servicios profesionales y de apoyo a la gestión","Contratación directa","Prestación de servicios profesionales y de apoyo a la gestión, o para la ejecución de trabajos artísticos que sólo puedan encomendarse a determinadas personas naturales;","o PRESTAR LOS SERVICIOS TÉCNICOS PARA LA OPERACIÓN, SEGUIMIENTO Y CUMPLIMIENTO DE LOS PROCESOS Y PROCEDIMIENTOS DEL SERVICIO APOYOS ECONÓMICOS TIPO C, REQUERIDOS PARA EL OPORTUNO Y ADECUADO REGISTRO, CRUCE Y REPORTE DE LOS DATOS EN EL SISTEMA MISIONAL¿SIRBE, QUE CONTRIBUYAN A LA GARANTÍA DE LOS DERECHOS DE LA POBLACIÓN MAYOR EN EL MARCO DE LA POLÍTICA PÚBLICA SOCIAL PARA EL ENVEJECIMIENTO Y LA VEJEZ EN EL DISTRITO CAPITAL A CARGO DE LA ALCALDÍA LOCAL.","Inversión","Un Nuevo Contrato Social y Ambiental para la Bogotá del Siglo XXI",1,{"$f":"IF(ISERROR(VLOOKUP(L171,Proposito_programa!$C$2:$E$59,2,FALSE)),\" \",VLOOKUP(L171,Proposito_programa!$C$2:$E$59,2,FALSE))","v":"Subsidios y transferencias para la equidad"},{"$f":"IF(ISERROR(VLOOKUP(L171,Proposito_programa!$C$2:$E$59,3,FALSE)),\" \",VLOOKUP(L171,Proposito_programa!$C$2:$E$59,3,FALSE))","v":"Propósito 1: Hacer un nuevo contrato social para incrementar la inclusión social, productiva y política"},1605,1,80263860,"PEDRO SIERRA GARCIA","Persona Natural",null,null,null,9114000,null,1,1023000,10137000,9207000,44462,44462,44571,98,1,11,null,null,null,null,null,null,"X",null,0.90825688073394495]
[1,151,2021,"FDLC-SASI-002-2021","https://community.secop.gov.co/Public/Tendering/OpportunityDetail/Index?noticeUID=CO1.NTC.2193591&isFromPublicArea=True&isModal=False","Compraventa de bienes muebles","Selección abreviada","Subasta inversa ","ADQUISICIÓN DE CARPAS PARA EL USO DE ACTIVIDADES INSTITUCIONALES, DE CONFORMIDAD CON LAS ESPECIFICACIONES TÉCNICAS","Inversión","Un Nuevo Contrato Social y Ambiental para la Bogotá del Siglo XXI",6,{"$f":"IF(ISERROR(VLOOKUP(L172,Proposito_programa!$C$2:$E$59,2,FALSE)),\" \",VLOOKUP(L172,Proposito_programa!$C$2:$E$59,2,FALSE))","v":"Sistema Distrital de Cuidado"},{"$f":"IF(ISERROR(VLOOKUP(L172,Proposito_programa!$C$2:$E$59,3,FALSE)),\" \",VLOOKUP(L172,Proposito_programa!$C$2:$E$59,3,FALSE))","v":"Propósito 1: Hacer un nuevo contrato social para incrementar la inclusión social, productiva y política"},1628,4,901525481,"U T KYC 2021","Unión Temporal",901061836,"CASTECK SAS",0.5,31628403,null,null,null,31628403,31628403,44463,44470,44500,30,null,null,null,null,null,null,null,null,"X",null,1]
[0,151,2021,"FDLC-SASI-002-2021","https://community.secop.gov.co/Public/Tendering/OpportunityDetail/Index?noticeUID=CO1.NTC.2193591&isFromPublicArea=True&isModal=False","Compraventa de bienes muebles","Selección abreviada","Subasta inversa ","ADQUISICIÓN DE CARPAS PARA EL USO DE ACTIVIDADES INSTITUCIONALES, DE CONFORMIDAD CON LAS ESPECIFICACIONES TÉCNICAS","Inversión","Un Nuevo Contrato Social y Ambiental para la Bogotá del Siglo XXI",6,{"$f":"IF(ISERROR(VLOOKUP(L173,Proposito_programa!$C$2:$E$59,2,FALSE)),\" \",VLOOKUP(L173,Proposito_programa!$C$2:$E$59,2,FALSE))","v":"Sistema Distrital de Cuidado"},{"$f":"IF(ISERROR(VLOOKUP(L173,Proposito_programa!$C$2:$E$59,3,FALSE)),\" \",VLOOKUP(L173,Proposito_programa!$C$2:$E$59,3,FALSE))","v":"Propósito 1: Hacer un nuevo contrato social para incrementar la inclusión social, productiva y política"},1628,4,901525481,"U T KYC 2021","Unión Temporal",900934968,"CORPORACION KAYROS SAS",0.5,0,null,null,null,0,0,44463,44470,44500,30,null,null,null,null,null,null,null,null,null,null,"-"]
[1,152,2021,"FDLC-IMC-006-2021","https://community.secop.gov.co/Public/Tendering/OpportunityDetail/Index?noticeUID=CO1.NTC.2236614&isFromPublicArea=True&isModal=False","Suministro","Contratación mínima cuantia","No aplica","SUMINISTRO DE PRODUCTOS DE PAPELERÍA, ELEMENTOS, ÚTILES Y ARTÍCULOS DE OFICINA NECESARIOS PARA EL CUMPLIMIENTO DE LAS FUNCIONES ADMINISTRATIVAS Y MISIONALES DE LA ALCALDÍA LOCAL DE LA CANDELARIA","Funcionamiento","Un Nuevo Contrato Social y Ambiental para la Bogotá del Siglo XXI","No aplica",{"$f":"IF(ISERROR(VLOOKUP(L174,Proposito_programa!$C$2:$E$59,2,FALSE)),\" \",VLOOKUP(L174,Proposito_programa!$C$2:$E$59,2,FALSE))","v":" "},{"$f":"IF(ISERROR(VLOOKUP(L174,Proposito_programa!$C$2:$E$59,3,FALSE)),\" \",VLOOKUP(L174,Proposito_programa!$C$2:$E$59,3,FALSE))","v":" "},"N/A",11,53010819,"ANGELA JOHANNA RODRIGUEZ CASTRO","Persona Natural",null,null,null,6455500,null,null,null,6455500,6455500,44463,44467,44497,30,null,null,null,null,null,null,null,null,"X",null,1]
[1,153,2021,"FDLC-CPS-153-2021","https://community.secop.gov.co/Public/Tendering/OpportunityDetail/Index?noticeUID=CO1.NTC.2272930&isFromPublicArea=True&isModal=False","Contratos de prestación de servicios profesionales y de apoyo a la gestión","Contratación directa","Prestación de servicios profesionales y de apoyo a la gestión, o para la ejecución de trabajos artísticos que sólo puedan encomendarse a determinadas personas naturales;","PRESTAR SERVICIOS PROFESIONALES AL FONDO DE DESARROLLO LOCAL DE LA CANDELARIA PARA APOYAR EL SEGUIMIENTO Y EJECUCION DE LOS PROGRAMAS AMBIENTALES Y DE AGRICULTURA URBANA EN LA LOCALIDAD.","Inversión","Un Nuevo Contrato Social y Ambiental para la Bogotá del Siglo XXI",24,{"$f":"IF(ISERROR(VLOOKUP(L175,Proposito_programa!$C$2:$E$59,2,FALSE)),\" \",VLOOKUP(L175,Proposito_programa!$C$2:$E$59,2,FALSE))","v":"Bogotá región emprendedora e innovadora"},{"$f":"IF(ISERROR(VLOOKUP(L175,Proposito_programa!$C$2:$E$59,3,FALSE)),\" \",VLOOKUP(L175,Proposito_programa!$C$2:$E$59,3,FALSE))","v":"Propósito 1: Hacer un nuevo contrato social para incrementar la inclusión social, productiva y política"},1626,1,1013628927,"DAISSY TATIANA FAJARDO VELASCO","Persona Natural",null,null,null,13541200,null,1,1535600,15076800,9353200,44463,44463,44571,97,1,11,null,null,null,null,null,null,"X",null,0.62037037037037035]
[1,154,2021,"FDLC-CPS-154-2021","https://community.secop.gov.co/Public/Tendering/OpportunityDetail/Index?noticeUID=CO1.NTC.2279672&isFromPublicArea=True&isModal=False","Contratos de prestación de servicios profesionales y de apoyo a la gestión","Contratación directa","Prestación de servicios profesionales y de apoyo a la gestión, o para la ejecución de trabajos artísticos que sólo puedan encomendarse a determinadas personas naturales;","PRESTAR SERVICIOS DE APOYO EN LA EMISORA A CARGO DEL FONDO DE DESARROLLO LOCAL LA CANDELARIA.","Inversión","Un Nuevo Contrato Social y Ambiental para la Bogotá del Siglo XXI",21,{"$f":"IF(ISERROR(VLOOKUP(L176,Proposito_programa!$C$2:$E$59,2,FALSE)),\" \",VLOOKUP(L176,Proposito_programa!$C$2:$E$59,2,FALSE))","v":"Creación y vida cotidiana: Apropiación ciudadana del arte, la cultura y el patrimonio, para la democracia cultural"},{"$f":"IF(ISERROR(VLOOKUP(L176,Proposito_programa!$C$2:$E$59,3,FALSE)),\" \",VLOOKUP(L176,Proposito_programa!$C$2:$E$59,3,FALSE))","v":"Propósito 1: Hacer un nuevo contrato social para incrementar la inclusión social, productiva y política"},1625,1,14250858,"RICARDO ABEL ROLDAN CORREA","Persona Natural",null,null,null,7350000,null,null,null,7350000,5145000,44467,44467,44557,90,null,null,null,null,null,null,null,null,"X",null,0.7]
[1,155,2021,"FDLC-CPS-155-2021","https://community.secop.gov.co/Public/Tendering/OpportunityDetail/Index?noticeUID=CO1.NTC.2279673&isFromPublicArea=True&isModal=False","Contratos de prestación de servicios profesionales y de apoyo a la gestión","Contratación directa","Prestación de servicios profesionales y de apoyo a la gestión, o para la ejecución de trabajos artísticos que sólo puedan encomendarse a determinadas personas naturales;","PRESTAR SERVICIOS DE APOYO ADMINISTRATIVO Y ASISTENCIAL AL ÁREA DE GESTIÓN DE DESARROLLO LOCAL, EN LOS PROCESOS DE COMPETENCIA RELACIONADOS CON LAS ACTIVIDADES DE GESTION DOCUMENTAL DE LA ALCALDÍA LOCAL DE LA CANDELARIA.","Inversión","Un Nuevo Contrato Social y Ambiental para la Bogotá del Siglo XXI",57,{"$f":"IF(ISERROR(VLOOKUP(L177,Proposito_programa!$C$2:$E$59,2,FALSE)),\" \",VLOOKUP(L177,Proposito_programa!$C$2:$E$59,2,FALSE))","v":"Gestión pública local"},{"$f":"IF(ISERROR(VLOOKUP(L177,Proposito_programa!$C$2:$E$59,3,FALSE)),\" \",VLOOKUP(L177,Proposito_programa!$C$2:$E$59,3,FALSE))","v":"Propósito 5: Construir Bogotá - Región con gobierno abierto, transparente y ciudadanía consciente"},2021,1,1001281981,"YEISON ESMIK GOMEZ HERNANDEZ","Persona Natural",null,null,null,5400000,null,null,null,5400000,1920000,44467,44467,44557,90,null,null,null,null,null,null,null,null,"X",null,0.35555555555555557]
[1,156,2021,"FDLC-SAMC-007-2021","https://community.secop.gov.co/Public/Tendering/OpportunityDetail/Index?noticeUID=CO1.NTC.2278880&isFromPublicArea=True&isModal=False","Contratos de prestación de servicios","Selección abreviada","Selección abreviada por menor cuantía ","PRESTAR SERVICIOS PARA REALIZAR ACTIVIDADES QUE PROMUEVAN LA PREVENCION DE VIOLENCIA INTRAFAMILIAR Y SEXUAL SOBRE POBLACIONES EN SITUACIONES DE RIESGO Y VULNERACIÓN DE DERECHOS EN EL MARCO DEL PROYECTO 1662 LA CANDELARIA TERRITORIO LIBRE DE VIOLENCIA INTRAFAMILIAR Y SEXUAL\t","Inversión","Un Nuevo Contrato Social y Ambiental para la Bogotá del Siglo XXI",6,{"$f":"IF(ISERROR(VLOOKUP(L178,Proposito_programa!$C$2:$E$59,2,FALSE)),\" \",VLOOKUP(L178,Proposito_programa!$C$2:$E$59,2,FALSE))","v":"Sistema Distrital de Cuidado"},{"$f":"IF(ISERROR(VLOOKUP(L178,Proposito_programa!$C$2:$E$59,3,FALSE)),\" \",VLOOKUP(L178,Proposito_programa!$C$2:$E$59,3,FALSE))","v":"Propósito 1: Hacer un nuevo contrato social para incrementar la inclusión social, productiva y política"},1662,11,830095614,"FUNVIVE 2.0","Persona Jurídica",null,null,null,105696000,null,null,null,105696000,0,44480,44483,44574,90,null,null,null,null,null,null,null,null,"X",null,0]
[1,157,2021,"FDLC-CPS-157-2021","https://community.secop.gov.co/Public/Tendering/OpportunityDetail/Index?noticeUID=CO1.NTC.2315643&isFromPublicArea=True&isModal=False","Contratos de prestación de servicios profesionales y de apoyo a la gestión","Contratación directa","Prestación de servicios profesionales y de apoyo a la gestión, o para la ejecución de trabajos artísticos que sólo puedan encomendarse a determinadas personas naturales;","PRESTACIÓN DE SERVICIOS DE APOYO LOGÍSTICO EN LOS EVENTOS Y ACTIVIDADES DE LA ADMINISTRACIÓN LOCAL DE LA LOCALIDAD DE LA CANDELARIA.","Inversión","Un Nuevo Contrato Social y Ambiental para la Bogotá del Siglo XXI",6,{"$f":"IF(ISERROR(VLOOKUP(L179,Proposito_programa!$C$2:$E$59,2,FALSE)),\" \",VLOOKUP(L179,Proposito_programa!$C$2:$E$59,2,FALSE))","v":"Sistema Distrital de Cuidado"},{"$f":"IF(ISERROR(VLOOKUP(L179,Proposito_programa!$C$2:$E$59,3,FALSE)),\" \",VLOOKUP(L179,Proposito_programa!$C$2:$E$59,3,FALSE))","v":"Propósito 1: Hacer un nuevo contrato social para incrementar la inclusión social, productiva y política"},1628,1,19458700,"OSCAR BARRERA ARROYAVE","Persona Natural",null,null,null,3932500,null,null,null,3932500,2117500,44495,44495,44560,65,null,null,null,null,null,null,null,null,"X",null,0.53846153846153844]
[1,158,2021,"FDLC-CPS-158-2021","https://community.secop.gov.co/Public/Tendering/OpportunityDetail/Index?noticeUID=CO1.NTC.2332005&isFromPublicArea=True&isModal=False\n","Contratos de prestación de servicios profesionales y de apoyo a la gestión","Contratación directa","Prestación de servicios profesionales y de apoyo a la gestión, o para la ejecución de trabajos artísticos que sólo puedan encomendarse a determinadas personas naturales;","PRESTACIÓN DE SERVICIOS TÉCNICOS AL ÁREA DE GESTIÓN DE DESARROLLO LOCAL DE LA ALCALDÍA LOCAL DE LA CANDELARIA, PARA APOYAR LA GESTIÓN Y LAS CONVOCATORIAS REALIZADAS POR LA ALCALDÍA LOCAL EN BENEFICIO DE LA COMUNIDAD","Inversión","Un Nuevo Contrato Social y Ambiental para la Bogotá del Siglo XXI",21,{"$f":"IF(ISERROR(VLOOKUP(L180,Proposito_programa!$C$2:$E$59,2,FALSE)),\" \",VLOOKUP(L180,Proposito_programa!$C$2:$E$59,2,FALSE))","v":"Creación y vida cotidiana: Apropiación ciudadana del arte, la cultura y el patrimonio, para la democracia cultural"},{"$f":"IF(ISERROR(VLOOKUP(L180,Proposito_programa!$C$2:$E$59,3,FALSE)),\" \",VLOOKUP(L180,Proposito_programa!$C$2:$E$59,3,FALSE))","v":"Propósito 1: Hacer un nuevo contrato social para incrementar la inclusión social, productiva y política"},1625,1,41621560,"NELLY PARRA TOCORA","Persona Natural",null,null,null,6783000,null,null,null,6783000,3876000,44490,44490,44560,70,null,null,null,null,null,null,null,null,"X",null,0.5714285714285714]
[1,159,2021,"FDLC-CPS-159-2021","https://community.secop.gov.co/Public/Tendering/OpportunityDetail/Index?noticeUID=CO1.NTC.2315279&isFromPublicArea=True&isModal=False","Contratos de prestación de servicios profesionales y de apoyo a la gestión","Contratación directa","Prestación de servicios profesionales y de apoyo a la gestión, o para la ejecución de trabajos artísticos que sólo puedan encomendarse a determinadas personas naturales;","PRESTACIÓN DE SERVICIOS PROFESIONALES DE APOYO AL FONDO DE DESARROLLO LOCAL DE LA CANDELARIA PARA APOYAR EL SEGUIMIENTO Y EJECUCION DE LOS PROYECTOS DE MUJERES, EQUIDAD DE GÉNERO, VIOLENCIA INTRAFAMILIAR, CUIDADORAS Y CUIDADORES.","Inversión","Un Nuevo Contrato Social y Ambiental para la Bogotá del Siglo XXI",6,{"$f":"IF(ISERROR(VLOOKUP(L181,Proposito_programa!$C$2:$E$59,2,FALSE)),\" \",VLOOKUP(L181,Proposito_programa!$C$2:$E$59,2,FALSE))","v":"Sistema Distrital de Cuidado"},{"$f":"IF(ISERROR(VLOOKUP(L181,Proposito_programa!$C$2:$E$59,3,FALSE)),\" \",VLOOKUP(L181,Proposito_programa!$C$2:$E$59,3,FALSE))","v":"Propósito 1: Hacer un nuevo contrato social para incrementar la inclusión social, productiva y política"},1662,1,41648295,"ISABEL SANCHEZ RODRIGUEZ","Persona Natural",null,null,null,11338599,null,null,null,11338599,6977600,44482,44482,44560,78,null,null,null,null,null,null,null,null,"X",null,0.61538466965804151]
[1,160,2021,"FDLC-CPS-160-2021","https://community.secop.gov.co/Public/Tendering/OpportunityDetail/Index?noticeUID=CO1.NTC.2314796&isFromPublicArea=True&isModal=False\n","Contratos de prestación de servicios profesionales y de apoyo a la gestión","Contratación directa","Prestación de servicios profesionales y de apoyo a la gestión, o para la ejecución de trabajos artísticos que sólo puedan encomendarse a determinadas personas naturales;","PRESTAR SERVICIOS PROFESIONALES AL FONDO DE DESARROLLO LOCAL DE LA CANDELARIA PARA LA FORMULACIÓN Y SEGUIMIENTO DE PLANES, POLITICAS PROGRAMAS Y PROYECTOS RELACIONADOS CON LA ESTRATEGIA DE CUIDADO, PREVENCIÓN DE VIOLENCIAS Y PROYECTOS CON ENFOQUE DE GÉNERO DEL PLAN DE DESARROLLO LOCAL.","Inversión","Un Nuevo Contrato Social y Ambiental para la Bogotá del Siglo XXI",6,{"$f":"IF(ISERROR(VLOOKUP(L182,Proposito_programa!$C$2:$E$59,2,FALSE)),\" \",VLOOKUP(L182,Proposito_programa!$C$2:$E$59,2,FALSE))","v":"Sistema Distrital de Cuidado"},{"$f":"IF(ISERROR(VLOOKUP(L182,Proposito_programa!$C$2:$E$59,3,FALSE)),\" \",VLOOKUP(L182,Proposito_programa!$C$2:$E$59,3,FALSE))","v":"Propósito 1: Hacer un nuevo contrato social para incrementar la inclusión social, productiva y política"},1663,1,1010221878,"LUISA MARIA MURILLO LOREO","Persona Natural",null,null,null,13083000,null,null,null,13083000,2616600,44482,44482,44560,77,null,null,null,null,null,null,null,null,"X",null,0.2]
[1,161,2021,"FDLC-CPS-161-2021","https://community.secop.gov.co/Public/Tendering/OpportunityDetail/Index?noticeUID=CO1.NTC.2342192&isFromPublicArea=True&isModal=False\n","Contratos de prestación de servicios profesionales y de apoyo a la gestión","Contratación directa","Prestación de servicios profesionales y de apoyo a la gestión, o para la ejecución de trabajos artísticos que sólo puedan encomendarse a determinadas personas naturales;","\tPRESTAR SERVICIOS PROFESIONALES PARA APOYAR AL FONDO DE DESARROLLO LOCAL DE LA CANDELARIA, EN LA IMPLEMENTACIÓN Y SEGUIMIENTO DE LAS ACTIVIDADES CULTURALES, ARTÍSTICAS Y MUSICALES, ASI COMO TAMBIEN, LA FORMULACIÓN DEL PROYECTO SALVAMENTO DE TEATROS","Inversión","Un Nuevo Contrato Social y Ambiental para la Bogotá del Siglo XXI",21,{"$f":"IF(ISERROR(VLOOKUP(L183,Proposito_programa!$C$2:$E$59,2,FALSE)),\" \",VLOOKUP(L183,Proposito_programa!$C$2:$E$59,2,FALSE))","v":"Creación y vida cotidiana: Apropiación ciudadana del arte, la cultura y el patrimonio, para la democracia cultural"},{"$f":"IF(ISERROR(VLOOKUP(L183,Proposito_programa!$C$2:$E$59,3,FALSE)),\" \",VLOOKUP(L183,Proposito_programa!$C$2:$E$59,3,FALSE))","v":"Propósito 1: Hacer un nuevo contrato social para incrementar la inclusión social, productiva y política"},1625,1,79911301,"CLIMACO ESTEBAN ZABALA RAMIREZ","Persona Natural",null,null,null,12805000,null,null,null,12805000,0,44495,44495,44560,65,null,null,null,null,null,null,null,null,"X",null,0]
[1,162,2021,"FDLC-CPS-162-2021","https://community.secop.gov.co/Public/Tendering/OpportunityDetail/Index?noticeUID=CO1.NTC.2343241&isFromPublicArea=True&isModal=False\n","Contratos de prestación de servicios profesionales y de apoyo a la gestión","Contratación directa","Prestación de servicios profesionales y de apoyo a la gestión, o para la ejecución de trabajos artísticos que sólo puedan encomendarse a determinadas personas naturales;","PRESTACIÓN DE SERVICIOS DE APOYO LOGÍSTICO EN LOS EVENTOS Y ACTIVIDADES DE LA ADMINISTRACIÓN LOCAL DE LA LOCALIDAD DE LA CANDELARIA.","Inversión","Un Nuevo Contrato Social y Ambiental para la Bogotá del Siglo XXI",6,{"$f":"IF(ISERROR(VLOOKUP(L184,Proposito_programa!$C$2:$E$59,2,FALSE)),\" \",VLOOKUP(L184,Proposito_programa!$C$2:$E$59,2,FALSE))","v":"Sistema Distrital de Cuidado"},{"$f":"IF(ISERROR(VLOOKUP(L184,Proposito_programa!$C$2:$E$59,3,FALSE)),\" \",VLOOKUP(L184,Proposito_programa!$C$2:$E$59,3,FALSE))","v":"Propósito 1: Hacer un nuevo contrato social para incrementar la inclusión social, productiva y política"},1628,1,80108185,"ALEXIS ROLANDO CASTELLANOS MOSQUERA","Persona Natural",null,null,null,3932500,null,null,null,3932500,2117500,44495,44495,44560,65,null,null,null,null,null,null,null,null,"X",null,0.53846153846153844]
[1,"FDLC-CIA-005-2021",2021,"FDLC-CIA-005-2021","https://community.secop.gov.co/Public/Tendering/OpportunityDetail/Index?noticeUID=CO1.NTC.2381784&isFromPublicArea=True&isModal=False\n","Contratos interadministrativos","Contratación directa","Contratos interadministrativos","AUNAR ESFUERZOS TÉCNICOS, ADMINISTRATIVOS Y FINANCIEROS, PARA EJECUTAR LAS ETAPAS DEL PROCESO DE OTORGAMIENTO DE DISPOSITIVOS DE ASISTENCIA PERSONAL - AYUDAS TÉCNICAS (NO INCLUIDOS EN LOS PLANES DE BENEFICIO), A PERSONAS CON DISCAPACIDAD, DANDO RESPUESTA A LAS NECESIDADES TERRITORIALES DESDE LOS ENFOQUES DEL BUEN VIVIR, SOCIAL Y DE DERECHOS.","Inversión","Un Nuevo Contrato Social y Ambiental para la Bogotá del Siglo XXI",6,{"$f":"IF(ISERROR(VLOOKUP(L185,Proposito_programa!$C$2:$E$59,2,FALSE)),\" \",VLOOKUP(L185,Proposito_programa!$C$2:$E$59,2,FALSE))","v":"Sistema Distrital de Cuidado"},{"$f":"IF(ISERROR(VLOOKUP(L185,Proposito_programa!$C$2:$E$59,3,FALSE)),\" \",VLOOKUP(L185,Proposito_programa!$C$2:$E$59,3,FALSE))","v":"Propósito 1: Hacer un nuevo contrato social para incrementar la inclusión social, productiva y política"},1664,1,900959051,"SUBRED INTEGRADA DE SERVICIOS DE SALUD CENTRO ORIENTE ESE","Persona Jurídica",null,null,null,71492730,null,null,null,71492730,0,44541,44541,44691,180,null,null,null,null,null,null,null,"X",null,null,0]
[1,"FDLC-CIA-006-2021",2021,"FDLC-CIA-006-2021","https://community.secop.gov.co/Public/Tendering/OpportunityDetail/Index?noticeUID=CO1.NTC.2389555&isFromPublicArea=True&isModal=False","Contratos interadministrativos","Contratación directa","Contratos interadministrativos","AUNAR ESFUERZOS TÉCNICOS, LOGÍSTICOS, HUMANOS Y ADMINISTRATIVOS CON EL FIN DE IMPLEMENTAR POLÍTICAS, PLANES, PROYECTOS Y DESARROLLAR ACCIONES ENCAMINADAS A LA PROTECCIÓN, CONSERVACIÓN, INTERVENCIÓN, INVESTIGACIÓN Y DIVULGACIÓN DEL PATRIMONIO CULTURAL DE BOGOTÁ EN ÁREAS DE INTERÉS CONJUNTAS PARA EL INSTITUTO DISTRITAL DE PATRIMONIO CULTURAL (IDPC) Y LA ALCALDÍA LOCAL DE LA CANDELARIA DE CONFORMIDAD CON LOS OBJETOS MISIONALES DE AMBAS ENTIDADES","Funcionamiento","Un Nuevo Contrato Social y Ambiental para la Bogotá del Siglo XXI","No aplica",{"$f":"IF(ISERROR(VLOOKUP(L186,Proposito_programa!$C$2:$E$59,2,FALSE)),\" \",VLOOKUP(L186,Proposito_programa!$C$2:$E$59,2,FALSE))","v":" "},{"$f":"IF(ISERROR(VLOOKUP(L186,Proposito_programa!$C$2:$E$59,3,FALSE)),\" \",VLOOKUP(L186,Proposito_programa!$C$2:$E$59,3,FALSE))","v":" "},null,1,860506170,"INSTITUTO DISTRITAL DE PATRIMONIO CULTURAL (IDPC)\r","Persona Jurídica",null,null,null,0,null,null,null,0,0,44512,44512,45607,{"$f":"360*3","v":1080},null,null,null,null,null,null,null,"X",null,null,"-"]
[1,"FDLC-CIA-007-2021",2021,"FDLC-CIA-007-2021","https://community.secop.gov.co/Public/Tendering/OpportunityDetail/Index?noticeUID=CO1.NTC.2391142&isFromPublicArea=True&isModal=False\n","Contratos interadministrativos","Contratación directa","Contratos interadministrativos","AUNAR ESFUERZOS TÉCNICOS, ADMINISTRATIVOS, LOGÍSTICOS ENTRE LA ALCALDÍA LOCAL DE LA CANDELARIA Y LA ORQUESTA FILARMÓNICA DE BOGOTÁ PARA LA CONTINUIDAD Y DESARROLLO DEL CENTRO FILARMÓNICO LOCAL, COMO UN ESPACIO PARA EL PROCESO DE FORMACIÓN MUSICAL IMPLEMENTADO POR LA ORQUESTA Y DIRIGIDO A LA LOCALIDAD, LAS CUALES SE DEASRROLLARAN DE MANERA VIRTUAL Y PRESENCIAL, TENIENDO EN CUENTA LA SITUACION ACTUAL DE PANDEMIA NACIONAL QUE VIVE EL PAIS","Funcionamiento","Un Nuevo Contrato Social y Ambiental para la Bogotá del Siglo XXI","No aplica",{"$f":"IF(ISERROR(VLOOKUP(L187,Proposito_programa!$C$2:$E$59,2,FALSE)),\" \",VLOOKUP(L187,Proposito_programa!$C$2:$E$59,2,FALSE))","v":" "},{"$f":"IF(ISERROR(VLOOKUP(L187,Proposito_programa!$C$2:$E$59,3,FALSE)),\" \",VLOOKUP(L187,Proposito_programa!$C$2:$E$59,3,FALSE))","v":" "},null,1,899999282,"ORQUESTA FILARMONICA DE BOGOTA","Persona Jurídica",null,null,null,0,null,null,null,0,0,44512,44512,44865,207,null,null,null,null,null,null,null,"X",null,null,"-"]
[1,"FDLC-CIA-008-2021",2021,"FDLC-CIA-008-2021","https://community.secop.gov.co/Public/Tendering/OpportunityDetail/Index?noticeUID=CO1.NTC.2390812&isFromPublicArea=True&isModal=False","Contratos interadministrativos","Contratación directa","Contratos interadministrativos","“Implementar acciones para el reconocimiento integral de las comunidades indígenas que habitan en la localidad, mediante la generación de herramientas que les permitan el conocimiento de sus derechos, y el mejoramiento de sus condiciones de existencia individual y colectivamente con la implementación de los proyectos: 1626 LA CANDELARIA SOSTENIBLE: AGRICULTURA URBANA, COMPONENTE 1.\nAGRICULTURA URBANA; 1628 LA CANDELARIA PRODUCTIVA Y RESILIENTE, COMPONENTE 4.TRANSFORMACIÓN PRODUCTIVA; 1663 LA CANDELARIA REDISTRIBUTIVA: DEMOCRATIZANDO EL TRABAJO DE CUIDADO, COMPONENTE 1. ESTRATEGIAS DE CUIDADO; 1664 LA CANDELARIA INCLUYENTE Y ANCESTRAL, COMPONENTE 2. SABERES ANCESTRALES; Y 1781 LA CANDELARIA SEGURA: MUJERES LIBRES DE VIOLENCIAS, COMPONENTE 2. PREVENCIÓN DEL FEMINICIDIO Y LA VIOLENCIA CONTRA LA MUJER”.","Inversión","Un Nuevo Contrato Social y Ambiental para la Bogotá del Siglo XXI",24,{"$f":"IF(ISERROR(VLOOKUP(L188,Proposito_programa!$C$2:$E$59,2,FALSE)),\" \",VLOOKUP(L188,Proposito_programa!$C$2:$E$59,2,FALSE))","v":"Bogotá región emprendedora e innovadora"},{"$f":"IF(ISERROR(VLOOKUP(L188,Proposito_programa!$C$2:$E$59,3,FALSE)),\" \",VLOOKUP(L188,Proposito_programa!$C$2:$E$59,3,FALSE))","v":"Propósito 1: Hacer un nuevo contrato social para incrementar la inclusión social, productiva y política"},1626,1,830032429,"CABILDO INDIGENA INGA DE BOGOTA D.C.","Persona Jurídica",null,null,null,27345350,null,null,null,27345350,27345350,44512,44517,44608,90,null,null,null,null,null,null,null,"X",null,null,1]
[0,"FDLC-CIA-008-2021",2021,"FDLC-CIA-008-2021","https://community.secop.gov.co/Public/Tendering/OpportunityDetail/Index?noticeUID=CO1.NTC.2390812&isFromPublicArea=True&isModal=False","Contratos interadministrativos","Contratación directa","Contratos interadministrativos","“Implementar acciones para el reconocimiento integral de las comunidades indígenas que habitan en la localidad, mediante la generación de herramientas que les permitan el conocimiento de sus derechos, y el mejoramiento de sus condiciones de existencia individual y colectivamente con la implementación de los proyectos: 1626 LA CANDELARIA SOSTENIBLE: AGRICULTURA URBANA, COMPONENTE 1.\nAGRICULTURA URBANA; 1628 LA CANDELARIA PRODUCTIVA Y RESILIENTE, COMPONENTE 4.TRANSFORMACIÓN PRODUCTIVA; 1663 LA CANDELARIA REDISTRIBUTIVA: DEMOCRATIZANDO EL TRABAJO DE CUIDADO, COMPONENTE 1. ESTRATEGIAS DE CUIDADO; 1664 LA CANDELARIA INCLUYENTE Y ANCESTRAL, COMPONENTE 2. SABERES ANCESTRALES; Y 1781 LA CANDELARIA SEGURA: MUJERES LIBRES DE VIOLENCIAS, COMPONENTE 2. PREVENCIÓN DEL FEMINICIDIO Y LA VIOLENCIA CONTRA LA MUJER”.","Inversión","Un Nuevo Contrato Social y Ambiental para la Bogotá del Siglo XXI",6,{"$f":"IF(ISERROR(VLOOKUP(L189,Proposito_programa!$C$2:$E$59,2,FALSE)),\" \",VLOOKUP(L189,Proposito_programa!$C$2:$E$59,2,FALSE))","v":"Sistema Distrital de Cuidado"},{"$f":"IF(ISERROR(VLOOKUP(L189,Proposito_programa!$C$2:$E$59,3,FALSE)),\" \",VLOOKUP(L189,Proposito_programa!$C$2:$E$59,3,FALSE))","v":"Propósito 1: Hacer un nuevo contrato social para incrementar la inclusión social, productiva y política"},1628,1,830032429,"CABILDO INDIGENA INGA DE BOGOTA D.C.","Persona Jurídica",null,null,null,22680000,null,null,null,{"$f":"+W189+X189+Z189","v":22680000},22680000,44512,44517,44608,90,null,null,null,null,null,null,null,"X",null,null,{"$f":"IF(ISERROR(AB189/AA189),\"-\",(AB189/AA189))","v":1}]
[0,"FDLC-CIA-008-2021",2021,"FDLC-CIA-008-2021","https://community.secop.gov.co/Public/Tendering/OpportunityDetail/Index?noticeUID=CO1.NTC.2390812&isFromPublicArea=True&isModal=False","Contratos interadministrativos","Contratación directa","Contratos interadministrativos","“Implementar acciones para el reconocimiento integral de las comunidades indígenas que habitan en la localidad, mediante la generación de herramientas que les permitan el conocimiento de sus derechos, y el mejoramiento de sus condiciones de existencia individual y colectivamente con la implementación de los proyectos: 1626 LA CANDELARIA SOSTENIBLE: AGRICULTURA URBANA, COMPONENTE 1.\nAGRICULTURA URBANA; 1628 LA CANDELARIA PRODUCTIVA Y RESILIENTE, COMPONENTE 4.TRANSFORMACIÓN PRODUCTIVA; 1663 LA CANDELARIA REDISTRIBUTIVA: DEMOCRATIZANDO EL TRABAJO DE CUIDADO, COMPONENTE 1. ESTRATEGIAS DE CUIDADO; 1664 LA CANDELARIA INCLUYENTE Y ANCESTRAL, COMPONENTE 2. SABERES ANCESTRALES; Y 1781 LA CANDELARIA SEGURA: MUJERES LIBRES DE VIOLENCIAS, COMPONENTE 2. PREVENCIÓN DEL FEMINICIDIO Y LA VIOLENCIA CONTRA LA MUJER”.","Inversión","Un Nuevo Contrato Social y Ambiental para la Bogotá del Siglo XXI",6,{"$f":"IF(ISERROR(VLOOKUP(L190,Proposito_programa!$C$2:$E$59,2,FALSE)),\" \",VLOOKUP(L190,Proposito_programa!$C$2:$E$59,2,FALSE))","v":"Sistema Distrital de Cuidado"},{"$f":"IF(ISERROR(VLOOKUP(L190,Proposito_programa!$C$2:$E$59,3,FALSE)),\" \",VLOOKUP(L190,Proposito_programa!$C$2:$E$59,3,FALSE))","v":"Propósito 1: Hacer un nuevo contrato social para incrementar la inclusión social, productiva y política"},1663,1,830032429,"CABILDO INDIGENA INGA DE BOGOTA D.C.","Persona Jurídica",null,null,null,39378333,null,null,null,39378333,1824097,44512,44517,44608,90,null,null,null,null,null,null,null,"X",null,null,4.6322351939072685E-2]
[0,"FDLC-CIA-008-2021",2021,"FDLC-CIA-008-2021","https://community.secop.gov.co/Public/Tendering/OpportunityDetail/Index?noticeUID=CO1.NTC.2390812&isFromPublicArea=True&isModal=False","Contratos interadministrativos","Contratación directa","Contratos interadministrativos","“Implementar acciones para el reconocimiento integral de las comunidades indígenas que habitan en la localidad, mediante la generación de herramientas que les permitan el conocimiento de sus derechos, y el mejoramiento de sus condiciones de existencia individual y colectivamente con la implementación de los proyectos: 1626 LA CANDELARIA SOSTENIBLE: AGRICULTURA URBANA, COMPONENTE 1.\nAGRICULTURA URBANA; 1628 LA CANDELARIA PRODUCTIVA Y RESILIENTE, COMPONENTE 4.TRANSFORMACIÓN PRODUCTIVA; 1663 LA CANDELARIA REDISTRIBUTIVA: DEMOCRATIZANDO EL TRABAJO DE CUIDADO, COMPONENTE 1. ESTRATEGIAS DE CUIDADO; 1664 LA CANDELARIA INCLUYENTE Y ANCESTRAL, COMPONENTE 2. SABERES ANCESTRALES; Y 1781 LA CANDELARIA SEGURA: MUJERES LIBRES DE VIOLENCIAS, COMPONENTE 2. PREVENCIÓN DEL FEMINICIDIO Y LA VIOLENCIA CONTRA LA MUJER”.","Inversión","Un Nuevo Contrato Social y Ambiental para la Bogotá del Siglo XXI",6,{"$f":"IF(ISERROR(VLOOKUP(L191,Proposito_programa!$C$2:$E$59,2,FALSE)),\" \",VLOOKUP(L191,Proposito_programa!$C$2:$E$59,2,FALSE))","v":"Sistema Distrital de Cuidado"},{"$f":"IF(ISERROR(VLOOKUP(L191,Proposito_programa!$C$2:$E$59,3,FALSE)),\" \",VLOOKUP(L191,Proposito_programa!$C$2:$E$59,3,FALSE))","v":"Propósito 1: Hacer un nuevo contrato social para incrementar la inclusión social, productiva y política"},1664,1,830032429,"CABILDO INDIGENA INGA DE BOGOTA D.C.","Persona Jurídica",null,null,null,55452806,null,null,null,55452806,0,44512,44517,44608,90,null,null,null,null,null,null,null,"X",null,null,0]
[0,"FDLC-CIA-008-2021",2021,"FDLC-CIA-008-2021","https://community.secop.gov.co/Public/Tendering/OpportunityDetail/Index?noticeUID=CO1.NTC.2390812&isFromPublicArea=True&isModal=False","Contratos interadministrativos","Contratación directa","Contratos interadministrativos","“Implementar acciones para el reconocimiento integral de las comunidades indígenas que habitan en la localidad, mediante la generación de herramientas que les permitan el conocimiento de sus derechos, y el mejoramiento de sus condiciones de existencia individual y colectivamente con la implementación de los proyectos: 1626 LA CANDELARIA SOSTENIBLE: AGRICULTURA URBANA, COMPONENTE 1.\nAGRICULTURA URBANA; 1628 LA CANDELARIA PRODUCTIVA Y RESILIENTE, COMPONENTE 4.TRANSFORMACIÓN PRODUCTIVA; 1663 LA CANDELARIA REDISTRIBUTIVA: DEMOCRATIZANDO EL TRABAJO DE CUIDADO, COMPONENTE 1. ESTRATEGIAS DE CUIDADO; 1664 LA CANDELARIA INCLUYENTE Y ANCESTRAL, COMPONENTE 2. SABERES ANCESTRALES; Y 1781 LA CANDELARIA SEGURA: MUJERES LIBRES DE VIOLENCIAS, COMPONENTE 2. PREVENCIÓN DEL FEMINICIDIO Y LA VIOLENCIA CONTRA LA MUJER”.","Inversión","Un Nuevo Contrato Social y Ambiental para la Bogotá del Siglo XXI",40,{"$f":"IF(ISERROR(VLOOKUP(L192,Proposito_programa!$C$2:$E$59,2,FALSE)),\" \",VLOOKUP(L192,Proposito_programa!$C$2:$E$59,2,FALSE))","v":"Más mujeres viven una vida libre de violencias, se sienten seguras y acceden con confianza al sistema de justicia"},{"$f":"IF(ISERROR(VLOOKUP(L192,Proposito_programa!$C$2:$E$59,3,FALSE)),\" \",VLOOKUP(L192,Proposito_programa!$C$2:$E$59,3,FALSE))","v":"Propósito 3: Inspirar confianza y legitimidad para vivir sin miedo y ser epicentro de cultura ciudadana, paz y reconciliación"},1781,1,830032429,"CABILDO INDIGENA INGA DE BOGOTA D.C.","Persona Jurídica",null,null,null,27975000,null,null,null,27975000,0,44512,44517,44608,90,null,null,null,null,null,null,null,"X",null,null,0]
[1,163,2021,"FDLC-SASI-003-2021","https://community.secop.gov.co/Public/Tendering/OpportunityDetail/Index?noticeUID=CO1.NTC.2301455&isFromPublicArea=True&isModal=False","Compraventa de bienes muebles","Selección abreviada","Subasta inversa ","Adquisición de material bibliográfico, elementos didácticos, deportivos, musicales, material tecnológico y papelería necesarios en el marco del proyecto no. 1608 denominado “La Candelaria pedagógica bases sólidas para la vida\"","Inversión","Un Nuevo Contrato Social y Ambiental para la Bogotá del Siglo XXI",12,{"$f":"IF(ISERROR(VLOOKUP(L193,Proposito_programa!$C$2:$E$59,2,FALSE)),\" \",VLOOKUP(L193,Proposito_programa!$C$2:$E$59,2,FALSE))","v":"Educación inicial: Bases sólidas para la vida."},{"$f":"IF(ISERROR(VLOOKUP(L193,Proposito_programa!$C$2:$E$59,3,FALSE)),\" \",VLOOKUP(L193,Proposito_programa!$C$2:$E$59,3,FALSE))","v":"Propósito 1: Hacer un nuevo contrato social para incrementar la inclusión social, productiva y política"},1608,6,830037946,"PANAMERICANA LIBRERIA Y PAPELERIA S A","Persona Jurídica",null,null,null,38500000,null,null,null,{"$f":"+W193+X193+Z193","v":38500000},0,44505,44509,44569,60,null,null,null,null,null,null,null,null,"X",null,{"$f":"IF(ISERROR(AB193/AA193),\"-\",(AB193/AA193))","v":0}]
[1,164,2021,"FDLC-SASI-003-2021","https://community.secop.gov.co/Public/Tendering/OpportunityDetail/Index?noticeUID=CO1.NTC.2301455&isFromPublicArea=True&isModal=False","Compraventa de bienes muebles","Selección abreviada","Subasta inversa ","Adquisición de material bibliográfico, elementos didácticos, deportivos, musicales, material tecnológico y papelería necesarios en el marco del proyecto no. 1608 denominado “La Candelaria pedagógica bases sólidas para la vida\"","Inversión","Un Nuevo Contrato Social y Ambiental para la Bogotá del Siglo XXI",12,{"$f":"IF(ISERROR(VLOOKUP(L194,Proposito_programa!$C$2:$E$59,2,FALSE)),\" \",VLOOKUP(L194,Proposito_programa!$C$2:$E$59,2,FALSE))","v":"Educación inicial: Bases sólidas para la vida."},{"$f":"IF(ISERROR(VLOOKUP(L194,Proposito_programa!$C$2:$E$59,3,FALSE)),\" \",VLOOKUP(L194,Proposito_programa!$C$2:$E$59,3,FALSE))","v":"Propósito 1: Hacer un nuevo contrato social para incrementar la inclusión social, productiva y política"},1608,6,901151389,"S&S SERVICIOS Y SUMINISTROS STELAR SAS","Persona Jurídica",null,null,null,10360501,null,null,null,10360501,0,44505,44511,44571,60,null,null,null,null,null,null,null,null,"X",null,0]
[1,165,2021,"FDLC-SASI-003-2021","https://community.secop.gov.co/Public/Tendering/OpportunityDetail/Index?noticeUID=CO1.NTC.2301455&isFromPublicArea=True&isModal=False","Compraventa de bienes muebles","Selección abreviada","Subasta inversa ","Adquisición de material bibliográfico, elementos didácticos, deportivos, musicales, material tecnológico y papelería necesarios en el marco del proyecto no. 1608 denominado “La Candelaria pedagógica bases sólidas para la vida\"","Inversión","Un Nuevo Contrato Social y Ambiental para la Bogotá del Siglo XXI",12,{"$f":"IF(ISERROR(VLOOKUP(L195,Proposito_programa!$C$2:$E$59,2,FALSE)),\" \",VLOOKUP(L195,Proposito_programa!$C$2:$E$59,2,FALSE))","v":"Educación inicial: Bases sólidas para la vida."},{"$f":"IF(ISERROR(VLOOKUP(L195,Proposito_programa!$C$2:$E$59,3,FALSE)),\" \",VLOOKUP(L195,Proposito_programa!$C$2:$E$59,3,FALSE))","v":"Propósito 1: Hacer un nuevo contrato social para incrementar la inclusión social, productiva y política"},1608,6,901151389,"S&S SERVICIOS Y SUMINISTROS STELAR SAS","Persona Jurídica",null,null,null,14503919,null,null,null,14503919,0,44505,44511,44571,60,null,null,null,null,null,null,null,null,"X",null,0]
[1,166,2021,"FDLC-SASI-003-2021","https://community.secop.gov.co/Public/Tendering/OpportunityDetail/Index?noticeUID=CO1.NTC.2301455&isFromPublicArea=True&isModal=False","Compraventa de bienes muebles","Selección abreviada","Subasta inversa ","Adquisición de material bibliográfico, elementos didácticos, deportivos, musicales, material tecnológico y papelería necesarios en el marco del proyecto no. 1608 denominado “La Candelaria pedagógica bases sólidas para la vida\"","Inversión","Un Nuevo Contrato Social y Ambiental para la Bogotá del Siglo XXI",12,{"$f":"IF(ISERROR(VLOOKUP(L196,Proposito_programa!$C$2:$E$59,2,FALSE)),\" \",VLOOKUP(L196,Proposito_programa!$C$2:$E$59,2,FALSE))","v":"Educación inicial: Bases sólidas para la vida."},{"$f":"IF(ISERROR(VLOOKUP(L196,Proposito_programa!$C$2:$E$59,3,FALSE)),\" \",VLOOKUP(L196,Proposito_programa!$C$2:$E$59,3,FALSE))","v":"Propósito 1: Hacer un nuevo contrato social para incrementar la inclusión social, productiva y política"},1608,6,901151389,"S&S SERVICIOS Y SUMINISTROS STELAR SAS","Persona Jurídica",null,null,null,6745000,null,null,null,6745000,0,44505,44511,44571,60,null,null,null,null,null,null,null,null,"X",null,0]
[1,167,2021,"FDLC-SASI-003-2021","https://community.secop.gov.co/Public/Tendering/OpportunityDetail/Index?noticeUID=CO1.NTC.2301455&isFromPublicArea=True&isModal=False","Compraventa de bienes muebles","Selección abreviada","Subasta inversa ","Adquisición de material bibliográfico, elementos didácticos, deportivos, musicales, material tecnológico y papelería necesarios en el marco del proyecto no. 1608 denominado “La Candelaria pedagógica bases sólidas para la vida\"","Inversión","Un Nuevo Contrato Social y Ambiental para la Bogotá del Siglo XXI",12,{"$f":"IF(ISERROR(VLOOKUP(L197,Proposito_programa!$C$2:$E$59,2,FALSE)),\" \",VLOOKUP(L197,Proposito_programa!$C$2:$E$59,2,FALSE))","v":"Educación inicial: Bases sólidas para la vida."},{"$f":"IF(ISERROR(VLOOKUP(L197,Proposito_programa!$C$2:$E$59,3,FALSE)),\" \",VLOOKUP(L197,Proposito_programa!$C$2:$E$59,3,FALSE))","v":"Propósito 1: Hacer un nuevo contrato social para incrementar la inclusión social, productiva y política"},1608,6,901151389,"S&S SERVICIOS Y SUMINISTROS STELAR SAS","Persona Jurídica",null,null,null,2478996,null,null,null,2478996,0,44505,44511,44571,60,null,null,null,null,null,null,null,null,"X",null,0]
[1,168,2021,"FDLC-SAMC-008-2021","https://community.secop.gov.co/Public/Tendering/OpportunityDetail/Index?noticeUID=CO1.NTC.2326293&isFromPublicArea=True&isModal=False","Contratos de prestación de servicios","Selección abreviada","Selección abreviada por menor cuantía ","Ejecutar la preproducción, producción, realización, y postproducción técnica y logística de los eventos, fiestas y festivales de la Localidad de la Candelaria, a través de la administración, alquiler y suministro de los bienes y servicios necesarios para su desarrollo","Inversión","Un Nuevo Contrato Social y Ambiental para la Bogotá del Siglo XXI",21,{"$f":"IF(ISERROR(VLOOKUP(L198,Proposito_programa!$C$2:$E$59,2,FALSE)),\" \",VLOOKUP(L198,Proposito_programa!$C$2:$E$59,2,FALSE))","v":"Creación y vida cotidiana: Apropiación ciudadana del arte, la cultura y el patrimonio, para la democracia cultural"},{"$f":"IF(ISERROR(VLOOKUP(L198,Proposito_programa!$C$2:$E$59,3,FALSE)),\" \",VLOOKUP(L198,Proposito_programa!$C$2:$E$59,3,FALSE))","v":"Propósito 1: Hacer un nuevo contrato social para incrementar la inclusión social, productiva y política"},1625,12,900387383,"UNLOFT PRODUCCION DE MARCA S A S","Persona Jurídica",null,null,null,211047353,null,1,102840884,{"$f":"+W198+X198+Z198","v":313888237},63314206,44509,44511,44630,120,null,null,null,null,null,null,null,null,"X",null,0.20170939378018171]
[1,169,2021,"FDLC-CPS-169-2021","https://community.secop.gov.co/Public/Tendering/OpportunityDetail/Index?noticeUID=CO1.NTC.2399905&isFromPublicArea=True&isModal=False","Contratos de prestación de servicios profesionales y de apoyo a la gestión","Contratación directa","Prestación de servicios profesionales y de apoyo a la gestión, o para la ejecución de trabajos artísticos que sólo puedan encomendarse a determinadas personas naturales;","PRESTAR SERVICIOS PROFESIONALES AL FONDO DE DESARROLLO LOCAL DE LA CANDELARIA PARA COORDINAR LA ARTICULACIÓN, ASISTENCIA Y ACOMPAÑAMIENTO DE LOS PROCESOS DE PLANEACIÓN LOCAL, PARA LA PROMOCIÓN DE LA PARTICIPACIÓN DE LAS MUJERES Y DE LA EQUIDAD DE GÉNERO, PARA MATERIALIZAR EN LA LOCALIDAD LAS ESTRATEGIAS DE TERRITORIALIZACIÓN Y TRANSVERSALIZACIÓN DE LA POLÍTICA PUBLICA DE MUJERES Y EQUIDAD DE GÉNERO, PPMYEG","Inversión","Un Nuevo Contrato Social y Ambiental para la Bogotá del Siglo XXI",40,{"$f":"IF(ISERROR(VLOOKUP(L199,Proposito_programa!$C$2:$E$59,2,FALSE)),\" \",VLOOKUP(L199,Proposito_programa!$C$2:$E$59,2,FALSE))","v":"Más mujeres viven una vida libre de violencias, se sienten seguras y acceden con confianza al sistema de justicia"},{"$f":"IF(ISERROR(VLOOKUP(L199,Proposito_programa!$C$2:$E$59,3,FALSE)),\" \",VLOOKUP(L199,Proposito_programa!$C$2:$E$59,3,FALSE))","v":"Propósito 3: Inspirar confianza y legitimidad para vivir sin miedo y ser epicentro de cultura ciudadana, paz y reconciliación"},1781,1,52619262,"MARIA PAULA AVILA GONZALEZ","Persona Natural",null,null,null,7497600,null,null,null,7497600,0,44517,44517,44560,44,null,null,null,null,null,null,null,null,"X",null,0]
[1,170,2021,"FDLC-CPS-170-2021","https://community.secop.gov.co/Public/Tendering/OpportunityDetail/Index?noticeUID=CO1.NTC.2399907&isFromPublicArea=True&isModal=False","Contratos de prestación de servicios profesionales y de apoyo a la gestión","Contratación directa","Prestación de servicios profesionales y de apoyo a la gestión, o para la ejecución de trabajos artísticos que sólo puedan encomendarse a determinadas personas naturales;","PRESTAR SERVICIOS DE APOYO A LA GESTIÓN AL FONDO DE DESARROLLO LOCAL DE LA CANDELARIA PARA LA IDENTIFICACION, MITIGACIÓN Y MONITOREO DE PROBLEMAS AMBIENTALES Y EL ORTALECIMIENTO DE LA PRACTICA DE AGRICULTURA URBANA EN ARAS DE LA SOSTENIBILIDAD DE LA LOCALIDAD","Inversión","Un Nuevo Contrato Social y Ambiental para la Bogotá del Siglo XXI",24,{"$f":"IF(ISERROR(VLOOKUP(L200,Proposito_programa!$C$2:$E$59,2,FALSE)),\" \",VLOOKUP(L200,Proposito_programa!$C$2:$E$59,2,FALSE))","v":"Bogotá región emprendedora e innovadora"},{"$f":"IF(ISERROR(VLOOKUP(L200,Proposito_programa!$C$2:$E$59,3,FALSE)),\" \",VLOOKUP(L200,Proposito_programa!$C$2:$E$59,3,FALSE))","v":"Propósito 1: Hacer un nuevo contrato social para incrementar la inclusión social, productiva y política"},1626,1,65788328,"EMPERATRIZ GONZALEZ PALENCIA","Persona Natural",null,null,null,2346667,null,1,1173334,3520001,746667,44517,44517,44582,44,null,22,null,null,null,null,null,null,"X",null,0.21212124655646405]
[1,171,2021,"FDLC-CPS-171-2021","https://community.secop.gov.co/Public/Tendering/OpportunityDetail/Index?noticeUID=CO1.NTC.2405465&isFromPublicArea=True&isModal=False\n","Contratos de prestación de servicios profesionales y de apoyo a la gestión","Contratación directa","Prestación de servicios profesionales y de apoyo a la gestión, o para la ejecución de trabajos artísticos que sólo puedan encomendarse a determinadas personas naturales;","PRESTAR SERVICIOS DE APOYO A LA GESTIÓN AL FONDO DE DESARROLLO LOCAL DE LA CANDELARIA PARA LA IDENTIFICACION, MITIGACIÓN Y MONITOREO DE PROBLEMAS AMBIENTALES Y EL FORTALECIMIENTO DE LA PRACTICA DE AGRICULTURA URBANA EN ARAS DE LA SOSTENIBILIDAD DE LA LOCALIDAD","Inversión","Un Nuevo Contrato Social y Ambiental para la Bogotá del Siglo XXI",24,{"$f":"IF(ISERROR(VLOOKUP(L201,Proposito_programa!$C$2:$E$59,2,FALSE)),\" \",VLOOKUP(L201,Proposito_programa!$C$2:$E$59,2,FALSE))","v":"Bogotá región emprendedora e innovadora"},{"$f":"IF(ISERROR(VLOOKUP(L201,Proposito_programa!$C$2:$E$59,3,FALSE)),\" \",VLOOKUP(L201,Proposito_programa!$C$2:$E$59,3,FALSE))","v":"Propósito 1: Hacer un nuevo contrato social para incrementar la inclusión social, productiva y política"},1626,1,1026273776,"DIANA MARCELA ALARCON","Persona Natural",null,null,null,2240000,null,1,1120000,3360000,0,44519,44519,44581,42,1,21,null,null,null,null,null,null,"X",null,0]
[1,172,2021,"FDLC-CPS-172-2021","https://community.secop.gov.co/Public/Tendering/OpportunityDetail/Index?noticeUID=CO1.NTC.2405667&isFromPublicArea=True&isModal=False","Contratos de prestación de servicios profesionales y de apoyo a la gestión","Contratación directa","Prestación de servicios profesionales y de apoyo a la gestión, o para la ejecución de trabajos artísticos que sólo puedan encomendarse a determinadas personas naturales;","PRESTAR SERVICIOS DE APOYO A LA GESTIÓN AL FONDO DE DESARROLLO LOCAL DE LA CANDELARIA PARA LA IDENTIFICACION, MITIGACIÓN Y MONITOREO DE PROBLEMAS AMBIENTALES Y EL FORTALECIMIENTO DE LA PRACTICA DE AGRICULTURA URBANA EN ARAS DE LA SOSTENIBILIDAD DE LA LOCALIDAD","Inversión","Un Nuevo Contrato Social y Ambiental para la Bogotá del Siglo XXI",24,{"$f":"IF(ISERROR(VLOOKUP(L202,Proposito_programa!$C$2:$E$59,2,FALSE)),\" \",VLOOKUP(L202,Proposito_programa!$C$2:$E$59,2,FALSE))","v":"Bogotá región emprendedora e innovadora"},{"$f":"IF(ISERROR(VLOOKUP(L202,Proposito_programa!$C$2:$E$59,3,FALSE)),\" \",VLOOKUP(L202,Proposito_programa!$C$2:$E$59,3,FALSE))","v":"Propósito 1: Hacer un nuevo contrato social para incrementar la inclusión social, productiva y política"},1626,1,79043047,"ENRIQUE CAMARGO MUNEVAR","Persona Natural",null,null,null,2240000,null,1,1120000,3360000,0,44519,44519,44581,42,1,21,null,null,null,null,null,null,"X",null,0]
[1,173,2021,"FDLC-CPS-173-2021","https://community.secop.gov.co/Public/Tendering/OpportunityDetail/Index?noticeUID=CO1.NTC.2405680&isFromPublicArea=True&isModal=False","Contratos de prestación de servicios profesionales y de apoyo a la gestión","Contratación directa","Prestación de servicios profesionales y de apoyo a la gestión, o para la ejecución de trabajos artísticos que sólo puedan encomendarse a determinadas personas naturales;","PRESTAR SERVICIOS DE APOYO A LA GESTIÓN AL FONDO DE DESARROLLO LOCAL DE LA CANDELARIA PARA LA IDENTIFICACION, MITIGACIÓN Y MONITOREO DE PROBLEMAS AMBIENTALES Y EL FORTALECIMIENTO DE LA PRACTICA DE AGRICULTURA URBANA EN ARAS DE LA SOSTENIBILIDAD DE LA LOCALIDAD","Inversión","Un Nuevo Contrato Social y Ambiental para la Bogotá del Siglo XXI",24,{"$f":"IF(ISERROR(VLOOKUP(L203,Proposito_programa!$C$2:$E$59,2,FALSE)),\" \",VLOOKUP(L203,Proposito_programa!$C$2:$E$59,2,FALSE))","v":"Bogotá región emprendedora e innovadora"},{"$f":"IF(ISERROR(VLOOKUP(L203,Proposito_programa!$C$2:$E$59,3,FALSE)),\" \",VLOOKUP(L203,Proposito_programa!$C$2:$E$59,3,FALSE))","v":"Propósito 1: Hacer un nuevo contrato social para incrementar la inclusión social, productiva y política"},1626,1,79790721,"FERNANDO AUGUSTO ESPITIA AMEZQUITA","Persona Natural",null,null,null,2240000,null,1,1120000,3360000,0,44519,44519,44581,42,null,21,79745860,"WILSON JAIR GONZALEZ BELTRAN",44525,112000,null,null,"X",null,0]
[1,174,2021,"FDLC-CPS-174-2021","https://community.secop.gov.co/Public/Tendering/OpportunityDetail/Index?noticeUID=CO1.NTC.2421579&isFromPublicArea=True&isModal=False\n","Contratos de prestación de servicios profesionales y de apoyo a la gestión","Contratación directa","Prestación de servicios profesionales y de apoyo a la gestión, o para la ejecución de trabajos artísticos que sólo puedan encomendarse a determinadas personas naturales;","PRESTAR SERVICIOS DE APOYO A LA GESTIÓN AL FONDO DE DESARROLLO LOCAL DE LA CANDELARIA PARA LA IDENTIFICACION, MITIGACIÓN Y MONITOREO DE PROBLEMAS AMBIENTALES Y EL FORTALECIMIENTO DE LA PRACTICA DE AGRICULTURA URBANA EN ARAS DE LA SOSTENIBILIDAD DE LA LOCALIDAD","Inversión","Un Nuevo Contrato Social y Ambiental para la Bogotá del Siglo XXI",24,{"$f":"IF(ISERROR(VLOOKUP(L204,Proposito_programa!$C$2:$E$59,2,FALSE)),\" \",VLOOKUP(L204,Proposito_programa!$C$2:$E$59,2,FALSE))","v":"Bogotá región emprendedora e innovadora"},{"$f":"IF(ISERROR(VLOOKUP(L204,Proposito_programa!$C$2:$E$59,3,FALSE)),\" \",VLOOKUP(L204,Proposito_programa!$C$2:$E$59,3,FALSE))","v":"Propósito 1: Hacer un nuevo contrato social para incrementar la inclusión social, productiva y política"},1626,1,79648784,"JOSE RENE AGUIRRE TIJARO","Persona Natural",null,null,null,1866667,null,1,906667,2773334,0,44526,44526,44577,35,1,17,null,null,null,null,null,null,"X",null,0]
[1,175,2021,"FDLC-CPS-175-2021","https://community.secop.gov.co/Public/Tendering/OpportunityDetail/Index?noticeUID=CO1.NTC.2425883&isFromPublicArea=True&isModal=False","Contratos de prestación de servicios profesionales y de apoyo a la gestión","Contratación directa","Prestación de servicios profesionales y de apoyo a la gestión, o para la ejecución de trabajos artísticos que sólo puedan encomendarse a determinadas personas naturales;","PRESTAR SERVICIOS PROFESIONALES AL FONDO DE DESARROLLO LOCAL DE LA CANDELARIA EN LOS TRÁMITES RELACIONADOS CON LOS PROCESOS PRECONTRACTUALES, CONTRACTUALES Y POS CONTRACTUALES QUE SE ADELANTEN A TRAVÉS DE SECOP I Y II, ASÍ COMO LA ADQUISICIÓN DE BIENES Y SERVICIOS A TRAVÉS DE LA TIENDA VIRTUAL DEL ESTADO COLOMBIANO.","Inversión","Un Nuevo Contrato Social y Ambiental para la Bogotá del Siglo XXI",57,{"$f":"IF(ISERROR(VLOOKUP(L205,Proposito_programa!$C$2:$E$59,2,FALSE)),\" \",VLOOKUP(L205,Proposito_programa!$C$2:$E$59,2,FALSE))","v":"Gestión pública local"},{"$f":"IF(ISERROR(VLOOKUP(L205,Proposito_programa!$C$2:$E$59,3,FALSE)),\" \",VLOOKUP(L205,Proposito_programa!$C$2:$E$59,3,FALSE))","v":"Propósito 5: Construir Bogotá - Región con gobierno abierto, transparente y ciudadanía consciente"},2021,1,1010198763,"CARLOS MAURICIO PALOMAR COVALEDA","Persona Natural",null,null,null,4651733,null,1,2325867,6977600,4797100,44529,44529,44576,32,null,16,null,null,null,null,null,null,"X",null,0.6875]
[1,176,2021,"FDLC-IMC-010-2021","https://community.secop.gov.co/Public/Tendering/OpportunityDetail/Index?noticeUID=CO1.NTC.2399927&isFromPublicArea=True&isModal=False","Compraventa de bienes muebles","Contratación mínima cuantia","No aplica","ADQUISICIÓN DE ELEMENTOS Y EQUIPOS TECNOLÓGICOS Y DE COMUNICACIÓN PARA DOTACIÓN DE LA OFICINA DE PRENSA Y COMUNICACIONES DE LA ALCADÍA LOCAL DE LA CANDELARIA","Funcionamiento","Un Nuevo Contrato Social y Ambiental para la Bogotá del Siglo XXI","No aplica",{"$f":"IF(ISERROR(VLOOKUP(L206,Proposito_programa!$C$2:$E$59,2,FALSE)),\" \",VLOOKUP(L206,Proposito_programa!$C$2:$E$59,2,FALSE))","v":" "},{"$f":"IF(ISERROR(VLOOKUP(L206,Proposito_programa!$C$2:$E$59,3,FALSE)),\" \",VLOOKUP(L206,Proposito_programa!$C$2:$E$59,3,FALSE))","v":" "},"N/A",1,900354145,"COMERCIALIZADORA CMS","Persona Jurídica",null,null,null,9134800,null,null,null,9134800,0,44531,44533,44563,30,null,null,null,null,null,null,"X",null,null,null,0]
[1,177,2021,"FDLC-CPS-177-2021","https://community.secop.gov.co/Public/Tendering/OpportunityDetail/Index?noticeUID=CO1.NTC.2432529&isFromPublicArea=True&isModal=False","Contratos de prestación de servicios profesionales y de apoyo a la gestión","Contratación directa","Prestación de servicios profesionales y de apoyo a la gestión, o para la ejecución de trabajos artísticos que sólo puedan encomendarse a determinadas personas naturales;","PRESTAR SERVICIOS DE APOYO A LA GESTIÓN AL FONDO DE DESARROLLO LOCAL DE LA CANDELARIA PARA LA IDENTIFICACION, MITIGACIÓN Y MONITOREO DE PROBLEMAS AMBIENTALES Y EL FORTALECIMIENTO DE LA PRACTICA DE AGRICULTURA URBANA EN ARAS DE LA SOSTENIBILIDAD DE LA LOCALIDAD","Inversión","Un Nuevo Contrato Social y Ambiental para la Bogotá del Siglo XXI",24,{"$f":"IF(ISERROR(VLOOKUP(L207,Proposito_programa!$C$2:$E$59,2,FALSE)),\" \",VLOOKUP(L207,Proposito_programa!$C$2:$E$59,2,FALSE))","v":"Bogotá región emprendedora e innovadora"},{"$f":"IF(ISERROR(VLOOKUP(L207,Proposito_programa!$C$2:$E$59,3,FALSE)),\" \",VLOOKUP(L207,Proposito_programa!$C$2:$E$59,3,FALSE))","v":"Propósito 1: Hacer un nuevo contrato social para incrementar la inclusión social, productiva y política"},1626,1,1032436900,"MARY JUDITH GOMEZ CHICO","Persona Natural",null,null,null,1600000,null,1,800000,2400000,0,44531,44531,44576,31,1,15,null,null,null,null,null,null,"X",null,0]
[1,178,2021,"FDLC-CPS-178-2021","https://community.secop.gov.co/Public/Tendering/OpportunityDetail/Index?noticeUID=CO1.NTC.2434899&isFromPublicArea=True&isModal=False","Contratos de prestación de servicios profesionales y de apoyo a la gestión","Contratación directa","Prestación de servicios profesionales y de apoyo a la gestión, o para la ejecución de trabajos artísticos que sólo puedan encomendarse a determinadas personas naturales;","PRESTAR SERVICIOS DE APOYO A LA GESTIÓN AL FONDO DE DESARROLLO LOCAL DE LA CANDELARIA PARA LA IDENTIFICACION, MITIGACIÓN Y MONITOREO DE PROBLEMAS AMBIENTALES Y EL FORTALECIMIENTO DE LA PRACTICA DE AGRICULTURA URBANA EN ARAS DE LA SOSTENIBILIDAD DE LA LOCALIDAD","Inversión","Un Nuevo Contrato Social y Ambiental para la Bogotá del Siglo XXI",24,{"$f":"IF(ISERROR(VLOOKUP(L208,Proposito_programa!$C$2:$E$59,2,FALSE)),\" \",VLOOKUP(L208,Proposito_programa!$C$2:$E$59,2,FALSE))","v":"Bogotá región emprendedora e innovadora"},{"$f":"IF(ISERROR(VLOOKUP(L208,Proposito_programa!$C$2:$E$59,3,FALSE)),\" \",VLOOKUP(L208,Proposito_programa!$C$2:$E$59,3,FALSE))","v":"Propósito 1: Hacer un nuevo contrato social para incrementar la inclusión social, productiva y política"},1626,1,1019093628,"ALEX DAVID AVENDAÑO OSORIO","Persona Natural",null,null,null,1600000,null,1,800000,2400000,0,44532,44532,44561,30,null,null,null,null,null,null,null,null,"X",null,0]
[1,179,2021,"FDLC-CPS-179-2021","https://community.secop.gov.co/Public/Tendering/OpportunityDetail/Index?noticeUID=CO1.NTC.2434485&isFromPublicArea=True&isModal=False","Contratos de prestación de servicios profesionales y de apoyo a la gestión","Contratación directa","Prestación de servicios profesionales y de apoyo a la gestión, o para la ejecución de trabajos artísticos que sólo puedan encomendarse a determinadas personas naturales;","PRESTAR SERVICIOS DE APOYO A LA GESTIÓN AL FONDO DE DESARROLLO LOCAL DE LA CANDELARIA PARA LA IDENTIFICACION, MITIGACIÓN Y MONITOREO DE PROBLEMAS AMBIENTALES Y EL FORTALECIMIENTO DE LA PRACTICA DE AGRICULTURA URBANA EN ARAS DE LA SOSTENIBILIDAD DE LA LOCALIDAD","Inversión","Un Nuevo Contrato Social y Ambiental para la Bogotá del Siglo XXI",24,{"$f":"IF(ISERROR(VLOOKUP(L209,Proposito_programa!$C$2:$E$59,2,FALSE)),\" \",VLOOKUP(L209,Proposito_programa!$C$2:$E$59,2,FALSE))","v":"Bogotá región emprendedora e innovadora"},{"$f":"IF(ISERROR(VLOOKUP(L209,Proposito_programa!$C$2:$E$59,3,FALSE)),\" \",VLOOKUP(L209,Proposito_programa!$C$2:$E$59,3,FALSE))","v":"Propósito 1: Hacer un nuevo contrato social para incrementar la inclusión social, productiva y política"},1626,1,1026295534,"HAROLD ESTEVENS CASAS VARGAS","Persona Natural",null,null,null,1600000,null,1,800000,2400000,0,44532,44532,44576,30,null,15,null,null,null,null,null,null,"X",null,0]
[1,180,2021,"FDLC IMC 011-2021","https://community.secop.gov.co/Public/Tendering/OpportunityDetail/Index?noticeUID=CO1.NTC.2402678&isFromPublicArea=True&isModal=False","Compraventa de bienes muebles","Contratación mínima cuantia","No aplica","ADQUISICIÓN DE EQUIPOS DE IMPRESIÓN MULTIFUNCIONALES CON FUNCIONES DE IMPRESIÓN, COPIADO Y DIGITALIZACIÓN, PARA EL FORTALECIMIENTO DE LA ESTRUCTURA ADMINISTRATIVA DE LA ALCALDÍA LOCAL DE LA CANDELARIA","Funcionamiento","Un Nuevo Contrato Social y Ambiental para la Bogotá del Siglo XXI","No aplica",{"$f":"IF(ISERROR(VLOOKUP(L210,Proposito_programa!$C$2:$E$59,2,FALSE)),\" \",VLOOKUP(L210,Proposito_programa!$C$2:$E$59,2,FALSE))","v":" "},{"$f":"IF(ISERROR(VLOOKUP(L210,Proposito_programa!$C$2:$E$59,3,FALSE)),\" \",VLOOKUP(L210,Proposito_programa!$C$2:$E$59,3,FALSE))","v":" "},"N/A",4,901099408,"A&F SOLUCIONES CORPORATIVAS","Persona Jurídica",null,null,null,13964550,null,null,null,13964550,0,44533,44536,44566,30,null,null,null,null,null,null,"X",null,null,null,0]
[1,181,2021,"FDLC-CPS-181-2021","https://community.secop.gov.co/Public/Tendering/OpportunityDetail/Index?noticeUID=CO1.NTC.2444558&isFromPublicArea=True&isModal=False","Contratos de prestación de servicios profesionales y de apoyo a la gestión","Contratación directa","Prestación de servicios profesionales y de apoyo a la gestión, o para la ejecución de trabajos artísticos que sólo puedan encomendarse a determinadas personas naturales;","PRESTACIÓN DE SERVICIOS PROFESIONALES PARA LA IMPLEMENTACIÓN DE ACCIONES Y ESTRATEGIAS DE COMUNICACIÓN RELACIONADA CON LOS EVENTOS CULTURALES Y TURISTICOS DESARROLLADOS POR LA ALCALDIA LOCAL DE LA CANDELARIA","Inversión","Un Nuevo Contrato Social y Ambiental para la Bogotá del Siglo XXI",21,{"$f":"IF(ISERROR(VLOOKUP(L211,Proposito_programa!$C$2:$E$59,2,FALSE)),\" \",VLOOKUP(L211,Proposito_programa!$C$2:$E$59,2,FALSE))","v":"Creación y vida cotidiana: Apropiación ciudadana del arte, la cultura y el patrimonio, para la democracia cultural"},{"$f":"IF(ISERROR(VLOOKUP(L211,Proposito_programa!$C$2:$E$59,3,FALSE)),\" \",VLOOKUP(L211,Proposito_programa!$C$2:$E$59,3,FALSE))","v":"Propósito 1: Hacer un nuevo contrato social para incrementar la inclusión social, productiva y política"},1625,1,1032488659,"KEVIN SEBASTIAN MELO RIVERA","Persona Natural",null,null,null,3600000,null,1,1800000,5400000,0,44537,44537,44572,24,1,12,null,null,null,null,null,null,"X",null,0]
[1,182,2021,"FDLC-CPS-182-2021","https://community.secop.gov.co/Public/Tendering/OpportunityDetail/Index?noticeUID=CO1.NTC.2448437&isFromPublicArea=True&isModal=False","Contratos de prestación de servicios profesionales y de apoyo a la gestión","Contratación directa","Prestación de servicios profesionales y de apoyo a la gestión, o para la ejecución de trabajos artísticos que sólo puedan encomendarse a determinadas personas naturales;","PRESTAR SERVICIOS DE APOYO A LA GESTIÓN AL FONDO DE DESARROLLO LOCAL DE LA CANDELARIA PARA LA IDENTIFICACION, MITIGACIÓN Y MONITOREO DE PROBLEMAS AMBIENTALES Y EL FORTALECIMIENTO DE LA PRACTICA DE AGRICULTURA URBANA EN ARAS DE LA SOSTENIBILIDAD DE LA LOCALIDAD","Inversión","Un Nuevo Contrato Social y Ambiental para la Bogotá del Siglo XXI",24,{"$f":"IF(ISERROR(VLOOKUP(L212,Proposito_programa!$C$2:$E$59,2,FALSE)),\" \",VLOOKUP(L212,Proposito_programa!$C$2:$E$59,2,FALSE))","v":"Bogotá región emprendedora e innovadora"},{"$f":"IF(ISERROR(VLOOKUP(L212,Proposito_programa!$C$2:$E$59,3,FALSE)),\" \",VLOOKUP(L212,Proposito_programa!$C$2:$E$59,3,FALSE))","v":"Propósito 1: Hacer un nuevo contrato social para incrementar la inclusión social, productiva y política"},1626,1,79976027,"JAIME ALIRIO RUIZ CALDERON","Persona Natural",null,null,null,1173333,null,1,586667,1760000,0,44539,44539,44572,22,1,11,null,null,null,null,null,null,"X",null,0]
[1,183,2021,"FDLC-CPS-183-2021","https://community.secop.gov.co/Public/Tendering/OpportunityDetail/Index?noticeUID=CO1.NTC.2453783&isFromPublicArea=True&isModal=False","Contratos de prestación de servicios profesionales y de apoyo a la gestión","Contratación directa","Prestación de servicios profesionales y de apoyo a la gestión, o para la ejecución de trabajos artísticos que sólo puedan encomendarse a determinadas personas naturales;","\nPRESTAR SERVICIOS PROFESIONALES ESPECIALIZADOS AL FONDO DE DESARROLLO LOCAL DE LA CANDELARIA PARA APOYAR LA REVISIÓN DE LOS PROCESOS CONTRACTUALES Y LOS RESPECTIVOS INCUMPLIMIENTOS QUE PRETENDA ADELANTAR LA ENTIDAD.","Inversión","Un Nuevo Contrato Social y Ambiental para la Bogotá del Siglo XXI",49,{"$f":"IF(ISERROR(VLOOKUP(L213,Proposito_programa!$C$2:$E$59,2,FALSE)),\" \",VLOOKUP(L213,Proposito_programa!$C$2:$E$59,2,FALSE))","v":"Movilidad segura, sostenible y accesible"},{"$f":"IF(ISERROR(VLOOKUP(L213,Proposito_programa!$C$2:$E$59,3,FALSE)),\" \",VLOOKUP(L213,Proposito_programa!$C$2:$E$59,3,FALSE))","v":"Propósito 4: Hacer de Bogotá Región un modelo de movilidad multimodal, incluyente y sostenible"},2020,1,80763536,"OSCAR JAVIER FONSECA GOMEZ","Persona Natural",null,null,null,5383333,null,null,null,5383333,0,44543,44543,44561,19,null,null,null,null,null,null,null,null,"X",null,0]
[1,184,2021,"FDLC-CPS-184-2021","https://community.secop.gov.co/Public/Tendering/OpportunityDetail/Index?noticeUID=CO1.NTC.2454166&isFromPublicArea=True&isModal=False","Contratos de prestación de servicios profesionales y de apoyo a la gestión","Contratación directa","Prestación de servicios profesionales y de apoyo a la gestión, o para la ejecución de trabajos artísticos que sólo puedan encomendarse a determinadas personas naturales;","PRESTAR SERVICIOS PROFESIONALES PARA APOYAR EL SEGUIMIENTO A LA EJECUCIÓN DE LOS PROYECTOS DE OBRA E INFRAESTRUCTURA DE LA LOCALIDAD","Inversión","Un Nuevo Contrato Social y Ambiental para la Bogotá del Siglo XXI",49,{"$f":"IF(ISERROR(VLOOKUP(L214,Proposito_programa!$C$2:$E$59,2,FALSE)),\" \",VLOOKUP(L214,Proposito_programa!$C$2:$E$59,2,FALSE))","v":"Movilidad segura, sostenible y accesible"},{"$f":"IF(ISERROR(VLOOKUP(L214,Proposito_programa!$C$2:$E$59,3,FALSE)),\" \",VLOOKUP(L214,Proposito_programa!$C$2:$E$59,3,FALSE))","v":"Propósito 4: Hacer de Bogotá Región un modelo de movilidad multimodal, incluyente y sostenible"},2020,1,1032475141,"LAURA DANIELA JACOME HERNANDEZ","Persona Natural",null,null,null,2761967,null,1,1308300,4070267,0,44543,44543,44570,19,1,9,null,null,null,null,null,null,"X",null,0]
[1,185,2021,"FDLC-SAMC-009-2021","https://community.secop.gov.co/Public/Tendering/OpportunityDetail/Index?noticeUID=CO1.NTC.2421131&isFromPublicArea=True&isModal=False","Contratos de prestación de servicios","Selección abreviada","Selección abreviada por menor cuantía ","Prestar los servicios para la ejecución de procesos de formación, asistencia técnica, dotación y encadenamiento productivo, para el fortalecimiento de la práctica de agricultura urbana, en el marco del proyecto 1626 \"La Candelaria Sostenible: Agricultura Urbana\"","Inversión","Un Nuevo Contrato Social y Ambiental para la Bogotá del Siglo XXI",24,{"$f":"IF(ISERROR(VLOOKUP(L215,Proposito_programa!$C$2:$E$59,2,FALSE)),\" \",VLOOKUP(L215,Proposito_programa!$C$2:$E$59,2,FALSE))","v":"Bogotá región emprendedora e innovadora"},{"$f":"IF(ISERROR(VLOOKUP(L215,Proposito_programa!$C$2:$E$59,3,FALSE)),\" \",VLOOKUP(L215,Proposito_programa!$C$2:$E$59,3,FALSE))","v":"Propósito 1: Hacer un nuevo contrato social para incrementar la inclusión social, productiva y política"},1626,1,900070729,"CORPORACIÓN METAMORFOSIS","Persona Jurídica",null,null,null,70919820,null,null,null,70919820,0,44545,44550,44627,75,null,null,null,null,null,null,null,"X",null,null,0]
[1,186,2021,"FDLC-IMC-022-2021","https://community.secop.gov.co/Public/Tendering/OpportunityDetail/Index?noticeUID=CO1.NTC.2445485&isFromPublicArea=True&isModal=False","Suministro","Contratación mínima cuantia","No aplica","ADQUIRIR INSUMOS INSTITUCIONALES A MONTO AGOTABLE PARA APOYAR LAS ACTIVIDADES DE ESPACIO PÚBLICO EN LA LOCALIDAD DE LA CANDELARIA DE ACUERDO CON ANEXO TÉCNICO Y EL MANUAL USO DE MARCA ALCALDIA DE BOGOTÁ","Inversión","Un Nuevo Contrato Social y Ambiental para la Bogotá del Siglo XXI",45,{"$f":"IF(ISERROR(VLOOKUP(L216,Proposito_programa!$C$2:$E$59,2,FALSE)),\" \",VLOOKUP(L216,Proposito_programa!$C$2:$E$59,2,FALSE))","v":"Espacio público más seguro y construido colectivamente"},{"$f":"IF(ISERROR(VLOOKUP(L216,Proposito_programa!$C$2:$E$59,3,FALSE)),\" \",VLOOKUP(L216,Proposito_programa!$C$2:$E$59,3,FALSE))","v":"Propósito 3: Inspirar confianza y legitimidad para vivir sin miedo y ser epicentro de cultura ciudadana, paz y reconciliación"},1786,1,900334037,"COMERCIALIZADORA CAFE BOTERO SAS","Persona Jurídica",null,null,null,25400000,null,null,null,25400000,0,44547,44550,44580,30,null,null,null,null,null,null,null,null,"X",null,0]
[1,187,2021,"FDLC-IMC-016-2021","https://community.secop.gov.co/Public/Tendering/OpportunityDetail/Index?noticeUID=CO1.NTC.2444053&isFromPublicArea=True&isModal=False","Suministro","Contratación mínima cuantia","No aplica","SUMINISTRO DE REFRIGERIOS A MONTO AGOTABLE PARA FORTALECER LA PARTICIPACIÓN CIUDADANA Y LAS ACTIVIDADES DE INSTANCIAS Y ORGANIZACIONES SOCIALES DE LA CANDELARIA","Inversión","Un Nuevo Contrato Social y Ambiental para la Bogotá del Siglo XXI",55,{"$f":"IF(ISERROR(VLOOKUP(L217,Proposito_programa!$C$2:$E$59,2,FALSE)),\" \",VLOOKUP(L217,Proposito_programa!$C$2:$E$59,2,FALSE))","v":"Fortalecimiento de cultura ciudadana y su institucionalidad"},{"$f":"IF(ISERROR(VLOOKUP(L217,Proposito_programa!$C$2:$E$59,3,FALSE)),\" \",VLOOKUP(L217,Proposito_programa!$C$2:$E$59,3,FALSE))","v":"Propósito 5: Construir Bogotá - Región con gobierno abierto, transparente y ciudadanía consciente"},2019,5,800081700,"FRUPYS LTDA","Persona Jurídica",null,null,null,12119285,null,null,null,{"$f":"+W217+X217+Z217","v":12119285},0,44547,44547,44728,180,null,null,null,null,null,null,null,null,"X",null,0]
[1,188,2021,"FDLC-CPS-188-2021","https://community.secop.gov.co/Public/Tendering/OpportunityDetail/Index?noticeUID=CO1.NTC.2460788&isFromPublicArea=True&isModal=False","Contratos de prestación de servicios profesionales y de apoyo a la gestión","Contratación directa","Prestación de servicios profesionales y de apoyo a la gestión, o para la ejecución de trabajos artísticos que sólo puedan encomendarse a determinadas personas naturales;","PRESTACIÓN DE SERVICIOS DE APOYO LOGÍSTICO EN LOS EVENTOS Y ACTIVIDADES DE LA ADMINISTRACIÓN LOCAL DE LA LOCALIDAD DE LA CANDELARIA EN EL MARCO DEL PROYECTO 1786 LA CANDELARIA INCLUYENTE, ESPACIO PUBLICO PARA LA CIUDADANIA","Inversión","Un Nuevo Contrato Social y Ambiental para la Bogotá del Siglo XXI",45,{"$f":"IF(ISERROR(VLOOKUP(L218,Proposito_programa!$C$2:$E$59,2,FALSE)),\" \",VLOOKUP(L218,Proposito_programa!$C$2:$E$59,2,FALSE))","v":"Espacio público más seguro y construido colectivamente"},{"$f":"IF(ISERROR(VLOOKUP(L218,Proposito_programa!$C$2:$E$59,3,FALSE)),\" \",VLOOKUP(L218,Proposito_programa!$C$2:$E$59,3,FALSE))","v":"Propósito 3: Inspirar confianza y legitimidad para vivir sin miedo y ser epicentro de cultura ciudadana, paz y reconciliación"},1786,1,51940511,"ALEIDA CRUZ GRANADA","Persona Natural",null,null,null,2443200,null,null,null,{"$f":"+W218+X218+Z218","v":2443200},0,44546,44546,44561,15,null,null,null,null,null,null,null,null,"X",null,0]
[1,189,2021,"FDLC-CPS-189-2021","https://community.secop.gov.co/Public/Tendering/OpportunityDetail/Index?noticeUID=CO1.NTC.2461077&isFromPublicArea=True&isModal=False","Contratos de prestación de servicios profesionales y de apoyo a la gestión","Contratación directa","Prestación de servicios profesionales y de apoyo a la gestión, o para la ejecución de trabajos artísticos que sólo puedan encomendarse a determinadas personas naturales;","PRESTAR SERVICIOS DE PROFESIONALES PARA APOYAR LA PROMOCIÓN DE LA LECTURA EN LOS COLEGIOS DE LA LOCALIDAD.","Inversión","Un Nuevo Contrato Social y Ambiental para la Bogotá del Siglo XXI",21,{"$f":"IF(ISERROR(VLOOKUP(L219,Proposito_programa!$C$2:$E$59,2,FALSE)),\" \",VLOOKUP(L219,Proposito_programa!$C$2:$E$59,2,FALSE))","v":"Creación y vida cotidiana: Apropiación ciudadana del arte, la cultura y el patrimonio, para la democracia cultural"},{"$f":"IF(ISERROR(VLOOKUP(L219,Proposito_programa!$C$2:$E$59,3,FALSE)),\" \",VLOOKUP(L219,Proposito_programa!$C$2:$E$59,3,FALSE))","v":"Propósito 1: Hacer un nuevo contrato social para incrementar la inclusión social, productiva y política"},1625,1,1018472325,"MARIA ALEJANDRA TAMAYO ARANGO","Persona Natural",null,null,null,2325866,null,null,null,{"$f":"+W219+X219+Z219","v":2325866},0,44546,44546,44561,16,null,null,null,null,null,null,null,null,"X",null,{"$f":"IF(ISERROR(AB219/AA219),\"-\",(AB219/AA219))","v":0}]
[1,190,2021,"FDLC-IMC-023-2021","https://community.secop.gov.co/Public/Tendering/OpportunityDetail/Index?noticeUID=CO1.NTC.2447722&isFromPublicArea=True&isModal=False","Compraventa de bienes muebles","Contratación mínima cuantia","No aplica","ALQUILER Y MONTAJE DE ARCOS NAVIDEÑOS PARA LOS CORREDORES DE LA CALLE 10 ENTRE CARRERAS 2 Y 4 Y LA CALLE 11 ENTRE CARRERAS 5 Y 6 DE LA LOCALIDAD DE LA CANDELARIA","Inversión","Un Nuevo Contrato Social y Ambiental para la Bogotá del Siglo XXI",45,{"$f":"IF(ISERROR(VLOOKUP(L220,Proposito_programa!$C$2:$E$59,2,FALSE)),\" \",VLOOKUP(L220,Proposito_programa!$C$2:$E$59,2,FALSE))","v":"Espacio público más seguro y construido colectivamente"},{"$f":"IF(ISERROR(VLOOKUP(L220,Proposito_programa!$C$2:$E$59,3,FALSE)),\" \",VLOOKUP(L220,Proposito_programa!$C$2:$E$59,3,FALSE))","v":"Propósito 3: Inspirar confianza y legitimidad para vivir sin miedo y ser epicentro de cultura ciudadana, paz y reconciliación"},1786,2,830110990,"CORPORACION SOLIDARIDAD Y TRABAJO","Persona Jurídica",null,null,null,18579960,null,null,null,18579960,0,44547,44550,44581,30,null,null,null,null,null,null,null,null,"X",null,0]
[1,191,2021,"FDLC-IMC-015-2021","https://community.secop.gov.co/Public/Tendering/OpportunityDetail/Index?noticeUID=CO1.NTC.2444115&isFromPublicArea=True&isModal=False","Compraventa de bienes muebles","Contratación mínima cuantia","No aplica","ADQUISICIÓN DE UN DESFIBRILADOR EXTERNO AUTOMÁTICO (DEA) PARA LA SEDE DE LA ALCALDÍA LOCAL DE LA CANDELARIA","Inversión","Un Nuevo Contrato Social y Ambiental para la Bogotá del Siglo XXI",57,{"$f":"IF(ISERROR(VLOOKUP(L221,Proposito_programa!$C$2:$E$59,2,FALSE)),\" \",VLOOKUP(L221,Proposito_programa!$C$2:$E$59,2,FALSE))","v":"Gestión pública local"},{"$f":"IF(ISERROR(VLOOKUP(L221,Proposito_programa!$C$2:$E$59,3,FALSE)),\" \",VLOOKUP(L221,Proposito_programa!$C$2:$E$59,3,FALSE))","v":"Propósito 5: Construir Bogotá - Región con gobierno abierto, transparente y ciudadanía consciente"},2021,5,860070078,"IMCOLMEDICA S.A.","Persona Jurídica",null,null,null,5229346,null,null,null,5229346,0,44547,44553,44583,30,null,null,null,null,null,null,"X",null,null,null,0]
[1,192,2021,"FDLC-IMC-019-2021","https://community.secop.gov.co/Public/Tendering/OpportunityDetail/Index?noticeUID=CO1.NTC.2444912&isFromPublicArea=True&isModal=False","Compraventa de bienes muebles","Contratación mínima cuantia","No aplica","ADQUISICIÓN DE ELEMENTOS DIDÁCTICOS Y JUEGOS TRADICIONALES PARA EL USO EN ACTIVIDADES RECREO-DEPORTIVAS, CULTURALES, Y/O MERCADOS TEMPORALES EN LA LOCALIDAD DE LA CANDELARIA\t ","Inversión","Un Nuevo Contrato Social y Ambiental para la Bogotá del Siglo XXI",45,{"$f":"IF(ISERROR(VLOOKUP(L222,Proposito_programa!$C$2:$E$59,2,FALSE)),\" \",VLOOKUP(L222,Proposito_programa!$C$2:$E$59,2,FALSE))","v":"Espacio público más seguro y construido colectivamente"},{"$f":"IF(ISERROR(VLOOKUP(L222,Proposito_programa!$C$2:$E$59,3,FALSE)),\" \",VLOOKUP(L222,Proposito_programa!$C$2:$E$59,3,FALSE))","v":"Propósito 3: Inspirar confianza y legitimidad para vivir sin miedo y ser epicentro de cultura ciudadana, paz y reconciliación"},1786,4,830084135,"DIDACTICOS SIMBOLOS Y SIGNOS S EN C","Persona Jurídica",null,null,null,20394284,null,null,null,20394284,0,44550,44553,44583,30,null,null,null,null,null,null,null,null,"X",null,0]
[1,193,2021,"FDLC-IMC-018-2021","https://community.secop.gov.co/Public/Tendering/OpportunityDetail/Index?noticeUID=CO1.NTC.2444510&isFromPublicArea=True&isModal=False","Contratos de prestación de servicios","Contratación mínima cuantia","No aplica","PRESTACIÓN DE SERVICIOS TENDIENTE A CAPACITAR A LAS MUJERES DE LA LOCALIDAD DE LA CANDELARIA EN LOS DIVERSOS BENEFICIOS DEL USO DE LA COPA MENSTRUAL, COMO HERRAMIENTA DE AUTOCONOCIMIENTO Y EMPODERAMIENTO DE LA MUJER CANDELARIA","Inversión","Un Nuevo Contrato Social y Ambiental para la Bogotá del Siglo XXI",6,{"$f":"IF(ISERROR(VLOOKUP(L223,Proposito_programa!$C$2:$E$59,2,FALSE)),\" \",VLOOKUP(L223,Proposito_programa!$C$2:$E$59,2,FALSE))","v":"Sistema Distrital de Cuidado"},{"$f":"IF(ISERROR(VLOOKUP(L223,Proposito_programa!$C$2:$E$59,3,FALSE)),\" \",VLOOKUP(L223,Proposito_programa!$C$2:$E$59,3,FALSE))","v":"Propósito 1: Hacer un nuevo contrato social para incrementar la inclusión social, productiva y política"},1662,3,901353823,"EVA COPA MENSTRUAL S.A.S.","Persona Jurídica",null,null,null,11806283,null,null,null,11806283,0,44547,44553,44673,120,null,null,null,null,null,null,null,"X",null,null,0]
[0,193,2021,"FDLC-IMC-018-2021","https://community.secop.gov.co/Public/Tendering/OpportunityDetail/Index?noticeUID=CO1.NTC.2444510&isFromPublicArea=True&isModal=False","Contratos de prestación de servicios","Contratación mínima cuantia","No aplica","PRESTACIÓN DE SERVICIOS TENDIENTE A CAPACITAR A LAS MUJERES DE LA LOCALIDAD DE LA CANDELARIA EN LOS DIVERSOS BENEFICIOS DEL USO DE LA COPA MENSTRUAL, COMO HERRAMIENTA DE AUTOCONOCIMIENTO Y EMPODERAMIENTO DE LA MUJER CANDELARIA","Inversión","Un Nuevo Contrato Social y Ambiental para la Bogotá del Siglo XXI",6,{"$f":"IF(ISERROR(VLOOKUP(L224,Proposito_programa!$C$2:$E$59,2,FALSE)),\" \",VLOOKUP(L224,Proposito_programa!$C$2:$E$59,2,FALSE))","v":"Sistema Distrital de Cuidado"},{"$f":"IF(ISERROR(VLOOKUP(L224,Proposito_programa!$C$2:$E$59,3,FALSE)),\" \",VLOOKUP(L224,Proposito_programa!$C$2:$E$59,3,FALSE))","v":"Propósito 1: Hacer un nuevo contrato social para incrementar la inclusión social, productiva y política"},1663,3,901353823,"EVA COPA MENSTRUAL S.A.S.","Persona Jurídica",null,null,null,7391667,null,null,null,{"$f":"+W224+X224+Z224","v":7391667},0,44547,44553,44673,120,null,null,null,null,null,null,null,"X",null,null,{"$f":"IF(ISERROR(AB224/AA224),\"-\",(AB224/AA224))","v":0}]
[0,193,2021,"FDLC-IMC-018-2021","https://community.secop.gov.co/Public/Tendering/OpportunityDetail/Index?noticeUID=CO1.NTC.2444510&isFromPublicArea=True&isModal=False","Contratos de prestación de servicios","Contratación mínima cuantia","No aplica","PRESTACIÓN DE SERVICIOS TENDIENTE A CAPACITAR A LAS MUJERES DE LA LOCALIDAD DE LA CANDELARIA EN LOS DIVERSOS BENEFICIOS DEL USO DE LA COPA MENSTRUAL, COMO HERRAMIENTA DE AUTOCONOCIMIENTO Y EMPODERAMIENTO DE LA MUJER CANDELARIA","Inversión","Un Nuevo Contrato Social y Ambiental para la Bogotá del Siglo XXI",40,{"$f":"IF(ISERROR(VLOOKUP(L225,Proposito_programa!$C$2:$E$59,2,FALSE)),\" \",VLOOKUP(L225,Proposito_programa!$C$2:$E$59,2,FALSE))","v":"Más mujeres viven una vida libre de violencias, se sienten seguras y acceden con confianza al sistema de justicia"},{"$f":"IF(ISERROR(VLOOKUP(L225,Proposito_programa!$C$2:$E$59,3,FALSE)),\" \",VLOOKUP(L225,Proposito_programa!$C$2:$E$59,3,FALSE))","v":"Propósito 3: Inspirar confianza y legitimidad para vivir sin miedo y ser epicentro de cultura ciudadana, paz y reconciliación"},1781,3,901353823,"EVA COPA MENSTRUAL S.A.S.","Persona Jurídica",null,null,null,1629550,null,null,null,1629550,0,44547,44553,44673,120,null,null,null,null,null,null,null,"X",null,null,0]
[null,null,2021,null,null,"Otros gastos","Otros gastos","Otros gastos","ATENDER 1550 HOGARES EN SITUACIÓN DE POBREZA O DE VULNERABILIDAD CON APOYOS QUE CONTRIBUYAN AL INGRESO MÍNIMO GARANTIZADO A TRAVÉS DEL CANAL DE TRANSFERENCIAS MONETARIAS.","Inversión","Un Nuevo Contrato Social y Ambiental para la Bogotá del Siglo XXI",1,{"$f":"IF(ISERROR(VLOOKUP(L226,Proposito_programa!$C$2:$E$59,2,FALSE)),\" \",VLOOKUP(L226,Proposito_programa!$C$2:$E$59,2,FALSE))","v":"Subsidios y transferencias para la equidad"},{"$f":"IF(ISERROR(VLOOKUP(L226,Proposito_programa!$C$2:$E$59,3,FALSE)),\" \",VLOOKUP(L226,Proposito_programa!$C$2:$E$59,3,FALSE))","v":"Propósito 1: Hacer un nuevo contrato social para incrementar la inclusión social, productiva y política"},1605,1,899999061,"FONDO DE DESARROLLO LOCAL DE LA CANDELAR IA","Persona Jurídica",null,null,null,992000000,null,null,null,992000000,992000000,44246,44246,44246,null,null,null,null,null,null,null,null,null,null,null,1]
[1,195,2021,"FDLC-CPS-195-2021","https://community.secop.gov.co/Public/Tendering/OpportunityDetail/Index?noticeUID=CO1.NTC.2462299&isFromPublicArea=True&isModal=False","Contratos de prestación de servicios profesionales y de apoyo a la gestión","Contratación directa","Prestación de servicios profesionales y de apoyo a la gestión, o para la ejecución de trabajos artísticos que sólo puedan encomendarse a determinadas personas naturales;","PRESTACIÓN DE SERVICIOS DE APOYO LOGÍSTICO EN LOS EVENTOS Y ACTIVIDADES DE LA ADMINISTRACIÓN LOCAL DE LA LOCALIDAD DE LA CANDELARIA EN EL MARCO DEL PROYECTO 1786 LA CANDELARIA INCLUYENTE, ESPACIO PUBLICO PARA LA CIUDADANIA","Inversión","Un Nuevo Contrato Social y Ambiental para la Bogotá del Siglo XXI",45,{"$f":"IF(ISERROR(VLOOKUP(L227,Proposito_programa!$C$2:$E$59,2,FALSE)),\" \",VLOOKUP(L227,Proposito_programa!$C$2:$E$59,2,FALSE))","v":"Espacio público más seguro y construido colectivamente"},{"$f":"IF(ISERROR(VLOOKUP(L227,Proposito_programa!$C$2:$E$59,3,FALSE)),\" \",VLOOKUP(L227,Proposito_programa!$C$2:$E$59,3,FALSE))","v":"Propósito 3: Inspirar confianza y legitimidad para vivir sin miedo y ser epicentro de cultura ciudadana, paz y reconciliación"},1786,1,52219688,"ENIT QUIÑONES","Persona Natural",null,null,null,800000,null,null,null,800000,0,44547,44547,44561,15,null,null,null,null,null,null,null,null,"X",null,0]
[1,196,2021,"FDLC-IMC-020-2021","https://community.secop.gov.co/Public/Tendering/OpportunityDetail/Index?noticeUID=CO1.NTC.2444674&isFromPublicArea=True&isModal=False","Contratos de prestación de servicios","Contratación mínima cuantia","No aplica","EJECUCIÓN DE TALLERES LÚDICO PEDAGÓGICOS DE PROMOCIÓN DE LECTURA Y ESCRITURA, QUE CONTENGAN EXPRESIONES ARTÍSTICAS Y DE NARRACIÓN ORAL DIRIGIDOS A LOS NIÑOS Y NIÑAS DE TRES A SEIS AÑOS DE LA LOCALIDAD DE LA CANDELARIA, EN EL MARCO DEL PROYECTO 1608 LA CANDELARIA BASES SÓLIDAS PARA LA VIDA","Inversión","Un Nuevo Contrato Social y Ambiental para la Bogotá del Siglo XXI",12,{"$f":"IF(ISERROR(VLOOKUP(L228,Proposito_programa!$C$2:$E$59,2,FALSE)),\" \",VLOOKUP(L228,Proposito_programa!$C$2:$E$59,2,FALSE))","v":"Educación inicial: Bases sólidas para la vida."},{"$f":"IF(ISERROR(VLOOKUP(L228,Proposito_programa!$C$2:$E$59,3,FALSE)),\" \",VLOOKUP(L228,Proposito_programa!$C$2:$E$59,3,FALSE))","v":"Propósito 1: Hacer un nuevo contrato social para incrementar la inclusión social, productiva y política"},1608,1,901352122,"DIRECCION Y GESTIÓN DE PROYECTOS SAS","Persona Jurídica",null,null,null,11128245,null,null,null,11128245,0,44547,44551,44640,90,null,null,null,null,null,null,null,"X",null,null,0]
[1,197,2021,"FDLC-CPS-197-2021","https://community.secop.gov.co/Public/Tendering/OpportunityDetail/Index?noticeUID=CO1.NTC.2466826&isFromPublicArea=True&isModal=False","Contratos de prestación de servicios profesionales y de apoyo a la gestión","Contratación directa","Prestación de servicios profesionales y de apoyo a la gestión, o para la ejecución de trabajos artísticos que sólo puedan encomendarse a determinadas personas naturales;","PRESTACIÓN DE SERVICIOS DE APOYO LOGÍSTICO EN LOS EVENTOS Y ACTIVIDADES DE LA ADMINISTRACIÓN LOCAL DE LA LOCALIDAD DE LA CANDELARIA EN EL MARCO DEL PROYECTO 1786 LA CANDELARIA INCLUYENTE, ESPACIO PUBLICO PARA LA CIUDADANIA","Inversión","Un Nuevo Contrato Social y Ambiental para la Bogotá del Siglo XXI",45,{"$f":"IF(ISERROR(VLOOKUP(L229,Proposito_programa!$C$2:$E$59,2,FALSE)),\" \",VLOOKUP(L229,Proposito_programa!$C$2:$E$59,2,FALSE))","v":"Espacio público más seguro y construido colectivamente"},{"$f":"IF(ISERROR(VLOOKUP(L229,Proposito_programa!$C$2:$E$59,3,FALSE)),\" \",VLOOKUP(L229,Proposito_programa!$C$2:$E$59,3,FALSE))","v":"Propósito 3: Inspirar confianza y legitimidad para vivir sin miedo y ser epicentro de cultura ciudadana, paz y reconciliación"},1786,1,1104701337,"GABRIEL FELIPE CARDONA CANDIL","Persona Natural",null,null,null,639996,null,null,null,639996,0,44549,44549,44561,12,null,null,null,null,null,null,null,null,"X",null,0]
[1,198,2021,"FDLC-CPS-198-2021","https://community.secop.gov.co/Public/Tendering/OpportunityDetail/Index?noticeUID=CO1.NTC.2468702&isFromPublicArea=True&isModal=False","Contratos de prestación de servicios profesionales y de apoyo a la gestión","Contratación directa","Prestación de servicios profesionales y de apoyo a la gestión, o para la ejecución de trabajos artísticos que sólo puedan encomendarse a determinadas personas naturales;","PRESTACION DE SERVICIOS DE APOYO LOGISTICO EN LOS EVENTOS Y ACTIVIDADES DE LA ADMINISTRACION LOCAL DE LA LOCALIDAD DE LA CANDELARIA EN EL MARCO DEL PROYECTO 1786 LA CANDELARIA INCLUYENTE, ESPACIO PUBLICO PARA LA CIUDADANIA.","Inversión","Un Nuevo Contrato Social y Ambiental para la Bogotá del Siglo XXI",45,{"$f":"IF(ISERROR(VLOOKUP(L230,Proposito_programa!$C$2:$E$59,2,FALSE)),\" \",VLOOKUP(L230,Proposito_programa!$C$2:$E$59,2,FALSE))","v":"Espacio público más seguro y construido colectivamente"},{"$f":"IF(ISERROR(VLOOKUP(L230,Proposito_programa!$C$2:$E$59,3,FALSE)),\" \",VLOOKUP(L230,Proposito_programa!$C$2:$E$59,3,FALSE))","v":"Propósito 3: Inspirar confianza y legitimidad para vivir sin miedo y ser epicentro de cultura ciudadana, paz y reconciliación"},1786,1,1026575561,"DIEGO ALEJANDRO SOLORZA CORRALES","Persona Natural",null,null,null,586663,null,null,null,586663,0,44551,44551,44561,11,null,null,null,null,null,null,null,null,"X",null,0]
[1,199,2021,"FDLC-SAMC-011-2021","https://community.secop.gov.co/Public/Tendering/OpportunityDetail/Index?noticeUID=CO1.NTC.2456359&isFromPublicArea=True&isModal=False","Contratos de prestación de servicios","Selección abreviada","Selección abreviada por menor cuantía ","MPLEMENTAR LOS ACUERDOS PARTICIPATIVOS CONCERTADOS CON LOS ACTORES DE LOS CORREDORES DE LAS CALLES 10 Y 11 DE LA CANDELARIA, MEDIANTE ACCIONES CULTURALES, DEPORTIVAS, RECREACIONALES Y/O MERCADOS TEMPORALES-CAMPESINOS, QUE PERMITAN ORGANIZAR EL ESPACIO PÚBLICO, A TRAVÉS DE LA GENERACIÓN DE ESPACIOS DE FORMACIÓN PARA LA SANA CONVIVENCIA Y EL FORTALECIMIENTO DE CAPACIDADES DE REACTIVACIÓN ECONÓMICA, PROMOVIENDO - LA CONSOLIDACIÓN DE BOGOTÁ REGIÓN METROPOLITANA EN EL CENTRO HISTÓRICO DE BOGOTA","Inversión","Un Nuevo Contrato Social y Ambiental para la Bogotá del Siglo XXI",45,{"$f":"IF(ISERROR(VLOOKUP(L231,Proposito_programa!$C$2:$E$59,2,FALSE)),\" \",VLOOKUP(L231,Proposito_programa!$C$2:$E$59,2,FALSE))","v":"Espacio público más seguro y construido colectivamente"},{"$f":"IF(ISERROR(VLOOKUP(L231,Proposito_programa!$C$2:$E$59,3,FALSE)),\" \",VLOOKUP(L231,Proposito_programa!$C$2:$E$59,3,FALSE))","v":"Propósito 3: Inspirar confianza y legitimidad para vivir sin miedo y ser epicentro de cultura ciudadana, paz y reconciliación"},1786,1,830083016,"PROFESIONALES EN LOGISTICA DEPORTES Y EV ENTOS LTDA","Persona Jurídica",null,null,null,250166192,null,null,null,250166192,0,44558,44560,44710,150,null,null,null,null,null,null,null,"X",null,null,0]
[1,200,2021,"FDLC-SASI-004-2021","https://community.secop.gov.co/Public/Tendering/OpportunityDetail/Index?noticeUID=CO1.NTC.2442331&isFromPublicArea=True&isModal=False","Suministro","Selección abreviada","Subasta inversa ","ADQUISICIÓN DE ALIMENTOS Y ELEMENTOS DE USO VETERINARIO, CON EL FIN DE MEJORAR LAS CONDICIONES DE PROTECCIÓN Y BIENESTAR DE LOS ANIMALES MAS VULNERABLES DE LA LOCALIDAD DE LA CANDELARIA EN EL MARCO DEL PROYECTO LOCAL 1704 LA CANDELARIA ANIMALISTA","Inversión","Un Nuevo Contrato Social y Ambiental para la Bogotá del Siglo XXI",34,{"$f":"IF(ISERROR(VLOOKUP(L232,Proposito_programa!$C$2:$E$59,2,FALSE)),\" \",VLOOKUP(L232,Proposito_programa!$C$2:$E$59,2,FALSE))","v":"Bogotá protectora de los animales"},{"$f":"IF(ISERROR(VLOOKUP(L232,Proposito_programa!$C$2:$E$59,3,FALSE)),\" \",VLOOKUP(L232,Proposito_programa!$C$2:$E$59,3,FALSE))","v":"Propósito 2 : Cambiar Nuestros Hábitos de Vida para Reverdecer a Bogotá y Adaptarnos y Mitigar la Crisis Climática"},1704,2,901352122,"DIRECCION Y GESTIÓN DE PROYECTOS SAS","Persona Jurídica",null,null,null,34422311,null,null,null,34422311,0,44559,44559,44589,30,null,null,null,null,null,null,null,null,"X",null,0]
[1,201,2021,"FDLC-SAMC-010-2021","https://community.secop.gov.co/Public/Tendering/OpportunityDetail/Index?noticeUID=CO1.NTC.2454825&isFromPublicArea=True&isModal=False","Obra pública","Selección abreviada","Selección abreviada por menor cuantía ","\nEJECUTAR A PRECIOS UNITARIOS FIJOS Y A MONTO AGOTABLE LAS ACTIVIDADES Y OBRAS REQUERIDAS PARA LA CONSERVACIÓN DEL ESPACIO PÚBLICO PEATONAL CON ACCIONES DE CONSERVACIÓN QUE FOMENTE EL ACCESO DE LAS PERSONAS CON DISCAPACIDAD EN LA LOCALIDAD DE LA CANDELARIA.","Inversión","Un Nuevo Contrato Social y Ambiental para la Bogotá del Siglo XXI",49,{"$f":"IF(ISERROR(VLOOKUP(L233,Proposito_programa!$C$2:$E$59,2,FALSE)),\" \",VLOOKUP(L233,Proposito_programa!$C$2:$E$59,2,FALSE))","v":"Movilidad segura, sostenible y accesible"},{"$f":"IF(ISERROR(VLOOKUP(L233,Proposito_programa!$C$2:$E$59,3,FALSE)),\" \",VLOOKUP(L233,Proposito_programa!$C$2:$E$59,3,FALSE))","v":"Propósito 4: Hacer de Bogotá Región un modelo de movilidad multimodal, incluyente y sostenible"},2020,2,900211384,"UNION TEMPORAL MANTENIMIENTO","Unión Temporal",900388354,"VAREGO SOCIEDAD POR ACCIONES SIMPLIFICADA O VAREGO S.A.S",0.5,229058163,null,null,null,229058163,0,44559,44559,44679,120,null,null,null,null,null,null,null,null,null,"X",0]
[0,201,2021,"FDLC-SAMC-010-2021","https://community.secop.gov.co/Public/Tendering/OpportunityDetail/Index?noticeUID=CO1.NTC.2454825&isFromPublicArea=True&isModal=False","Obra pública","Selección abreviada","Selección abreviada por menor cuantía ","\nEJECUTAR A PRECIOS UNITARIOS FIJOS Y A MONTO AGOTABLE LAS ACTIVIDADES Y OBRAS REQUERIDAS PARA LA CONSERVACIÓN DEL ESPACIO PÚBLICO PEATONAL CON ACCIONES DE CONSERVACIÓN QUE FOMENTE EL ACCESO DE LAS PERSONAS CON DISCAPACIDAD EN LA LOCALIDAD DE LA CANDELARIA.","Inversión","Un Nuevo Contrato Social y Ambiental para la Bogotá del Siglo XXI",49,{"$f":"IF(ISERROR(VLOOKUP(L234,Proposito_programa!$C$2:$E$59,2,FALSE)),\" \",VLOOKUP(L234,Proposito_programa!$C$2:$E$59,2,FALSE))","v":"Movilidad segura, sostenible y accesible"},{"$f":"IF(ISERROR(VLOOKUP(L234,Proposito_programa!$C$2:$E$59,3,FALSE)),\" \",VLOOKUP(L234,Proposito_programa!$C$2:$E$59,3,FALSE))","v":"Propósito 4: Hacer de Bogotá Región un modelo de movilidad multimodal, incluyente y sostenible"},2020,2,900211384,"UNION TEMPORAL MANTENIMIENTO","Unión Temporal",800229583,"EQUIPOS Y CONSTRUCIONES VAREGO SAS",0.5,0,null,null,null,0,0,44559,44559,44679,120,null,null,null,null,null,null,null,null,null,"X","-"]
[null,null,2021,null,null,"Otros gastos","Otros gastos","Otros gastos","PAGO DE COSTOS OPERATIVOS CORRESPONDIENTES AL PROGRAMA N°1605 APOYO SUBSIDIO ECONOMICO TIPO C VIGENCIA DE ENERO A JUNIO 2021","Inversión","Un Nuevo Contrato Social y Ambiental para la Bogotá del Siglo XXI",1,{"$f":"IF(ISERROR(VLOOKUP(L235,Proposito_programa!$C$2:$E$59,2,FALSE)),\" \",VLOOKUP(L235,Proposito_programa!$C$2:$E$59,2,FALSE))","v":"Subsidios y transferencias para la equidad"},{"$f":"IF(ISERROR(VLOOKUP(L235,Proposito_programa!$C$2:$E$59,3,FALSE)),\" \",VLOOKUP(L235,Proposito_programa!$C$2:$E$59,3,FALSE))","v":"Propósito 1: Hacer un nuevo contrato social para incrementar la inclusión social, productiva y política"},1605,1,860066942,"CAJA DE COMPENSACION FAMILIAR COMPENSAR","Persona Jurídica",null,null,null,5061704,null,null,null,5061704,5061704,44221,44221,44221,null,null,null,null,null,null,null,null,null,null,null,1]
[null,null,2021,null,null,"Otros gastos","Otros gastos","Otros gastos","Entrega de subsidios a población vulnerable de la localidad que contribuyan con el ingreso mínim de los hogares a través de los canales definidos en el Sistema Bogotá Solidaria","Inversión","Un Nuevo Contrato Social y Ambiental para la Bogotá del Siglo XXI",1,{"$f":"IF(ISERROR(VLOOKUP(L236,Proposito_programa!$C$2:$E$59,2,FALSE)),\" \",VLOOKUP(L236,Proposito_programa!$C$2:$E$59,2,FALSE))","v":"Subsidios y transferencias para la equidad"},{"$f":"IF(ISERROR(VLOOKUP(L236,Proposito_programa!$C$2:$E$59,3,FALSE)),\" \",VLOOKUP(L236,Proposito_programa!$C$2:$E$59,3,FALSE))","v":"Propósito 1: Hacer un nuevo contrato social para incrementar la inclusión social, productiva y política"},1605,1,899999061,"FONDO DE DESARROLLO LOCAL DE LA CANDELAR IA","Persona Jurídica",null,null,null,248536000,null,null,null,248536000,248536000,44340,44340,44340,null,null,null,null,null,null,null,null,null,null,null,1]
[null,null,2021,null,null,"Otros gastos","Otros gastos","Otros gastos","PAGO DE COSTOS OPERATIVOS CORRESPONDIENTES AL PROGRAMA N°1605 APOYO SUBSIDIO ECONOMICO TIPO C VIGENCIA DE JULIO A DICIEMBRE 2021.","Inversión","Un Nuevo Contrato Social y Ambiental para la Bogotá del Siglo XXI",1,{"$f":"IF(ISERROR(VLOOKUP(L237,Proposito_programa!$C$2:$E$59,2,FALSE)),\" \",VLOOKUP(L237,Proposito_programa!$C$2:$E$59,2,FALSE))","v":"Subsidios y transferencias para la equidad"},{"$f":"IF(ISERROR(VLOOKUP(L237,Proposito_programa!$C$2:$E$59,3,FALSE)),\" \",VLOOKUP(L237,Proposito_programa!$C$2:$E$59,3,FALSE))","v":"Propósito 1: Hacer un nuevo contrato social para incrementar la inclusión social, productiva y política"},1605,1,860066942,"CAJA DE COMPENSACION FAMILIAR COMPENSAR","Persona Jurídica",null,null,null,5000000,null,null,null,5000000,3896309,44389,44389,44389,null,null,null,null,null,null,null,null,null,null,null,0.7792618]
[null,null,2021,null,null,"Otros gastos","Otros gastos","Otros gastos","ABONOS A LOS ADULTOS MAYORES BENEFICIARIOS DEL PROGRAMA APOYO SUBSIDIO ECONÓMICO TIPO C. VIGENCIA JULIO A OCTUBRE DE 2021.","Inversión","Un Nuevo Contrato Social y Ambiental para la Bogotá del Siglo XXI",1,{"$f":"IF(ISERROR(VLOOKUP(L238,Proposito_programa!$C$2:$E$59,2,FALSE)),\" \",VLOOKUP(L238,Proposito_programa!$C$2:$E$59,2,FALSE))","v":"Subsidios y transferencias para la equidad"},{"$f":"IF(ISERROR(VLOOKUP(L238,Proposito_programa!$C$2:$E$59,3,FALSE)),\" \",VLOOKUP(L238,Proposito_programa!$C$2:$E$59,3,FALSE))","v":"Propósito 1: Hacer un nuevo contrato social para incrementar la inclusión social, productiva y política"},1605,1,860066942,"CAJA DE COMPENSACION FAMILIAR COMPENSAR","Persona Jurídica",null,null,null,228180000,null,null,null,228180000,228180000,44389,44389,44389,null,null,null,null,null,null,null,null,null,null,null,1]
[null,null,2021,null,null,"Otros gastos","Otros gastos","Otros gastos","ABONOS A LOS ADULTOS MAYORES BENEFICIARIOS DEL PROGRAMA APOYO SUBSIDIO ECONÓMICO TIPO C. VIGENCIA NOVIEMBRE DE 2021.","Inversión","Un Nuevo Contrato Social y Ambiental para la Bogotá del Siglo XXI",1,{"$f":"IF(ISERROR(VLOOKUP(L239,Proposito_programa!$C$2:$E$59,2,FALSE)),\" \",VLOOKUP(L239,Proposito_programa!$C$2:$E$59,2,FALSE))","v":"Subsidios y transferencias para la equidad"},{"$f":"IF(ISERROR(VLOOKUP(L239,Proposito_programa!$C$2:$E$59,3,FALSE)),\" \",VLOOKUP(L239,Proposito_programa!$C$2:$E$59,3,FALSE))","v":"Propósito 1: Hacer un nuevo contrato social para incrementar la inclusión social, productiva y política"},1605,1,860066942,"CAJA DE COMPENSACION FAMILIAR COMPENSAR","Persona Jurídica",null,null,null,58500000,null,null,null,58500000,58500000,44503,44503,44503,null,null,null,null,null,null,null,null,null,null,null,1]
[null,null,2021,null,null,"Otros gastos","Otros gastos","Otros gastos","ABONOS A LOS ADULTOS MAYORES BENEFICIARIOS DEL PROGRAMA DE APOYO SUBDIDIO TIPO C VIGENCIA DICIEMBRE 2021.","Inversión","Un Nuevo Contrato Social y Ambiental para la Bogotá del Siglo XXI",1,{"$f":"IF(ISERROR(VLOOKUP(L240,Proposito_programa!$C$2:$E$59,2,FALSE)),\" \",VLOOKUP(L240,Proposito_programa!$C$2:$E$59,2,FALSE))","v":"Subsidios y transferencias para la equidad"},{"$f":"IF(ISERROR(VLOOKUP(L240,Proposito_programa!$C$2:$E$59,3,FALSE)),\" \",VLOOKUP(L240,Proposito_programa!$C$2:$E$59,3,FALSE))","v":"Propósito 1: Hacer un nuevo contrato social para incrementar la inclusión social, productiva y política"},1605,1,860066942,"CAJA DE COMPENSACION FAMILIAR COMPENSAR","Persona Jurídica",null,null,null,58500000,null,null,null,58500000,58500000,44533,44533,44533,null,null,null,null,null,null,null,null,null,null,null,1]
[1,208,2021,"ORDEN DE COMPRA 83779","https://www.colombiacompra.gov.co/tienda-virtual-del-estado-colombiano/ordenes-compra/83779/1","Compraventa de bienes muebles","Selección abreviada","Acuerdo marco de precios ","El contrato que se pretende celebrar tendrá por objeto Adquirir bienes para realizar la adecuación y dotación de la Casa Cultural del Zipa en la Localidad de La Candelaria mediante el Acuerdo Marco de Precios No. CCE-925-AMP-2019","Inversión","Un Nuevo Contrato Social y Ambiental para la Bogotá del Siglo XXI",21,{"$f":"IF(ISERROR(VLOOKUP(L241,Proposito_programa!$C$2:$E$59,2,FALSE)),\" \",VLOOKUP(L241,Proposito_programa!$C$2:$E$59,2,FALSE))","v":"Creación y vida cotidiana: Apropiación ciudadana del arte, la cultura y el patrimonio, para la democracia cultural"},{"$f":"IF(ISERROR(VLOOKUP(L241,Proposito_programa!$C$2:$E$59,3,FALSE)),\" \",VLOOKUP(L241,Proposito_programa!$C$2:$E$59,3,FALSE))","v":"Propósito 1: Hacer un nuevo contrato social para incrementar la inclusión social, productiva y política"},1625,1,830001338,"SUMIMAS S A S","Persona Jurídica",null,null,null,184913148,null,null,null,184913148,0,44559,44559,44559,null,null,null,null,null,null,null,"X",null,null,null,0]
[1,209,2021,"ORDEN DE COMPRA 83973","https://www.colombiacompra.gov.co/tienda-virtual-del-estado-colombiano/ordenes-compra/83973","Compraventa de bienes muebles","Selección abreviada","Acuerdo marco de precios ","El contrato que se pretende celebrar tendrá por objeto Adquirir bienes para realizar la adecuación y dotación de la Casa Cultural del Zipa en la Localidad de La Candelaria mediante el Acuerdo Marco CCE 912 I AMP 2019. para la compra de dotaciones escolares II de octubre 8 de 2019, hasta octubre 8 de 2022.","Inversión","Un Nuevo Contrato Social y Ambiental para la Bogotá del Siglo XXI",21,{"$f":"IF(ISERROR(VLOOKUP(L242,Proposito_programa!$C$2:$E$59,2,FALSE)),\" \",VLOOKUP(L242,Proposito_programa!$C$2:$E$59,2,FALSE))","v":"Creación y vida cotidiana: Apropiación ciudadana del arte, la cultura y el patrimonio, para la democracia cultural"},{"$f":"IF(ISERROR(VLOOKUP(L242,Proposito_programa!$C$2:$E$59,3,FALSE)),\" \",VLOOKUP(L242,Proposito_programa!$C$2:$E$59,3,FALSE))","v":"Propósito 1: Hacer un nuevo contrato social para incrementar la inclusión social, productiva y política"},1625,1,52430291,"NELLY CARMENSA FIGUEROA ANACONA","Persona Natural",null,null,null,40362032,null,null,null,40362032,0,44560,44560,44560,null,null,null,null,null,null,null,"X",null,null,null,0]
[1,210,2021,"ORDEN DE COMPRA 83971","https://www.colombiacompra.gov.co/tienda-virtual-del-estado-colombiano/ordenes-compra/83971","Compraventa de bienes muebles","Selección abreviada","Acuerdo marco de precios ","El contrato que se pretende celebrar tendrá por objeto Adquirir bienes para realizar la adecuación y dotación de la Casa Cultural del Zipa en la Localidad de La Candelaria mediante el Acuerdo Marco CCE 912 I AMP 2019. para la compra de dotaciones escolares II de octubre 8 de 2019, hasta octubre 8 de 2022.","Inversión","Un Nuevo Contrato Social y Ambiental para la Bogotá del Siglo XXI",21,{"$f":"IF(ISERROR(VLOOKUP(L243,Proposito_programa!$C$2:$E$59,2,FALSE)),\" \",VLOOKUP(L243,Proposito_programa!$C$2:$E$59,2,FALSE))","v":"Creación y vida cotidiana: Apropiación ciudadana del arte, la cultura y el patrimonio, para la democracia cultural"},{"$f":"IF(ISERROR(VLOOKUP(L243,Proposito_programa!$C$2:$E$59,3,FALSE)),\" \",VLOOKUP(L243,Proposito_programa!$C$2:$E$59,3,FALSE))","v":"Propósito 1: Hacer un nuevo contrato social para incrementar la inclusión social, productiva y política"},1625,1,900741497,"TECNOPHONE COLOMBIA SAS","Persona Jurídica",null,null,null,107061555,null,null,null,107061555,0,44560,44560,44560,null,null,null,null,null,null,null,"X",null,null,null,0]
[1,211,2021,"ORDEN DE COMPRA 83974","https://www.colombiacompra.gov.co/tienda-virtual-del-estado-colombiano/ordenes-compra/83974","Compraventa de bienes muebles","Selección abreviada","Acuerdo marco de precios ","El contrato que se pretende celebrar tendrá por objeto Adquirir bienes para realizar la adecuación y dotación de la Casa Cultural del Zipa en la Localidad de La Candelaria mediante el Acuerdo Marco CCE 912 I AMP 2019. para la compra de dotaciones escolares II de octubre 8 de 2019, hasta octubre 8 de 2022.","Inversión","Un Nuevo Contrato Social y Ambiental para la Bogotá del Siglo XXI",21,{"$f":"IF(ISERROR(VLOOKUP(L244,Proposito_programa!$C$2:$E$59,2,FALSE)),\" \",VLOOKUP(L244,Proposito_programa!$C$2:$E$59,2,FALSE))","v":"Creación y vida cotidiana: Apropiación ciudadana del arte, la cultura y el patrimonio, para la democracia cultural"},{"$f":"IF(ISERROR(VLOOKUP(L244,Proposito_programa!$C$2:$E$59,3,FALSE)),\" \",VLOOKUP(L244,Proposito_programa!$C$2:$E$59,3,FALSE))","v":"Propósito 1: Hacer un nuevo contrato social para incrementar la inclusión social, productiva y política"},1625,1,900156826,"OFIX SUMINISTROS Y LOGISTICA SAS","Persona Jurídica",null,null,null,14334130,null,null,null,14334130,0,44560,44560,44560,null,null,null,null,null,null,null,"X",null,null,null,0]
[1,212,2021,"ORDEN DE COMPRA 83970","https://www.colombiacompra.gov.co/tienda-virtual-del-estado-colombiano/ordenes-compra/83970","Compraventa de bienes muebles","Selección abreviada","Acuerdo marco de precios ","ADQUIRIR BIENES PARA REALIZAR LA ADECUACIÓN Y DOTACIÓN DE LA CASA CULTURAL DEL ZIPA EN LA LOCALIDAD DE LA CANDELARIA”.MEDIANTE ACUERDO MARCO CCE-912-1-AMP-2019 PARA LA COMPRA DOTACIONES ESCOLARES II DE OCTUBRE 8, DE 2022.","Inversión","Un Nuevo Contrato Social y Ambiental para la Bogotá del Siglo XXI",21,{"$f":"IF(ISERROR(VLOOKUP(L245,Proposito_programa!$C$2:$E$59,2,FALSE)),\" \",VLOOKUP(L245,Proposito_programa!$C$2:$E$59,2,FALSE))","v":"Creación y vida cotidiana: Apropiación ciudadana del arte, la cultura y el patrimonio, para la democracia cultural"},{"$f":"IF(ISERROR(VLOOKUP(L245,Proposito_programa!$C$2:$E$59,3,FALSE)),\" \",VLOOKUP(L245,Proposito_programa!$C$2:$E$59,3,FALSE))","v":"Propósito 1: Hacer un nuevo contrato social para incrementar la inclusión social, productiva y política"},1625,1,830001338,"SUMIMAS S A S","Persona Jurídica",null,null,null,64036715,null,null,null,64036715,0,44560,44560,44560,null,null,null,null,null,null,null,"X",null,null,null,0]
[1,213,2021,"ORDEN DE COMPRA 83972","https://www.colombiacompra.gov.co/tienda-virtual-del-estado-colombiano/ordenes-compra/83972","Compraventa de bienes muebles","Selección abreviada","Acuerdo marco de precios ","Adquirir bienes para realizar la adecuación y dotación de la Casa Cultural del Zipa en la Localidad de La Candelaria mediante el acuerdo marco de precios No. CCE-166-AMP-2021","Inversión","Un Nuevo Contrato Social y Ambiental para la Bogotá del Siglo XXI",21,{"$f":"IF(ISERROR(VLOOKUP(L246,Proposito_programa!$C$2:$E$59,2,FALSE)),\" \",VLOOKUP(L246,Proposito_programa!$C$2:$E$59,2,FALSE))","v":"Creación y vida cotidiana: Apropiación ciudadana del arte, la cultura y el patrimonio, para la democracia cultural"},{"$f":"IF(ISERROR(VLOOKUP(L246,Proposito_programa!$C$2:$E$59,3,FALSE)),\" \",VLOOKUP(L246,Proposito_programa!$C$2:$E$59,3,FALSE))","v":"Propósito 1: Hacer un nuevo contrato social para incrementar la inclusión social, productiva y política"},1625,1,805013342,"COMERCIALIZADORA MUNDIAL DE DEPORTES LTD A","Persona Jurídica",null,null,null,1269259,null,null,null,1269259,0,44560,44560,44560,null,null,null,null,null,null,null,"X",null,null,null,0]
[null,null,2021,null,null,"Otros gastos","Otros gastos","Otros gastos","CAUSAR Y ORDENAR EL PAGO POR CONCEPTO DE COTIZACIÓN AL SISTEMA DE RIESGOS LABORALES DE LOS CONTRATISTAS VINCULADOS CON EL FONDO DE DESARROLLO LOCAL DE LA CANDELARIA PERSONAL CONTRATISTA PRESTADOR DE SERVICIOS CUYAS ACTIVIDADES ESTÁN CLASIFICADAS EN EL NIVEL DE RIESGO IV Y V DE CONFORMIDAD CON LA PARTE CONSIDERATIVA DEL PRESENTE ACTO ADMINIS TRATIVO. ESTE PAGO SE REALIZARÁ MENSUALMENTE Y POR LA VIGENCIA DE LOS CONTRATOS SUSCRITOS.","Inversión","Un Nuevo Contrato Social y Ambiental para la Bogotá del Siglo XXI",24,{"$f":"IF(ISERROR(VLOOKUP(L247,Proposito_programa!$C$2:$E$59,2,FALSE)),\" \",VLOOKUP(L247,Proposito_programa!$C$2:$E$59,2,FALSE))","v":"Bogotá región emprendedora e innovadora"},{"$f":"IF(ISERROR(VLOOKUP(L247,Proposito_programa!$C$2:$E$59,3,FALSE)),\" \",VLOOKUP(L247,Proposito_programa!$C$2:$E$59,3,FALSE))","v":"Propósito 1: Hacer un nuevo contrato social para incrementar la inclusión social, productiva y política"},1626,1,860011153,"POSITIVA COMPAÑIA DE SEGUROS SA","Persona Jurídica",null,null,null,428700,null,null,null,428700,428700,44348,44348,44348,null,null,null,null,null,null,null,null,null,null,null,1]
[null,null,2021,null,null,"Otros gastos","Otros gastos","Otros gastos","CAUSAR Y ODENAR EL PAGO POR CONCEPTO DE COTIZACIÓN AL SISTEMA DE RIESGOSLABORALES DE LOS CONTRATISTAS VINCULADOS CON EL FONDO DE DESARROLLO LOCAL DE LA CANDELARIA,PERSONAL CONTRATISTA PRESTADOR DE SERVICIOS CUYAS ACTIVIDADES ESTÁN CLASIFICADAS EN EL NIVEL DE RIESGO IV Y V DE CONFORMI DAD CON LA PARTE CONSIDERATIVA DEL PRESENTE ACTO ADMINISTRATIVO. ESTE PAGO SE REALIZARÁ MENSUALMENTE Y POR LA VIGENCIA DE LOS CONTRATOS SUSCRITOS.","Inversión","Un Nuevo Contrato Social y Ambiental para la Bogotá del Siglo XXI",24,{"$f":"IF(ISERROR(VLOOKUP(L248,Proposito_programa!$C$2:$E$59,2,FALSE)),\" \",VLOOKUP(L248,Proposito_programa!$C$2:$E$59,2,FALSE))","v":"Bogotá región emprendedora e innovadora"},{"$f":"IF(ISERROR(VLOOKUP(L248,Proposito_programa!$C$2:$E$59,3,FALSE)),\" \",VLOOKUP(L248,Proposito_programa!$C$2:$E$59,3,FALSE))","v":"Propósito 1: Hacer un nuevo contrato social para incrementar la inclusión social, productiva y política"},1626,1,860011153,"POSITIVA COMPAÑIA DE SEGUROS SA","Persona Jurídica",null,null,null,161900,null,null,null,161900,161900,44377,44377,44377,null,null,null,null,null,null,null,null,null,null,null,1]
[null,null,2021,null,null,"Otros gastos","Otros gastos","Otros gastos","CAUSAR Y ORDENAR EL PAGO POR CONCEPTO DE COTIZACIÓN AL SISTEMA DE RIESGOS  LABORALES DE LOS CONTRATISTAS VINCULADOS CON EL FONDO DE DESARROLLO LOCAL DE LA CANDELARIA PERSONAL CONTRATISTA PRESTADOR DE SERVICIOS CUYAS ACTIVIDADES ESTÁN CLASIFICADAS EN EL NIVEL DE RIESGO LABORAL IV Y V DE CONFORMIDAD CON LA PARTE CONSIDERATIVA DEL PRESENTE ACTO AMINISTRATIVO ESTE PAGO SE REALIZARÁ MENSUALMENTE Y POR LA VIGENCIA DE LOS CONTRATOS SUSCRITOS.","Inversión","Un Nuevo Contrato Social y Ambiental para la Bogotá del Siglo XXI",24,{"$f":"IF(ISERROR(VLOOKUP(L249,Proposito_programa!$C$2:$E$59,2,FALSE)),\" \",VLOOKUP(L249,Proposito_programa!$C$2:$E$59,2,FALSE))","v":"Bogotá región emprendedora e innovadora"},{"$f":"IF(ISERROR(VLOOKUP(L249,Proposito_programa!$C$2:$E$59,3,FALSE)),\" \",VLOOKUP(L249,Proposito_programa!$C$2:$E$59,3,FALSE))","v":"Propósito 1: Hacer un nuevo contrato social para incrementar la inclusión social, productiva y política"},1626,1,860011153,"POSITIVA COMPAÑIA DE SEGUROS SA","Persona Jurídica",null,null,null,161900,null,null,null,161900,161900,44411,44411,44411,null,null,null,null,null,null,null,null,null,null,null,1]
[null,null,2021,null,null,"Otros gastos","Otros gastos","Otros gastos","CAUSAR Y ODENAR EL PAGO POR CONCEPTO DE COTIZACIÓN AL SISTEMA DE RIESGOSLABORALES  DE LOS CONTRATISTAS VINCULADOS CON EL FONDO DE DESARROLLO LOCAL DE LA CANDELARIA.PERSONAL CONTRATISTA PRESTADOR DE SERVICIOS CUYAS ACTIVIDADES  ESTÁN CLASIFICADAS EN EL NIVEL DE RIESGO IV Y V DE CONFORMI DAD CON LA PARTE CONSIDERATIVA DEL PRESENTE ACTO ADMINISTRATIVO.","Inversión","Un Nuevo Contrato Social y Ambiental para la Bogotá del Siglo XXI",24,{"$f":"IF(ISERROR(VLOOKUP(L250,Proposito_programa!$C$2:$E$59,2,FALSE)),\" \",VLOOKUP(L250,Proposito_programa!$C$2:$E$59,2,FALSE))","v":"Bogotá región emprendedora e innovadora"},{"$f":"IF(ISERROR(VLOOKUP(L250,Proposito_programa!$C$2:$E$59,3,FALSE)),\" \",VLOOKUP(L250,Proposito_programa!$C$2:$E$59,3,FALSE))","v":"Propósito 1: Hacer un nuevo contrato social para incrementar la inclusión social, productiva y política"},1626,1,860011153,"POSITIVA COMPAÑIA DE SEGUROS SA","Persona Jurídica",null,null,null,161900,null,null,null,161900,161900,44446,44446,44446,null,null,null,null,null,null,null,null,null,null,null,1]
[null,null,2021,null,null,"Otros gastos","Otros gastos","Otros gastos","CAUSAR Y ODENAR EL PAGO POR CONCEPTO DE COTIZACIÓN AL SISTEMA DE RIESGOSLABORALES  DE LOS CONTRATISTAS VINCULADOS CON EL FONDO DE DESARROLLO LOCAL DE LA CANDELARIA.PERSONAL CONTRATISTA PRESTADOR DE SERVICIOS CUYAS ACTIVIDADES ESTÁN CLASIFICADAS EN EL NIVEL DE RIESGO IV Y V DE CONFORMIDADCONLA PARTE CONSIDERATIVA DEL PRESENTE ACTO ADMINISTRATIVO.","Inversión","Un Nuevo Contrato Social y Ambiental para la Bogotá del Siglo XXI",24,{"$f":"IF(ISERROR(VLOOKUP(L251,Proposito_programa!$C$2:$E$59,2,FALSE)),\" \",VLOOKUP(L251,Proposito_programa!$C$2:$E$59,2,FALSE))","v":"Bogotá región emprendedora e innovadora"},{"$f":"IF(ISERROR(VLOOKUP(L251,Proposito_programa!$C$2:$E$59,3,FALSE)),\" \",VLOOKUP(L251,Proposito_programa!$C$2:$E$59,3,FALSE))","v":"Propósito 1: Hacer un nuevo contrato social para incrementar la inclusión social, productiva y política"},1626,1,860011153,"POSITIVA COMPAÑIA DE SEGUROS SA","Persona Jurídica",null,null,null,161900,null,null,null,161900,161900,44470,44470,44470,null,null,null,null,null,null,null,null,null,null,null,1]
[null,null,2021,null,null,"Otros gastos","Otros gastos","Otros gastos","CAUSAR Y ODENAR EL PAGO POR CONCEPTO DE COTIZACIÓN AL SISTEMA DE RIESGOSRIESGOSLABORALES DE LOS CONTRATISTAS VINCULADOS CON EL FONDO DE DESARRO LLO LOCAL DE LA CANDELARIA PERSONAL CONTRATISTA PRESTADOR DE SERVICIOS CUYAS ACTIVIDADES ESTAN CLASIFICADAS EN EL NIVEL DE RIESGO IV Y V DE CONFORMIDAD CON LA PARTE CONSIDERATIVA DEL PRESENTE ACTO ADMINISTRATIVO.","Inversión","Un Nuevo Contrato Social y Ambiental para la Bogotá del Siglo XXI",24,{"$f":"IF(ISERROR(VLOOKUP(L252,Proposito_programa!$C$2:$E$59,2,FALSE)),\" \",VLOOKUP(L252,Proposito_programa!$C$2:$E$59,2,FALSE))","v":"Bogotá región emprendedora e innovadora"},{"$f":"IF(ISERROR(VLOOKUP(L252,Proposito_programa!$C$2:$E$59,3,FALSE)),\" \",VLOOKUP(L252,Proposito_programa!$C$2:$E$59,3,FALSE))","v":"Propósito 1: Hacer un nuevo contrato social para incrementar la inclusión social, productiva y política"},1626,1,860011153,"POSITIVA COMPAÑIA DE SEGUROS SA","Persona Jurídica",null,null,null,161900,null,null,null,161900,161900,44509,44509,44509,null,null,null,null,null,null,null,null,null,null,null,1]
[null,null,2021,null,null,"Otros gastos","Otros gastos","Otros gastos","CAUSAR Y ODENAR EL PAGO POR CONCEPTO DE COTIZACIÓN AL SISTEMA DE RIESGOSCONTRATISTAS VINCULADOS CON EL FONDO DE DESARRO LLO LOCAL DE LA CANDELARIA PERSONAL CONTRATISTA PRESTADOR DE SERVICIOS CUYAS ACTIVIDADES ESTAN CLASIFICADAS EN EL NIVEL DE RIESGO IV Y V DE CONFORMIDAD CON LA PARTE CONSIDERATIVA DEL PRESENTE ACTO .(RESOLUCION 028 DE 2021).","Inversión","Un Nuevo Contrato Social y Ambiental para la Bogotá del Siglo XXI",24,{"$f":"IF(ISERROR(VLOOKUP(L253,Proposito_programa!$C$2:$E$59,2,FALSE)),\" \",VLOOKUP(L253,Proposito_programa!$C$2:$E$59,2,FALSE))","v":"Bogotá región emprendedora e innovadora"},{"$f":"IF(ISERROR(VLOOKUP(L253,Proposito_programa!$C$2:$E$59,3,FALSE)),\" \",VLOOKUP(L253,Proposito_programa!$C$2:$E$59,3,FALSE))","v":"Propósito 1: Hacer un nuevo contrato social para incrementar la inclusión social, productiva y política"},1626,1,860011153,"POSITIVA COMPAÑIA DE SEGUROS SA","Persona Jurídica",null,null,null,359900,null,null,null,359900,359900,44540,44540,44540,null,null,null,null,null,null,null,null,null,null,null,1]
[null,null,2021,null,null,"Otros gastos","Otros gastos","Otros gastos","CAUSAR Y ODENAR EL PAGO POR CONCEPTO DE COTIZACIÓN AL SISTEMA DE RIESGOSCONTRATISTAS VINCULADOS CON EL FONDO DE DESARRO LLO LOCAL DE LA CANDELARIA PERSONAL CONTRATISTA PRESTADOR DE SERVICIOS CUYAS ACTIVIDADES ESTAN CLASIFICADAS EN EL NIVEL DE RIESGO IV Y V DE CONFORMIDAD CON LA PARTE CONSIDERATIVA DEL PRESENTE ACTO .(RESOLUCION 028 DE 2021).","Inversión","Un Nuevo Contrato Social y Ambiental para la Bogotá del Siglo XXI",24,{"$f":"IF(ISERROR(VLOOKUP(L254,Proposito_programa!$C$2:$E$59,2,FALSE)),\" \",VLOOKUP(L254,Proposito_programa!$C$2:$E$59,2,FALSE))","v":"Bogotá región emprendedora e innovadora"},{"$f":"IF(ISERROR(VLOOKUP(L254,Proposito_programa!$C$2:$E$59,3,FALSE)),\" \",VLOOKUP(L254,Proposito_programa!$C$2:$E$59,3,FALSE))","v":"Propósito 1: Hacer un nuevo contrato social para incrementar la inclusión social, productiva y política"},1626,1,860011153,"POSITIVA COMPAÑIA DE SEGUROS SA","Persona Jurídica",null,null,null,724900,null,null,null,724900,724900,44561,44561,44561,null,null,null,null,null,null,null,null,null,null,null,1]
[null,null,2021,null,null,"Otros gastos","Otros gastos","Otros gastos","CAUSAR Y ODENAR EL PAGO POR CONCEPTO DE COTIZACIÓN AL SISTEMA DE RIESGOSCONTRATISTAS VINCULADOS CON EL FONDO DE DESARRO LLO LOCAL DE LA CANDELARIA PERSONAL CONTRATISTA PRESTADOR DE SERVICIOS CUYAS ACTIVIDADES ESTAN CLASIFICADAS EN EL NIVEL DE RIESGO IV Y V DE CONFORMIDAD CON LA PARTE CONSIDERATIVA DEL PRESENTE ACTO .(RESOLUCION 028 DE 2021).","Inversión","Un Nuevo Contrato Social y Ambiental para la Bogotá del Siglo XXI",6,{"$f":"IF(ISERROR(VLOOKUP(L255,Proposito_programa!$C$2:$E$59,2,FALSE)),\" \",VLOOKUP(L255,Proposito_programa!$C$2:$E$59,2,FALSE))","v":"Sistema Distrital de Cuidado"},{"$f":"IF(ISERROR(VLOOKUP(L255,Proposito_programa!$C$2:$E$59,3,FALSE)),\" \",VLOOKUP(L255,Proposito_programa!$C$2:$E$59,3,FALSE))","v":"Propósito 1: Hacer un nuevo contrato social para incrementar la inclusión social, productiva y política"},1628,1,860011153,"POSITIVA COMPAÑIA DE SEGUROS SA","Persona Jurídica",null,null,null,189700,null,null,null,189700,189700,44348,44348,44348,null,null,null,null,null,null,null,null,null,null,null,1]
[null,null,2021,null,null,"Otros gastos","Otros gastos","Otros gastos","CAUSAR Y ODENAR EL PAGO POR CONCEPTO DE COTIZACIÓN AL SISTEMA DE RIESGOSCONTRATISTAS VINCULADOS CON EL FONDO DE DESARRO LLO LOCAL DE LA CANDELARIA PERSONAL CONTRATISTA PRESTADOR DE SERVICIOS CUYAS ACTIVIDADES ESTAN CLASIFICADAS EN EL NIVEL DE RIESGO IV Y V DE CONFORMIDAD CON LA PARTE CONSIDERATIVA DEL PRESENTE ACTO .(RESOLUCION 028 DE 2021).","Inversión","Un Nuevo Contrato Social y Ambiental para la Bogotá del Siglo XXI",6,{"$f":"IF(ISERROR(VLOOKUP(L256,Proposito_programa!$C$2:$E$59,2,FALSE)),\" \",VLOOKUP(L256,Proposito_programa!$C$2:$E$59,2,FALSE))","v":"Sistema Distrital de Cuidado"},{"$f":"IF(ISERROR(VLOOKUP(L256,Proposito_programa!$C$2:$E$59,3,FALSE)),\" \",VLOOKUP(L256,Proposito_programa!$C$2:$E$59,3,FALSE))","v":"Propósito 1: Hacer un nuevo contrato social para incrementar la inclusión social, productiva y política"},1628,1,860011153,"POSITIVA COMPAÑIA DE SEGUROS SA","Persona Jurídica",null,null,null,63300,null,null,null,63300,63300,44377,44377,44377,null,null,null,null,null,null,null,null,null,null,null,1]
[null,null,2021,null,null,"Otros gastos","Otros gastos","Otros gastos","CAUSAR Y ODENAR EL PAGO POR CONCEPTO DE COTIZACIÓN AL SISTEMA DE RIESGOSCONTRATISTAS VINCULADOS CON EL FONDO DE DESARRO LLO LOCAL DE LA CANDELARIA PERSONAL CONTRATISTA PRESTADOR DE SERVICIOS CUYAS ACTIVIDADES ESTAN CLASIFICADAS EN EL NIVEL DE RIESGO IV Y V DE CONFORMIDAD CON LA PARTE CONSIDERATIVA DEL PRESENTE ACTO .(RESOLUCION 028 DE 2021).","Inversión","Un Nuevo Contrato Social y Ambiental para la Bogotá del Siglo XXI",6,{"$f":"IF(ISERROR(VLOOKUP(L257,Proposito_programa!$C$2:$E$59,2,FALSE)),\" \",VLOOKUP(L257,Proposito_programa!$C$2:$E$59,2,FALSE))","v":"Sistema Distrital de Cuidado"},{"$f":"IF(ISERROR(VLOOKUP(L257,Proposito_programa!$C$2:$E$59,3,FALSE)),\" \",VLOOKUP(L257,Proposito_programa!$C$2:$E$59,3,FALSE))","v":"Propósito 1: Hacer un nuevo contrato social para incrementar la inclusión social, productiva y política"},1628,1,860011153,"POSITIVA COMPAÑIA DE SEGUROS SA","Persona Jurídica",null,null,null,63300,null,null,null,63300,63300,44411,44411,44411,null,null,null,null,null,null,null,null,null,null,null,1]
[null,null,2021,null,null,"Otros gastos","Otros gastos","Otros gastos","CAUSAR Y ODENAR EL PAGO POR CONCEPTO DE COTIZACIÓN AL SISTEMA DE RIESGOSCONTRATISTAS VINCULADOS CON EL FONDO DE DESARRO LLO LOCAL DE LA CANDELARIA PERSONAL CONTRATISTA PRESTADOR DE SERVICIOS CUYAS ACTIVIDADES ESTAN CLASIFICADAS EN EL NIVEL DE RIESGO IV Y V DE CONFORMIDAD CON LA PARTE CONSIDERATIVA DEL PRESENTE ACTO .(RESOLUCION 028 DE 2021).","Inversión","Un Nuevo Contrato Social y Ambiental para la Bogotá del Siglo XXI",6,{"$f":"IF(ISERROR(VLOOKUP(L258,Proposito_programa!$C$2:$E$59,2,FALSE)),\" \",VLOOKUP(L258,Proposito_programa!$C$2:$E$59,2,FALSE))","v":"Sistema Distrital de Cuidado"},{"$f":"IF(ISERROR(VLOOKUP(L258,Proposito_programa!$C$2:$E$59,3,FALSE)),\" \",VLOOKUP(L258,Proposito_programa!$C$2:$E$59,3,FALSE))","v":"Propósito 1: Hacer un nuevo contrato social para incrementar la inclusión social, productiva y política"},1628,1,860011153,"POSITIVA COMPAÑIA DE SEGUROS SA","Persona Jurídica",null,null,null,63300,null,null,null,63300,63300,44446,44446,44446,null,null,null,null,null,null,null,null,null,null,null,1]
[null,null,2021,null,null,"Otros gastos","Otros gastos","Otros gastos","CAUSAR Y ODENAR EL PAGO POR CONCEPTO DE COTIZACIÓN AL SISTEMA DE RIESGOSCONTRATISTAS VINCULADOS CON EL FONDO DE DESARRO LLO LOCAL DE LA CANDELARIA PERSONAL CONTRATISTA PRESTADOR DE SERVICIOS CUYAS ACTIVIDADES ESTAN CLASIFICADAS EN EL NIVEL DE RIESGO IV Y V DE CONFORMIDAD CON LA PARTE CONSIDERATIVA DEL PRESENTE ACTO .(RESOLUCION 028 DE 2021).","Inversión","Un Nuevo Contrato Social y Ambiental para la Bogotá del Siglo XXI",6,{"$f":"IF(ISERROR(VLOOKUP(L259,Proposito_programa!$C$2:$E$59,2,FALSE)),\" \",VLOOKUP(L259,Proposito_programa!$C$2:$E$59,2,FALSE))","v":"Sistema Distrital de Cuidado"},{"$f":"IF(ISERROR(VLOOKUP(L259,Proposito_programa!$C$2:$E$59,3,FALSE)),\" \",VLOOKUP(L259,Proposito_programa!$C$2:$E$59,3,FALSE))","v":"Propósito 1: Hacer un nuevo contrato social para incrementar la inclusión social, productiva y política"},1628,1,860011153,"POSITIVA COMPAÑIA DE SEGUROS SA","Persona Jurídica",null,null,null,63300,null,null,null,63300,63300,44470,44470,44470,null,null,null,null,null,null,null,null,null,null,null,1]
[null,null,2021,null,null,"Otros gastos","Otros gastos","Otros gastos","CAUSAR Y ODENAR EL PAGO POR CONCEPTO DE COTIZACIÓN AL SISTEMA DE RIESGOSCONTRATISTAS VINCULADOS CON EL FONDO DE DESARRO LLO LOCAL DE LA CANDELARIA PERSONAL CONTRATISTA PRESTADOR DE SERVICIOS CUYAS ACTIVIDADES ESTAN CLASIFICADAS EN EL NIVEL DE RIESGO IV Y V DE CONFORMIDAD CON LA PARTE CONSIDERATIVA DEL PRESENTE ACTO .(RESOLUCION 028 DE 2021).","Inversión","Un Nuevo Contrato Social y Ambiental para la Bogotá del Siglo XXI",6,{"$f":"IF(ISERROR(VLOOKUP(L260,Proposito_programa!$C$2:$E$59,2,FALSE)),\" \",VLOOKUP(L260,Proposito_programa!$C$2:$E$59,2,FALSE))","v":"Sistema Distrital de Cuidado"},{"$f":"IF(ISERROR(VLOOKUP(L260,Proposito_programa!$C$2:$E$59,3,FALSE)),\" \",VLOOKUP(L260,Proposito_programa!$C$2:$E$59,3,FALSE))","v":"Propósito 1: Hacer un nuevo contrato social para incrementar la inclusión social, productiva y política"},1628,1,860011153,"POSITIVA COMPAÑIA DE SEGUROS SA","Persona Jurídica",null,null,null,63300,null,null,null,63300,63300,44509,44509,44509,null,null,null,null,null,null,null,null,null,null,null,1]
[null,null,2021,null,null,"Otros gastos","Otros gastos","Otros gastos","CAUSAR Y ODENAR EL PAGO POR CONCEPTO DE COTIZACIÓN AL SISTEMA DE RIESGOSCONTRATISTAS VINCULADOS CON EL FONDO DE DESARRO LLO LOCAL DE LA CANDELARIA PERSONAL CONTRATISTA PRESTADOR DE SERVICIOS CUYAS ACTIVIDADES ESTAN CLASIFICADAS EN EL NIVEL DE RIESGO IV Y V DE CONFORMIDAD CON LA PARTE CONSIDERATIVA DEL PRESENTE ACTO .(RESOLUCION 028 DE 2021).","Inversión","Un Nuevo Contrato Social y Ambiental para la Bogotá del Siglo XXI",6,{"$f":"IF(ISERROR(VLOOKUP(L261,Proposito_programa!$C$2:$E$59,2,FALSE)),\" \",VLOOKUP(L261,Proposito_programa!$C$2:$E$59,2,FALSE))","v":"Sistema Distrital de Cuidado"},{"$f":"IF(ISERROR(VLOOKUP(L261,Proposito_programa!$C$2:$E$59,3,FALSE)),\" \",VLOOKUP(L261,Proposito_programa!$C$2:$E$59,3,FALSE))","v":"Propósito 1: Hacer un nuevo contrato social para incrementar la inclusión social, productiva y política"},1628,1,860011153,"POSITIVA COMPAÑIA DE SEGUROS SA","Persona Jurídica",null,null,null,63300,null,null,null,63300,63300,44540,44540,44540,null,null,null,null,null,null,null,null,null,null,null,1]
[null,null,2021,null,null,"Otros gastos","Otros gastos","Otros gastos","CAUSAR Y ODENAR EL PAGO POR CONCEPTO DE COTIZACIÓN AL SISTEMA DE RIESGOSCONTRATISTAS VINCULADOS CON EL FONDO DE DESARRO LLO LOCAL DE LA CANDELARIA PERSONAL CONTRATISTA PRESTADOR DE SERVICIOS CUYAS ACTIVIDADES ESTAN CLASIFICADAS EN EL NIVEL DE RIESGO IV Y V DE CONFORMIDAD CON LA PARTE CONSIDERATIVA DEL PRESENTE ACTO .(RESOLUCION 028 DE 2021).","Inversión","Un Nuevo Contrato Social y Ambiental para la Bogotá del Siglo XXI",6,{"$f":"IF(ISERROR(VLOOKUP(L262,Proposito_programa!$C$2:$E$59,2,FALSE)),\" \",VLOOKUP(L262,Proposito_programa!$C$2:$E$59,2,FALSE))","v":"Sistema Distrital de Cuidado"},{"$f":"IF(ISERROR(VLOOKUP(L262,Proposito_programa!$C$2:$E$59,3,FALSE)),\" \",VLOOKUP(L262,Proposito_programa!$C$2:$E$59,3,FALSE))","v":"Propósito 1: Hacer un nuevo contrato social para incrementar la inclusión social, productiva y política"},1628,1,860011153,"POSITIVA COMPAÑIA DE SEGUROS SA","Persona Jurídica",null,null,null,63300,null,null,null,63300,63300,44561,44561,44561,null,null,null,null,null,null,null,null,null,null,null,1]
[null,null,2021,null,null,"Otros gastos","Otros gastos","Otros gastos","CAUSAR Y ODENAR EL PAGO POR CONCEPTO DE COTIZACIÓN AL SISTEMA DE RIESGOSCONTRATISTAS VINCULADOS CON EL FONDO DE DESARRO LLO LOCAL DE LA CANDELARIA PERSONAL CONTRATISTA PRESTADOR DE SERVICIOS CUYAS ACTIVIDADES ESTAN CLASIFICADAS EN EL NIVEL DE RIESGO IV Y V DE CONFORMIDAD CON LA PARTE CONSIDERATIVA DEL PRESENTE ACTO .(RESOLUCION 028 DE 2021).","Inversión","Un Nuevo Contrato Social y Ambiental para la Bogotá del Siglo XXI",34,{"$f":"IF(ISERROR(VLOOKUP(L263,Proposito_programa!$C$2:$E$59,2,FALSE)),\" \",VLOOKUP(L263,Proposito_programa!$C$2:$E$59,2,FALSE))","v":"Bogotá protectora de los animales"},{"$f":"IF(ISERROR(VLOOKUP(L263,Proposito_programa!$C$2:$E$59,3,FALSE)),\" \",VLOOKUP(L263,Proposito_programa!$C$2:$E$59,3,FALSE))","v":"Propósito 2 : Cambiar Nuestros Hábitos de Vida para Reverdecer a Bogotá y Adaptarnos y Mitigar la Crisis Climática"},1704,1,860011153,"POSITIVA COMPAÑIA DE SEGUROS SA","Persona Jurídica",null,null,null,361100,null,null,null,361100,361100,44348,44348,44348,null,null,null,null,null,null,null,null,null,null,null,1]
[null,null,2021,null,null,"Otros gastos","Otros gastos","Otros gastos","CAUSAR Y ODENAR EL PAGO POR CONCEPTO DE COTIZACIÓN AL SISTEMA DE RIESGOSCONTRATISTAS VINCULADOS CON EL FONDO DE DESARRO LLO LOCAL DE LA CANDELARIA PERSONAL CONTRATISTA PRESTADOR DE SERVICIOS CUYAS ACTIVIDADES ESTAN CLASIFICADAS EN EL NIVEL DE RIESGO IV Y V DE CONFORMIDAD CON LA PARTE CONSIDERATIVA DEL PRESENTE ACTO .(RESOLUCION 028 DE 2021).","Inversión","Un Nuevo Contrato Social y Ambiental para la Bogotá del Siglo XXI",34,{"$f":"IF(ISERROR(VLOOKUP(L264,Proposito_programa!$C$2:$E$59,2,FALSE)),\" \",VLOOKUP(L264,Proposito_programa!$C$2:$E$59,2,FALSE))","v":"Bogotá protectora de los animales"},{"$f":"IF(ISERROR(VLOOKUP(L264,Proposito_programa!$C$2:$E$59,3,FALSE)),\" \",VLOOKUP(L264,Proposito_programa!$C$2:$E$59,3,FALSE))","v":"Propósito 2 : Cambiar Nuestros Hábitos de Vida para Reverdecer a Bogotá y Adaptarnos y Mitigar la Crisis Climática"},1704,1,860011153,"POSITIVA COMPAÑIA DE SEGUROS SA","Persona Jurídica",null,null,null,142500,null,null,null,142500,142500,44377,44377,44377,null,null,null,null,null,null,null,null,null,null,null,1]
[null,null,2021,null,null,"Otros gastos","Otros gastos","Otros gastos","CAUSAR Y ODENAR EL PAGO POR CONCEPTO DE COTIZACIÓN AL SISTEMA DE RIESGOSCONTRATISTAS VINCULADOS CON EL FONDO DE DESARRO LLO LOCAL DE LA CANDELARIA PERSONAL CONTRATISTA PRESTADOR DE SERVICIOS CUYAS ACTIVIDADES ESTAN CLASIFICADAS EN EL NIVEL DE RIESGO IV Y V DE CONFORMIDAD CON LA PARTE CONSIDERATIVA DEL PRESENTE ACTO .(RESOLUCION 028 DE 2021).","Inversión","Un Nuevo Contrato Social y Ambiental para la Bogotá del Siglo XXI",34,{"$f":"IF(ISERROR(VLOOKUP(L265,Proposito_programa!$C$2:$E$59,2,FALSE)),\" \",VLOOKUP(L265,Proposito_programa!$C$2:$E$59,2,FALSE))","v":"Bogotá protectora de los animales"},{"$f":"IF(ISERROR(VLOOKUP(L265,Proposito_programa!$C$2:$E$59,3,FALSE)),\" \",VLOOKUP(L265,Proposito_programa!$C$2:$E$59,3,FALSE))","v":"Propósito 2 : Cambiar Nuestros Hábitos de Vida para Reverdecer a Bogotá y Adaptarnos y Mitigar la Crisis Climática"},1704,1,860011153,"POSITIVA COMPAÑIA DE SEGUROS SA","Persona Jurídica",null,null,null,142500,null,null,null,142500,142500,44411,44411,44411,null,null,null,null,null,null,null,null,null,null,null,1]
[null,null,2021,null,null,"Otros gastos","Otros gastos","Otros gastos","CAUSAR Y ODENAR EL PAGO POR CONCEPTO DE COTIZACIÓN AL SISTEMA DE RIESGOSCONTRATISTAS VINCULADOS CON EL FONDO DE DESARRO LLO LOCAL DE LA CANDELARIA PERSONAL CONTRATISTA PRESTADOR DE SERVICIOS CUYAS ACTIVIDADES ESTAN CLASIFICADAS EN EL NIVEL DE RIESGO IV Y V DE CONFORMIDAD CON LA PARTE CONSIDERATIVA DEL PRESENTE ACTO .(RESOLUCION 028 DE 2021).","Inversión","Un Nuevo Contrato Social y Ambiental para la Bogotá del Siglo XXI",34,{"$f":"IF(ISERROR(VLOOKUP(L266,Proposito_programa!$C$2:$E$59,2,FALSE)),\" \",VLOOKUP(L266,Proposito_programa!$C$2:$E$59,2,FALSE))","v":"Bogotá protectora de los animales"},{"$f":"IF(ISERROR(VLOOKUP(L266,Proposito_programa!$C$2:$E$59,3,FALSE)),\" \",VLOOKUP(L266,Proposito_programa!$C$2:$E$59,3,FALSE))","v":"Propósito 2 : Cambiar Nuestros Hábitos de Vida para Reverdecer a Bogotá y Adaptarnos y Mitigar la Crisis Climática"},1704,1,860011153,"POSITIVA COMPAÑIA DE SEGUROS SA","Persona Jurídica",null,null,null,142500,null,null,null,142500,142500,44446,44446,44446,null,null,null,null,null,null,null,null,null,null,null,1]
[null,null,2021,null,null,"Otros gastos","Otros gastos","Otros gastos","CAUSAR Y ODENAR EL PAGO POR CONCEPTO DE COTIZACIÓN AL SISTEMA DE RIESGOSCONTRATISTAS VINCULADOS CON EL FONDO DE DESARRO LLO LOCAL DE LA CANDELARIA PERSONAL CONTRATISTA PRESTADOR DE SERVICIOS CUYAS ACTIVIDADES ESTAN CLASIFICADAS EN EL NIVEL DE RIESGO IV Y V DE CONFORMIDAD CON LA PARTE CONSIDERATIVA DEL PRESENTE ACTO .(RESOLUCION 028 DE 2021).","Inversión","Un Nuevo Contrato Social y Ambiental para la Bogotá del Siglo XXI",34,{"$f":"IF(ISERROR(VLOOKUP(L267,Proposito_programa!$C$2:$E$59,2,FALSE)),\" \",VLOOKUP(L267,Proposito_programa!$C$2:$E$59,2,FALSE))","v":"Bogotá protectora de los animales"},{"$f":"IF(ISERROR(VLOOKUP(L267,Proposito_programa!$C$2:$E$59,3,FALSE)),\" \",VLOOKUP(L267,Proposito_programa!$C$2:$E$59,3,FALSE))","v":"Propósito 2 : Cambiar Nuestros Hábitos de Vida para Reverdecer a Bogotá y Adaptarnos y Mitigar la Crisis Climática"},1704,1,860011153,"POSITIVA COMPAÑIA DE SEGUROS SA","Persona Jurídica",null,null,null,142500,null,null,null,142500,142500,44470,44470,44470,null,null,null,null,null,null,null,null,null,null,null,1]
[null,null,2021,null,null,"Otros gastos","Otros gastos","Otros gastos","CAUSAR Y ODENAR EL PAGO POR CONCEPTO DE COTIZACIÓN AL SISTEMA DE RIESGOSCONTRATISTAS VINCULADOS CON EL FONDO DE DESARRO LLO LOCAL DE LA CANDELARIA PERSONAL CONTRATISTA PRESTADOR DE SERVICIOS CUYAS ACTIVIDADES ESTAN CLASIFICADAS EN EL NIVEL DE RIESGO IV Y V DE CONFORMIDAD CON LA PARTE CONSIDERATIVA DEL PRESENTE ACTO .(RESOLUCION 028 DE 2021).","Inversión","Un Nuevo Contrato Social y Ambiental para la Bogotá del Siglo XXI",34,{"$f":"IF(ISERROR(VLOOKUP(L268,Proposito_programa!$C$2:$E$59,2,FALSE)),\" \",VLOOKUP(L268,Proposito_programa!$C$2:$E$59,2,FALSE))","v":"Bogotá protectora de los animales"},{"$f":"IF(ISERROR(VLOOKUP(L268,Proposito_programa!$C$2:$E$59,3,FALSE)),\" \",VLOOKUP(L268,Proposito_programa!$C$2:$E$59,3,FALSE))","v":"Propósito 2 : Cambiar Nuestros Hábitos de Vida para Reverdecer a Bogotá y Adaptarnos y Mitigar la Crisis Climática"},1704,1,860011153,"POSITIVA COMPAÑIA DE SEGUROS SA","Persona Jurídica",null,null,null,142500,null,null,null,142500,142500,44509,44509,44509,null,null,null,null,null,null,null,null,null,null,null,1]
[null,null,2021,null,null,"Otros gastos","Otros gastos","Otros gastos","CAUSAR Y ODENAR EL PAGO POR CONCEPTO DE COTIZACIÓN AL SISTEMA DE RIESGOSCONTRATISTAS VINCULADOS CON EL FONDO DE DESARRO LLO LOCAL DE LA CANDELARIA PERSONAL CONTRATISTA PRESTADOR DE SERVICIOS CUYAS ACTIVIDADES ESTAN CLASIFICADAS EN EL NIVEL DE RIESGO IV Y V DE CONFORMIDAD CON LA PARTE CONSIDERATIVA DEL PRESENTE ACTO .(RESOLUCION 028 DE 2021).","Inversión","Un Nuevo Contrato Social y Ambiental para la Bogotá del Siglo XXI",34,{"$f":"IF(ISERROR(VLOOKUP(L269,Proposito_programa!$C$2:$E$59,2,FALSE)),\" \",VLOOKUP(L269,Proposito_programa!$C$2:$E$59,2,FALSE))","v":"Bogotá protectora de los animales"},{"$f":"IF(ISERROR(VLOOKUP(L269,Proposito_programa!$C$2:$E$59,3,FALSE)),\" \",VLOOKUP(L269,Proposito_programa!$C$2:$E$59,3,FALSE))","v":"Propósito 2 : Cambiar Nuestros Hábitos de Vida para Reverdecer a Bogotá y Adaptarnos y Mitigar la Crisis Climática"},1704,1,860011153,"POSITIVA COMPAÑIA DE SEGUROS SA","Persona Jurídica",null,null,null,142500,null,null,null,142500,142500,44540,44540,44540,null,null,null,null,null,null,null,null,null,null,null,1]
[null,null,2021,null,null,"Otros gastos","Otros gastos","Otros gastos","CAUSAR Y ODENAR EL PAGO POR CONCEPTO DE COTIZACIÓN AL SISTEMA DE RIESGOSCONTRATISTAS VINCULADOS CON EL FONDO DE DESARRO LLO LOCAL DE LA CANDELARIA PERSONAL CONTRATISTA PRESTADOR DE SERVICIOS CUYAS ACTIVIDADES ESTAN CLASIFICADAS EN EL NIVEL DE RIESGO IV Y V DE CONFORMIDAD CON LA PARTE CONSIDERATIVA DEL PRESENTE ACTO .(RESOLUCION 028 DE 2021).","Inversión","Un Nuevo Contrato Social y Ambiental para la Bogotá del Siglo XXI",34,{"$f":"IF(ISERROR(VLOOKUP(L270,Proposito_programa!$C$2:$E$59,2,FALSE)),\" \",VLOOKUP(L270,Proposito_programa!$C$2:$E$59,2,FALSE))","v":"Bogotá protectora de los animales"},{"$f":"IF(ISERROR(VLOOKUP(L270,Proposito_programa!$C$2:$E$59,3,FALSE)),\" \",VLOOKUP(L270,Proposito_programa!$C$2:$E$59,3,FALSE))","v":"Propósito 2 : Cambiar Nuestros Hábitos de Vida para Reverdecer a Bogotá y Adaptarnos y Mitigar la Crisis Climática"},1704,1,860011153,"POSITIVA COMPAÑIA DE SEGUROS SA","Persona Jurídica",null,null,null,80389,null,null,null,80389,80389,44561,44561,44561,null,null,null,null,null,null,null,null,null,null,null,1]
[null,null,2021,null,null,"Otros gastos","Otros gastos","Otros gastos","CAUSAR Y ODENAR EL PAGO POR CONCEPTO DE COTIZACIÓN AL SISTEMA DE RIESGOSCONTRATISTAS VINCULADOS CON EL FONDO DE DESARRO LLO LOCAL DE LA CANDELARIA PERSONAL CONTRATISTA PRESTADOR DE SERVICIOS CUYAS ACTIVIDADES ESTAN CLASIFICADAS EN EL NIVEL DE RIESGO IV Y V DE CONFORMIDAD CON LA PARTE CONSIDERATIVA DEL PRESENTE ACTO .(RESOLUCION 028 DE 2021).","Inversión","Un Nuevo Contrato Social y Ambiental para la Bogotá del Siglo XXI",43,{"$f":"IF(ISERROR(VLOOKUP(L271,Proposito_programa!$C$2:$E$59,2,FALSE)),\" \",VLOOKUP(L271,Proposito_programa!$C$2:$E$59,2,FALSE))","v":"Cultura ciudadana para la confianza, la convivencia y la participación desde la vida cotidiana"},{"$f":"IF(ISERROR(VLOOKUP(L271,Proposito_programa!$C$2:$E$59,3,FALSE)),\" \",VLOOKUP(L271,Proposito_programa!$C$2:$E$59,3,FALSE))","v":"Propósito 3: Inspirar confianza y legitimidad para vivir sin miedo y ser epicentro de cultura ciudadana, paz y reconciliación"},1785,1,860011153,"POSITIVA COMPAÑIA DE SEGUROS SA","Persona Jurídica",null,null,null,2177100,null,null,null,2177100,2177100,44348,44348,44348,null,null,null,null,null,null,null,null,null,null,null,1]
[null,null,2021,null,null,"Otros gastos","Otros gastos","Otros gastos","CAUSAR Y ODENAR EL PAGO POR CONCEPTO DE COTIZACIÓN AL SISTEMA DE RIESGOSCONTRATISTAS VINCULADOS CON EL FONDO DE DESARRO LLO LOCAL DE LA CANDELARIA PERSONAL CONTRATISTA PRESTADOR DE SERVICIOS CUYAS ACTIVIDADES ESTAN CLASIFICADAS EN EL NIVEL DE RIESGO IV Y V DE CONFORMIDAD CON LA PARTE CONSIDERATIVA DEL PRESENTE ACTO .(RESOLUCION 028 DE 2021).","Inversión","Un Nuevo Contrato Social y Ambiental para la Bogotá del Siglo XXI",43,{"$f":"IF(ISERROR(VLOOKUP(L272,Proposito_programa!$C$2:$E$59,2,FALSE)),\" \",VLOOKUP(L272,Proposito_programa!$C$2:$E$59,2,FALSE))","v":"Cultura ciudadana para la confianza, la convivencia y la participación desde la vida cotidiana"},{"$f":"IF(ISERROR(VLOOKUP(L272,Proposito_programa!$C$2:$E$59,3,FALSE)),\" \",VLOOKUP(L272,Proposito_programa!$C$2:$E$59,3,FALSE))","v":"Propósito 3: Inspirar confianza y legitimidad para vivir sin miedo y ser epicentro de cultura ciudadana, paz y reconciliación"},1785,1,860011153,"POSITIVA COMPAÑIA DE SEGUROS SA","Persona Jurídica",null,null,null,671300,null,null,null,671300,671300,44377,44377,44377,null,null,null,null,null,null,null,null,null,null,null,1]
[null,null,2021,null,null,"Otros gastos","Otros gastos","Otros gastos","CAUSAR Y ODENAR EL PAGO POR CONCEPTO DE COTIZACIÓN AL SISTEMA DE RIESGOSCONTRATISTAS VINCULADOS CON EL FONDO DE DESARRO LLO LOCAL DE LA CANDELARIA PERSONAL CONTRATISTA PRESTADOR DE SERVICIOS CUYAS ACTIVIDADES ESTAN CLASIFICADAS EN EL NIVEL DE RIESGO IV Y V DE CONFORMIDAD CON LA PARTE CONSIDERATIVA DEL PRESENTE ACTO .(RESOLUCION 028 DE 2021).","Inversión","Un Nuevo Contrato Social y Ambiental para la Bogotá del Siglo XXI",43,{"$f":"IF(ISERROR(VLOOKUP(L273,Proposito_programa!$C$2:$E$59,2,FALSE)),\" \",VLOOKUP(L273,Proposito_programa!$C$2:$E$59,2,FALSE))","v":"Cultura ciudadana para la confianza, la convivencia y la participación desde la vida cotidiana"},{"$f":"IF(ISERROR(VLOOKUP(L273,Proposito_programa!$C$2:$E$59,3,FALSE)),\" \",VLOOKUP(L273,Proposito_programa!$C$2:$E$59,3,FALSE))","v":"Propósito 3: Inspirar confianza y legitimidad para vivir sin miedo y ser epicentro de cultura ciudadana, paz y reconciliación"},1785,1,860011153,"POSITIVA COMPAÑIA DE SEGUROS SA","Persona Jurídica",null,null,null,671300,null,null,null,671300,671300,44411,44411,44411,null,null,null,null,null,null,null,null,null,null,null,1]
[null,null,2021,null,null,"Otros gastos","Otros gastos","Otros gastos","CAUSAR Y ODENAR EL PAGO POR CONCEPTO DE COTIZACIÓN AL SISTEMA DE RIESGOSCONTRATISTAS VINCULADOS CON EL FONDO DE DESARRO LLO LOCAL DE LA CANDELARIA PERSONAL CONTRATISTA PRESTADOR DE SERVICIOS CUYAS ACTIVIDADES ESTAN CLASIFICADAS EN EL NIVEL DE RIESGO IV Y V DE CONFORMIDAD CON LA PARTE CONSIDERATIVA DEL PRESENTE ACTO .(RESOLUCION 028 DE 2021).","Inversión","Un Nuevo Contrato Social y Ambiental para la Bogotá del Siglo XXI",43,{"$f":"IF(ISERROR(VLOOKUP(L274,Proposito_programa!$C$2:$E$59,2,FALSE)),\" \",VLOOKUP(L274,Proposito_programa!$C$2:$E$59,2,FALSE))","v":"Cultura ciudadana para la confianza, la convivencia y la participación desde la vida cotidiana"},{"$f":"IF(ISERROR(VLOOKUP(L274,Proposito_programa!$C$2:$E$59,3,FALSE)),\" \",VLOOKUP(L274,Proposito_programa!$C$2:$E$59,3,FALSE))","v":"Propósito 3: Inspirar confianza y legitimidad para vivir sin miedo y ser epicentro de cultura ciudadana, paz y reconciliación"},1785,1,860011153,"POSITIVA COMPAÑIA DE SEGUROS SA","Persona Jurídica",null,null,null,685200,null,null,null,685200,685200,44446,44446,44446,null,null,null,null,null,null,null,null,null,null,null,1]
[null,null,2021,null,null,"Otros gastos","Otros gastos","Otros gastos","CAUSAR Y ODENAR EL PAGO POR CONCEPTO DE COTIZACIÓN AL SISTEMA DE RIESGOSCONTRATISTAS VINCULADOS CON EL FONDO DE DESARRO LLO LOCAL DE LA CANDELARIA PERSONAL CONTRATISTA PRESTADOR DE SERVICIOS CUYAS ACTIVIDADES ESTAN CLASIFICADAS EN EL NIVEL DE RIESGO IV Y V DE CONFORMIDAD CON LA PARTE CONSIDERATIVA DEL PRESENTE ACTO .(RESOLUCION 028 DE 2021).","Inversión","Un Nuevo Contrato Social y Ambiental para la Bogotá del Siglo XXI",43,{"$f":"IF(ISERROR(VLOOKUP(L275,Proposito_programa!$C$2:$E$59,2,FALSE)),\" \",VLOOKUP(L275,Proposito_programa!$C$2:$E$59,2,FALSE))","v":"Cultura ciudadana para la confianza, la convivencia y la participación desde la vida cotidiana"},{"$f":"IF(ISERROR(VLOOKUP(L275,Proposito_programa!$C$2:$E$59,3,FALSE)),\" \",VLOOKUP(L275,Proposito_programa!$C$2:$E$59,3,FALSE))","v":"Propósito 3: Inspirar confianza y legitimidad para vivir sin miedo y ser epicentro de cultura ciudadana, paz y reconciliación"},1785,1,860011153,"POSITIVA COMPAÑIA DE SEGUROS SA","Persona Jurídica",null,null,null,671300,null,null,null,671300,671300,44470,44470,44470,null,null,null,null,null,null,null,null,null,null,null,1]
[null,null,2021,null,null,"Otros gastos","Otros gastos","Otros gastos","CAUSAR Y ODENAR EL PAGO POR CONCEPTO DE COTIZACIÓN AL SISTEMA DE RIESGOSCONTRATISTAS VINCULADOS CON EL FONDO DE DESARRO LLO LOCAL DE LA CANDELARIA PERSONAL CONTRATISTA PRESTADOR DE SERVICIOS CUYAS ACTIVIDADES ESTAN CLASIFICADAS EN EL NIVEL DE RIESGO IV Y V DE CONFORMIDAD CON LA PARTE CONSIDERATIVA DEL PRESENTE ACTO .(RESOLUCION 028 DE 2021).","Inversión","Un Nuevo Contrato Social y Ambiental para la Bogotá del Siglo XXI",43,{"$f":"IF(ISERROR(VLOOKUP(L276,Proposito_programa!$C$2:$E$59,2,FALSE)),\" \",VLOOKUP(L276,Proposito_programa!$C$2:$E$59,2,FALSE))","v":"Cultura ciudadana para la confianza, la convivencia y la participación desde la vida cotidiana"},{"$f":"IF(ISERROR(VLOOKUP(L276,Proposito_programa!$C$2:$E$59,3,FALSE)),\" \",VLOOKUP(L276,Proposito_programa!$C$2:$E$59,3,FALSE))","v":"Propósito 3: Inspirar confianza y legitimidad para vivir sin miedo y ser epicentro de cultura ciudadana, paz y reconciliación"},1785,1,860011153,"POSITIVA COMPAÑIA DE SEGUROS SA","Persona Jurídica",null,null,null,671300,null,null,null,671300,671300,44509,44509,44509,null,null,null,null,null,null,null,null,null,null,null,1]
[null,null,2021,null,null,"Otros gastos","Otros gastos","Otros gastos","CAUSAR Y ODENAR EL PAGO POR CONCEPTO DE COTIZACIÓN AL SISTEMA DE RIESGOSCONTRATISTAS VINCULADOS CON EL FONDO DE DESARRO LLO LOCAL DE LA CANDELARIA PERSONAL CONTRATISTA PRESTADOR DE SERVICIOS CUYAS ACTIVIDADES ESTAN CLASIFICADAS EN EL NIVEL DE RIESGO IV Y V DE CONFORMIDAD CON LA PARTE CONSIDERATIVA DEL PRESENTE ACTO .(RESOLUCION 028 DE 2021).","Inversión","Un Nuevo Contrato Social y Ambiental para la Bogotá del Siglo XXI",43,{"$f":"IF(ISERROR(VLOOKUP(L277,Proposito_programa!$C$2:$E$59,2,FALSE)),\" \",VLOOKUP(L277,Proposito_programa!$C$2:$E$59,2,FALSE))","v":"Cultura ciudadana para la confianza, la convivencia y la participación desde la vida cotidiana"},{"$f":"IF(ISERROR(VLOOKUP(L277,Proposito_programa!$C$2:$E$59,3,FALSE)),\" \",VLOOKUP(L277,Proposito_programa!$C$2:$E$59,3,FALSE))","v":"Propósito 3: Inspirar confianza y legitimidad para vivir sin miedo y ser epicentro de cultura ciudadana, paz y reconciliación"},1785,1,860011153,"POSITIVA COMPAÑIA DE SEGUROS SA","Persona Jurídica",null,null,null,671300,null,null,null,671300,671300,44540,44540,44540,null,null,null,null,null,null,null,null,null,null,null,1]
[null,null,2021,null,null,"Otros gastos","Otros gastos","Otros gastos","CAUSAR Y ODENAR EL PAGO POR CONCEPTO DE COTIZACIÓN AL SISTEMA DE RIESGOSCONTRATISTAS VINCULADOS CON EL FONDO DE DESARRO LLO LOCAL DE LA CANDELARIA PERSONAL CONTRATISTA PRESTADOR DE SERVICIOS CUYAS ACTIVIDADES ESTAN CLASIFICADAS EN EL NIVEL DE RIESGO IV Y V DE CONFORMIDAD CON LA PARTE CONSIDERATIVA DEL PRESENTE ACTO .(RESOLUCION 028 DE 2021).","Inversión","Un Nuevo Contrato Social y Ambiental para la Bogotá del Siglo XXI",43,{"$f":"IF(ISERROR(VLOOKUP(L278,Proposito_programa!$C$2:$E$59,2,FALSE)),\" \",VLOOKUP(L278,Proposito_programa!$C$2:$E$59,2,FALSE))","v":"Cultura ciudadana para la confianza, la convivencia y la participación desde la vida cotidiana"},{"$f":"IF(ISERROR(VLOOKUP(L278,Proposito_programa!$C$2:$E$59,3,FALSE)),\" \",VLOOKUP(L278,Proposito_programa!$C$2:$E$59,3,FALSE))","v":"Propósito 3: Inspirar confianza y legitimidad para vivir sin miedo y ser epicentro de cultura ciudadana, paz y reconciliación"},1785,1,860011153,"POSITIVA COMPAÑIA DE SEGUROS SA","Persona Jurídica",null,null,null,671300,null,null,null,671300,671300,44561,44561,44561,null,null,null,null,null,null,null,null,null,null,null,1]
[null,null,2021,null,null,"Otros gastos","Otros gastos","Otros gastos","CAUSAR Y ODENAR EL PAGO POR CONCEPTO DE COTIZACIÓN AL SISTEMA DE RIESGOSCONTRATISTAS VINCULADOS CON EL FONDO DE DESARRO LLO LOCAL DE LA CANDELARIA PERSONAL CONTRATISTA PRESTADOR DE SERVICIOS CUYAS ACTIVIDADES ESTAN CLASIFICADAS EN EL NIVEL DE RIESGO IV Y V DE CONFORMIDAD CON LA PARTE CONSIDERATIVA DEL PRESENTE ACTO .(RESOLUCION 028 DE 2021).","Inversión","Un Nuevo Contrato Social y Ambiental para la Bogotá del Siglo XXI",45,{"$f":"IF(ISERROR(VLOOKUP(L279,Proposito_programa!$C$2:$E$59,2,FALSE)),\" \",VLOOKUP(L279,Proposito_programa!$C$2:$E$59,2,FALSE))","v":"Espacio público más seguro y construido colectivamente"},{"$f":"IF(ISERROR(VLOOKUP(L279,Proposito_programa!$C$2:$E$59,3,FALSE)),\" \",VLOOKUP(L279,Proposito_programa!$C$2:$E$59,3,FALSE))","v":"Propósito 3: Inspirar confianza y legitimidad para vivir sin miedo y ser epicentro de cultura ciudadana, paz y reconciliación"},1786,1,860011153,"POSITIVA COMPAÑIA DE SEGUROS SA","Persona Jurídica",null,null,null,557300,null,null,null,557300,557300,44348,44348,44348,null,null,null,null,null,null,null,null,null,null,null,1]
[null,null,2021,null,null,"Otros gastos","Otros gastos","Otros gastos","CAUSAR Y ODENAR EL PAGO POR CONCEPTO DE COTIZACIÓN AL SISTEMA DE RIESGOSCONTRATISTAS VINCULADOS CON EL FONDO DE DESARRO LLO LOCAL DE LA CANDELARIA PERSONAL CONTRATISTA PRESTADOR DE SERVICIOS CUYAS ACTIVIDADES ESTAN CLASIFICADAS EN EL NIVEL DE RIESGO IV Y V DE CONFORMIDAD CON LA PARTE CONSIDERATIVA DEL PRESENTE ACTO .(RESOLUCION 028 DE 2021).","Inversión","Un Nuevo Contrato Social y Ambiental para la Bogotá del Siglo XXI",45,{"$f":"IF(ISERROR(VLOOKUP(L280,Proposito_programa!$C$2:$E$59,2,FALSE)),\" \",VLOOKUP(L280,Proposito_programa!$C$2:$E$59,2,FALSE))","v":"Espacio público más seguro y construido colectivamente"},{"$f":"IF(ISERROR(VLOOKUP(L280,Proposito_programa!$C$2:$E$59,3,FALSE)),\" \",VLOOKUP(L280,Proposito_programa!$C$2:$E$59,3,FALSE))","v":"Propósito 3: Inspirar confianza y legitimidad para vivir sin miedo y ser epicentro de cultura ciudadana, paz y reconciliación"},1786,1,860011153,"POSITIVA COMPAÑIA DE SEGUROS SA","Persona Jurídica",null,null,null,260900,null,null,null,260900,260900,44377,44377,44377,null,null,null,null,null,null,null,null,null,null,null,1]
[null,null,2021,null,null,"Otros gastos","Otros gastos","Otros gastos","CAUSAR Y ODENAR EL PAGO POR CONCEPTO DE COTIZACIÓN AL SISTEMA DE RIESGOSCONTRATISTAS VINCULADOS CON EL FONDO DE DESARRO LLO LOCAL DE LA CANDELARIA PERSONAL CONTRATISTA PRESTADOR DE SERVICIOS CUYAS ACTIVIDADES ESTAN CLASIFICADAS EN EL NIVEL DE RIESGO IV Y V DE CONFORMIDAD CON LA PARTE CONSIDERATIVA DEL PRESENTE ACTO .(RESOLUCION 028 DE 2021).","Inversión","Un Nuevo Contrato Social y Ambiental para la Bogotá del Siglo XXI",45,{"$f":"IF(ISERROR(VLOOKUP(L281,Proposito_programa!$C$2:$E$59,2,FALSE)),\" \",VLOOKUP(L281,Proposito_programa!$C$2:$E$59,2,FALSE))","v":"Espacio público más seguro y construido colectivamente"},{"$f":"IF(ISERROR(VLOOKUP(L281,Proposito_programa!$C$2:$E$59,3,FALSE)),\" \",VLOOKUP(L281,Proposito_programa!$C$2:$E$59,3,FALSE))","v":"Propósito 3: Inspirar confianza y legitimidad para vivir sin miedo y ser epicentro de cultura ciudadana, paz y reconciliación"},1786,1,860011153,"POSITIVA COMPAÑIA DE SEGUROS SA","Persona Jurídica",null,null,null,260900,null,null,null,260900,260900,44411,44411,44411,null,null,null,null,null,null,null,null,null,null,null,1]
[null,null,2021,null,null,"Otros gastos","Otros gastos","Otros gastos","CAUSAR Y ODENAR EL PAGO POR CONCEPTO DE COTIZACIÓN AL SISTEMA DE RIESGOSCONTRATISTAS VINCULADOS CON EL FONDO DE DESARRO LLO LOCAL DE LA CANDELARIA PERSONAL CONTRATISTA PRESTADOR DE SERVICIOS CUYAS ACTIVIDADES ESTAN CLASIFICADAS EN EL NIVEL DE RIESGO IV Y V DE CONFORMIDAD CON LA PARTE CONSIDERATIVA DEL PRESENTE ACTO .(RESOLUCION 028 DE 2021).","Inversión","Un Nuevo Contrato Social y Ambiental para la Bogotá del Siglo XXI",45,{"$f":"IF(ISERROR(VLOOKUP(L282,Proposito_programa!$C$2:$E$59,2,FALSE)),\" \",VLOOKUP(L282,Proposito_programa!$C$2:$E$59,2,FALSE))","v":"Espacio público más seguro y construido colectivamente"},{"$f":"IF(ISERROR(VLOOKUP(L282,Proposito_programa!$C$2:$E$59,3,FALSE)),\" \",VLOOKUP(L282,Proposito_programa!$C$2:$E$59,3,FALSE))","v":"Propósito 3: Inspirar confianza y legitimidad para vivir sin miedo y ser epicentro de cultura ciudadana, paz y reconciliación"},1786,1,860011153,"POSITIVA COMPAÑIA DE SEGUROS SA","Persona Jurídica",null,null,null,260900,null,null,null,260900,260900,44446,44446,44446,null,null,null,null,null,null,null,null,null,null,null,1]
[null,null,2021,null,null,"Otros gastos","Otros gastos","Otros gastos","CAUSAR Y ODENAR EL PAGO POR CONCEPTO DE COTIZACIÓN AL SISTEMA DE RIESGOSCONTRATISTAS VINCULADOS CON EL FONDO DE DESARRO LLO LOCAL DE LA CANDELARIA PERSONAL CONTRATISTA PRESTADOR DE SERVICIOS CUYAS ACTIVIDADES ESTAN CLASIFICADAS EN EL NIVEL DE RIESGO IV Y V DE CONFORMIDAD CON LA PARTE CONSIDERATIVA DEL PRESENTE ACTO .(RESOLUCION 028 DE 2021).","Inversión","Un Nuevo Contrato Social y Ambiental para la Bogotá del Siglo XXI",45,{"$f":"IF(ISERROR(VLOOKUP(L283,Proposito_programa!$C$2:$E$59,2,FALSE)),\" \",VLOOKUP(L283,Proposito_programa!$C$2:$E$59,2,FALSE))","v":"Espacio público más seguro y construido colectivamente"},{"$f":"IF(ISERROR(VLOOKUP(L283,Proposito_programa!$C$2:$E$59,3,FALSE)),\" \",VLOOKUP(L283,Proposito_programa!$C$2:$E$59,3,FALSE))","v":"Propósito 3: Inspirar confianza y legitimidad para vivir sin miedo y ser epicentro de cultura ciudadana, paz y reconciliación"},1786,1,860011153,"POSITIVA COMPAÑIA DE SEGUROS SA","Persona Jurídica",null,null,null,260900,null,null,null,260900,260900,44470,44470,44470,null,null,null,null,null,null,null,null,null,null,null,1]
[null,null,2021,null,null,"Otros gastos","Otros gastos","Otros gastos","CAUSAR Y ODENAR EL PAGO POR CONCEPTO DE COTIZACIÓN AL SISTEMA DE RIESGOSCONTRATISTAS VINCULADOS CON EL FONDO DE DESARRO LLO LOCAL DE LA CANDELARIA PERSONAL CONTRATISTA PRESTADOR DE SERVICIOS CUYAS ACTIVIDADES ESTAN CLASIFICADAS EN EL NIVEL DE RIESGO IV Y V DE CONFORMIDAD CON LA PARTE CONSIDERATIVA DEL PRESENTE ACTO .(RESOLUCION 028 DE 2021).","Inversión","Un Nuevo Contrato Social y Ambiental para la Bogotá del Siglo XXI",45,{"$f":"IF(ISERROR(VLOOKUP(L284,Proposito_programa!$C$2:$E$59,2,FALSE)),\" \",VLOOKUP(L284,Proposito_programa!$C$2:$E$59,2,FALSE))","v":"Espacio público más seguro y construido colectivamente"},{"$f":"IF(ISERROR(VLOOKUP(L284,Proposito_programa!$C$2:$E$59,3,FALSE)),\" \",VLOOKUP(L284,Proposito_programa!$C$2:$E$59,3,FALSE))","v":"Propósito 3: Inspirar confianza y legitimidad para vivir sin miedo y ser epicentro de cultura ciudadana, paz y reconciliación"},1786,1,860011153,"POSITIVA COMPAÑIA DE SEGUROS SA","Persona Jurídica",null,null,null,260900,null,null,null,260900,260900,44509,44509,44509,null,null,null,null,null,null,null,null,null,null,null,1]
[null,null,2021,null,null,"Otros gastos","Otros gastos","Otros gastos","CAUSAR Y ODENAR EL PAGO POR CONCEPTO DE COTIZACIÓN AL SISTEMA DE RIESGOSCONTRATISTAS VINCULADOS CON EL FONDO DE DESARRO LLO LOCAL DE LA CANDELARIA PERSONAL CONTRATISTA PRESTADOR DE SERVICIOS CUYAS ACTIVIDADES ESTAN CLASIFICADAS EN EL NIVEL DE RIESGO IV Y V DE CONFORMIDAD CON LA PARTE CONSIDERATIVA DEL PRESENTE ACTO .(RESOLUCION 028 DE 2021).","Inversión","Un Nuevo Contrato Social y Ambiental para la Bogotá del Siglo XXI",45,{"$f":"IF(ISERROR(VLOOKUP(L285,Proposito_programa!$C$2:$E$59,2,FALSE)),\" \",VLOOKUP(L285,Proposito_programa!$C$2:$E$59,2,FALSE))","v":"Espacio público más seguro y construido colectivamente"},{"$f":"IF(ISERROR(VLOOKUP(L285,Proposito_programa!$C$2:$E$59,3,FALSE)),\" \",VLOOKUP(L285,Proposito_programa!$C$2:$E$59,3,FALSE))","v":"Propósito 3: Inspirar confianza y legitimidad para vivir sin miedo y ser epicentro de cultura ciudadana, paz y reconciliación"},1786,1,860011153,"POSITIVA COMPAÑIA DE SEGUROS SA","Persona Jurídica",null,null,null,260900,null,null,null,260900,260900,44540,44540,44540,null,null,null,null,null,null,null,null,null,null,null,1]
[null,null,2021,null,null,"Otros gastos","Otros gastos","Otros gastos","CAUSAR Y ODENAR EL PAGO POR CONCEPTO DE COTIZACIÓN AL SISTEMA DE RIESGOSCONTRATISTAS VINCULADOS CON EL FONDO DE DESARRO LLO LOCAL DE LA CANDELARIA PERSONAL CONTRATISTA PRESTADOR DE SERVICIOS CUYAS ACTIVIDADES ESTAN CLASIFICADAS EN EL NIVEL DE RIESGO IV Y V DE CONFORMIDAD CON LA PARTE CONSIDERATIVA DEL PRESENTE ACTO .(RESOLUCION 028 DE 2021).","Inversión","Un Nuevo Contrato Social y Ambiental para la Bogotá del Siglo XXI",45,{"$f":"IF(ISERROR(VLOOKUP(L286,Proposito_programa!$C$2:$E$59,2,FALSE)),\" \",VLOOKUP(L286,Proposito_programa!$C$2:$E$59,2,FALSE))","v":"Espacio público más seguro y construido colectivamente"},{"$f":"IF(ISERROR(VLOOKUP(L286,Proposito_programa!$C$2:$E$59,3,FALSE)),\" \",VLOOKUP(L286,Proposito_programa!$C$2:$E$59,3,FALSE))","v":"Propósito 3: Inspirar confianza y legitimidad para vivir sin miedo y ser epicentro de cultura ciudadana, paz y reconciliación"},1786,1,860011153,"POSITIVA COMPAÑIA DE SEGUROS SA","Persona Jurídica",null,null,null,323011,null,null,null,323011,323011,44561,44561,44561,null,null,null,null,null,null,null,null,null,null,null,1]
[null,null,2021,null,null,"Otros gastos","Otros gastos","Otros gastos","CAUSAR Y ODENAR EL PAGO POR CONCEPTO DE COTIZACIÓN AL SISTEMA DE RIESGOSCONTRATISTAS VINCULADOS CON EL FONDO DE DESARRO LLO LOCAL DE LA CANDELARIA PERSONAL CONTRATISTA PRESTADOR DE SERVICIOS CUYAS ACTIVIDADES ESTAN CLASIFICADAS EN EL NIVEL DE RIESGO IV Y V DE CONFORMIDAD CON LA PARTE CONSIDERATIVA DEL PRESENTE ACTO .(RESOLUCION 028 DE 2021).","Inversión","Un Nuevo Contrato Social y Ambiental para la Bogotá del Siglo XXI",57,{"$f":"IF(ISERROR(VLOOKUP(L287,Proposito_programa!$C$2:$E$59,2,FALSE)),\" \",VLOOKUP(L287,Proposito_programa!$C$2:$E$59,2,FALSE))","v":"Gestión pública local"},{"$f":"IF(ISERROR(VLOOKUP(L287,Proposito_programa!$C$2:$E$59,3,FALSE)),\" \",VLOOKUP(L287,Proposito_programa!$C$2:$E$59,3,FALSE))","v":"Propósito 5: Construir Bogotá - Región con gobierno abierto, transparente y ciudadanía consciente"},2021,1,860011153,"POSITIVA COMPAÑIA DE SEGUROS SA","Persona Jurídica",null,null,null,782600,null,null,null,782600,782600,44348,44348,44348,null,null,null,null,null,null,null,null,null,null,null,1]
[null,null,2021,null,null,"Otros gastos","Otros gastos","Otros gastos","CAUSAR Y ODENAR EL PAGO POR CONCEPTO DE COTIZACIÓN AL SISTEMA DE RIESGOSCONTRATISTAS VINCULADOS CON EL FONDO DE DESARRO LLO LOCAL DE LA CANDELARIA PERSONAL CONTRATISTA PRESTADOR DE SERVICIOS CUYAS ACTIVIDADES ESTAN CLASIFICADAS EN EL NIVEL DE RIESGO IV Y V DE CONFORMIDAD CON LA PARTE CONSIDERATIVA DEL PRESENTE ACTO .(RESOLUCION 028 DE 2021).","Inversión","Un Nuevo Contrato Social y Ambiental para la Bogotá del Siglo XXI",57,{"$f":"IF(ISERROR(VLOOKUP(L288,Proposito_programa!$C$2:$E$59,2,FALSE)),\" \",VLOOKUP(L288,Proposito_programa!$C$2:$E$59,2,FALSE))","v":"Gestión pública local"},{"$f":"IF(ISERROR(VLOOKUP(L288,Proposito_programa!$C$2:$E$59,3,FALSE)),\" \",VLOOKUP(L288,Proposito_programa!$C$2:$E$59,3,FALSE))","v":"Propósito 5: Construir Bogotá - Región con gobierno abierto, transparente y ciudadanía consciente"},2021,1,860011153,"POSITIVA COMPAÑIA DE SEGUROS SA","Persona Jurídica",null,null,null,195800,null,null,null,195800,195800,44377,44377,44377,null,null,null,null,null,null,null,null,null,null,null,1]
[null,null,2021,null,null,"Otros gastos","Otros gastos","Otros gastos","CAUSAR Y ODENAR EL PAGO POR CONCEPTO DE COTIZACIÓN AL SISTEMA DE RIESGOSCONTRATISTAS VINCULADOS CON EL FONDO DE DESARRO LLO LOCAL DE LA CANDELARIA PERSONAL CONTRATISTA PRESTADOR DE SERVICIOS CUYAS ACTIVIDADES ESTAN CLASIFICADAS EN EL NIVEL DE RIESGO IV Y V DE CONFORMIDAD CON LA PARTE CONSIDERATIVA DEL PRESENTE ACTO .(RESOLUCION 028 DE 2021).","Inversión","Un Nuevo Contrato Social y Ambiental para la Bogotá del Siglo XXI",57,{"$f":"IF(ISERROR(VLOOKUP(L289,Proposito_programa!$C$2:$E$59,2,FALSE)),\" \",VLOOKUP(L289,Proposito_programa!$C$2:$E$59,2,FALSE))","v":"Gestión pública local"},{"$f":"IF(ISERROR(VLOOKUP(L289,Proposito_programa!$C$2:$E$59,3,FALSE)),\" \",VLOOKUP(L289,Proposito_programa!$C$2:$E$59,3,FALSE))","v":"Propósito 5: Construir Bogotá - Región con gobierno abierto, transparente y ciudadanía consciente"},2021,1,860011153,"POSITIVA COMPAÑIA DE SEGUROS SA","Persona Jurídica",null,null,null,195800,null,null,null,195800,195800,44411,44411,44411,null,null,null,null,null,null,null,null,null,null,null,1]
[null,null,2021,null,null,"Otros gastos","Otros gastos","Otros gastos","CAUSAR Y ODENAR EL PAGO POR CONCEPTO DE COTIZACIÓN AL SISTEMA DE RIESGOSCONTRATISTAS VINCULADOS CON EL FONDO DE DESARRO LLO LOCAL DE LA CANDELARIA PERSONAL CONTRATISTA PRESTADOR DE SERVICIOS CUYAS ACTIVIDADES ESTAN CLASIFICADAS EN EL NIVEL DE RIESGO IV Y V DE CONFORMIDAD CON LA PARTE CONSIDERATIVA DEL PRESENTE ACTO .(RESOLUCION 028 DE 2021).","Inversión","Un Nuevo Contrato Social y Ambiental para la Bogotá del Siglo XXI",57,{"$f":"IF(ISERROR(VLOOKUP(L290,Proposito_programa!$C$2:$E$59,2,FALSE)),\" \",VLOOKUP(L290,Proposito_programa!$C$2:$E$59,2,FALSE))","v":"Gestión pública local"},{"$f":"IF(ISERROR(VLOOKUP(L290,Proposito_programa!$C$2:$E$59,3,FALSE)),\" \",VLOOKUP(L290,Proposito_programa!$C$2:$E$59,3,FALSE))","v":"Propósito 5: Construir Bogotá - Región con gobierno abierto, transparente y ciudadanía consciente"},2021,1,860011153,"POSITIVA COMPAÑIA DE SEGUROS SA","Persona Jurídica",null,null,null,195800,null,null,null,195800,195800,44446,44446,44446,null,null,null,null,null,null,null,null,null,null,null,1]
[null,null,2021,null,null,"Otros gastos","Otros gastos","Otros gastos","CAUSAR Y ODENAR EL PAGO POR CONCEPTO DE COTIZACIÓN AL SISTEMA DE RIESGOSCONTRATISTAS VINCULADOS CON EL FONDO DE DESARRO LLO LOCAL DE LA CANDELARIA PERSONAL CONTRATISTA PRESTADOR DE SERVICIOS CUYAS ACTIVIDADES ESTAN CLASIFICADAS EN EL NIVEL DE RIESGO IV Y V DE CONFORMIDAD CON LA PARTE CONSIDERATIVA DEL PRESENTE ACTO .(RESOLUCION 028 DE 2021).","Inversión","Un Nuevo Contrato Social y Ambiental para la Bogotá del Siglo XXI",57,{"$f":"IF(ISERROR(VLOOKUP(L291,Proposito_programa!$C$2:$E$59,2,FALSE)),\" \",VLOOKUP(L291,Proposito_programa!$C$2:$E$59,2,FALSE))","v":"Gestión pública local"},{"$f":"IF(ISERROR(VLOOKUP(L291,Proposito_programa!$C$2:$E$59,3,FALSE)),\" \",VLOOKUP(L291,Proposito_programa!$C$2:$E$59,3,FALSE))","v":"Propósito 5: Construir Bogotá - Región con gobierno abierto, transparente y ciudadanía consciente"},2021,1,860011153,"POSITIVA COMPAÑIA DE SEGUROS SA","Persona Jurídica",null,null,null,195800,null,null,null,195800,195800,44470,44470,44470,null,null,null,null,null,null,null,null,null,null,null,1]
[null,null,2021,null,null,"Otros gastos","Otros gastos","Otros gastos","CAUSAR Y ODENAR EL PAGO POR CONCEPTO DE COTIZACIÓN AL SISTEMA DE RIESGOSCONTRATISTAS VINCULADOS CON EL FONDO DE DESARRO LLO LOCAL DE LA CANDELARIA PERSONAL CONTRATISTA PRESTADOR DE SERVICIOS CUYAS ACTIVIDADES ESTAN CLASIFICADAS EN EL NIVEL DE RIESGO IV Y V DE CONFORMIDAD CON LA PARTE CONSIDERATIVA DEL PRESENTE ACTO .(RESOLUCION 028 DE 2021).","Inversión","Un Nuevo Contrato Social y Ambiental para la Bogotá del Siglo XXI",57,{"$f":"IF(ISERROR(VLOOKUP(L292,Proposito_programa!$C$2:$E$59,2,FALSE)),\" \",VLOOKUP(L292,Proposito_programa!$C$2:$E$59,2,FALSE))","v":"Gestión pública local"},{"$f":"IF(ISERROR(VLOOKUP(L292,Proposito_programa!$C$2:$E$59,3,FALSE)),\" \",VLOOKUP(L292,Proposito_programa!$C$2:$E$59,3,FALSE))","v":"Propósito 5: Construir Bogotá - Región con gobierno abierto, transparente y ciudadanía consciente"},2021,1,860011153,"POSITIVA COMPAÑIA DE SEGUROS SA","Persona Jurídica",null,null,null,195800,null,null,null,195800,195800,44509,44509,44509,null,null,null,null,null,null,null,null,null,null,null,1]
[null,null,2021,null,null,"Otros gastos","Otros gastos","Otros gastos","CAUSAR Y ODENAR EL PAGO POR CONCEPTO DE COTIZACIÓN AL SISTEMA DE RIESGOSCONTRATISTAS VINCULADOS CON EL FONDO DE DESARRO LLO LOCAL DE LA CANDELARIA PERSONAL CONTRATISTA PRESTADOR DE SERVICIOS CUYAS ACTIVIDADES ESTAN CLASIFICADAS EN EL NIVEL DE RIESGO IV Y V DE CONFORMIDAD CON LA PARTE CONSIDERATIVA DEL PRESENTE ACTO .(RESOLUCION 028 DE 2021).","Inversión","Un Nuevo Contrato Social y Ambiental para la Bogotá del Siglo XXI",57,{"$f":"IF(ISERROR(VLOOKUP(L293,Proposito_programa!$C$2:$E$59,2,FALSE)),\" \",VLOOKUP(L293,Proposito_programa!$C$2:$E$59,2,FALSE))","v":"Gestión pública local"},{"$f":"IF(ISERROR(VLOOKUP(L293,Proposito_programa!$C$2:$E$59,3,FALSE)),\" \",VLOOKUP(L293,Proposito_programa!$C$2:$E$59,3,FALSE))","v":"Propósito 5: Construir Bogotá - Región con gobierno abierto, transparente y ciudadanía consciente"},2021,1,860011153,"POSITIVA COMPAÑIA DE SEGUROS SA","Persona Jurídica",null,null,null,195800,null,null,null,195800,195800,44540,44540,44540,null,null,null,null,null,null,null,null,null,null,null,1]
[null,null,2021,null,null,"Otros gastos","Otros gastos","Otros gastos","CAUSAR Y ODENAR EL PAGO POR CONCEPTO DE COTIZACIÓN AL SISTEMA DE RIESGOSCONTRATISTAS VINCULADOS CON EL FONDO DE DESARRO LLO LOCAL DE LA CANDELARIA PERSONAL CONTRATISTA PRESTADOR DE SERVICIOS CUYAS ACTIVIDADES ESTAN CLASIFICADAS EN EL NIVEL DE RIESGO IV Y V DE CONFORMIDAD CON LA PARTE CONSIDERATIVA DEL PRESENTE ACTO .(RESOLUCION 028 DE 2021).","Inversión","Un Nuevo Contrato Social y Ambiental para la Bogotá del Siglo XXI",57,{"$f":"IF(ISERROR(VLOOKUP(L294,Proposito_programa!$C$2:$E$59,2,FALSE)),\" \",VLOOKUP(L294,Proposito_programa!$C$2:$E$59,2,FALSE))","v":"Gestión pública local"},{"$f":"IF(ISERROR(VLOOKUP(L294,Proposito_programa!$C$2:$E$59,3,FALSE)),\" \",VLOOKUP(L294,Proposito_programa!$C$2:$E$59,3,FALSE))","v":"Propósito 5: Construir Bogotá - Región con gobierno abierto, transparente y ciudadanía consciente"},2021,1,860011153,"POSITIVA COMPAÑIA DE SEGUROS SA","Persona Jurídica",null,null,null,195800,null,null,null,195800,195800,44561,44561,44561,null,null,null,null,null,null,null,null,null,null,null,1]
[null,null,2021,null,null,"Otros gastos","Otros gastos","Otros gastos","CAUSAR Y ODENAR EL PAGO POR CONCEPTO DE COTIZACIÓN AL SISTEMA DE RIESGOSCONTRATISTAS VINCULADOS CON EL FONDO DE DESARRO LLO LOCAL DE LA CANDELARIA PERSONAL CONTRATISTA PRESTADOR DE SERVICIOS CUYAS ACTIVIDADES ESTAN CLASIFICADAS EN EL NIVEL DE RIESGO IV Y V DE CONFORMIDAD CON LA PARTE CONSIDERATIVA DEL PRESENTE ACTO .(RESOLUCION 028 DE 2021).","Inversión","Un Nuevo Contrato Social y Ambiental para la Bogotá del Siglo XXI",57,{"$f":"IF(ISERROR(VLOOKUP(L295,Proposito_programa!$C$2:$E$59,2,FALSE)),\" \",VLOOKUP(L295,Proposito_programa!$C$2:$E$59,2,FALSE))","v":"Gestión pública local"},{"$f":"IF(ISERROR(VLOOKUP(L295,Proposito_programa!$C$2:$E$59,3,FALSE)),\" \",VLOOKUP(L295,Proposito_programa!$C$2:$E$59,3,FALSE))","v":"Propósito 5: Construir Bogotá - Región con gobierno abierto, transparente y ciudadanía consciente"},2023,1,860011153,"POSITIVA COMPAÑIA DE SEGUROS SA","Persona Jurídica",null,null,null,291500,null,null,null,291500,291500,44348,44348,44348,null,null,null,null,null,null,null,null,null,null,null,1]
[null,null,2021,null,null,"Otros gastos","Otros gastos","Otros gastos","CAUSAR Y ODENAR EL PAGO POR CONCEPTO DE COTIZACIÓN AL SISTEMA DE RIESGOSCONTRATISTAS VINCULADOS CON EL FONDO DE DESARRO LLO LOCAL DE LA CANDELARIA PERSONAL CONTRATISTA PRESTADOR DE SERVICIOS CUYAS ACTIVIDADES ESTAN CLASIFICADAS EN EL NIVEL DE RIESGO IV Y V DE CONFORMIDAD CON LA PARTE CONSIDERATIVA DEL PRESENTE ACTO .(RESOLUCION 028 DE 2021).","Inversión","Un Nuevo Contrato Social y Ambiental para la Bogotá del Siglo XXI",57,{"$f":"IF(ISERROR(VLOOKUP(L296,Proposito_programa!$C$2:$E$59,2,FALSE)),\" \",VLOOKUP(L296,Proposito_programa!$C$2:$E$59,2,FALSE))","v":"Gestión pública local"},{"$f":"IF(ISERROR(VLOOKUP(L296,Proposito_programa!$C$2:$E$59,3,FALSE)),\" \",VLOOKUP(L296,Proposito_programa!$C$2:$E$59,3,FALSE))","v":"Propósito 5: Construir Bogotá - Región con gobierno abierto, transparente y ciudadanía consciente"},2023,1,860011153,"POSITIVA COMPAÑIA DE SEGUROS SA","Persona Jurídica",null,null,null,72900,null,null,null,72900,72900,44377,44377,44377,null,null,null,null,null,null,null,null,null,null,null,1]
[null,null,2021,null,null,"Otros gastos","Otros gastos","Otros gastos","CAUSAR Y ODENAR EL PAGO POR CONCEPTO DE COTIZACIÓN AL SISTEMA DE RIESGOSCONTRATISTAS VINCULADOS CON EL FONDO DE DESARRO LLO LOCAL DE LA CANDELARIA PERSONAL CONTRATISTA PRESTADOR DE SERVICIOS CUYAS ACTIVIDADES ESTAN CLASIFICADAS EN EL NIVEL DE RIESGO IV Y V DE CONFORMIDAD CON LA PARTE CONSIDERATIVA DEL PRESENTE ACTO .(RESOLUCION 028 DE 2021).","Inversión","Un Nuevo Contrato Social y Ambiental para la Bogotá del Siglo XXI",57,{"$f":"IF(ISERROR(VLOOKUP(L297,Proposito_programa!$C$2:$E$59,2,FALSE)),\" \",VLOOKUP(L297,Proposito_programa!$C$2:$E$59,2,FALSE))","v":"Gestión pública local"},{"$f":"IF(ISERROR(VLOOKUP(L297,Proposito_programa!$C$2:$E$59,3,FALSE)),\" \",VLOOKUP(L297,Proposito_programa!$C$2:$E$59,3,FALSE))","v":"Propósito 5: Construir Bogotá - Región con gobierno abierto, transparente y ciudadanía consciente"},2023,1,860011153,"POSITIVA COMPAÑIA DE SEGUROS SA","Persona Jurídica",null,null,null,72900,null,null,null,72900,72900,44411,44411,44411,null,null,null,null,null,null,null,null,null,null,null,1]
[null,null,2021,null,null,"Otros gastos","Otros gastos","Otros gastos","CAUSAR Y ODENAR EL PAGO POR CONCEPTO DE COTIZACIÓN AL SISTEMA DE RIESGOSCONTRATISTAS VINCULADOS CON EL FONDO DE DESARRO LLO LOCAL DE LA CANDELARIA PERSONAL CONTRATISTA PRESTADOR DE SERVICIOS CUYAS ACTIVIDADES ESTAN CLASIFICADAS EN EL NIVEL DE RIESGO IV Y V DE CONFORMIDAD CON LA PARTE CONSIDERATIVA DEL PRESENTE ACTO .(RESOLUCION 028 DE 2021).","Inversión","Un Nuevo Contrato Social y Ambiental para la Bogotá del Siglo XXI",57,{"$f":"IF(ISERROR(VLOOKUP(L298,Proposito_programa!$C$2:$E$59,2,FALSE)),\" \",VLOOKUP(L298,Proposito_programa!$C$2:$E$59,2,FALSE))","v":"Gestión pública local"},{"$f":"IF(ISERROR(VLOOKUP(L298,Proposito_programa!$C$2:$E$59,3,FALSE)),\" \",VLOOKUP(L298,Proposito_programa!$C$2:$E$59,3,FALSE))","v":"Propósito 5: Construir Bogotá - Región con gobierno abierto, transparente y ciudadanía consciente"},2023,1,860011153,"POSITIVA COMPAÑIA DE SEGUROS SA","Persona Jurídica",null,null,null,72900,null,null,null,72900,72900,44446,44446,44446,null,null,null,null,null,null,null,null,null,null,null,1]
[null,null,2021,null,null,"Otros gastos","Otros gastos","Otros gastos","CAUSAR Y ODENAR EL PAGO POR CONCEPTO DE COTIZACIÓN AL SISTEMA DE RIESGOSCONTRATISTAS VINCULADOS CON EL FONDO DE DESARRO LLO LOCAL DE LA CANDELARIA PERSONAL CONTRATISTA PRESTADOR DE SERVICIOS CUYAS ACTIVIDADES ESTAN CLASIFICADAS EN EL NIVEL DE RIESGO IV Y V DE CONFORMIDAD CON LA PARTE CONSIDERATIVA DEL PRESENTE ACTO .(RESOLUCION 028 DE 2021).","Inversión","Un Nuevo Contrato Social y Ambiental para la Bogotá del Siglo XXI",57,{"$f":"IF(ISERROR(VLOOKUP(L299,Proposito_programa!$C$2:$E$59,2,FALSE)),\" \",VLOOKUP(L299,Proposito_programa!$C$2:$E$59,2,FALSE))","v":"Gestión pública local"},{"$f":"IF(ISERROR(VLOOKUP(L299,Proposito_programa!$C$2:$E$59,3,FALSE)),\" \",VLOOKUP(L299,Proposito_programa!$C$2:$E$59,3,FALSE))","v":"Propósito 5: Construir Bogotá - Región con gobierno abierto, transparente y ciudadanía consciente"},2023,1,860011153,"POSITIVA COMPAÑIA DE SEGUROS SA","Persona Jurídica",null,null,null,72900,null,null,null,72900,72900,44470,44470,44470,null,null,null,null,null,null,null,null,null,null,null,1]
[null,null,2021,null,null,"Otros gastos","Otros gastos","Otros gastos","CAUSAR Y ODENAR EL PAGO POR CONCEPTO DE COTIZACIÓN AL SISTEMA DE RIESGOSCONTRATISTAS VINCULADOS CON EL FONDO DE DESARRO LLO LOCAL DE LA CANDELARIA PERSONAL CONTRATISTA PRESTADOR DE SERVICIOS CUYAS ACTIVIDADES ESTAN CLASIFICADAS EN EL NIVEL DE RIESGO IV Y V DE CONFORMIDAD CON LA PARTE CONSIDERATIVA DEL PRESENTE ACTO .(RESOLUCION 028 DE 2021).","Inversión","Un Nuevo Contrato Social y Ambiental para la Bogotá del Siglo XXI",57,{"$f":"IF(ISERROR(VLOOKUP(L300,Proposito_programa!$C$2:$E$59,2,FALSE)),\" \",VLOOKUP(L300,Proposito_programa!$C$2:$E$59,2,FALSE))","v":"Gestión pública local"},{"$f":"IF(ISERROR(VLOOKUP(L300,Proposito_programa!$C$2:$E$59,3,FALSE)),\" \",VLOOKUP(L300,Proposito_programa!$C$2:$E$59,3,FALSE))","v":"Propósito 5: Construir Bogotá - Región con gobierno abierto, transparente y ciudadanía consciente"},2023,1,860011153,"POSITIVA COMPAÑIA DE SEGUROS SA","Persona Jurídica",null,null,null,72900,null,null,null,72900,72900,44509,44509,44509,null,null,null,null,null,null,null,null,null,null,null,1]
[null,null,2021,null,null,"Otros gastos","Otros gastos","Otros gastos","CAUSAR Y ODENAR EL PAGO POR CONCEPTO DE COTIZACIÓN AL SISTEMA DE RIESGOSCONTRATISTAS VINCULADOS CON EL FONDO DE DESARRO LLO LOCAL DE LA CANDELARIA PERSONAL CONTRATISTA PRESTADOR DE SERVICIOS CUYAS ACTIVIDADES ESTAN CLASIFICADAS EN EL NIVEL DE RIESGO IV Y V DE CONFORMIDAD CON LA PARTE CONSIDERATIVA DEL PRESENTE ACTO .(RESOLUCION 028 DE 2021).","Inversión","Un Nuevo Contrato Social y Ambiental para la Bogotá del Siglo XXI",57,{"$f":"IF(ISERROR(VLOOKUP(L301,Proposito_programa!$C$2:$E$59,2,FALSE)),\" \",VLOOKUP(L301,Proposito_programa!$C$2:$E$59,2,FALSE))","v":"Gestión pública local"},{"$f":"IF(ISERROR(VLOOKUP(L301,Proposito_programa!$C$2:$E$59,3,FALSE)),\" \",VLOOKUP(L301,Proposito_programa!$C$2:$E$59,3,FALSE))","v":"Propósito 5: Construir Bogotá - Región con gobierno abierto, transparente y ciudadanía consciente"},2023,1,860011153,"POSITIVA COMPAÑIA DE SEGUROS SA","Persona Jurídica",null,null,null,72900,null,null,null,72900,72900,44540,44540,44540,null,null,null,null,null,null,null,null,null,null,null,1]
[null,null,2021,null,null,"Otros gastos","Otros gastos","Otros gastos","CAUSAR Y ODENAR EL PAGO POR CONCEPTO DE COTIZACIÓN AL SISTEMA DE RIESGOSCONTRATISTAS VINCULADOS CON EL FONDO DE DESARRO LLO LOCAL DE LA CANDELARIA PERSONAL CONTRATISTA PRESTADOR DE SERVICIOS CUYAS ACTIVIDADES ESTAN CLASIFICADAS EN EL NIVEL DE RIESGO IV Y V DE CONFORMIDAD CON LA PARTE CONSIDERATIVA DEL PRESENTE ACTO .(RESOLUCION 028 DE 2021).","Inversión","Un Nuevo Contrato Social y Ambiental para la Bogotá del Siglo XXI",57,{"$f":"IF(ISERROR(VLOOKUP(L302,Proposito_programa!$C$2:$E$59,2,FALSE)),\" \",VLOOKUP(L302,Proposito_programa!$C$2:$E$59,2,FALSE))","v":"Gestión pública local"},{"$f":"IF(ISERROR(VLOOKUP(L302,Proposito_programa!$C$2:$E$59,3,FALSE)),\" \",VLOOKUP(L302,Proposito_programa!$C$2:$E$59,3,FALSE))","v":"Propósito 5: Construir Bogotá - Región con gobierno abierto, transparente y ciudadanía consciente"},2023,1,860011153,"POSITIVA COMPAÑIA DE SEGUROS SA","Persona Jurídica",null,null,null,72900,null,null,null,72900,72900,44561,44561,44561,null,null,null,null,null,null,null,null,null,null,null,1]
[null,null,2021,null,null,"Otros gastos","Otros gastos","Otros gastos","PAGO FACTURAS OCTUBRE -DICIEMBRE DE 2020 FACTURAS 38354318313- 33099959711-33099959810-59919-60511-60412-60016-60115-60214-60313-60610.","Funcionamiento","Un Nuevo Contrato Social y Ambiental para la Bogotá del Siglo XXI","No aplica",null,null,"N/A",null,899999094,"EMPRESA DE ACUEDUCTO Y ALCANTARILLADO DE BOGOTA ESP","Persona Jurídica",null,null,null,1212380,null,null,null,1212380,1212380,44229,44229,44229,null,null,null,null,null,null,null,null,null,null,null,1]
[null,null,2021,null,null,"Otros gastos","Otros gastos","Otros gastos","PAGO SERVICIO 20 DIC 22 DE ENERO DE 2021 FACT 3376080050214 Y 3939043115","Funcionamiento","Un Nuevo Contrato Social y Ambiental para la Bogotá del Siglo XXI","No aplica",null,null,"N/A",null,899999094,"EMPRESA DE ACUEDUCTO Y ALCANTARILLADO DE BOGOTA ESP","Persona Jurídica",null,null,null,120126,null,null,null,120126,120126,44263,44263,44263,null,null,null,null,null,null,null,null,null,null,null,1]
[null,null,2021,null,null,"Otros gastos","Otros gastos","Otros gastos","PAGO FACTURAS 36420665519-36420665618-36420676417-36420671210- 36420666715-36420666913-36420667416-36420668612-36420680518-364206652 12- 37700420617  DE 30 DICIEMBRE AL 26 DE FEBRERO 2021","Funcionamiento","Un Nuevo Contrato Social y Ambiental para la Bogotá del Siglo XXI","No aplica",null,null,"N/A",null,899999094,"EMPRESA DE ACUEDUCTO Y ALCANTARILLADO DE BOGOTA ESP","Persona Jurídica",null,null,null,1281669,null,null,null,1281669,1281669,44302,44302,44302,null,null,null,null,null,null,null,null,null,null,null,1]
[null,null,2021,null,null,"Otros gastos","Otros gastos","Otros gastos","PAGO FACTURSA 37717992319 -37717992616- 37717992715-37718003512 37717998316-37717993812- 37717994018- 37717994513- 37717995718 37718007612","Funcionamiento","Un Nuevo Contrato Social y Ambiental para la Bogotá del Siglo XXI","No aplica",null,null,"N/A",null,899999094,"EMPRESA DE ACUEDUCTO Y ALCANTARILLADO DE BOGOTA ESP","Persona Jurídica",null,null,null,1176531,null,null,null,1176531,1176531,44350,44350,44350,null,null,null,null,null,null,null,null,null,null,null,1]
[null,null,2021,null,null,"Otros gastos","Otros gastos","Otros gastos","PAGO CONSUMO PERÍODO 28 DE ABRIL A 25 DE JUNIO SEDES ALCALDIA LOCAL DE LA CANDELARIA.","Funcionamiento","Un Nuevo Contrato Social y Ambiental para la Bogotá del Siglo XXI","No aplica",null,null,"N/A",null,899999094,"EMPRESA DE ACUEDUCTO Y ALCANTARILLADO DE BOGOTA ESP","Persona Jurídica",null,null,null,1146252,null,null,null,1146252,1146252,44411,44411,44411,null,null,null,null,null,null,null,null,null,null,null,1]
[null,null,2021,null,null,"Otros gastos","Otros gastos","Otros gastos","PAGO CONSUMO DEL 26 DE JUNIO AL 26 DE AGOSTO SEDE ALCALDIA Y CASAS COMUNITARIAS.","Funcionamiento","Un Nuevo Contrato Social y Ambiental para la Bogotá del Siglo XXI","No aplica",null,null,"N/A",null,899999094,"EMPRESA DE ACUEDUCTO Y ALCANTARILLADO DE BOGOTA ESP","Persona Jurídica",null,null,null,2044652,null,null,null,2044652,2044652,44460,44460,44460,null,null,null,null,null,null,null,null,null,null,null,1]
[null,null,2021,null,null,"Otros gastos","Otros gastos","Otros gastos","PAGO FACTURAS F39103036719-F39103036818-F39103040216-F39103039119- F39103037014-F39103037212-F39103037410-F39103038012-F39103042519- CORRESPONDIENTE AL PERIODO AGOSTO A OCTUBRE 2021.","Funcionamiento","Un Nuevo Contrato Social y Ambiental para la Bogotá del Siglo XXI","No aplica",null,null,"N/A",null,899999094,"EMPRESA DE ACUEDUCTO Y ALCANTARILLADO DE BOGOTA ESP","Persona Jurídica",null,null,null,2220132,null,null,null,2220132,2220132,44536,44536,44536,null,null,null,null,null,null,null,null,null,null,null,1]
[null,null,2021,null,null,"Otros gastos","Otros gastos","Otros gastos","PAGO FACTURAS 56315429-56315808-56315958-56316005-56316006-56316049 56316057 CONSUMO DE MARZO DE 2021.","Funcionamiento","Un Nuevo Contrato Social y Ambiental para la Bogotá del Siglo XXI","No aplica",null,null,"N/A",null,901145808,"PROMOAMBIENTAL DISTRITO S A S ESP","Persona Jurídica",null,null,null,438068,null,null,null,438068,438068,44322,44322,44322,null,null,null,null,null,null,null,null,null,null,null,1]
[null,null,2021,null,null,"Otros gastos","Otros gastos","Otros gastos","PAGO FACTURAS 66516185-66516564-66516714-66516761-66516762-66516805 66516813 CORRESPONDIENTES A LAS SEDES DE LA ALCALDIA DE LA CANDELARIA","Funcionamiento","Un Nuevo Contrato Social y Ambiental para la Bogotá del Siglo XXI","No aplica",null,null,"N/A",null,901145808,"PROMOAMBIENTAL DISTRITO S A S ESP","Persona Jurídica",null,null,null,10397620,null,null,null,10397620,10397620,44489,44489,44489,null,null,null,null,null,null,null,null,null,null,null,1]
[null,null,2021,null,null,"Otros gastos","Otros gastos","Otros gastos","RECOLECCIÓN MES DE SEPTIEMBRE FACTURAS 68598057- 68598780- 68599066 68599139- 68599140- 68599183- 68599191","Funcionamiento","Un Nuevo Contrato Social y Ambiental para la Bogotá del Siglo XXI","No aplica",null,null,"N/A",null,901145808,"PROMOAMBIENTAL DISTRITO S A S ESP","Persona Jurídica",null,null,null,357520,null,null,null,357520,357520,44510,44510,44510,null,null,null,null,null,null,null,null,null,null,null,1]
[null,null,2021,null,null,"Otros gastos","Otros gastos","Otros gastos","PAGO FACTURAS 70572737- 70572638-70572729-70572488-70572685-70572686- 70572109, CORRESPODIENTES AL MES DE OCTUBRE 2021.","Funcionamiento","Un Nuevo Contrato Social y Ambiental para la Bogotá del Siglo XXI","No aplica",null,null,"N/A",null,901145808,"PROMOAMBIENTAL DISTRITO S A S ESP","Persona Jurídica",null,null,null,229710,null,null,null,229710,229440,44536,44536,44536,null,null,null,null,null,null,null,null,null,null,null,0.99882460493665925]
[1,214,2021,"ORDEN DE COMPRA 83778","https://www.colombiacompra.gov.co/tienda-virtual-del-estado-colombiano/ordenes-compra/83778","Compraventa de bienes muebles","Selección abreviada","Acuerdo marco de precios ","ADQUIRIR LICENCIAS DE SOFTWARE PARA LA ALCALDIA LOCAL DE LA CANDELARIA  POR MEDIO DEL INSTRUMENTO DE AGREGACIÓN DE DEMANDA PARA LA ADQUISICIÓN  DE SOFTWARE POR CATÁLOGO QUE REQUIERAN LAS ENTIDADES ESTATALES CCE-139-2020”","Funcionamiento","Un Nuevo Contrato Social y Ambiental para la Bogotá del Siglo XXI","No aplica",null,null,"N/A",1,901010523,"SOLUCIONES ORION SUCURSAL COLOMBIA","Persona Jurídica",null,null,null,11134656,null,null,null,11134656,0,44558,44558,44620,null,null,null,null,null,null,null,"X",null,null,null,0]
[null,null,2021,null,null,"Otros gastos","Otros gastos","Otros gastos","PAGO FACTURA N°6192435845 DE DICIEMBRE DE 2020.","Funcionamiento","Un Nuevo Contrato Social y Ambiental para la Bogotá del Siglo XXI","No aplica",null,null,"N/A",null,830037248,"CODENSA S.A. ESP","Persona Jurídica",null,null,null,65760,null,null,null,65760,65760,44229,44229,44229,null,null,null,null,null,null,null,null,null,null,null,1]
[null,null,2021,null,null,"Otros gastos","Otros gastos","Otros gastos","PAGO SERVICIO ENERO 2021 FACTURA 622815903","Funcionamiento","Un Nuevo Contrato Social y Ambiental para la Bogotá del Siglo XXI","No aplica",null,null,"N/A",null,830037248,"CODENSA S.A. ESP","Persona Jurídica",null,null,null,138640,null,null,null,138640,138640,44263,44263,44263,null,null,null,null,null,null,null,null,null,null,null,1]
[null,null,2021,null,null,"Otros gastos","Otros gastos","Otros gastos","PAGO FACTURAS 626394419-4 / 629987084-3 ENERO DE 2021","Funcionamiento","Un Nuevo Contrato Social y Ambiental para la Bogotá del Siglo XXI","No aplica",null,null,"N/A",null,830037248,"CODENSA S.A. ESP","Persona Jurídica",null,null,null,252940,null,null,null,252940,252940,44302,44302,44302,null,null,null,null,null,null,null,null,null,null,null,1]
[null,null,2021,null,null,"Otros gastos","Otros gastos","Otros gastos","PAGO CUENTA CLIENTE 3993908-4 FACTURA 631909508-5 CONSUMO DE 10 MARZO 12 DE ABRIL DE 2021","Funcionamiento","Un Nuevo Contrato Social y Ambiental para la Bogotá del Siglo XXI","No aplica",null,null,"N/A",null,830037248,"CODENSA S.A. ESP","Persona Jurídica",null,null,null,3412334,null,null,null,3412334,3412334,44322,44322,44322,null,null,null,null,null,null,null,null,null,null,null,1]
[null,null,2021,null,null,"Otros gastos","Otros gastos","Otros gastos","PAGO 12 ABRIL 10 DE MAYO 2020 CUENTA CLIENTE 3993908-4","Funcionamiento","Un Nuevo Contrato Social y Ambiental para la Bogotá del Siglo XXI","No aplica",null,null,"N/A",null,830037248,"CODENSA S.A. ESP","Persona Jurídica",null,null,null,2919135,null,null,null,2919135,2919135,44336,44336,44336,null,null,null,null,null,null,null,null,null,null,null,1]
[null,null,2021,null,null,"Otros gastos","Otros gastos","Otros gastos","PAGO FACTURA 639204837-7, CONSUMO 10 DE MAYO 09 DE JUNIO DE 2021","Funcionamiento","Un Nuevo Contrato Social y Ambiental para la Bogotá del Siglo XXI","No aplica",null,null,"N/A",null,830037248,"CODENSA S.A. ESP","Persona Jurídica",null,null,null,3090853,null,null,null,3090853,3090853,44363,44363,44363,null,null,null,null,null,null,null,null,null,null,null,1]
[null,null,2021,null,null,"Otros gastos","Otros gastos","Otros gastos","PAGO CUENTA CLIENTE  3993908-4 FACTURA 642805194-3 DE 09 JUNIO A 09 DE JULIO 2021.","Funcionamiento","Un Nuevo Contrato Social y Ambiental para la Bogotá del Siglo XXI","No aplica",null,null,"N/A",null,830037248,"CODENSA S.A. ESP","Persona Jurídica",null,null,null,2893251,null,null,null,2893251,2893251,44393,44393,44393,null,null,null,null,null,null,null,null,null,null,null,1]
[null,null,2021,null,null,"Otros gastos","Otros gastos","Otros gastos","PAGO FACTURA 646498445-8 Cuenta Cliente 3993908-4. CONSUMO DEL 9 JULIO AL 9 DE AGOSTO.","Funcionamiento","Un Nuevo Contrato Social y Ambiental para la Bogotá del Siglo XXI","No aplica",null,null,"N/A",null,830037248,"CODENSA S.A. ESP","Persona Jurídica",null,null,null,3275772,null,null,null,3275772,3275772,44431,44431,44431,null,null,null,null,null,null,null,null,null,null,null,1]
[null,null,2021,null,null,"Otros gastos","Otros gastos","Otros gastos","PAGO CONSUMO 9 AGOSTO 8 SEPTIEMBRE 2021 CUENTA CLIENTE 3993908-4 FACTURANo. 650131069-0.","Funcionamiento","Un Nuevo Contrato Social y Ambiental para la Bogotá del Siglo XXI","No aplica",null,null,"N/A",null,830037248,"CODENSA S.A. ESP","Persona Jurídica",null,null,null,3095816,null,null,null,3095816,3095816,44452,44452,44452,null,null,null,null,null,null,null,null,null,null,null,1]
[null,null,2021,null,null,"Otros gastos","Otros gastos","Otros gastos","PAGO FACTURA 653771186-6 CUENTA CLIENTE 3993908-4 CONSUMO SEPT-OCTUBRE","Funcionamiento","Un Nuevo Contrato Social y Ambiental para la Bogotá del Siglo XXI","No aplica",null,null,"N/A",null,830037248,"CODENSA S.A. ESP","Persona Jurídica",null,null,null,3281059,null,null,null,3281059,3281059,44489,44489,44489,null,null,null,null,null,null,null,null,null,null,null,1]
[null,null,2021,null,null,"Otros gastos","Otros gastos","Otros gastos","PAGO FACTURA 657419690-5 PERIODO 08-Oct al 09-Nov 2021","Funcionamiento","Un Nuevo Contrato Social y Ambiental para la Bogotá del Siglo XXI","No aplica",null,null,"N/A",null,830037248,"CODENSA S.A. ESP","Persona Jurídica",null,null,null,14449770,null,null,null,14449770,14449770,44531,44531,44531,null,null,null,null,null,null,null,null,null,null,null,1]
[null,null,2021,null,null,"Otros gastos","Otros gastos","Otros gastos","PAGO FACTURA 6610746471 CONSUMO DE 09 DE NOVIEMBRE A 10 DE DICIEMBRE","Funcionamiento","Un Nuevo Contrato Social y Ambiental para la Bogotá del Siglo XXI","No aplica",null,null,"N/A",null,830037248,"CODENSA S.A. ESP","Persona Jurídica",null,null,null,3500940,null,null,null,3500940,3500940,44551,44551,44551,null,null,null,null,null,null,null,null,null,null,null,1]
[null,null,2021,null,null,"Otros gastos","Otros gastos","Otros gastos","PAGO FACTURAS F1513475566 - F1513410766 - 60856137.","Funcionamiento","Un Nuevo Contrato Social y Ambiental para la Bogotá del Siglo XXI","No aplica",null,null,"N/A",null,"800007813","VANTI S.A. ESP","Persona Jurídica",null,null,null,214710,null,null,null,214710,214710,44221,44221,44221,null,null,null,null,null,null,null,null,null,null,null,1]
[null,null,2021,null,null,"Otros gastos","Otros gastos","Otros gastos","Prestar servicios profesionales a la Subdirección de Gestión del riesgo en el marco del proceso de conocimiento del riesgo, en activ idades relacionadas con inspecciones técnicas, según oficio de Dirección 2020I009786 del 20/05/2020.","Funcionamiento","Un Nuevo Contrato Social y Ambiental para la Bogotá del Siglo XXI","No aplica",null,null,"N/A",null,"800007813","VANTI S.A. ESP","Persona Jurídica",null,null,null,172690,null,null,null,172690,172690,44263,44263,44263,null,null,null,null,null,null,null,null,null,null,null,1]
[null,null,2021,null,null,"Otros gastos","Otros gastos","Otros gastos","PAGO DE SERVICIO VANTI No. F1517876080 Del 16 de Febrero de 2021.","Funcionamiento","Un Nuevo Contrato Social y Ambiental para la Bogotá del Siglo XXI","No aplica",null,null,"N/A",null,"800007813","VANTI S.A. ESP","Persona Jurídica",null,null,null,29120,null,null,null,29120,29120,44278,44278,44278,null,null,null,null,null,null,null,null,null,null,null,1]
[null,null,2021,null,null,"Otros gastos","Otros gastos","Otros gastos","PAGO FACTURA F15110244296 CASA SANTA BARBARA 15 MARZO DE 2021","Funcionamiento","Un Nuevo Contrato Social y Ambiental para la Bogotá del Siglo XXI","No aplica",null,null,"N/A",null,"800007813","VANTI S.A. ESP","Persona Jurídica",null,null,null,3410,null,null,null,3410,3410,44280,44280,44280,null,null,null,null,null,null,null,null,null,null,null,1]
[null,null,2021,null,null,"Otros gastos","Otros gastos","Otros gastos","PAGO FACTURAS F15110219083 F15110506700 F15110565420 CASAS BELEN CONCORDIA Y EGIPTO","Funcionamiento","Un Nuevo Contrato Social y Ambiental para la Bogotá del Siglo XXI","No aplica",null,null,"N/A",null,"800007813","VANTI S.A. ESP","Persona Jurídica",null,null,null,65530,null,null,null,65530,65530,44302,44302,44302,null,null,null,null,null,null,null,null,null,null,null,1]
[null,null,2021,null,null,"Otros gastos","Otros gastos","Otros gastos","PAGO FACTURAS 15 Y 19 ABRIL NÚMEROS F15112926255-F15112812877- F151120340","Funcionamiento","Un Nuevo Contrato Social y Ambiental para la Bogotá del Siglo XXI","No aplica",null,null,"N/A",null,"800007813","VANTI S.A. ESP","Persona Jurídica",null,null,null,35050,null,null,null,35050,35050,44322,44322,44322,null,null,null,null,null,null,null,null,null,null,null,1]
[null,null,2021,null,null,"Otros gastos","Otros gastos","Otros gastos","PAGO FACTURA F15112581559 15 DE ABRIL DE 2021 CUENTA CLIENTE 61542220","Funcionamiento","Un Nuevo Contrato Social y Ambiental para la Bogotá del Siglo XXI","No aplica",null,null,"N/A",null,"800007813","VANTI S.A. ESP","Persona Jurídica",null,null,null,19680,null,null,null,19680,19680,44328,44328,44328,null,null,null,null,null,null,null,null,null,null,null,1]
[null,null,2021,null,null,"Otros gastos","Otros gastos","Otros gastos","PAGO CONSUMO CUENTA CLIENTE  60856137 F15115013983 ABRIL 2021","Funcionamiento","Un Nuevo Contrato Social y Ambiental para la Bogotá del Siglo XXI","No aplica",null,null,"N/A",null,"800007813","VANTI S.A. ESP","Persona Jurídica",null,null,null,54090,null,null,null,54090,54090,44341,44341,44341,null,null,null,null,null,null,null,null,null,null,null,1]
[null,null,2021,null,null,"Otros gastos","Otros gastos","Otros gastos","PAGO DE FACTURAS F15115239989 Y F15115193558 CONSUMO DE MAYO 2021","Funcionamiento","Un Nuevo Contrato Social y Ambiental para la Bogotá del Siglo XXI","No aplica",null,null,"N/A",null,"800007813","VANTI S.A. ESP","Persona Jurídica",null,null,null,41320,null,null,null,41320,41320,44350,44350,44350,null,null,null,null,null,null,null,null,null,null,null,1]
[null,null,2021,null,null,"Otros gastos","Otros gastos","Otros gastos","PAGO FACTURA F15117380413# MAYO-JUNIO 2021","Funcionamiento","Un Nuevo Contrato Social y Ambiental para la Bogotá del Siglo XXI","No aplica",null,null,"N/A",null,"800007813","VANTI S.A. ESP","Persona Jurídica",null,null,null,13540,null,null,null,13540,13540,44371,44371,44371,null,null,null,null,null,null,null,null,null,null,null,1]
[null,null,2021,null,null,"Otros gastos","Otros gastos","Otros gastos","PAGO FACTURAS F1517637312 Y F15117348805 MAYO DE 2021","Funcionamiento","Un Nuevo Contrato Social y Ambiental para la Bogotá del Siglo XXI","No aplica",null,null,"N/A",null,"800007813","VANTI S.A. ESP","Persona Jurídica",null,null,null,38990,null,null,null,38990,38990,44378,44378,44378,null,null,null,null,null,null,null,null,null,null,null,1]
[null,null,2021,null,null,"Otros gastos","Otros gastos","Otros gastos","PAGO FACTURA F15117558304 18 DE JUNIO CUENTA CLIENTE  62168563","Funcionamiento","Un Nuevo Contrato Social y Ambiental para la Bogotá del Siglo XXI","No aplica",null,null,"N/A",null,"800007813","VANTI S.A. ESP","Persona Jurídica",null,null,null,7970,null,null,null,7970,7970,44385,44385,44385,null,null,null,null,null,null,null,null,null,null,null,1]
[null,null,2021,null,null,"Otros gastos","Otros gastos","Otros gastos","PAGO FACTURAS SEDES ALCALDIA LOCAL FACTURAS F15119679840 -F15120033015 F15120042209- F15119735000, CORRRESPONDIENTE AL MES DE JULIO 2021","Funcionamiento","Un Nuevo Contrato Social y Ambiental para la Bogotá del Siglo XXI","No aplica",null,null,"N/A",null,"800007813","VANTI S.A. ESP","Persona Jurídica",null,null,null,69480,null,null,null,69480,69480,44411,44411,44411,null,null,null,null,null,null,null,null,null,null,null,1]
[null,null,2021,null,null,"Otros gastos","Otros gastos","Otros gastos","PAGO FACTURAS F15122158236-F15122394701 CONSUMO MES DE AGOSTO SANTA BARABARA Y CONCORDIA.","Funcionamiento","Un Nuevo Contrato Social y Ambiental para la Bogotá del Siglo XXI","No aplica",null,null,"N/A",null,"800007813","VANTI S.A. ESP","Persona Jurídica",null,null,null,31950,null,null,null,31950,31950,44440,44440,44440,null,null,null,null,null,null,null,null,null,null,null,1]
[null,null,2021,null,null,"Otros gastos","Otros gastos","Otros gastos","PAGO 02 DE SEPTIEMBRE CUENTA CLIENTE  62168563 FACTURA F15123619554","Funcionamiento","Un Nuevo Contrato Social y Ambiental para la Bogotá del Siglo XXI","No aplica",null,null,"N/A",null,"800007813","VANTI S.A. ESP","Persona Jurídica",null,null,null,68580,null,null,null,68580,68580,44459,44459,44459,null,null,null,null,null,null,null,null,null,null,null,1]
[null,null,2021,null,null,"Otros gastos","Otros gastos","Otros gastos","PAGO FACTURAS F15124480538- #F1512477713 CUENTA CLIENTE 62310174 Y 60856137.","Funcionamiento","Un Nuevo Contrato Social y Ambiental para la Bogotá del Siglo XXI","No aplica",null,null,"N/A",null,"800007813","VANTI S.A. ESP","Persona Jurídica",null,null,null,30080,null,null,null,30080,30080,44470,44470,44470,null,null,null,null,null,null,null,null,null,null,null,1]
[null,null,2021,null,null,"Otros gastos","Otros gastos","Otros gastos","PAGO FACTURAS F1126858468 Y F15126930726 CONSUMO CASA BELEN Y CASA STA BARBARA.","Funcionamiento","Un Nuevo Contrato Social y Ambiental para la Bogotá del Siglo XXI","No aplica",null,null,"N/A",null,"800007813","VANTI S.A. ESP","Persona Jurídica",null,null,null,143490,null,null,null,143490,143490,44494,44494,44494,null,null,null,null,null,null,null,null,null,null,null,1]
[null,null,2021,null,null,"Otros gastos","Otros gastos","Otros gastos","PAGO CONSUMO AL 15 DE OCTUBRE FACTURA F15127183860.","Funcionamiento","Un Nuevo Contrato Social y Ambiental para la Bogotá del Siglo XXI","No aplica",null,null,"N/A",null,"800007813","VANTI S.A. ESP","Persona Jurídica",null,null,null,50200,null,null,null,50200,50200,44510,44510,44510,null,null,null,null,null,null,null,null,null,null,null,1]
[null,null,2021,null,null,"Otros gastos","Otros gastos","Otros gastos","PAGO FACTURA OCTUBRE-NOVIEMBRE F15128400342","Funcionamiento","Un Nuevo Contrato Social y Ambiental para la Bogotá del Siglo XXI","No aplica",null,null,"N/A",null,"800007813","VANTI S.A. ESP","Persona Jurídica",null,null,null,132890,null,null,null,132890,132890,44510,44510,44510,null,null,null,null,null,null,null,null,null,null,null,1]
[null,null,2021,null,null,"Otros gastos","Otros gastos","Otros gastos","PAGO FACTURAS F15129101044- F15129066822-F15129573923.CONSUMO DE OCTUBREA NOVIEMBRE.","Funcionamiento","Un Nuevo Contrato Social y Ambiental para la Bogotá del Siglo XXI","No aplica",null,null,"N/A",null,"800007813","VANTI S.A. ESP","Persona Jurídica",null,null,null,48430,null,null,null,48430,48430,44532,44532,44532,null,null,null,null,null,null,null,null,null,null,null,1]
[null,null,2021,null,null,"Otros gastos","Otros gastos","Otros gastos","PAGO CONSUMO NOVIEMBRE DICIEMBRE DE 2021","Funcionamiento","Un Nuevo Contrato Social y Ambiental para la Bogotá del Siglo XXI","No aplica",null,null,"N/A",null,"800007813","VANTI S.A. ESP","Persona Jurídica",null,null,null,274990,null,null,null,274990,18710,44559,44559,44559,null,null,null,null,null,null,null,null,null,null,null,6.8038837775919125E-2]
[null,null,2021,null,null,"Otros gastos","Otros gastos","Otros gastos","HONORARIOS EDILES DE LA LOCALIDAD DE LA CANDELARIA POR LA ASISTENCIA A SESIONES REALIZADAS DURANTE EL MES DE ENERO DE 2021, CONFORME A LAS ACTAS ANEXAS Y RELACIÓN DE ASISTENCIA Y A LA CAUSACIÓN CONTABLE.","Funcionamiento","Un Nuevo Contrato Social y Ambiental para la Bogotá del Siglo XXI","No aplica",null,null,"N/A",null,"79593962","EDUARDO TITO GOMEZ CERON","Persona Natural",null,null,null,7492000,null,null,null,7492000,7492000,44228,44228,44228,null,null,null,null,null,null,null,null,null,null,null,1]
[null,null,2021,null,null,"Otros gastos","Otros gastos","Otros gastos","HONORARIOS EDILES DE LA LOCALIDAD DE LA CANDELARIA POR LA ASISTENCIA A SESIONES REALIZADAS DURANTE EL MES DE ENERO DE 2021, CONFORME A LAS ACTAS ANEXAS Y RELACIÓN DE ASISTENCIA Y A LA CAUSACIÓN CONTABLE.","Funcionamiento","Un Nuevo Contrato Social y Ambiental para la Bogotá del Siglo XXI","No aplica",null,null,"N/A",null,"3838495","JUAN CAMILO CASTELLANOS MEDINA","Persona Natural",null,null,null,7492000,null,null,null,7492000,7492000,44228,44228,44228,null,null,null,null,null,null,null,null,null,null,null,1]
[null,null,2021,null,null,"Otros gastos","Otros gastos","Otros gastos","HONORARIOS EDILES DE LA LOCALIDAD DE LA CANDELARIA POR LA ASISTENCIA A SESIONES REALIZADAS DURANTE EL MES DE ENERO DE 2021, CONFORME A LAS ACTAS ANEXAS Y RELACIÓN DE ASISTENCIA Y A LA CAUSACIÓN CONTABLE.","Funcionamiento","Un Nuevo Contrato Social y Ambiental para la Bogotá del Siglo XXI","No aplica",null,null,"N/A",null,"1010160868","GINNA ALEXANDRA QUIROGA GAMBOA","Persona Natural",null,null,null,7492000,null,null,null,7492000,7492000,44228,44228,44228,null,null,null,null,null,null,null,null,null,null,null,1]
[null,null,2021,null,null,"Otros gastos","Otros gastos","Otros gastos","HONORARIOS EDILES DE LA LOCALIDAD DE LA CANDELARIA POR LA ASISTENCIA A SESIONES REALIZADAS DURANTE EL MES DE ENERO DE 2021, CONFORME A LAS ACTAS ANEXAS Y RELACIÓN DE ASISTENCIA Y A LA CAUSACIÓN CONTABLE.","Funcionamiento","Un Nuevo Contrato Social y Ambiental para la Bogotá del Siglo XXI","No aplica",null,null,"N/A",null,"79687787","JUAN CARLOS MAHECHA ROBAYO","Persona Natural",null,null,null,7492000,null,null,null,7492000,7492000,44228,44228,44228,null,null,null,null,null,null,null,null,null,null,null,1]
[null,null,2021,null,null,"Otros gastos","Otros gastos","Otros gastos","HONORARIOS EDILES DE LA LOCALIDAD DE LA CANDELARIA POR LA ASISTENCIA A SESIONES REALIZADAS DURANTE EL MES DE ENERO DE 2021, CONFORME A LAS ACTAS ANEXAS Y RELACIÓN DE ASISTENCIA Y A LA CAUSACIÓN CONTABLE.","Funcionamiento","Un Nuevo Contrato Social y Ambiental para la Bogotá del Siglo XXI","No aplica",null,null,"N/A",null,"1010209957","MIGUEL ANGEL RODRIGUEZ RODRIGUEZ","Persona Natural",null,null,null,7492000,null,null,null,7492000,7492000,44228,44228,44228,null,null,null,null,null,null,null,null,null,null,null,1]
[null,null,2021,null,null,"Otros gastos","Otros gastos","Otros gastos","HONORARIOS EDILES DE LA LOCALIDAD DE LA CANDELARIA POR LA ASISTENCIA A SESIONES REALIZADAS DURANTE EL MES DE ENERO DE 2021, CONFORME A LAS ACTAS ANEXAS Y RELACIÓN DE ASISTENCIA Y A LA CAUSACIÓN CONTABLE.","Funcionamiento","Un Nuevo Contrato Social y Ambiental para la Bogotá del Siglo XXI","No aplica",null,null,"N/A",null,"79651441","ALVARO ENRIQUE SANCHEZ CARRILLO","Persona Natural",null,null,null,7492000,null,null,null,7492000,7492000,44228,44228,44228,null,null,null,null,null,null,null,null,null,null,null,1]
[null,null,2021,null,null,"Otros gastos","Otros gastos","Otros gastos","HONORARIOS EDILES DE LA LOCALIDAD DE LA CANDELARIA POR LA ASISTENCIA A SESIONES REALIZADAS DURANTE EL MES DE ENERO DE 2021, CONFORME A LAS ACTAS ANEXAS Y RELACIÓN DE ASISTENCIA Y A LA CAUSACIÓN CONTABLE.","Funcionamiento","Un Nuevo Contrato Social y Ambiental para la Bogotá del Siglo XXI","No aplica",null,null,"N/A",null,"88141104","DAGOBERTO  RODRIGUEZ MARTINEZ","Persona Natural",null,null,null,7492000,null,null,null,7492000,7492000,44228,44228,44228,null,null,null,null,null,null,null,null,null,null,null,1]
[null,null,2021,null,null,"Otros gastos","Otros gastos","Otros gastos","HONORARIOS EDILES DE LA LOCALIDAD DE LA CANDELARIA POR LA ASISTENCIA A SESIONES REALIZADS DURANTE EL MES DE FEBRERO DE 2021, CONFORME A LAS ACTAS ANEXAS, RELACIÓN DE ASISTENCIA Y CAUSACIÓN CONTABLE.","Funcionamiento","Un Nuevo Contrato Social y Ambiental para la Bogotá del Siglo XXI","No aplica",null,null,"N/A",null,"79593962","EDUARDO TITO GOMEZ CERON","Persona Natural",null,null,null,7492000,null,null,null,7492000,7492000,44258,44258,44258,null,null,null,null,null,null,null,null,null,null,null,1]
[null,null,2021,null,null,"Otros gastos","Otros gastos","Otros gastos","HONORARIOS EDILES DE LA LOCALIDAD DE LA CANDELARIA POR LA ASISTENCIA A SESIONES REALIZADS DURANTE EL MES DE FEBRERO DE 2021, CONFORME A LAS ACTAS ANEXAS, RELACIÓN DE ASISTENCIA Y CAUSACIÓN CONTABLE.","Funcionamiento","Un Nuevo Contrato Social y Ambiental para la Bogotá del Siglo XXI","No aplica",null,null,"N/A",null,"3838495","JUAN CAMILO CASTELLANOS MEDINA","Persona Natural",null,null,null,7492000,null,null,null,7492000,7492000,44258,44258,44258,null,null,null,null,null,null,null,null,null,null,null,1]
[null,null,2021,null,null,"Otros gastos","Otros gastos","Otros gastos","HONORARIOS EDILES DE LA LOCALIDAD DE LA CANDELARIA POR LA ASISTENCIA A SESIONES REALIZADS DURANTE EL MES DE FEBRERO DE 2021, CONFORME A LAS ACTAS ANEXAS, RELACIÓN DE ASISTENCIA Y CAUSACIÓN CONTABLE.","Funcionamiento","Un Nuevo Contrato Social y Ambiental para la Bogotá del Siglo XXI","No aplica",null,null,"N/A",null,"1010160868","GINNA ALEXANDRA QUIROGA GAMBOA","Persona Natural",null,null,null,7492000,null,null,null,7492000,7492000,44258,44258,44258,null,null,null,null,null,null,null,null,null,null,null,1]
[null,null,2021,null,null,"Otros gastos","Otros gastos","Otros gastos","HONORARIOS EDILES DE LA LOCALIDAD DE LA CANDELARIA POR LA ASISTENCIA A SESIONES REALIZADS DURANTE EL MES DE FEBRERO DE 2021, CONFORME A LAS ACTAS ANEXAS, RELACIÓN DE ASISTENCIA Y CAUSACIÓN CONTABLE.","Funcionamiento","Un Nuevo Contrato Social y Ambiental para la Bogotá del Siglo XXI","No aplica",null,null,"N/A",null,"79687787","JUAN CARLOS MAHECHA ROBAYO","Persona Natural",null,null,null,7492000,null,null,null,7492000,7492000,44258,44258,44258,null,null,null,null,null,null,null,null,null,null,null,1]
[null,null,2021,null,null,"Otros gastos","Otros gastos","Otros gastos","HONORARIOS EDILES DE LA LOCALIDAD DE LA CANDELARIA POR LA ASISTENCIA A SESIONES REALIZADS DURANTE EL MES DE FEBRERO DE 2021, CONFORME A LAS ACTAS ANEXAS, RELACIÓN DE ASISTENCIA Y CAUSACIÓN CONTABLE.","Funcionamiento","Un Nuevo Contrato Social y Ambiental para la Bogotá del Siglo XXI","No aplica",null,null,"N/A",null,"1010209957","MIGUEL ANGEL RODRIGUEZ RODRIGUEZ","Persona Natural",null,null,null,7492000,null,null,null,7492000,7492000,44258,44258,44258,null,null,null,null,null,null,null,null,null,null,null,1]
[null,null,2021,null,null,"Otros gastos","Otros gastos","Otros gastos","HONORARIOS EDILES DE LA LOCALIDAD DE LA CANDELARIA POR LA ASISTENCIA A SESIONES REALIZADS DURANTE EL MES DE FEBRERO DE 2021, CONFORME A LAS ACTAS ANEXAS, RELACIÓN DE ASISTENCIA Y CAUSACIÓN CONTABLE.","Funcionamiento","Un Nuevo Contrato Social y Ambiental para la Bogotá del Siglo XXI","No aplica",null,null,"N/A",null,"79651441","ALVARO ENRIQUE SANCHEZ CARRILLO","Persona Natural",null,null,null,7492000,null,null,null,7492000,7492000,44258,44258,44258,null,null,null,null,null,null,null,null,null,null,null,{"$f":"IF(ISERROR(AB360/AA360),\"-\",(AB360/AA360))","v":1}]
[null,null,2021,null,null,"Otros gastos","Otros gastos","Otros gastos","HONORARIOS EDILES DE LA LOCALIDAD DE LA CANDELARIA POR LA ASISTENCIA A SESIONES REALIZADS DURANTE EL MES DE FEBRERO DE 2021, CONFORME A LAS ACTAS ANEXAS, RELACIÓN DE ASISTENCIA Y CAUSACIÓN CONTABLE.","Funcionamiento","Un Nuevo Contrato Social y Ambiental para la Bogotá del Siglo XXI","No aplica",null,null,"N/A",null,"88141104","DAGOBERTO  RODRIGUEZ MARTINEZ","Persona Natural",null,null,null,7492000,null,null,null,7492000,7492000,44258,44258,44258,null,null,null,null,null,null,null,null,null,null,null,1]
[null,null,2021,null,null,"Otros gastos","Otros gastos","Otros gastos","HONORARIOS EDILES DE LA LOCALIDAD DE LA CANDELARIA POR LA ASISTENCIA A SESIONES REALIZADS DURANTE EL MES DE MARZO DE 2021 CONFORME A LAS ACTAS ANEXAS, RELACIÓN DE ASISTENCIA Y CAUSACIÓN CONTABLE.","Funcionamiento","Un Nuevo Contrato Social y Ambiental para la Bogotá del Siglo XXI","No aplica",null,null,"N/A",null,"79593962","EDUARDO TITO GOMEZ CERON","Persona Natural",null,null,null,7492000,null,null,null,7492000,7492000,44292,44292,44292,null,null,null,null,null,null,null,null,null,null,null,1]
[null,null,2021,null,null,"Otros gastos","Otros gastos","Otros gastos","HONORARIOS EDILES DE LA LOCALIDAD DE LA CANDELARIA POR LA ASISTENCIA A SESIONES REALIZADS DURANTE EL MES DE MARZO DE 2021 CONFORME A LAS ACTAS ANEXAS, RELACIÓN DE ASISTENCIA Y CAUSACIÓN CONTABLE.","Funcionamiento","Un Nuevo Contrato Social y Ambiental para la Bogotá del Siglo XXI","No aplica",null,null,"N/A",null,"3838495","JUAN CAMILO CASTELLANOS MEDINA","Persona Natural",null,null,null,7492000,null,null,null,7492000,7492000,44292,44292,44292,null,null,null,null,null,null,null,null,null,null,null,1]
[null,null,2021,null,null,"Otros gastos","Otros gastos","Otros gastos","HONORARIOS EDILES DE LA LOCALIDAD DE LA CANDELARIA POR LA ASISTENCIA A SESIONES REALIZADS DURANTE EL MES DE MARZO DE 2021 CONFORME A LAS ACTAS ANEXAS, RELACIÓN DE ASISTENCIA Y CAUSACIÓN CONTABLE.","Funcionamiento","Un Nuevo Contrato Social y Ambiental para la Bogotá del Siglo XXI","No aplica",null,null,"N/A",null,"1010160868","GINNA ALEXANDRA QUIROGA GAMBOA","Persona Natural",null,null,null,7492000,null,null,null,7492000,7492000,44292,44292,44292,null,null,null,null,null,null,null,null,null,null,null,1]
[null,null,2021,null,null,"Otros gastos","Otros gastos","Otros gastos","HONORARIOS EDILES DE LA LOCALIDAD DE LA CANDELARIA POR LA ASISTENCIA A SESIONES REALIZADS DURANTE EL MES DE MARZO DE 2021 CONFORME A LAS ACTAS ANEXAS, RELACIÓN DE ASISTENCIA Y CAUSACIÓN CONTABLE.","Funcionamiento","Un Nuevo Contrato Social y Ambiental para la Bogotá del Siglo XXI","No aplica",null,null,"N/A",null,"79687787","JUAN CARLOS MAHECHA ROBAYO","Persona Natural",null,null,null,7492000,null,null,null,7492000,7492000,44292,44292,44292,null,null,null,null,null,null,null,null,null,null,null,1]
[null,null,2021,null,null,"Otros gastos","Otros gastos","Otros gastos","HONORARIOS EDILES DE LA LOCALIDAD DE LA CANDELARIA POR LA ASISTENCIA A SESIONES REALIZADS DURANTE EL MES DE MARZO DE 2021 CONFORME A LAS ACTAS ANEXAS, RELACIÓN DE ASISTENCIA Y CAUSACIÓN CONTABLE.","Funcionamiento","Un Nuevo Contrato Social y Ambiental para la Bogotá del Siglo XXI","No aplica",null,null,"N/A",null,"1010209957","MIGUEL ANGEL RODRIGUEZ RODRIGUEZ","Persona Natural",null,null,null,7492000,null,null,null,7492000,7492000,44292,44292,44292,null,null,null,null,null,null,null,null,null,null,null,1]
[null,null,2021,null,null,"Otros gastos","Otros gastos","Otros gastos","HONORARIOS EDILES DE LA LOCALIDAD DE LA CANDELARIA POR LA ASISTENCIA A SESIONES REALIZADS DURANTE EL MES DE MARZO DE 2021 CONFORME A LAS ACTAS ANEXAS, RELACIÓN DE ASISTENCIA Y CAUSACIÓN CONTABLE.","Funcionamiento","Un Nuevo Contrato Social y Ambiental para la Bogotá del Siglo XXI","No aplica",null,null,"N/A",null,"79651441","ALVARO ENRIQUE SANCHEZ CARRILLO","Persona Natural",null,null,null,7492000,null,null,null,7492000,7492000,44292,44292,44292,null,null,null,null,null,null,null,null,null,null,null,1]
[null,null,2021,null,null,"Otros gastos","Otros gastos","Otros gastos","HONORARIOS EDILES DE LA LOCALIDAD DE LA CANDELARIA POR LA ASISTENCIA A SESIONES REALIZADS DURANTE EL MES DE MARZO DE 2021 CONFORME A LAS ACTAS ANEXAS, RELACIÓN DE ASISTENCIA Y CAUSACIÓN CONTABLE.","Funcionamiento","Un Nuevo Contrato Social y Ambiental para la Bogotá del Siglo XXI","No aplica",null,null,"N/A",null,"88141104","DAGOBERTO  RODRIGUEZ MARTINEZ","Persona Natural",null,null,null,7492000,null,null,null,7492000,7492000,44292,44292,44292,null,null,null,null,null,null,null,null,null,null,null,1]
[null,null,2021,null,null,"Otros gastos","Otros gastos","Otros gastos","HONORARIOS EDILES DE LA LOCALIDAD DE LA CANDELARIA POR LA ASISTENCIA A SESIONES REALIZADAS DURANTE EL MES DE ABRIL DE 2021, CONFORME A LAS ACTAS ANEXAS, RELACIÓN DE ASISTENCIA Y CAUSACIÓN CONTABLE.","Funcionamiento","Un Nuevo Contrato Social y Ambiental para la Bogotá del Siglo XXI","No aplica",null,null,"N/A",null,"1010160868","GINNA ALEXANDRA QUIROGA GAMBOA","Persona Natural",null,null,null,8121328,null,null,null,8121328,8121328,44320,44320,44320,null,null,null,null,null,null,null,null,null,null,null,1]
[null,null,2021,null,null,"Otros gastos","Otros gastos","Otros gastos","HONORARIOS EDILES DE LA LOCALIDAD DE LA CANDELARIA POR LA ASISTENCIA A SESIONES REALIZADAS DURANTE EL MES DE ABRIL DE 2021, CONFORME A LAS ACTAS ANEXAS, RELACIÓN DE ASISTENCIA Y CAUSACIÓN CONTABLE.","Funcionamiento","Un Nuevo Contrato Social y Ambiental para la Bogotá del Siglo XXI","No aplica",null,null,"N/A",null,"79593962","EDUARDO TITO GOMEZ CERON","Persona Natural",null,null,null,8121328,null,null,null,8121328,8121328,44320,44320,44320,null,null,null,null,null,null,null,null,null,null,null,1]
[null,null,2021,null,null,"Otros gastos","Otros gastos","Otros gastos","HONORARIOS EDILES DE LA LOCALIDAD DE LA CANDELARIA POR LA ASISTENCIA A SESIONES REALIZADAS DURANTE EL MES DE ABRIL DE 2021, CONFORME A LAS ACTAS ANEXAS, RELACIÓN DE ASISTENCIA Y CAUSACIÓN CONTABLE.","Funcionamiento","Un Nuevo Contrato Social y Ambiental para la Bogotá del Siglo XXI","No aplica",null,null,"N/A",null,"3838495","JUAN CAMILO CASTELLANOS MEDINA","Persona Natural",null,null,null,8121328,null,null,null,8121328,8121328,44320,44320,44320,null,null,null,null,null,null,null,null,null,null,null,1]
[null,null,2021,null,null,"Otros gastos","Otros gastos","Otros gastos","HONORARIOS EDILES DE LA LOCALIDAD DE LA CANDELARIA POR LA ASISTENCIA A SESIONES REALIZADAS DURANTE EL MES DE ABRIL DE 2021, CONFORME A LAS ACTAS ANEXAS, RELACIÓN DE ASISTENCIA Y CAUSACIÓN CONTABLE.","Funcionamiento","Un Nuevo Contrato Social y Ambiental para la Bogotá del Siglo XXI","No aplica",null,null,"N/A",null,"79687787","JUAN CARLOS MAHECHA ROBAYO","Persona Natural",null,null,null,8121328,null,null,null,8121328,8121328,44320,44320,44320,null,null,null,null,null,null,null,null,null,null,null,1]
[null,null,2021,null,null,"Otros gastos","Otros gastos","Otros gastos","HONORARIOS EDILES DE LA LOCALIDAD DE LA CANDELARIA POR LA ASISTENCIA A SESIONES REALIZADAS DURANTE EL MES DE ABRIL DE 2021, CONFORME A LAS ACTAS ANEXAS, RELACIÓN DE ASISTENCIA Y CAUSACIÓN CONTABLE.","Funcionamiento","Un Nuevo Contrato Social y Ambiental para la Bogotá del Siglo XXI","No aplica",null,null,"N/A",null,"1010209957","MIGUEL ANGEL RODRIGUEZ RODRIGUEZ","Persona Natural",null,null,null,8121328,null,null,null,8121328,8121328,44320,44320,44320,null,null,null,null,null,null,null,null,null,null,null,1]
[null,null,2021,null,null,"Otros gastos","Otros gastos","Otros gastos","HONORARIOS EDILES DE LA LOCALIDAD DE LA CANDELARIA POR LA ASISTENCIA A SESIONES REALIZADAS DURANTE EL MES DE ABRIL DE 2021, CONFORME A LAS ACTAS ANEXAS, RELACIÓN DE ASISTENCIA Y CAUSACIÓN CONTABLE.","Funcionamiento","Un Nuevo Contrato Social y Ambiental para la Bogotá del Siglo XXI","No aplica",null,null,"N/A",null,"79651441","ALVARO ENRIQUE SANCHEZ CARRILLO","Persona Natural",null,null,null,8121328,null,null,null,8121328,8121328,44320,44320,44320,null,null,null,null,null,null,null,null,null,null,null,1]
[null,null,2021,null,null,"Otros gastos","Otros gastos","Otros gastos","HONORARIOS EDILES DE LA LOCALIDAD DE LA CANDELARIA POR LA ASISTENCIA A SESIONES REALIZADAS DURANTE EL MES DE ABRIL DE 2021, CONFORME A LAS ACTAS ANEXAS, RELACIÓN DE ASISTENCIA Y CAUSACIÓN CONTABLE.","Funcionamiento","Un Nuevo Contrato Social y Ambiental para la Bogotá del Siglo XXI","No aplica",null,null,"N/A",null,"88141104","DAGOBERTO  RODRIGUEZ MARTINEZ","Persona Natural",null,null,null,8121328,null,null,null,8121328,8121328,44320,44320,44320,null,null,null,null,null,null,null,null,null,null,null,1]
[null,null,2021,null,null,"Otros gastos","Otros gastos","Otros gastos","HONORARIOS EDILES DE LA LOCALIDAD DE LA CANDELARIA POR LA ASISTENCIA A SESIONES DURANTE EL MES DE MAYO DE 2021.CONFORME A LAS ACTAS ANEXAS, PLANILLA DE ASISTENCIA Y CAUSACIÓN CONTABLE.","Funcionamiento","Un Nuevo Contrato Social y Ambiental para la Bogotá del Siglo XXI","No aplica",null,null,"N/A",null,"79593962","EDUARDO TITO GOMEZ CERON","Persona Natural",null,null,null,7649332,null,null,null,7649332,7649332,44349,44349,44349,null,null,null,null,null,null,null,null,null,null,null,1]
[null,null,2021,null,null,"Otros gastos","Otros gastos","Otros gastos","HONORARIOS EDILES DE LA LOCALIDAD DE LA CANDELARIA POR LA ASISTENCIA A SESIONES DURANTE EL MES DE MAYO DE 2021.CONFORME A LAS ACTAS ANEXAS, PLANILLA DE ASISTENCIA Y CAUSACIÓN CONTABLE.","Funcionamiento","Un Nuevo Contrato Social y Ambiental para la Bogotá del Siglo XXI","No aplica",null,null,"N/A",null,"3838495","JUAN CAMILO CASTELLANOS MEDINA","Persona Natural",null,null,null,7649332,null,null,null,7649332,7649332,44349,44349,44349,null,null,null,null,null,null,null,null,null,null,null,1]
[null,null,2021,null,null,"Otros gastos","Otros gastos","Otros gastos","HONORARIOS EDILES DE LA LOCALIDAD DE LA CANDELARIA POR LA ASISTENCIA A SESIONES DURANTE EL MES DE MAYO DE 2021.CONFORME A LAS ACTAS ANEXAS, PLANILLA DE ASISTENCIA Y CAUSACIÓN CONTABLE.","Funcionamiento","Un Nuevo Contrato Social y Ambiental para la Bogotá del Siglo XXI","No aplica",null,null,"N/A",null,"1010160868","GINNA ALEXANDRA QUIROGA GAMBOA","Persona Natural",null,null,null,7649332,null,null,null,7649332,7649332,44349,44349,44349,null,null,null,null,null,null,null,null,null,null,null,1]
[null,null,2021,null,null,"Otros gastos","Otros gastos","Otros gastos","HONORARIOS EDILES DE LA LOCALIDAD DE LA CANDELARIA POR LA ASISTENCIA A SESIONES DURANTE EL MES DE MAYO DE 2021.CONFORME A LAS ACTAS ANEXAS, PLANILLA DE ASISTENCIA Y CAUSACIÓN CONTABLE.","Funcionamiento","Un Nuevo Contrato Social y Ambiental para la Bogotá del Siglo XXI","No aplica",null,null,"N/A",null,"79687787","JUAN CARLOS MAHECHA ROBAYO","Persona Natural",null,null,null,7649332,null,null,null,7649332,7649332,44349,44349,44349,null,null,null,null,null,null,null,null,null,null,null,1]
[null,null,2021,null,null,"Otros gastos","Otros gastos","Otros gastos","HONORARIOS EDILES DE LA LOCALIDAD DE LA CANDELARIA POR LA ASISTENCIA A SESIONES DURANTE EL MES DE MAYO DE 2021.CONFORME A LAS ACTAS ANEXAS, PLANILLA DE ASISTENCIA Y CAUSACIÓN CONTABLE.","Funcionamiento","Un Nuevo Contrato Social y Ambiental para la Bogotá del Siglo XXI","No aplica",null,null,"N/A",null,"1010209957","MIGUEL ANGEL RODRIGUEZ RODRIGUEZ","Persona Natural",null,null,null,7649332,null,null,null,7649332,7649332,44349,44349,44349,null,null,null,null,null,null,null,null,null,null,null,1]
[null,null,2021,null,null,"Otros gastos","Otros gastos","Otros gastos","HONORARIOS EDILES DE LA LOCALIDAD DE LA CANDELARIA POR LA ASISTENCIA A SESIONES DURANTE EL MES DE MAYO DE 2021.CONFORME A LAS ACTAS ANEXAS, PLANILLA DE ASISTENCIA Y CAUSACIÓN CONTABLE.","Funcionamiento","Un Nuevo Contrato Social y Ambiental para la Bogotá del Siglo XXI","No aplica",null,null,"N/A",null,"79651441","ALVARO ENRIQUE SANCHEZ CARRILLO","Persona Natural",null,null,null,7649332,null,null,null,7649332,7649332,44349,44349,44349,null,null,null,null,null,null,null,null,null,null,null,1]
[null,null,2021,null,null,"Otros gastos","Otros gastos","Otros gastos","HONORARIOS EDILES DE LA LOCALIDAD DE LA CANDELARIA POR LA ASISTENCIA A SESIONES DURANTE EL MES DE MAYO DE 2021.CONFORME A LAS ACTAS ANEXAS, PLANILLA DE ASISTENCIA Y CAUSACIÓN CONTABLE.","Funcionamiento","Un Nuevo Contrato Social y Ambiental para la Bogotá del Siglo XXI","No aplica",null,null,"N/A",null,"88141104","DAGOBERTO  RODRIGUEZ MARTINEZ","Persona Natural",null,null,null,7649332,null,null,null,7649332,7649332,44349,44349,44349,null,null,null,null,null,null,null,null,null,null,null,1]
[null,null,2021,null,null,"Otros gastos","Otros gastos","Otros gastos","HONORARIOS EDILES DE LA LOCALIDAD DE LA CANDELARIA POR LA ASISTENCIA A SESIONES REALIZADAS DURANTE EL MES DE JUNIO DE 2021,  CONFORME A LAS ACTAS ANEXAS, PLANILLA DE ASISTENCIA Y CAUSACIÓN CONTABLES.","Funcionamiento","Un Nuevo Contrato Social y Ambiental para la Bogotá del Siglo XXI","No aplica",null,null,"N/A",null,"79593962","EDUARDO TITO GOMEZ CERON","Persona Natural",null,null,null,7649332,null,null,null,7649332,7649332,44379,44379,44379,null,null,null,null,null,null,null,null,null,null,null,1]
[null,null,2021,null,null,"Otros gastos","Otros gastos","Otros gastos","HONORARIOS EDILES DE LA LOCALIDAD DE LA CANDELARIA POR LA ASISTENCIA A SESIONES REALIZADAS DURANTE EL MES DE JUNIO DE 2021,  CONFORME A LAS ACTAS ANEXAS, PLANILLA DE ASISTENCIA Y CAUSACIÓN CONTABLES.","Funcionamiento","Un Nuevo Contrato Social y Ambiental para la Bogotá del Siglo XXI","No aplica",null,null,"N/A",null,"3838495","JUAN CAMILO CASTELLANOS MEDINA","Persona Natural",null,null,null,7649332,null,null,null,7649332,7649332,44379,44379,44379,null,null,null,null,null,null,null,null,null,null,null,1]
[null,null,2021,null,null,"Otros gastos","Otros gastos","Otros gastos","HONORARIOS EDILES DE LA LOCALIDAD DE LA CANDELARIA POR LA ASISTENCIA A SESIONES REALIZADAS DURANTE EL MES DE JUNIO DE 2021,  CONFORME A LAS ACTAS ANEXAS, PLANILLA DE ASISTENCIA Y CAUSACIÓN CONTABLES.","Funcionamiento","Un Nuevo Contrato Social y Ambiental para la Bogotá del Siglo XXI","No aplica",null,null,"N/A",null,"1010160868","GINNA ALEXANDRA QUIROGA GAMBOA","Persona Natural",null,null,null,7649332,null,null,null,7649332,7649332,44379,44379,44379,null,null,null,null,null,null,null,null,null,null,null,1]
[null,null,2021,null,null,"Otros gastos","Otros gastos","Otros gastos","HONORARIOS EDILES DE LA LOCALIDAD DE LA CANDELARIA POR LA ASISTENCIA A SESIONES REALIZADAS DURANTE EL MES DE JUNIO DE 2021,  CONFORME A LAS ACTAS ANEXAS, PLANILLA DE ASISTENCIA Y CAUSACIÓN CONTABLES.","Funcionamiento","Un Nuevo Contrato Social y Ambiental para la Bogotá del Siglo XXI","No aplica",null,null,"N/A",null,"79687787","JUAN CARLOS MAHECHA ROBAYO","Persona Natural",null,null,null,7649332,null,null,null,7649332,7649332,44379,44379,44379,null,null,null,null,null,null,null,null,null,null,null,1]
[null,null,2021,null,null,"Otros gastos","Otros gastos","Otros gastos","HONORARIOS EDILES DE LA LOCALIDAD DE LA CANDELARIA POR LA ASISTENCIA A SESIONES REALIZADAS DURANTE EL MES DE JUNIO DE 2021,  CONFORME A LAS ACTAS ANEXAS, PLANILLA DE ASISTENCIA Y CAUSACIÓN CONTABLES.","Funcionamiento","Un Nuevo Contrato Social y Ambiental para la Bogotá del Siglo XXI","No aplica",null,null,"N/A",null,"1010209957","MIGUEL ANGEL RODRIGUEZ RODRIGUEZ","Persona Natural",null,null,null,7649332,null,null,null,7649332,7649332,44379,44379,44379,null,null,null,null,null,null,null,null,null,null,null,1]
[null,null,2021,null,null,"Otros gastos","Otros gastos","Otros gastos","HONORARIOS EDILES DE LA LOCALIDAD DE LA CANDELARIA POR LA ASISTENCIA A SESIONES REALIZADAS DURANTE EL MES DE JUNIO DE 2021,  CONFORME A LAS ACTAS ANEXAS, PLANILLA DE ASISTENCIA Y CAUSACIÓN CONTABLES.","Funcionamiento","Un Nuevo Contrato Social y Ambiental para la Bogotá del Siglo XXI","No aplica",null,null,"N/A",null,"79651441","ALVARO ENRIQUE SANCHEZ CARRILLO","Persona Natural",null,null,null,7649332,null,null,null,7649332,7649332,44379,44379,44379,null,null,null,null,null,null,null,null,null,null,null,1]
[null,null,2021,null,null,"Otros gastos","Otros gastos","Otros gastos","HONORARIOS EDILES DE LA LOCALIDAD DE LA CANDELARIA POR LA ASISTENCIA A SESIONES REALIZADAS DURANTE EL MES DE JUNIO DE 2021,  CONFORME A LAS ACTAS ANEXAS, PLANILLA DE ASISTENCIA Y CAUSACIÓN CONTABLES.","Funcionamiento","Un Nuevo Contrato Social y Ambiental para la Bogotá del Siglo XXI","No aplica",null,null,"N/A",null,"88141104","DAGOBERTO  RODRIGUEZ MARTINEZ","Persona Natural",null,null,null,7649332,null,null,null,7649332,7649332,44379,44379,44379,null,null,null,null,null,null,null,null,null,null,null,1]
[null,null,2021,null,null,"Otros gastos","Otros gastos","Otros gastos","HONORARIOS EDILES DE LA LOCALIDAD DE LA CANDELARIA POR LA ASISTENCIA A SESIONES REALIZADAS DURANTE EL MES DE JULIO DE 2021, CONFORME A LAS ACTAANEXAS, PLANILLA DE ASISTENCIA Y CAUSACIÓN CONTABLE.","Funcionamiento","Un Nuevo Contrato Social y Ambiental para la Bogotá del Siglo XXI","No aplica",null,null,"N/A",null,"79593962","EDUARDO TITO GOMEZ CERON","Persona Natural",null,null,null,7649332,null,null,null,7649332,7649332,44410,44410,44410,null,null,null,null,null,null,null,null,null,null,null,1]
[null,null,2021,null,null,"Otros gastos","Otros gastos","Otros gastos","HONORARIOS EDILES DE LA LOCALIDAD DE LA CANDELARIA POR LA ASISTENCIA A SESIONES REALIZADAS DURANTE EL MES DE JULIO DE 2021, CONFORME A LAS ACTAANEXAS, PLANILLA DE ASISTENCIA Y CAUSACIÓN CONTABLE.","Funcionamiento","Un Nuevo Contrato Social y Ambiental para la Bogotá del Siglo XXI","No aplica",null,null,"N/A",null,"3838495","JUAN CAMILO CASTELLANOS MEDINA","Persona Natural",null,null,null,7649332,null,null,null,7649332,7649332,44410,44410,44410,null,null,null,null,null,null,null,null,null,null,null,1]
[null,null,2021,null,null,"Otros gastos","Otros gastos","Otros gastos","HONORARIOS EDILES DE LA LOCALIDAD DE LA CANDELARIA POR LA ASISTENCIA A SESIONES REALIZADAS DURANTE EL MES DE JULIO DE 2021, CONFORME A LAS ACTAANEXAS, PLANILLA DE ASISTENCIA Y CAUSACIÓN CONTABLE.","Funcionamiento","Un Nuevo Contrato Social y Ambiental para la Bogotá del Siglo XXI","No aplica",null,null,"N/A",null,"1010160868","GINNA ALEXANDRA QUIROGA GAMBOA","Persona Natural",null,null,null,7649332,null,null,null,7649332,7649332,44410,44410,44410,null,null,null,null,null,null,null,null,null,null,null,1]
[null,null,2021,null,null,"Otros gastos","Otros gastos","Otros gastos","HONORARIOS EDILES DE LA LOCALIDAD DE LA CANDELARIA POR LA ASISTENCIA A SESIONES REALIZADAS DURANTE EL MES DE JULIO DE 2021, CONFORME A LAS ACTAANEXAS, PLANILLA DE ASISTENCIA Y CAUSACIÓN CONTABLE.","Funcionamiento","Un Nuevo Contrato Social y Ambiental para la Bogotá del Siglo XXI","No aplica",null,null,"N/A",null,"79687787","JUAN CARLOS MAHECHA ROBAYO","Persona Natural",null,null,null,7649332,null,null,null,7649332,7649332,44410,44410,44410,null,null,null,null,null,null,null,null,null,null,null,1]
[null,null,2021,null,null,"Otros gastos","Otros gastos","Otros gastos","HONORARIOS EDILES DE LA LOCALIDAD DE LA CANDELARIA POR LA ASISTENCIA A SESIONES REALIZADAS DURANTE EL MES DE JULIO DE 2021, CONFORME A LAS ACTAANEXAS, PLANILLA DE ASISTENCIA Y CAUSACIÓN CONTABLE.","Funcionamiento","Un Nuevo Contrato Social y Ambiental para la Bogotá del Siglo XXI","No aplica",null,null,"N/A",null,"1010209957","MIGUEL ANGEL RODRIGUEZ RODRIGUEZ","Persona Natural",null,null,null,7649332,null,null,null,7649332,7649332,44410,44410,44410,null,null,null,null,null,null,null,null,null,null,null,1]
[null,null,2021,null,null,"Otros gastos","Otros gastos","Otros gastos","HONORARIOS EDILES DE LA LOCALIDAD DE LA CANDELARIA POR LA ASISTENCIA A SESIONES REALIZADAS DURANTE EL MES DE JULIO DE 2021, CONFORME A LAS ACTAANEXAS, PLANILLA DE ASISTENCIA Y CAUSACIÓN CONTABLE.","Funcionamiento","Un Nuevo Contrato Social y Ambiental para la Bogotá del Siglo XXI","No aplica",null,null,"N/A",null,"79651441","ALVARO ENRIQUE SANCHEZ CARRILLO","Persona Natural",null,null,null,7649332,null,null,null,7649332,7649332,44410,44410,44410,null,null,null,null,null,null,null,null,null,null,null,1]
[null,null,2021,null,null,"Otros gastos","Otros gastos","Otros gastos","HONORARIOS EDILES DE LA LOCALIDAD DE LA CANDELARIA POR LA ASISTENCIA A SESIONES REALIZADAS DURANTE EL MES DE JULIO DE 2021, CONFORME A LAS ACTAANEXAS, PLANILLA DE ASISTENCIA Y CAUSACIÓN CONTABLE.","Funcionamiento","Un Nuevo Contrato Social y Ambiental para la Bogotá del Siglo XXI","No aplica",null,null,"N/A",null,"88141104","DAGOBERTO  RODRIGUEZ MARTINEZ","Persona Natural",null,null,null,7649332,null,null,null,7649332,7649332,44410,44410,44410,null,null,null,null,null,null,null,null,null,null,null,1]
[null,null,2021,null,null,"Otros gastos","Otros gastos","Otros gastos","HONORARIOS EDILES DE LA LOCALIDAD DE LA CANDELARIA POR LA ASISTENCIA A SESIONES REALIZADAS DURANTE EL MES DE AGOSTO DE 2021,CONFORME A LAS ACTAS ANEXAS,PLANILLA DE ASISTENCIA Y CAUSACIÓN CONTABLE.","Funcionamiento","Un Nuevo Contrato Social y Ambiental para la Bogotá del Siglo XXI","No aplica",null,null,"N/A",null,"79593962","EDUARDO TITO GOMEZ CERON","Persona Natural",null,null,null,7649332,null,null,null,7649332,7649332,44440,44440,44440,null,null,null,null,null,null,null,null,null,null,null,1]
[null,null,2021,null,null,"Otros gastos","Otros gastos","Otros gastos","HONORARIOS EDILES DE LA LOCALIDAD DE LA CANDELARIA POR LA ASISTENCIA A SESIONES REALIZADAS DURANTE EL MES DE AGOSTO DE 2021,CONFORME A LAS ACTAS ANEXAS,PLANILLA DE ASISTENCIA Y CAUSACIÓN CONTABLE.","Funcionamiento","Un Nuevo Contrato Social y Ambiental para la Bogotá del Siglo XXI","No aplica",null,null,"N/A",null,"3838495","JUAN CAMILO CASTELLANOS MEDINA","Persona Natural",null,null,null,7649332,null,null,null,7649332,7649332,44440,44440,44440,null,null,null,null,null,null,null,null,null,null,null,1]
[null,null,2021,null,null,"Otros gastos","Otros gastos","Otros gastos","HONORARIOS EDILES DE LA LOCALIDAD DE LA CANDELARIA POR LA ASISTENCIA A SESIONES REALIZADAS DURANTE EL MES DE AGOSTO DE 2021,CONFORME A LAS ACTAS ANEXAS,PLANILLA DE ASISTENCIA Y CAUSACIÓN CONTABLE.","Funcionamiento","Un Nuevo Contrato Social y Ambiental para la Bogotá del Siglo XXI","No aplica",null,null,"N/A",null,"1010160868","GINNA ALEXANDRA QUIROGA GAMBOA","Persona Natural",null,null,null,7649332,null,null,null,7649332,7649332,44440,44440,44440,null,null,null,null,null,null,null,null,null,null,null,1]
[null,null,2021,null,null,"Otros gastos","Otros gastos","Otros gastos","HONORARIOS EDILES DE LA LOCALIDAD DE LA CANDELARIA POR LA ASISTENCIA A SESIONES REALIZADAS DURANTE EL MES DE AGOSTO DE 2021,CONFORME A LAS ACTAS ANEXAS,PLANILLA DE ASISTENCIA Y CAUSACIÓN CONTABLE.","Funcionamiento","Un Nuevo Contrato Social y Ambiental para la Bogotá del Siglo XXI","No aplica",null,null,"N/A",null,"79687787","JUAN CARLOS MAHECHA ROBAYO","Persona Natural",null,null,null,7649332,null,null,null,7649332,7649332,44440,44440,44440,null,null,null,null,null,null,null,null,null,null,null,1]
[null,null,2021,null,null,"Otros gastos","Otros gastos","Otros gastos","HONORARIOS EDILES DE LA LOCALIDAD DE LA CANDELARIA POR LA ASISTENCIA A SESIONES REALIZADAS DURANTE EL MES DE AGOSTO DE 2021,CONFORME A LAS ACTAS ANEXAS,PLANILLA DE ASISTENCIA Y CAUSACIÓN CONTABLE.","Funcionamiento","Un Nuevo Contrato Social y Ambiental para la Bogotá del Siglo XXI","No aplica",null,null,"N/A",null,"1010209957","MIGUEL ANGEL RODRIGUEZ RODRIGUEZ","Persona Natural",null,null,null,7649332,null,null,null,7649332,7649332,44440,44440,44440,null,null,null,null,null,null,null,null,null,null,null,1]
[null,null,2021,null,null,"Otros gastos","Otros gastos","Otros gastos","HONORARIOS EDILES DE LA LOCALIDAD DE LA CANDELARIA POR LA ASISTENCIA A SESIONES REALIZADAS DURANTE EL MES DE AGOSTO DE 2021,CONFORME A LAS ACTAS ANEXAS,PLANILLA DE ASISTENCIA Y CAUSACIÓN CONTABLE.","Funcionamiento","Un Nuevo Contrato Social y Ambiental para la Bogotá del Siglo XXI","No aplica",null,null,"N/A",null,"79651441","ALVARO ENRIQUE SANCHEZ CARRILLO","Persona Natural",null,null,null,7649332,null,null,null,7649332,7649332,44440,44440,44440,null,null,null,null,null,null,null,null,null,null,null,1]
[null,null,2021,null,null,"Otros gastos","Otros gastos","Otros gastos","HONORARIOS EDILES DE LA LOCALIDAD DE LA CANDELARIA POR LA ASISTENCIA A SESIONES REALIZADAS DURANTE EL MES DE AGOSTO DE 2021,CONFORME A LAS ACTAS ANEXAS,PLANILLA DE ASISTENCIA Y CAUSACIÓN CONTABLE.","Funcionamiento","Un Nuevo Contrato Social y Ambiental para la Bogotá del Siglo XXI","No aplica",null,null,"N/A",null,"88141104","DAGOBERTO  RODRIGUEZ MARTINEZ","Persona Natural",null,null,null,7649332,null,null,null,7649332,7649332,44440,44440,44440,null,null,null,null,null,null,null,null,null,null,null,1]
[null,null,2021,null,null,"Otros gastos","Otros gastos","Otros gastos","HONORARIOS EDILES DE LA LOCALIDAD DE LA CANDELARIA POR LA ASISTENCIA A SESIONES REALIZADAS DURANTE EL MES DE SEPTIEMBRE DE 2021, CONFORME A LASACTAS ADJUNTAS, PLANILLA DE ASISTENCIA Y CAUSACIÓN CONTABLE.","Funcionamiento","Un Nuevo Contrato Social y Ambiental para la Bogotá del Siglo XXI","No aplica",null,null,"N/A",null,"79593962","EDUARDO TITO GOMEZ CERON","Persona Natural",null,null,null,7649332,null,null,null,7649332,7649332,44470,44470,44470,null,null,null,null,null,null,null,null,null,null,null,1]
[null,null,2021,null,null,"Otros gastos","Otros gastos","Otros gastos","HONORARIOS EDILES DE LA LOCALIDAD DE LA CANDELARIA POR LA ASISTENCIA A SESIONES REALIZADAS DURANTE EL MES DE SEPTIEMBRE DE 2021, CONFORME A LASACTAS ADJUNTAS, PLANILLA DE ASISTENCIA Y CAUSACIÓN CONTABLE.","Funcionamiento","Un Nuevo Contrato Social y Ambiental para la Bogotá del Siglo XXI","No aplica",null,null,"N/A",null,"3838495","JUAN CAMILO CASTELLANOS MEDINA","Persona Natural",null,null,null,7649332,null,null,null,7649332,7649332,44470,44470,44470,null,null,null,null,null,null,null,null,null,null,null,1]
[null,null,2021,null,null,"Otros gastos","Otros gastos","Otros gastos","HONORARIOS EDILES DE LA LOCALIDAD DE LA CANDELARIA POR LA ASISTENCIA A SESIONES REALIZADAS DURANTE EL MES DE SEPTIEMBRE DE 2021, CONFORME A LASACTAS ADJUNTAS, PLANILLA DE ASISTENCIA Y CAUSACIÓN CONTABLE.","Funcionamiento","Un Nuevo Contrato Social y Ambiental para la Bogotá del Siglo XXI","No aplica",null,null,"N/A",null,"1010160868","GINNA ALEXANDRA QUIROGA GAMBOA","Persona Natural",null,null,null,7649332,null,null,null,7649332,7649332,44470,44470,44470,null,null,null,null,null,null,null,null,null,null,null,1]
[null,null,2021,null,null,"Otros gastos","Otros gastos","Otros gastos","HONORARIOS EDILES DE LA LOCALIDAD DE LA CANDELARIA POR LA ASISTENCIA A SESIONES REALIZADAS DURANTE EL MES DE SEPTIEMBRE DE 2021, CONFORME A LASACTAS ADJUNTAS, PLANILLA DE ASISTENCIA Y CAUSACIÓN CONTABLE.","Funcionamiento","Un Nuevo Contrato Social y Ambiental para la Bogotá del Siglo XXI","No aplica",null,null,"N/A",null,"79687787","JUAN CARLOS MAHECHA ROBAYO","Persona Natural",null,null,null,7649332,null,null,null,7649332,7649332,44470,44470,44470,null,null,null,null,null,null,null,null,null,null,null,1]
[null,null,2021,null,null,"Otros gastos","Otros gastos","Otros gastos","HONORARIOS EDILES DE LA LOCALIDAD DE LA CANDELARIA POR LA ASISTENCIA A SESIONES REALIZADAS DURANTE EL MES DE SEPTIEMBRE DE 2021, CONFORME A LASACTAS ADJUNTAS, PLANILLA DE ASISTENCIA Y CAUSACIÓN CONTABLE.","Funcionamiento","Un Nuevo Contrato Social y Ambiental para la Bogotá del Siglo XXI","No aplica",null,null,"N/A",null,"1010209957","MIGUEL ANGEL RODRIGUEZ RODRIGUEZ","Persona Natural",null,null,null,7649332,null,null,null,7649332,7649332,44470,44470,44470,null,null,null,null,null,null,null,null,null,null,null,1]
[null,null,2021,null,null,"Otros gastos","Otros gastos","Otros gastos","HONORARIOS EDILES DE LA LOCALIDAD DE LA CANDELARIA POR LA ASISTENCIA A SESIONES REALIZADAS DURANTE EL MES DE SEPTIEMBRE DE 2021, CONFORME A LASACTAS ADJUNTAS, PLANILLA DE ASISTENCIA Y CAUSACIÓN CONTABLE.","Funcionamiento","Un Nuevo Contrato Social y Ambiental para la Bogotá del Siglo XXI","No aplica",null,null,"N/A",null,"79651441","ALVARO ENRIQUE SANCHEZ CARRILLO","Persona Natural",null,null,null,7649332,null,null,null,7649332,7649332,44470,44470,44470,null,null,null,null,null,null,null,null,null,null,null,1]
[null,null,2021,null,null,"Otros gastos","Otros gastos","Otros gastos","HONORARIOS EDILES DE LA LOCALIDAD DE LA CANDELARIA POR LA ASISTENCIA A SESIONES REALIZADAS DURANTE EL MES DE SEPTIEMBRE DE 2021, CONFORME A LASACTAS ADJUNTAS, PLANILLA DE ASISTENCIA Y CAUSACIÓN CONTABLE.","Funcionamiento","Un Nuevo Contrato Social y Ambiental para la Bogotá del Siglo XXI","No aplica",null,null,"N/A",null,"88141104","DAGOBERTO  RODRIGUEZ MARTINEZ","Persona Natural",null,null,null,7649332,null,null,null,7649332,7649332,44470,44470,44470,null,null,null,null,null,null,null,null,null,null,null,1]
[null,null,2021,null,null,"Otros gastos","Otros gastos","Otros gastos","HONORARIOS EDILES DE LA LOCALIDAD DE LA CANDELARIA POR LA ASISTENCIA A SESIONES REALIZADAS DURANTE EL MES DE OCTUBRE DE 2021, CONFORME A LAS ACTAS ADJUNTAS, PLANILLA DE ASISTENCIA Y CAUSACIÓN CONTABLE.","Funcionamiento","Un Nuevo Contrato Social y Ambiental para la Bogotá del Siglo XXI","No aplica",null,null,"N/A",null,"79593962","EDUARDO TITO GOMEZ CERON","Persona Natural",null,null,null,7649332,null,null,null,7649332,7649332,44502,44502,44502,null,null,null,null,null,null,null,null,null,null,null,1]
[null,null,2021,null,null,"Otros gastos","Otros gastos","Otros gastos","HONORARIOS EDILES DE LA LOCALIDAD DE LA CANDELARIA POR LA ASISTENCIA A SESIONES REALIZADAS DURANTE EL MES DE OCTUBRE DE 2021, CONFORME A LAS ACTAS ADJUNTAS, PLANILLA DE ASISTENCIA Y CAUSACIÓN CONTABLE.","Funcionamiento","Un Nuevo Contrato Social y Ambiental para la Bogotá del Siglo XXI","No aplica",null,null,"N/A",null,"3838495","JUAN CAMILO CASTELLANOS MEDINA","Persona Natural",null,null,null,7649332,null,null,null,7649332,7649332,44502,44502,44502,null,null,null,null,null,null,null,null,null,null,null,1]
[null,null,2021,null,null,"Otros gastos","Otros gastos","Otros gastos","HONORARIOS EDILES DE LA LOCALIDAD DE LA CANDELARIA POR LA ASISTENCIA A SESIONES REALIZADAS DURANTE EL MES DE OCTUBRE DE 2021, CONFORME A LAS ACTAS ADJUNTAS, PLANILLA DE ASISTENCIA Y CAUSACIÓN CONTABLE.","Funcionamiento","Un Nuevo Contrato Social y Ambiental para la Bogotá del Siglo XXI","No aplica",null,null,"N/A",null,"1010160868","GINNA ALEXANDRA QUIROGA GAMBOA","Persona Natural",null,null,null,7649332,null,null,null,7649332,7649332,44502,44502,44502,null,null,null,null,null,null,null,null,null,null,null,1]
[null,null,2021,null,null,"Otros gastos","Otros gastos","Otros gastos","HONORARIOS EDILES DE LA LOCALIDAD DE LA CANDELARIA POR LA ASISTENCIA A SESIONES REALIZADAS DURANTE EL MES DE OCTUBRE DE 2021, CONFORME A LAS ACTAS ADJUNTAS, PLANILLA DE ASISTENCIA Y CAUSACIÓN CONTABLE.","Funcionamiento","Un Nuevo Contrato Social y Ambiental para la Bogotá del Siglo XXI","No aplica",null,null,"N/A",null,"79687787","JUAN CARLOS MAHECHA ROBAYO","Persona Natural",null,null,null,7649332,null,null,null,7649332,7649332,44502,44502,44502,null,null,null,null,null,null,null,null,null,null,null,1]
[null,null,2021,null,null,"Otros gastos","Otros gastos","Otros gastos","HONORARIOS EDILES DE LA LOCALIDAD DE LA CANDELARIA POR LA ASISTENCIA A SESIONES REALIZADAS DURANTE EL MES DE OCTUBRE DE 2021, CONFORME A LAS ACTAS ADJUNTAS, PLANILLA DE ASISTENCIA Y CAUSACIÓN CONTABLE.","Funcionamiento","Un Nuevo Contrato Social y Ambiental para la Bogotá del Siglo XXI","No aplica",null,null,"N/A",null,"1010209957","MIGUEL ANGEL RODRIGUEZ RODRIGUEZ","Persona Natural",null,null,null,7649332,null,null,null,7649332,7649332,44502,44502,44502,null,null,null,null,null,null,null,null,null,null,null,1]
[null,null,2021,null,null,"Otros gastos","Otros gastos","Otros gastos","HONORARIOS EDILES DE LA LOCALIDAD DE LA CANDELARIA POR LA ASISTENCIA A SESIONES REALIZADAS DURANTE EL MES DE OCTUBRE DE 2021, CONFORME A LAS ACTAS ADJUNTAS, PLANILLA DE ASISTENCIA Y CAUSACIÓN CONTABLE.","Funcionamiento","Un Nuevo Contrato Social y Ambiental para la Bogotá del Siglo XXI","No aplica",null,null,"N/A",null,"79651441","ALVARO ENRIQUE SANCHEZ CARRILLO","Persona Natural",null,null,null,7649332,null,null,null,7649332,7649332,44502,44502,44502,null,null,null,null,null,null,null,null,null,null,null,1]
[null,null,2021,null,null,"Otros gastos","Otros gastos","Otros gastos","HONORARIOS EDILES DE LA LOCALIDAD DE LA CANDELARIA POR LA ASISTENCIA A SESIONES REALIZADAS DURANTE EL MES DE OCTUBRE DE 2021, CONFORME A LAS ACTAS ADJUNTAS, PLANILLA DE ASISTENCIA Y CAUSACIÓN CONTABLE.","Funcionamiento","Un Nuevo Contrato Social y Ambiental para la Bogotá del Siglo XXI","No aplica",null,null,"N/A",null,"88141104","DAGOBERTO  RODRIGUEZ MARTINEZ","Persona Natural",null,null,null,7649332,null,null,null,7649332,7649332,44502,44502,44502,null,null,null,null,null,null,null,null,null,null,null,1]
[null,null,2021,null,null,"Otros gastos","Otros gastos","Otros gastos","HONORARIOS EDILES DE LA LOCALIDAD DE LA CANDELARIA POR LA ASISTENCIA SE SIONES REALIZADAS. CONFORME A LAS ACTAS ANEXAS, PLANILLA DE ASISTENCIA YCAUSACIÓN CONTABLE.","Funcionamiento","Un Nuevo Contrato Social y Ambiental para la Bogotá del Siglo XXI","No aplica",null,null,"N/A",null,"79593962","EDUARDO TITO GOMEZ CERON","Persona Natural",null,null,null,7649332,null,null,null,7649332,7649332,44532,44532,44532,null,null,null,null,null,null,null,null,null,null,null,1]
[null,null,2021,null,null,"Otros gastos","Otros gastos","Otros gastos","HONORARIOS EDILES DE LA LOCALIDAD DE LA CANDELARIA POR LA ASISTENCIA SE SIONES REALIZADAS. CONFORME A LAS ACTAS ANEXAS, PLANILLA DE ASISTENCIA YCAUSACIÓN CONTABLE.","Funcionamiento","Un Nuevo Contrato Social y Ambiental para la Bogotá del Siglo XXI","No aplica",null,null,"N/A",null,"3838495","JUAN CAMILO CASTELLANOS MEDINA","Persona Natural",null,null,null,7649332,null,null,null,7649332,7649332,44532,44532,44532,null,null,null,null,null,null,null,null,null,null,null,1]
[null,null,2021,null,null,"Otros gastos","Otros gastos","Otros gastos","HONORARIOS EDILES DE LA LOCALIDAD DE LA CANDELARIA POR LA ASISTENCIA SE SIONES REALIZADAS. CONFORME A LAS ACTAS ANEXAS, PLANILLA DE ASISTENCIA YCAUSACIÓN CONTABLE.","Funcionamiento","Un Nuevo Contrato Social y Ambiental para la Bogotá del Siglo XXI","No aplica",null,null,"N/A",null,"1010160868","GINNA ALEXANDRA QUIROGA GAMBOA","Persona Natural",null,null,null,7649332,null,null,null,7649332,7649332,44532,44532,44532,null,null,null,null,null,null,null,null,null,null,null,1]
[null,null,2021,null,null,"Otros gastos","Otros gastos","Otros gastos","HONORARIOS EDILES DE LA LOCALIDAD DE LA CANDELARIA POR LA ASISTENCIA SE SIONES REALIZADAS. CONFORME A LAS ACTAS ANEXAS, PLANILLA DE ASISTENCIA YCAUSACIÓN CONTABLE.","Funcionamiento","Un Nuevo Contrato Social y Ambiental para la Bogotá del Siglo XXI","No aplica",null,null,"N/A",null,"79687787","JUAN CARLOS MAHECHA ROBAYO","Persona Natural",null,null,null,7649332,null,null,null,7649332,7649332,44532,44532,44532,null,null,null,null,null,null,null,null,null,null,null,1]
[null,null,2021,null,null,"Otros gastos","Otros gastos","Otros gastos","HONORARIOS EDILES DE LA LOCALIDAD DE LA CANDELARIA POR LA ASISTENCIA SE SIONES REALIZADAS. CONFORME A LAS ACTAS ANEXAS, PLANILLA DE ASISTENCIA YCAUSACIÓN CONTABLE.","Funcionamiento","Un Nuevo Contrato Social y Ambiental para la Bogotá del Siglo XXI","No aplica",null,null,"N/A",null,"1010209957","MIGUEL ANGEL RODRIGUEZ RODRIGUEZ","Persona Natural",null,null,null,7649332,null,null,null,7649332,7649332,44532,44532,44532,null,null,null,null,null,null,null,null,null,null,null,1]
[null,null,2021,null,null,"Otros gastos","Otros gastos","Otros gastos","HONORARIOS EDILES DE LA LOCALIDAD DE LA CANDELARIA POR LA ASISTENCIA SE SIONES REALIZADAS. CONFORME A LAS ACTAS ANEXAS, PLANILLA DE ASISTENCIA YCAUSACIÓN CONTABLE.","Funcionamiento","Un Nuevo Contrato Social y Ambiental para la Bogotá del Siglo XXI","No aplica",null,null,"N/A",null,"79651441","ALVARO ENRIQUE SANCHEZ CARRILLO","Persona Natural",null,null,null,7649332,null,null,null,7649332,7649332,44532,44532,44532,null,null,null,null,null,null,null,null,null,null,null,1]
[null,null,2021,null,null,"Otros gastos","Otros gastos","Otros gastos","HONORARIOS EDILES DE LA LOCALIDAD DE LA CANDELARIA POR LA ASISTENCIA SE SIONES REALIZADAS. CONFORME A LAS ACTAS ANEXAS, PLANILLA DE ASISTENCIA YCAUSACIÓN CONTABLE.","Funcionamiento","Un Nuevo Contrato Social y Ambiental para la Bogotá del Siglo XXI","No aplica",null,null,"N/A",null,"88141104","DAGOBERTO  RODRIGUEZ MARTINEZ","Persona Natural",null,null,null,7649332,null,null,null,7649332,7649332,44532,44532,44532,null,null,null,null,null,null,null,null,null,null,null,{"$f":"IF(ISERROR(AB424/AA424),\"-\",(AB424/AA424))","v":1}]
[null,null,2021,null,null,"Otros gastos","Otros gastos","Otros gastos","HONORARIOS EDILES DE LA LOCALIDAD DE LA CANDELARIA POR LA ASISTENCIA SE SIONES REALIZADAS. CONFORME A LAS ACTAS ANEXAS, PLANILLA DE ASISTENCIA YCAUSACIÓN CONTABLE.","Funcionamiento","Un Nuevo Contrato Social y Ambiental para la Bogotá del Siglo XXI","No aplica",null,null,"N/A",null,"79593962","EDUARDO TITO GOMEZ CERON","Persona Natural",null,null,null,7649332,null,null,null,7649332,7649332,44560,44560,44560,null,null,null,null,null,null,null,null,null,null,null,1]
[null,null,2021,null,null,"Otros gastos","Otros gastos","Otros gastos","HONORARIOS EDILES DE LA LOCALIDAD DE LA CANDELARIA POR LA ASISTENCIA SE SIONES REALIZADAS. CONFORME A LAS ACTAS ANEXAS, PLANILLA DE ASISTENCIA YCAUSACIÓN CONTABLE.","Funcionamiento","Un Nuevo Contrato Social y Ambiental para la Bogotá del Siglo XXI","No aplica",null,null,"N/A",null,"3838495","JUAN CAMILO CASTELLANOS MEDINA","Persona Natural",null,null,null,7649332,null,null,null,7649332,7649332,44560,44560,44560,null,null,null,null,null,null,null,null,null,null,null,1]
[null,null,2021,null,null,"Otros gastos","Otros gastos","Otros gastos","HONORARIOS EDILES DE LA LOCALIDAD DE LA CANDELARIA POR LA ASISTENCIA SE SIONES REALIZADAS. CONFORME A LAS ACTAS ANEXAS, PLANILLA DE ASISTENCIA YCAUSACIÓN CONTABLE.","Funcionamiento","Un Nuevo Contrato Social y Ambiental para la Bogotá del Siglo XXI","No aplica",null,null,"N/A",null,"1010160868","GINNA ALEXANDRA QUIROGA GAMBOA","Persona Natural",null,null,null,7649332,null,null,null,7649332,7649332,44560,44560,44560,null,null,null,null,null,null,null,null,null,null,null,1]
[null,null,2021,null,null,"Otros gastos","Otros gastos","Otros gastos","HONORARIOS EDILES DE LA LOCALIDAD DE LA CANDELARIA POR LA ASISTENCIA SE SIONES REALIZADAS. CONFORME A LAS ACTAS ANEXAS, PLANILLA DE ASISTENCIA YCAUSACIÓN CONTABLE.","Funcionamiento","Un Nuevo Contrato Social y Ambiental para la Bogotá del Siglo XXI","No aplica",null,null,"N/A",null,"79687787","JUAN CARLOS MAHECHA ROBAYO","Persona Natural",null,null,null,7649332,null,null,null,7649332,7649332,44560,44560,44560,null,null,null,null,null,null,null,null,null,null,null,1]
[null,null,2021,null,null,"Otros gastos","Otros gastos","Otros gastos","HONORARIOS EDILES DE LA LOCALIDAD DE LA CANDELARIA POR LA ASISTENCIA SE SIONES REALIZADAS. CONFORME A LAS ACTAS ANEXAS, PLANILLA DE ASISTENCIA YCAUSACIÓN CONTABLE.","Funcionamiento","Un Nuevo Contrato Social y Ambiental para la Bogotá del Siglo XXI","No aplica",null,null,"N/A",null,"1010209957","MIGUEL ANGEL RODRIGUEZ RODRIGUEZ","Persona Natural",null,null,null,7649332,null,null,null,7649332,7649332,44560,44560,44560,null,null,null,null,null,null,null,null,null,null,null,1]
[null,null,2021,null,null,"Otros gastos","Otros gastos","Otros gastos","HONORARIOS EDILES DE LA LOCALIDAD DE LA CANDELARIA POR LA ASISTENCIA SE SIONES REALIZADAS. CONFORME A LAS ACTAS ANEXAS, PLANILLA DE ASISTENCIA YCAUSACIÓN CONTABLE.","Funcionamiento","Un Nuevo Contrato Social y Ambiental para la Bogotá del Siglo XXI","No aplica",null,null,"N/A",null,"79651441","ALVARO ENRIQUE SANCHEZ CARRILLO","Persona Natural",null,null,null,7649332,null,null,null,7649332,7649332,44560,44560,44560,null,null,null,null,null,null,null,null,null,null,null,1]
[null,null,2021,null,null,"Otros gastos","Otros gastos","Otros gastos","HONORARIOS EDILES DE LA LOCALIDAD DE LA CANDELARIA POR LA ASISTENCIA SE SIONES REALIZADAS. CONFORME A LAS ACTAS ANEXAS, PLANILLA DE ASISTENCIA YCAUSACIÓN CONTABLE.","Funcionamiento","Un Nuevo Contrato Social y Ambiental para la Bogotá del Siglo XXI","No aplica",null,null,"N/A",null,"88141104","DAGOBERTO  RODRIGUEZ MARTINEZ","Persona Natural",null,null,null,7649332,null,null,null,7649332,7649332,44560,44560,44560,null,null,null,null,null,null,null,null,null,null,null,1]
[null,null,2021,null,null,"Otros gastos","Otros gastos","Otros gastos","CONTRATAR LOS SEGUROS QUE AMPAREN LOS INTERESES PATRIMONIALES ACTUALES Y FUTUROS, ASÍ COMO LOS BIENES DE PROPIEDAD DE EL FONDO DE DESARROLLO LOCAL DE LA CANDELARIA, QUE ESTÉN BAJO SU RESPONSABILIDAD Y CUSTODIA Y AQUELLOS QUE SEAN ADQUIRIDOS PARA DESARROLLAR LAS FUNCIONES INHERENTES A SU ACTIVIDAD Y CUALQUIER OTRA PÓLIZA DE SEGUROS QUE REQUIERA LA ENTIDAD EN EL DESARROLLO DE SU ACTIVIDAD”","Funcionamiento","Un Nuevo Contrato Social y Ambiental para la Bogotá del Siglo XXI","No aplica",null,null,"N/A",null,"860002400","LA PREVISORA S A COMPAÑIA DE SEGUROS","Persona Jurídica",null,null,null,4129811,null,null,null,4129811,4129811,null,null,null,null,null,null,null,null,null,null,null,null,null,null,1]
[null,null,2021,null,null,"Otros gastos","Otros gastos","Otros gastos","pago de salud por mi planilla","Funcionamiento","Un Nuevo Contrato Social y Ambiental para la Bogotá del Siglo XXI","No aplica",null,null,"N/A",null,"830113831","ALIANSALUD ENTIDAD PROMOTORA DE SALUD S. A","Persona Jurídica",null,null,null,6693400,null,null,null,6693400,6693400,null,null,null,null,null,null,null,null,null,null,null,null,null,null,1]
[null,null,2021,null,null,"Otros gastos","Otros gastos","Otros gastos","pago de salud por mi planilla","Funcionamiento","Un Nuevo Contrato Social y Ambiental para la Bogotá del Siglo XXI","No aplica",null,null,"N/A",null,860066942,"CAJA DE COMPENSACION FAMILIAR COMPENSAR","Persona Jurídica",null,null,null,12410800,null,null,null,11474300,11474300,null,null,null,null,null,null,null,null,null,null,null,null,null,null,1]
[null,null,2021,null,null,"Otros gastos","Otros gastos","Otros gastos","pago de salud por mi planilla","Funcionamiento","Un Nuevo Contrato Social y Ambiental para la Bogotá del Siglo XXI","No aplica",null,null,"N/A",null,899999115,"EMPRESA DE TELECOMUNICACIONES DE BOGOTÁ S.A. E.S.P. - ETB S.A. ESP","Persona Jurídica",null,null,null,37000000,null,null,null,37000000,35456391,44221,44221,44559,null,null,null,null,null,null,null,null,null,null,null,0.9582808378378378]
[null,null,2021,null,null,"Otros gastos","Otros gastos","Otros gastos","pago de salud por mi planilla","Funcionamiento","Un Nuevo Contrato Social y Ambiental para la Bogotá del Siglo XXI","No aplica",null,null,"N/A",null,"830003564","ENTIDAD PROMOTORA DE SALUD FAMISANAR S.A .S","Persona Jurídica",null,null,null,11474300,null,null,null,11474300,11474300,44228,44228,44560,null,null,null,null,null,null,null,null,null,null,null,1]
[null,null,2021,null,null,"Otros gastos","Otros gastos","Otros gastos","pago de salud por mi planilla","Funcionamiento","Un Nuevo Contrato Social y Ambiental para la Bogotá del Siglo XXI","No aplica",null,null,"N/A",null,"800251440","ENTIDAD PROMOTORA DE SALUD SANITAS S.A.S","Persona Jurídica",null,null,null,45897200,null,null,null,45897200,45897200,44228,44228,44560,null,null,null,null,null,null,null,null,null,null,null,1]
[null,null,2021,null,null,"Otros gastos","Otros gastos","Otros gastos","pago de salud por mi planilla","Funcionamiento","Un Nuevo Contrato Social y Ambiental para la Bogotá del Siglo XXI","No aplica",null,null,"N/A",null,900156264,"NUEVA EMPRESA PROMOTORA DE SALUD S.A.","Persona Jurídica",null,null,null,3844400,null,null,null,3844400,3844400,44258,44258,44349,null,null,null,null,null,null,null,null,null,null,null,1]
[1,407,2020,"FDLC-CPS-117-2020","https://community.secop.gov.co/Public/Tendering/OpportunityDetail/Index?noticeUID=CO1.NTC.1284401&isFromPublicArea=True&isModal=False","Contratos de prestación de servicios","Licitación pública","No aplica","ADICIONAR Y PRORROGAR EL CONTRATO DE PRESTACIÓN DE SERVICIOS No. 117 DE 2020 EL CUAL TIENE POR OBJETO: PRESTACION DEL SERVICIO DE VIGILANCIA Y SEGURIDAD PRIVADA INTEGRAL PERMANENTE PARA TODOS LOS BIENES MUEBLES E INMUEBLES DE PROPIEDAD DE LA ENTIDAD Y DE LOS QUE LEGALMENTE SEA O LLEGAREA SER RESPONSABLE EL FONDO DE DESARROLLO LOCAL DE LA CANDELARIA.","Funcionamiento","Un Nuevo Contrato Social y Ambiental para la Bogotá del Siglo XXI","No aplica",null,null,"N/A",20,"860011268","AMCOVIT LTDA","Persona Jurídica",null,null,null,null,null,1,99361322,99361322,99361322,44251,44251,44286,33,1,37,null,null,null,null,null,null,"X",null,1]
[null,null,2021,null,null,"Otros gastos","Otros gastos","Otros gastos","pago de salud por mi planilla","Funcionamiento","Un Nuevo Contrato Social y Ambiental para la Bogotá del Siglo XXI","No aplica",null,null,"N/A",null,"860045904","CAJA DE COMPENSACION FAMILIAR DE CUNDINA MARCA COMFACUNDI","Persona Jurídica",null,null,null,936500,null,null,null,936500,936500,null,null,null,null,null,null,null,null,null,null,null,null,null,null,1]
[null,null,2021,null,null,"Otros gastos","Otros gastos","Otros gastos","Obligaciones por Pagar Vigencia Anterior","Funcionamiento","Un Nuevo Contrato Social y Ambiental para la Bogotá del Siglo XXI","No aplica",null,null,"N/A",null,null,null,null,null,null,null,359231126,null,null,null,332303492,324470066,null,null,null,null,null,null,null,null,null,null,null,null,null,null,1]
[null,"Total",null,null,null,null,null,null,null,null,null,null,null,null,null,null,null,null,null,null,null,null,{"$f":"SUM(W14:W441)","v":12456171100.91},{"$f":"SUM(X14:X438)","v":-224730167},73,537080069,{"$f":"SUM(AA14:AA439)","v":12506778198.91},{"$f":"SUM(AB14:AB441)","v":9847340586},null,null,null,null,null,null,null,null,null,null,null,null,null,null,{"$f":"SUM(AQ14:AQ234)","v":142.86635816807251}]
[]
[null,null,null,null,null,null,null,null,null,null,null,null,null,null,null,null,901465521,null,null,null,null,null,{"$f":"W442+Z442","v":12993251169.91},null,10392042514,10486819847.1,{"$f":"+Z444-Y444","v":94777333.100000381}]
[]
[null,null,null,null,null,null,null,null,null,null,null,null,null,null,null,null,null,null,null,null,null,null,"TOTAL",null,null,"GIROS",null,{"$f":"AB17+AB20+AB49+AB110+AB111+AB122","v":181375198}]
[null,null,null,null,null,null,null,null,null,null,null,null,null,null,null,null,null,null,null,null,"MATRIZ CALCULO",null,{"$f":"+SUBTOTAL(9,AA14:AA439)","v":1067423230},null,null,{"$f":"+SUBTOTAL(9,AB14:AB439)","v":937151552},7688593159]
[null,null,null,null,null,null,null,null,null,null,null,null,null,null,null,null,null,null,null,null,"CRP","INVERSION",10392042514,null,null,7688593159]
[null,null,null,null,null,null,null,null,null,null,null,null,null,null,null,null,null,null,null,null,null,"FUNCIONAMIENTO",2115672185,null,null,1834277361,null,"MATRIZ VEE","TOTAL","CRP","TOTAL"]
[null,null,null,null,null,null,null,null,null,null,null,null,null,null,null,null,null,null,null,null,null,null,"COMPROMETIDO",null,"GIRADO",null,null,1605,{"$f":"+AB35+AB42+AB69+AB73+AB76+AB136+AB171+AB226+AB235+AB236+AB237+AB238+AB239+AB240","v":2057935613},null,2057935613]
[null,null,null,null,null,null,null,null,null,null,null,null,null,null,null,null,null,null,null,null,"TOTAL PRESUPUESTO","INVERSION",10392042514,null,7688593159,null,null,1605,"NADA"]
[null,null,null,null,null,null,null,null,null,null,null,null,null,null,null,null,null,null,null,null,null,"FUNCIONAMIENTO",2115672185,null,1834277361,null,null,1608,{"$f":"+AB98+AB170+AB193+AB194+AB195+AB196+AB197+AB228","v":20448000},null,20448000]
[null,null,null,null,null,null,null,null,null,null,null,null,null,null,null,null,null,null,null,null,null,null,{"$f":"+W451+W452","v":12507714699},null,{"$f":"+Y452+Y451","v":9522870520},null,null,1606,{"$f":"+AB99","v":30672000},null,30672000]
[null,null,null,null,null,null,null,null,null,null,null,null,null,null,null,null,null,null,null,null,null,null,null,null,null,null,null,1607,{"$f":"+AA100+AA116","v":860583000},null,860583000]
[null,null,null,null,null,null,null,null,null,null,null,null,null,null,null,null,null,null,null,null,null,null,null,null,null,null,null,1607,"NADA"]
[null,null,null,null,null,null,null,null,null,null,null,null,null,null,null,null,null,null,null,null,null,null,null,null,null,null,null,1625,{"$f":"+AB89+AB91+AB103+AB104+AB101+AB151+AB176+AB180+AB183+AB198+AB90+AB92+AB211+AB219+AB241+AB242+AB243+AB244+AB245+AB246","v":1042491458},null,1042491458]
[null,null,null,null,null,null,null,null,null,null,null,null,null,null,null,null,null,null,null,null,null,null,null,null,null,null,null,1625,"NADA"]
[null,null,null,null,null,null,null,null,null,null,null,null,null,null,null,null,null,null,null,null,null,null,null,null,null,null,null,1626,{"$f":"SUM(AB51,AB56,AB106,AB175,AB188,AB200,AB201,AB202,AB203,AB204,AB207,AB208,AB209,AB212,AB215,AB247,AB248,AB249,AB250,AB251,AB252,AB253,AB254)","v":131902117},null,131902117]
[null,null,null,null,null,null,null,null,null,null,null,null,null,null,null,null,null,null,null,null,null,null,null,null,null,null,null,1628,{"$f":"SUM(AB45,AB46,AB47,AB53,AB68,AB72,AB78,AB113,AB119,AB137,AB141,AB172,AB173,AB179,AB184,AB189,AB255,AB256,AB257,AB258,AB259,AB260,AB261,AB262)","v":1106824335},null,1106824335]
[null,null,null,null,null,null,null,null,null,null,null,null,null,null,null,null,null,null,null,null,null,null,null,null,null,null,null,1628,"NADA"]
[null,null,null,null,null,null,null,null,null,null,null,null,null,null,null,null,null,null,null,null,null,null,null,null,null,null,null,1628,"NADA"]
[null,null,null,null,null,null,null,null,null,null,null,null,null,null,null,null,null,null,null,null,null,null,null,null,null,null,null,1628,"NADA"]
[null,null,null,null,null,null,null,null,null,null,null,null,null,null,null,null,null,null,null,null,null,null,null,null,null,null,null,1662,{"$f":"SUM(AB60,AB71,AB153,AB154,AB155,AB156,AB157,AB158,AB159,AB160,AB161,AB162,AB163,AB164,AB165,AB166,AB178,AB181,AB223)","v":158576118},null,158576118]
[null,null,null,null,null,null,null,null,null,null,null,null,null,null,null,null,null,null,null,null,null,null,null,null,null,null,null,1662,"NADA"]
[null,null,null,null,null,null,null,null,null,null,null,null,null,null,null,null,null,null,null,null,null,null,null,null,null,null,null,1663,{"$f":"SUM(AB61,AB80,AB152,AB167,AB182,AB190,AB224)","v":74232297},null,74232297]
[null,null,null,null,null,null,null,null,null,null,null,null,null,null,null,null,null,null,null,null,null,null,null,null,null,null,null,1664,{"$f":"SUM(AB185,AB191)","v":0},null,0]
[null,null,null,null,null,null,null,null,null,null,null,null,null,null,null,null,null,null,null,null,null,null,null,null,null,null,null,1664,"NADA"]
[null,null,null,null,null,null,null,null,null,null,null,null,null,null,null,null,null,null,null,null,null,null,null,null,null,null,null,1704,{"$f":"SUM(AB59,AB109,AB124,AB149,AB232,AB263,AB264,AB265,AB266,AB267,AB268,AB269,AB270)","v":134005935},null,134005935]
[null,null,null,null,null,null,null,null,null,null,null,null,null,null,null,null,null,null,null,null,null,null,null,null,null,null,null,1781,{"$f":"SUM(AB57,AB146,AB168,AB192,AB199,AB225)","v":47818400},null,47818400]
[null,null,null,null,null,null,null,null,null,null,null,null,null,null,null,null,null,null,null,null,null,null,null,null,null,null,null,1785,{"$f":"SUM(AB43,AB82,AB83,AB84,AB85,AB86,AB87,AB93,AB94,AB271,AB272,AB273,AB274,AB275,AB276,AB277,AB278)","v":182027430},null,182027430]
[null,null,null,null,null,null,null,null,null,null,null,null,null,null,null,null,null,null,null,null,null,null,null,null,null,null,null,1786,{"$f":"SUM(AB52,AB95,AB102,AB108,AB216,AB218,AB220,AB222,AB227,AB229,AB230,AB231,AB279,AB280,AB281,AB282,AB283,AB284,AB285,AB286)","v":99454011},null,99454011]
[null,null,null,null,null,null,null,null,null,null,null,null,null,null,null,null,null,null,null,null,null,null,null,null,null,null,null,2019,{"$f":"SUM(AB41,AB70,AB81,AB107,AB112,AB123,AB145,AB169,AB217)","v":150927414},null,150927414]
[null,null,null,null,null,null,null,null,null,null,null,null,null,null,null,null,null,null,null,null,null,null,null,null,null,null,null,2020,"NADA"]
[null,null,null,null,null,null,null,null,null,null,null,null,null,null,null,null,null,null,null,null,null,null,null,null,null,null,null,2020,{"$f":"SUM(AB17,AB20,AB49,AB110,AB111,AB122,AB213,AB214,AB233,AB234)","v":181375198},null,181375198]
[null,null,null,null,null,null,null,null,null,null,null,null,null,null,null,null,null,null,null,null,null,null,null,null,null,null,null,2021,{"$f":"SUM(AB14,AB15,AB16,AB18,AB19,AB21,AB22,AB23,AB25,AB26,AB28,AB29,AB30,AB31,AB33,AB34,AB37,AB38,AB48,AB50,AB54,AB55,AB63,AB64,AB65,AB88,AB96,AB97,AB105,AB120,AB121,AB126,AB129,AB133,AB134,AB144,AB148,AB150,AB177,AB205,AB221,AB287,AB288,AB289,AB290,AB291,AB292,AB293,AB294)","v":977144733},null,977144733]
[null,null,null,null,null,null,null,null,null,null,null,null,null,null,null,null,null,null,null,null,null,null,null,null,null,null,null,2021,"NADA"]
[null,null,null,null,null,null,null,null,null,null,null,null,null,null,null,null,null,null,null,null,null,null,null,null,null,null,null,2023,{"$f":"SUM(AB24,AB27,AB32,AB36,AB39,AB40,AB44,AB58,AB62,AB77,AB127,AB128,AB130,AB131,AB132,AB135,AB138,AB139,AB140,AB142,AB143,AB147,AB295,AB296,AB297,AB298,AB299,AB300,AB301,AB302)","v":432175100},null,432175100]
[]
[null,null,null,null,null,null,null,null,null,null,null,null,null,null,null,null,null,null,null,null,null,null,null,null,null,null,null,null,{"$f":"SUM(AC450,AC452,AC453,AC454,AC456,AC458,AC459,AC463,AC465,AC466,AC468,AC469,AC470,AC471,AC472,AC474,AC475,AC477)","v":7688593159}]

{"sheet":"2. PAA","index":5,"n_rows":22,"n_cols":7,"rows_kept":22,"cut":false,"hidden":false,"merged":[[20,2,20,4],[9,1,9,6],[6,2,6,3],[6,5,6,6],[2,1,2,7],[3,1,3,7],[4,1,4,7],[5,2,5,3],[5,5,5,6]]}
[]
[]
[null,"PLAN ANUAL DE ADQUISIONES"]
[null,2021]
[]
[null,"Entidad","Alcaldia Local de La Candelaria",null,"Sector","Central"]
[null,"Responsable diligenciamiento","Katherin Johana Moreno Castañeda",null,"Número contacto y correo electrónico","3043754932- katherin.moreno@gobiernobogota.gov.co"]
[]
[]
[null,"A continuación registre la información del Plan Anual de Adquisiciones vigencia 2021,  diligencie el presupuesto total,  el presupuesto programado y contratado del 1 de septiembre al 31 de diciembre de 2021, igualmente la fecha de la primera y ultima públicación del PAA en SECOP, y el número de modificaciones realizadas."]
[]
[null,"Presupuesto Total PAA","Presupuesto programado\nSeptiembre 1 a 31 de diciembre de 2021","Presupuesto contratado\nSeptiembre 1 a 31 de diciembre de 2021","Fecha Primera Publicación\nD/M/A","Última fecha de modificación\nD/M/A","Número modificaciones"]
[null,11524382738,78548951,3480884982,44356,"11/29/2021",9]
[]
[]
[]
[]
[null,null,null,"apropiacion","compromiso"]
[null,null,"31 de agosto",12981639756,9026829717]
[null,null,"31 de dic",13060188707,12507714699]
[null,null,"diferencia"]
[null,null,"(1 de sep al 31 de dic)",78548951,3480884982]

{"sheet":"3. CONSOLIDADO","index":6,"n_rows":95,"n_cols":20,"rows_kept":95,"cut":false,"hidden":false,"merged":[[26,2,26,11],[50,2,52,5],[28,2,30,2],[29,3,29,4],[29,5,29,6],[29,7,29,8],[28,3,28,8],[11,21,11,22],[1,4,1,18],[2,4,2,18],[7,2,8,16],[10,2,12,2],[10,3,12,3],[10,4,10,8],[10,9,10,16],[11,4,11,5],[11,6,11,8],[11,19,11,20],[11,11,11,12],[11,13,11,14],[11,17,11,18],[9,2,9,16],[4,2,5,16],[16,2,16,16],[17,17,17,19],[19,2,21,2],[19,3,21,3],[11,9,11,10],[17,2,17,16],[11,15,11,16],[19,4,19,17],[19,18,20,19],[20,4,20,5],[20,6,20,7],[20,8,20,9],[20,10,20,11],[20,12,20,13],[20,14,20,15],[20,16,20,17]]}
[]
[null,null,null,null,"GESTIÓN CONTRACTUAL "]
[null,null,null,null,"Período de Evaluación: Septiembre 1 a 31 de diciembre de 2021"]
[]
[null,null,"La información consolidada que registra en esta hoja debe coincidir con la información que reporta en las hojas 1 \"INFORMACION ACUMULADA\" y 2 \"INFORMACION II CUATRIMESTRE\". En relación con las adiciones a contratos de años anteriores con cargo al periodo a reportar deben registrarse en filas independientes en los numerales 1 (información general, naturaleza jurídica) y 2 (modalidad). Ej. vigencia =2019; No. Contratos Adicionados:3; Número de adiciones: 4"]
[]
[]
[null,null,"1. Diligenciar en Información General el total de contratos que la entidad suscribió del 1 de septiembre al 31 de diciembre de 2021 y el valor total de ellos, igual el número de contratos que presentaron adiciones, el número de adiciones y el valor total de ellas. Respecto a la Naturaleza jurídica del contratista, diligenciar el número total de contratos suscritos y su valor por: personas naturales, jurídicas, consorcios y uniones temporales"]
[]
[]
[null,null,"Entidad","Vigencia","Información General",null,null,null,null,"Naturaleza jurídica del contratista"]
[null,null,null,null,"Contratos Suscritos",null,"Adiciones",null,null,"Contratos suscritos con personas naturales",null,"Contratos suscritos con personas jurídicas",null,"Contratos suscritos con uniones temporales",null,"Contratos suscritos con consorcios"]
[null,null,null,null,"Número Contratos","Valor Total","Número Contratos Adicionados","Número de Adiciones","Valor Total","Número Contratos y/o adiciones","Valor Total","Número Contratos y/o adiciones","Valor Total","Número Contratos y/o adiciones","Valor Total","Número Contratos y/o adiciones","Valor Total"]
[null,null,"LA CANDELARIA",2021,80,1943083259,61,61,201609933,41,268787496,36,1407668717,3,266627046,0,0]
["ADICIONES",null,"LA CANDELARIA",2021,null,null,null,null,null,61,201609933]
[]
[]
[null,null,"2. Registrar el número y valor total de los contratos y/o adiciones que se suscribieron del 1 de septiembre al 31 de diciembre de 2021 por cada modalidad. Igualmente en la tipología de contratos de prestación de servicios profesionales y de apoyo a la gestión."]
[]
[null,null,"Entidad","Vigencia","Modalidad",null,null,null,null,null,null,null,null,null,null,null,null,null,"Contratos realizados mediante la tipología de contratos de prestación de servicios profesionales y de apoyo a la gestión"]
[null,null,null,null,"Concurso de méritos",null,"Contratación directa",null,"Contratación mínima cuantia",null,"Selección abreviada",null,"Licitación pública",null,"Régimen privado",null,"Régimen especial"]
[null,null,null,null,"Número Contratos","Valor Total","Número Contratos","Valor Total","Número Contratos","Valor Total","Número Contratos","Valor Total","Número Contratos","Valor Total","Número Contratos","Valor Total","Número Contratos","Valor Total","Número Contratos","Valor Total"]
[null,null,"LA CANDELARIA",2021,0,0,12,266801186,11,148504470,19,1081444450,null,null,null,null,null,null,41,446333153]
["ADICIONES",null,"LA CANDELARIA",2021,null,null,null,null,null,null,null,null,null,null,null,null,null,null,61,201609933]
[]
[]
[null,null,"3. Detalle cada uno de los procesos de selección adelantados en el cuatrimestre por la entidad de acuerdo a cada modalidad de selección (licitación pública, selección abreviada o concurso de méritos), y diligencie el número de proponentes que se presentaron en cada uno de ellos"]
[]
[null,null,"Entidad","Proponentes (que se presentaron a los proceso de selección)"]
[null,null,null,"Concurso de méritos",null,"Selección abreviada",null,"Licitación pública"]
[null,null,null,"Número del proceso contractual en SECOP","Número de proponentes","Número del proceso contractual en SECOP","Número de proponentes","Número del proceso contractual en SECOP","Número de proponentes"]
[null,null,null,null,null,"FDLC-SASI-001-2021",7]
[null,null,null,null,null,"FDLC-SASI-001-2021",7]
[null,null,null,null,null,"FDLC-SASI-001-2021",7]
[null,null,null,null,null,"FDLC-SASI-001-2021",7]
[null,null,null,null,null,"FDLC-SASI-001-2021",7]
[null,null,null,null,null,"FDLC-SASI-002-2021",4]
[null,null,null,null,null,"FDLC-SASI-002-2021",4]
[null,null,null,null,null,"FDLC-SAMC-007-2021",11]
[null,null,null,null,null,"FDLC-SASI-003-2021",6]
[null,null,null,null,null,"FDLC-SASI-003-2021",6]
[null,null,null,null,null,"FDLC-SASI-003-2021",6]
[null,null,null,null,null,"FDLC-SASI-003-2021",6]
[null,null,null,null,null,"FDLC-SASI-003-2021",6]
[null,null,null,null,null,"FDLC-SAMC-008-2021",12]
[null,null,null,null,null,"FDLC-SAMC-009-2021",1]
[null,null,null,null,null,"FDLC-SAMC-011-2021",1]
[null,null,null,null,null,"FDLC-SASI-004-2021",2]
[null,null,null,null,null,"FDLC-SAMC-010-2021",2]
[]
[]
[]
[]
[]
[]
[]
[]
[]
[]
[]
[]
[]
[]
[]
[]
[]
[]
[]
[]
[]
[]
[]
[]
[]
[]
[]
[]
[]
[]
[null,null,null,"https://community.secop.gov.co/Public/Tendering/OpportunityDetail/Index?noticeUID=CO1.NTC.1867014&isFromPublicArea=True&isModal=False"]
[]
[]
[]
[]
[]
[]
[]
[]
[]
[]
[]
[]
[]
[]
[null,null,null,"https://community.secop.gov.co/Public/Tendering/OpportunityDetail/Index?noticeUID=CO1.NTC.1875724&isFromPublicArea=True&isModal=true&asPopupView=true"]

{"sheet":"4. INSTRUCTIVO","index":7,"n_rows":105,"n_cols":4,"rows_kept":105,"cut":false,"hidden":false,"merged":[[1,1,1,3],[2,1,2,3],[9,1,9,3],[3,1,3,3],[4,1,4,3],[5,1,5,3],[7,1,7,3],[6,1,6,3],[57,1,60,1],[59,2,60,2],[63,1,68,1],[8,1,8,3],[12,1,12,3],[23,1,23,3],[52,1,54,1],[52,2,54,2],[33,2,34,2],[29,2,30,2],[27,1,28,1],[24,1,25,1],[24,2,25,2],[29,1,51,1],[10,1,10,3],[76,1,77,1],[76,2,77,2],[71,1,71,3],[103,1,103,3],[85,1,85,3],[86,1,87,1],[86,2,87,2],[100,1,100,3],[94,1,94,3],[72,1,74,1],[72,2,74,2],[79,2,82,2],[79,1,82,1]]}
[]
[null,"INSTRUCTIVO FORMATO"]
[null,"Recomendamos leer cuidadosamente y poner en práctica las instrucciones que se explican en este instructivo. De la calidad de la información que se registre, depende en gran medida la calidad del informe de rendición de cuentas de la Gestión Contractual que presenta el Alcalde Mayor, consolidado por la Veeduría Distrital.\nEn este formato se deberán relacionar:\nHoja 1. \"INFORMACION ACUMULADA\", diligenciar en esta hoja la totalidad de la información contractual desde el 1 de enero al 31 de diciembre de 2021.\nHoja 2. “PLAN ANUAL DE ADQUISICIONES – PAA”, se pide información sobre el Plan Anual de Adquisiciones y sus modificaciones, por lo cual se deberá precisar el presupuesto total del plan; el programado del 1 de septiembre al 31 de diciembre de 2021; el efectivamente contratado en este período; la primera fecha de publicación del PAA; la última fecha de modificación y el número total de modificaciones realizadas durante este mismo período. \nHoja 3. “CONSOLIDADO”, se pide totalizar la información reportada en la hoja 1, sólo respecto a los contratos y adiciones suscritas entre el 1 de septiembre y el 31 de diciembre de 2021, por lo cual debe coincidir. Es así que en el numeral 1, se debe diligenciar el total de contratos suscritos por la entidad entre el 1 de septiembre y el 31 de diciembre de 2021, periodo de evaluación y su valor; el número total de contratos adicionados, el número total de adiciones y su valor; el número total de contratos celebrados con personas naturales, jurídicas, uniones temporales y consorcios, y su valor; en el numeral 2, se debe registrar en el periodo mencionado, el número total de contratos celebrados según la modalidad de selección y el valor total por cada modalidad; igualmente, es necesario precisar que se deberán relacionar los contratos celebrados mediante la tipología de prestación de servicios profesionales y de apoyo a la gestión y el valor total de ellos. En el numeral 3, se deberá indicar en las modalidades de licitación pública, concurso de méritos y selección abreviada, el número de procesos de selección en los que se presentaron 1 o más proponentes.\nHoja 4.“INSTRUCTIVO”, se dan las instrucciones para el diligenciamiento de la información, explicando paso a paso cada uno de los datos de la base y la manera de diligenciarla para efectos de que la información reportada sea veraz y no presente inconsistencias."]
[null,"La base en Excel a diligenciar NO debe modificarse, debe utilizar versión Excel 2010 o posteriores, la versión 2007 no habilita los macros. El formato está controlado y algunas celdas tienen opciones de selección y solo se debe escoger una de ellas.  El nombre de las hojas no se debe modificar o renombrar debido a que tiene macros. No incluya columnas con otro tipo de información que la Veeduría Distrital no está solicitando o que cambie el formato de celda establecido. Debe diliigencar la totalidad de las celdas, no combinarlas, registrar la información contractual en filas independientes. Las celdas donde se requieren relacionar valores, deben diligenciarse sin puntos, tildes, comas, ni caracteres especiales."]
[null,"Para insertar una o varias filas, en el encabezado del formato, se encuentra un botón denominado \"Insertar Filas\" en el cual se debe hacer click  y digite el número de filas a insertar. Si usted no sigue este procedimiento las filas que inserte no tomarán el formato de las filas anteriores. Se recomienda que antes de iniciar el registro de información inserte las filas que requiera, sin embargo, en cualquier momento que necesite puede hacer este paso"]
[null,"Si requiere insertar una o varias filas realícelo después de la fila A14 para que tomen el formato de las filas anteriores."]
[null,"Si necesita pegar información debe hacerlo por secciones debido a que hay columnas formuladas que están protegidas que no permiten realizar esta opción. Utilice la opción de pegado especial valores para no borrar las listas desplegables ni los formatos de las columnas. Si al pegar quedan textos en rojo,  verifique y ajuste la información, el dato que adiciono no se encuentra en la lista desplegable o no corresponde con el criterio definido en el columna."]
[null,"En primer lugar, diligencie toda la información correspondiente a los contratos suscritos con cargo la vigencia 2021."]
[null,"Una vez incluidos todos los contratos  de la vigencia 2021, a continuación diligencie el formato completo con la información correspondiente a las adiciones efectuadas con cargo a la vigencia 2021 de contratos suscritos en vigencias anteriores. La información general del contrato como: modalidad de selección, tipología contractual, objeto, entre otros, debe corresponder a la información del contrato adicionado o modificado. Respecto al valor, sólo se diligencia el valor en la columna adición, es decir, la columna de valor inicial debe quedar en blanco. No olvide registrar el número de adiciones realizadas en la columna correspondiente."]
[null,"La información que se registre en esta base de datos debe coincidir con los reportes en BOGDATA  y adicionalmente con SECOP.  Es así que la sumatoria del valor final de los contratos y adiciones, por eje/pilar/propósito, programa y proyecto registrada por la Entidad, debe coincidir con la ejecución presupuestal de la entidad, reporte de BOGDATA con corte a 31 de diciembre de 2021, es decir, se debe verificar su coincidencia por rubro con el total del compromiso acumulado; igualmente respecto al valor acumulado de los giros."]
[null,"En caso de haber realizado apropiaciones presupuestales en la vigencia a través de resoluciones, caja menor, honorarios ediles, servicios públicos, debe relacionar dicha información en una sola fila al final de la base, indicando de que se trata la apropiación y número de proyecto si hay lugar a ello. En el tipo de contrato se registra con la opción \"Otros gastos\"."]
[]
[null,"ENCABEZADO DEL FORMATO"]
[null,1,"Entidad","Indique el nombre completo de la Entidad."]
[null,2,"Sector","Seleccione el sector al cual pertenece la Entidad."]
[null,3,"Presupuesto Disponible Inversión Directa","Indique el valor total del presupuesto disponible de inversión directa, de acuerdo con el Informe de ejecución presupuestal de la entidad (BOGDATA), a 31 de diciembre de 2021."]
[null,4,"Presupuesto Comprometido de Inversión Directa ","Escriba el valor total del presupuesto comprometido de inversión directa, de acuerdo con el Informe de ejecución presupuestal de la entidad (BOGDATA), a 31 de diciembre de 2021."]
[null,5,"Presupuesto Disponible Funcionamiento","Indique el valor total del presupuesto de funcionamiento disponible, de acuerdo con el con el Informe de ejecución presupuestal de la entidad (BOGDATA), a 31 de diciembre de 2021."]
[null,6,"Presupuesto Comprometido funcionamiento ","Escriba el monto del presupuesto de funcionamiento, comprometido mediante contratos, de acuerdo con el Informe de ejecución presupuestal de la entidad (BOGDATA), a 31 de diciembre de 2021."]
[null,7,"Presupuesto Disponible Operación","Coloque el monto del presupuesto de operación disponible, de acuerdo con el Informe de ejecución presupuestal de la entidad (BOGDATA), a 31 de diciembre de 2021. Los gastos de operación corresponden solamente a aquellas entidades de régimen de contratación  privado."]
[null,8,"Presupuesto Comprometido operación mediante contratos","Escriba el monto del presupuesto de operación comprometido mediante contratos a 31 de diciembre de 2021."]
[null,9,"Nombre de quien diligencia el formato","Indique el nombre completo, cargo, número de teléfono con extensión y correo electrónico del profesional que diligencia el formato y que posteriormente realizará los ajustes y aclaraciones a que haya lugar por solicitud de la Veeduría Distrital."]
[]
[null,"1- INFORMACIÓN GENERAL"]
[null,1,"Número de Contrato","En estricto orden consecutivo registre el número del contrato, sin incluir los contratos que fueron anulados, ni comodatos."]
[null,null,null,"Una vez terminado el registro de los contratos celebrados con cargo a la vigencia 2021, en las siguientes filas registre la información correspondiente a las adiciones efectuadas con cargo a la vigencia 2021 de contratos suscritos en vigencias anteriores, especificando el año de suscripción en la columna dos."]
[null,2,"Año","Registre el año de celebración del contrato."]
[null,3,"Número de proceso en el SECOP","Relacione el número de proceso de selección con el cual se encuentra publicado el contrato en el SECOP, mas no el link o enlace. Ejemplo IDU-CMA-DTDP-240-2021"]
[null,null,"Link proceso SECOP","Registre el enlace del proceso en SECOP. Ejemplo  https://community.secop.gov.co/Public/xxxxxx"]
[null,4,"Tipo de Contrato","En esta columna seleccione de la lista, el tipo de contrato que corresponde al contrato suscrito. El formato no permite incluir tipo de contratos diferentes a los señaladas en la lista desplegable.  Se debe escoger de las tipologías contractuales que se relacionan a continuación:  "]
[null,null,null,"Para las adiciones a contratos suscritos en la vigencia 2021 y adiciones a contratos sucritos de años anteriores se debe diligenciar la tipología del contrato adicionado o modificado"]
[null,null,"Obra ","Son contratos de obra los que celebren las entidades estatales para la construcción, mantenimiento, instalación y, en general, para la realización de cualquier otro trabajo material sobre bienes inmuebles, cualquiera que sea la modalidad de ejecución y pago. Numeral 1 del artículo 32 de la Ley 80 de 1993"]
[null,null,"Consultoría","Aquellos que celebran las entidades estatales, referidos a los estudios necesarios para la ejecución de proyectos de inversión, de diagnósticos, prefactibilidad o factibilidad para programas o proyectos específicos, así como  las asesorías técnicas de coordinación, control y supervisión. Numeral 2 del artículo 32 de la Ley 80 de 1993"]
[null,null,"Interventoría","Son también  contratos de consultoría los que tienen por objeto la Interventoría, asesoría, gerencia de obras o de proyectos, dirección, programación y la ejecución de diseños, planos, anteproyectos y proyectos. Numeral 2 del artículo 32 de la Ley 80 de 1993"]
[null,null,null,"El contrato de Interventoría tiene por objeto la  supervisión, seguimiento y vigilancia a la ejecución material de un contrato principal"]
[null,null,"Contrato de Prestación de servicios","Son contratos de prestación de servicios los que celebren las entidades estatales para desarrollar actividades relacionadas con la administración o funcionamiento de la entidad. Numeral 3 del artículo 32 de la Ley 80 de 1993"]
[null,null,"Contrato de Prestación de servicios profesionales y de apoyo a la gestión","Corresponden a aquellos de naturaleza intelectual diferentes a los de consultoría que se derivan del cumplimiento de las funciones de la entidad estatal; así como los relacionados con actividades operativas, logísticas, o asistenciales. Art. 2.2.1.2.1.4.9. del Decreto 1082 de 2015"]
[null,null,"Compraventa de bienes muebles","Son aquellos contratos donde se transfiere el dominio de un bien mueble (aquellos susceptibles de ser trasladadas de un lugar a otro sin alterar ni su forma ni su esencia, tal es el caso del mobiliario y equipo de oficina, maquinaria, automóviles, etc.), cuya ejecución se agota de manera instantánea. Artículo 660, Código Civil"]
[null,null,"Compraventa de bienes inmuebles","Son aquellos contratos donde se transfiere el dominio de un bien inmueble (todos aquellos bienes considerados bienes raíces, por tener de común la circunstancia de estar íntimamente ligados al suelo, unidos de modo inseparable, física o jurídicamente, al terreno). Artículo 656, Código Civil"]
[null,null,"Arrendamiento de bienes muebles","Es un contrato que tiene por objeto, conceder el uso y goce de un bien mueble a cambio de un precio determinado. Artículo 1974, Código Civil"]
[null,null,"Arrendamiento de bienes inmuebles","Es un contrato que tiene por objeto, conceder el uso y goce de un bien inmueble a cambio de un precio determinado. Artículo 2.2.1.2.1.4.11 del Decreto 1082 de 2015"]
[null,null,"Seguros","El seguro es un contrato, en virtud del cual una persona jurídica llamada asegurador, asume, a cambio de una prima, un riesgo que le es trasladado por una persona natural o jurídica llamado tomador y en el cual éste tiene un interés asegurable, con el fin de indemnizarlo, en el evento de que ocurra la realización del riesgo amparado, de conformidad con el Título V, del Libro Cuarto del Código de Comercio"]
[null,null,"Suministro","El suministro es el contrato por el cual una parte se obliga, a cambio de una contraprestación, a cumplir en favor de otra, en forma independiente, prestaciones periódicas o continuadas de cosas o servicios. Artículo 968, Código de Comercio"]
[null,null,"Empréstitos","Son contratos de empréstito los que tienen por objeto proveer a la entidad estatal contratante de recursos en moneda nacional o extranjera con plazo para su pago. Artículo 7, Decreto 2681 de 1993"]
[null,null,"Fiducia mercantil o encargo fiduciario","Son contratos que tienen por objeto la administración o el manejo de los recursos vinculados a los contratos que tales entidades celebren. Numeral 5 del artículo 32 de la Ley 80 de 1993"]
[null,null,"Concesión","Este contrato tiene por objeto otorgar a una persona llamada concesionario la prestación, operación, explotación, organización o gestión, total o parcial, de un servicio público, o la construcción, explotación o conservación total o parcial, de una obra o bien destinados al servicio o uso público, así como todas aquellas actividades necesarias para la adecuada prestación o funcionamiento de la obra o servicio por cuenta y riesgo del concesionario, y bajo la vigilancia y control de la entidad concedente, a cambio de una remuneración que puede consistir en derechos, tarifas, tasas, valorización, o en la participación que se le otorgue en la explotación del bien, obra o servicio, o en una suma periódica, única o porcentual, y en general, en cualquier otra modalidad de contraprestación que las partes acuerden. Numeral 4 del artículo 32 de la Ley 80 de 1993"]
[null,null,"Convenios de cooperación","Son aquellos mediante los cuales se formaliza la asistencia, ayuda, auxilio, soporte o colaboración entre entidades de una misma nación, de distintos países o por parte de organizaciones internacionales de naturaleza pública o privada a favor de entidades públicas. Artículo 20 de la Ley 1150 de 2007"]
[null,null,"Convenios/Contratos interadministrativos","El convenio interadministrativo es el negocio jurídico en el cual están presentes dos entidades públicas en desarrollo de relaciones interadministrativas cuyo objeto es coordinar, cooperar, colaborar o distribuir competencias en la realización de funciones administrativas de interés común a los sujetos negociales. Artículo 95 de la Ley 489 de 1998"]
[null,null,"Convenios de Apoyo y/o Convenios de Asociación","Los contratos que en desarrollo de lo dispuesto en el segundo inciso del artículo 355 de la Constitución Política celebren la Nación, los Departamentos, Distritos y Municipios con entidades privadas sin ánimo de lucro y de reconocida idoneidad, con el propósito de impulsar programas y actividades de interés público. Reglamentado mediante Decreto 92 de 2017"]
[null,null,"Asociaciones Público Privadas","Los contratos con personas naturales o jurídicas que se celebran en desarrollo de lo dispuesto en la Ley 1508 de 2012"]
[null,null,"Otros","Los demás tipos de contratos que no se encuentren definidos en las anteriores tipologías"]
[null,null,"Otros gastos","Incluye los gastos no contractuales, estos se registran al final de la base, no cuentan con número de contrato, tipo, proceso o modalidad.  Estos gastos en los que no media un acuerdo de voluntades, en caso de ser del rubro de inversiòn, se deben discriminar por programa y proyecto. En el caso de ser del rubro de funcionamiento no requieren ser discriminados sino totalizados en una sola fila."]
[null,5,"Modalidad de Selección","Al ubicarse en la celda, se despliega una lista de modalidades de selección, de las cuales debe seleccionar la indicada"]
[null,null,null,"Para las adiciones a contratos suscritos en vigencias anteriores se debe diligenciar la modalidad de selección del contrato adicionado o modificado"]
[null,null,null,"La modalidad régimen especial se refiere a todos los contratos realizados en cumplimiento del Decreto 92 de 2017, convenios de asociación con ESAL. Régimen privado es para todas aquellas entidades que no se rigen por el Estatuto General de Contratación Pública (Ley 80 de 1993 y normas complementarias), caso en el que todos sus contratos deben ser identificados con esta modalidad"]
[null,6,"Procedimiento o causal","Esta columna solo se habilita y debe ser diligenciada, para las modalidades de selección abreviada y contratación directa. Al ubicarse en la celda, se despliega una lista de procedimientos o causales, de las cuales debe seleccionar la indicada. El formato no permite incluir procedimientos o causales diferentes a las señaladas en la lista desplegable.  "]
[null,7,"Objeto","Registre el objeto del contrato"]
[null,8,"Afectación ","Registre la afectación según la clasificación de cuentas del presupuesto de gastos. Funcionamiento, Inversión y Operación, esta última aplica únicamente para entidades de régimen privado. La celda solamente permite registrar estas tres opciones."]
[null,null,"Planes de Desarrollo Distrital","Seleccionar el PDD de acuerdo con los diferentes contratos suscritos, automáticamente en la columna K se activan  los números de programa de acuerdo al PDD."]
[null,null,"Número Programa","Si en la columna anterior “Afectación”,  indicó funcionamiento u operación deje en blanco el número de programa, es decir esta columna solamente aplica para gastos de Inversión."]
[null,null,null,"Identifíquelo de acuerdo con el código presupuestal del Plan de Desarrollo  \"Un Nuevo Contrato Social y Ambiental para la Bogotá del Siglo XXI\". Si un mismo contrato afecta más de un código presupuestal discrimine el contrato por cada código que afecte en filas separadas. Si se registra el número del programa, automáticamente en la columna L y M se despliega el nombre del programa y el  propósito según corresponda. "]
[null,9,"Número Proyecto","Indique el código presupuestal con el que se identifica el proyecto. Si un mismo contrato afecta más de un proyecto, discriminar el contrato por cada proyecto que afecte en filas separadas."]
[null,10,"Número de proponentes","Diligencie el número de proponentes que participaron en el proceso de selección adelantado que dio como resultado el contrato que se está diligenciando"]
[null,11,"Número de Identificación del contratista","Indicar el número de identificación del contratista persona natural o jurídica o contratistas plurales (uniones temporales y consorcios) con quien se suscribió el contrato, sin comas, tildes, puntos ni caracteres especiales, y si es NIT sin dígito de verificación"]
[null,null,"Nombre del Contratista","Indicar el nombre del contratista, persona natural o jurídica  o contratistas plurales (uniones temporales y consorcios) en mayúscula sostenida, sin comas, tildes, puntos ni caracteres especiales. Si se trata de personas jurídicas, diligenciar razón social y tipo societario, sin comas, tildes, puntos ni caracteres especiales. Si se trata de personas naturales diligenciar primero los nombres seguidos de los apellidos en la misma columna (nombre 1, nombre 2, apellido 1 y apellido 2)"]
[null,null,"Naturaleza Jurídica","Seleccione la naturaleza jurídica que corresponde al contratista, según las opciones"]
[null,null,"Número  de Identificación de los integrantes del Consorcio o U.T.\n(NIT sin digito de verificación)","Diligenciar este numeral sólo en los casos en que el contratista sea un Consorcio o Union Temporal, relacione en filas independientes (si son varios integrantes puede insertar filas adicionales), cada uno de los números de identificación de los integrantes de los consorcios o uniones temporales sin comas, tildes, puntos ni caracteres especiales, y si es NIT sin dígito de verificación. "]
[null,null,"Nombre del Integrante del Consorcio o U.T.","Diligenciar este numeral sólo en los casos en que el contratista sea un Consorcio o Union Temporal, relacione en filas independientes cada uno de los nombres de los integrantes de los consorcios o uniones temporales, si es persona jurídica la Razón social, es decir el nombre legal de la Empresa; si es persona natural relacione los nombres seguidos de los apellidos en mayúscula sostenida, sin comas, tildes, puntos ni caracteres especiales. Igualmente en el nombre relacione el Tipo societario de cada uno de ellos, entre los cuales se encuentra Sociedades por Acciones Simplificadas (SAS), Sociedad de Responsabilidad Limitada (LTDA), Sociedad en Comandita simple (SCS), Sociedad en Comandita por Acciones (SCA), Sociedad Colectiva, a manera de ejemplo: SOCIEDAD 1 LTDA"]
[null,null,"% Participación","Registre el porcentaje de participación de cada integrante del consorcio o unión temporal, registre sólo números, sin caracteres especiales"]
[]
[]
[null,"2- INFORMACIÓN FINANCIERA"]
[null,12,"Valor Inicial ","Registre el valor inicial del contrato con cargo al segundo cuatrimestre de la vigencia 2021. Esta columna sólo debe contener información numérica"]
[null,null,null,"En el caso de adiciones a contratos de años anteriores, no diligencie esta columna, registrar el valor en la columna 15 \"Valor Total Adiciones\".\nEn caso de adiciones a contratos suscritos en el primer cuatrimestre del 2021, no diligencie esta columna, registrar el valor en la columna 15 \"Valor Total Adiciones\""]
[null,null,null,"Excluya las reservas de apropiación y cuentas por pagar"]
[null,13,"Valor total reducciones (En valor negativo)","Registre el valor de la reducción del contrato en caso de haberse realizado, en negativo, durante la vigencia 2021"]
[null,14,"Número de adiciones ","Diligencie esta columna solo en el caso de adiciones al valor inicial que aumenten el valor del contrato con cargo a la vigencia."]
[null,null,null,"Registre en esta celda el número de adiciones que se realizaron al contrato"]
[null,15,"Valor total de adiciones","Registre el valor total de las adiciones que se realizaron al contrato,  el formato de celda no permite guiones, comas o texto. Esta columna solo debe contener información numérica."]
[null,16,"Valor Final","Esta columna se encuentra formulada por favor no modifique ni quite la fórmula; la fórmula suma las columnas valor inicial, valor de reducciones y valor de adiciones"]
[null,null,null,"La sumatoria de la columna 16 (valor final) para los contratos de Inversión Directa, de funcionamiento y/o operación, cuando aplique, deberán coincidir con el valor del rubro registrado en el encabezado 4, Presupuesto comprometido de inversión según BOGDATA, con el encabezado 6, Presupuesto Comprometido Funcionamiento según BOGDATA y con el encabezado 8, Presupuesto Comprometido Operación mediante contratos, respectivamente. A la vez, estos valores deben coincidir con los informes de ejecución presupuestal del BOGDATA.  "]
[null,null,null,"Si los valores no coinciden debe especificarse al final del formato en qué está representada la diferencia Otros gastos(discriminando los conceptos por Programa y Proyecto de inversión, si es el caso), con sus respectivos valores."]
[null,null,null,"Las bases donde dichos valores no coincidan serán devueltas por la Veeduría Distrital a cada entidad para los respectivos ajustes."]
[null,17,"Giros","Registre el valor total de los giros que se realizaron al contrato,  el formato de celda no permite guiones, comas o texto. Esta columna solo debe contener información numérica."]
[]
[null,"3- PLAZOS"]
[null,18,"Fecha de suscripción","Relacionar la fecha en que se suscribió el contrato original. La celda solo admite el formato Día/Mes/Año, por ejemplo: 17/02/2021"]
[null,null,null,"Para las adiciones a contratos de años anteriores se debe registrar en esta columna la fecha de suscripción de la adición en la vigencia 2021"]
[null,19,"Fecha de inicio","Indicar la fecha de inicio del contrato. Para las adiciones a contratos de años anteriores se debe diligenciar la fecha de inicio de la adición en la vigencia 2021. La celda solo admite el formato Día/Mes/Año así  13/03/2021."]
[null,20,"Fecha de terminación","Indicar la fecha efectiva de terminación del contrato. La celda solo admite el formato Día/Mes/Año así  15/02/2021."]
[null,21,"Plazo en días","Esta columna contiene el plazo inicial del contrato con el número total de días a ejecutar (sólo número de días, no mes, no texto). "]
[null,22,"Número de prórrogas","Registre en esta celda el número de prórrogas que se realizaron al contrato en la vigencia 2021."]
[null,23,"Prórroga en días","En caso de presentarse este evento, indicar en días, el tiempo por el cual se prorrogó el contrato a partir de la fecha inicial de terminación (sólo número de días, no mes, no texto)."]
[]
[null,"4- CESIÓN"]
[null,24,"Número  de Identificación del cesionario\n(NIT con digito de verificación)","Indicar el número de identificación del cesionario persona natural o jurídica con quien se suscribió la cesión, con digito de verificación (DV), el formato de celda no permite guiones o comas, solo números. Si hay más de una cesión adicione una fila y registre número de contrato, año, número proceso contractual SECOP y demás información que corresponda."]
[null,25,"Nombre cesionario","Indicar el nombre del cesionario, persona natural o jurídica."]
[null,26,"Fecha cesión","Relacionar la fecha en que se suscribió la cesión del contrato. La celda solo admite el formato Día/Mes/Año así  17/02/2021."]
[null,27,"Valor cesión","Registre el valor correspondiente a la cesión con cargo a la vigencia 2021, el formato de celda no permite guiones, comas o texto. Esta columna solo debe contener información numérica."]
[]
[null,"5- ESTADO A 31 DE DICIEMBRE DE 2021"]
[null,28,"Estado","Marque con una X en la respectiva columna si el contrato se encuentra a 31 de diciembre de 2021 Celebrado o por Iniciar, En Ejecución, Terminado o Liquidado."]
[]
[null,"5- PORCENTAJE DE AVANCE Y/O CUMPLIMIENTO"]
[null,29,"% Avance y/o cumplimiento","Indica el porcentaje de avance o de cumplimiento en términos presupuestales a 31 de diciembre de 2021, es decir lo efectivamente pagado al contratista. Si no se ha iniciado la ejecución, el % de avance es 0%. La celda se encuentra formulada y protegida. Es la relación entre el valor de los giros y el valor final del contrato. Si el porcentaje de avance no coincide, se debe revisar los valores que se registraron en estas columnas.  Este porcentaje no debe ser superior al 100%"]

{"sheet":"Proposito_programa","index":8,"n_rows":59,"n_cols":5,"rows_kept":59,"cut":false,"hidden":false,"merged":[]}
[]
[null,"PDD","No. Programa","Programa","Propósito"]
["Acuerdo 761 2020","Un Nuevo Contrato Social y Ambiental para la Bogotá del Siglo XXI",1,"Subsidios y transferencias para la equidad","Propósito 1: Hacer un nuevo contrato social para incrementar la inclusión social, productiva y política"]
["Pag. 51","Un Nuevo Contrato Social y Ambiental para la Bogotá del Siglo XXI",{"$f":"+C3+1","v":2},"Igualdad de oportunidades y desarrollo de capacidades para las mujeres","Propósito 1: Hacer un nuevo contrato social para incrementar la inclusión social, productiva y política"]
[null,"Un Nuevo Contrato Social y Ambiental para la Bogotá del Siglo XXI",{"$f":"+C4+1","v":3},"Movilidad social integral","Propósito 1: Hacer un nuevo contrato social para incrementar la inclusión social, productiva y política"]
[null,"Un Nuevo Contrato Social y Ambiental para la Bogotá del Siglo XXI",4,"Prevención de la exclusión por razones étnicas, religiosas, sociales, políticas y de orientación sexual","Propósito 1: Hacer un nuevo contrato social para incrementar la inclusión social, productiva y política"]
[null,"Un Nuevo Contrato Social y Ambiental para la Bogotá del Siglo XXI",5,"Promoción de la igualdad, el desarrollo de capacidades y el reconocimiento de las mujeres","Propósito 1: Hacer un nuevo contrato social para incrementar la inclusión social, productiva y política"]
[null,"Un Nuevo Contrato Social y Ambiental para la Bogotá del Siglo XXI",6,"Sistema Distrital de Cuidado","Propósito 1: Hacer un nuevo contrato social para incrementar la inclusión social, productiva y política"]
[null,"Un Nuevo Contrato Social y Ambiental para la Bogotá del Siglo XXI",7,"Mejora de la gestión de instituciones de salud","Propósito 1: Hacer un nuevo contrato social para incrementar la inclusión social, productiva y política"]
[null,"Un Nuevo Contrato Social y Ambiental para la Bogotá del Siglo XXI",8,"Prevención y atención de maternidad temprana","Propósito 1: Hacer un nuevo contrato social para incrementar la inclusión social, productiva y política"]
[null,"Un Nuevo Contrato Social y Ambiental para la Bogotá del Siglo XXI",9,"Prevención y cambios para mejorar la salud de la población","Propósito 1: Hacer un nuevo contrato social para incrementar la inclusión social, productiva y política"]
[null,"Un Nuevo Contrato Social y Ambiental para la Bogotá del Siglo XXI",10,"Salud para la vida y el bienestar","Propósito 1: Hacer un nuevo contrato social para incrementar la inclusión social, productiva y política"]
[null,"Un Nuevo Contrato Social y Ambiental para la Bogotá del Siglo XXI",11,"Salud y bienestar para niñas y niños","Propósito 1: Hacer un nuevo contrato social para incrementar la inclusión social, productiva y política"]
[null,"Un Nuevo Contrato Social y Ambiental para la Bogotá del Siglo XXI",12,"Educación inicial: Bases sólidas para la vida.","Propósito 1: Hacer un nuevo contrato social para incrementar la inclusión social, productiva y política"]
[null,"Un Nuevo Contrato Social y Ambiental para la Bogotá del Siglo XXI",13,"Educación para todos y todas: acceso y permanencia con equidad y énfasis en educación rural","Propósito 1: Hacer un nuevo contrato social para incrementar la inclusión social, productiva y política"]
[null,"Un Nuevo Contrato Social y Ambiental para la Bogotá del Siglo XXI",14,"Formación integral: más y mejor tiempo en los colegios","Propósito 1: Hacer un nuevo contrato social para incrementar la inclusión social, productiva y política"]
[null,"Un Nuevo Contrato Social y Ambiental para la Bogotá del Siglo XXI",15,"Plan Distrital de Lectura, Escritura y Oralidad: \"Leer para la vida\"","Propósito 1: Hacer un nuevo contrato social para incrementar la inclusión social, productiva y política"]
[null,"Un Nuevo Contrato Social y Ambiental para la Bogotá del Siglo XXI",16,"Transformación pedagógica y mejoramiento de la gestión educativa. Es con los maestros y maestras.","Propósito 1: Hacer un nuevo contrato social para incrementar la inclusión social, productiva y política"]
[null,"Un Nuevo Contrato Social y Ambiental para la Bogotá del Siglo XXI",17,"Jóvenes con capacidades: Proyecto de vida para la ciudadanía, la innovación y el trabajo del siglo XXI","Propósito 1: Hacer un nuevo contrato social para incrementar la inclusión social, productiva y política"]
[null,"Un Nuevo Contrato Social y Ambiental para la Bogotá del Siglo XXI",18,"Cierre de brechas para la inclusión productiva urbano rural","Propósito 1: Hacer un nuevo contrato social para incrementar la inclusión social, productiva y política"]
[null,"Un Nuevo Contrato Social y Ambiental para la Bogotá del Siglo XXI",19,"Vivienda y entornos dignos en el territorio urbano y rural","Propósito 1: Hacer un nuevo contrato social para incrementar la inclusión social, productiva y política"]
[null,"Un Nuevo Contrato Social y Ambiental para la Bogotá del Siglo XXI",20,"Bogotá, referente en cultura, deporte, recreación y actividad física, con parques para el desarrollo y la salud","Propósito 1: Hacer un nuevo contrato social para incrementar la inclusión social, productiva y política"]
[null,"Un Nuevo Contrato Social y Ambiental para la Bogotá del Siglo XXI",21,"Creación y vida cotidiana: Apropiación ciudadana del arte, la cultura y el patrimonio, para la democracia cultural","Propósito 1: Hacer un nuevo contrato social para incrementar la inclusión social, productiva y política"]
[null,"Un Nuevo Contrato Social y Ambiental para la Bogotá del Siglo XXI",22,"Transformación cultural para la conciencia ambiental y el cuidado de la fauna doméstica","Propósito 1: Hacer un nuevo contrato social para incrementar la inclusión social, productiva y política"]
[null,"Un Nuevo Contrato Social y Ambiental para la Bogotá del Siglo XXI",23,"Bogotá rural","Propósito 1: Hacer un nuevo contrato social para incrementar la inclusión social, productiva y política"]
[null,"Un Nuevo Contrato Social y Ambiental para la Bogotá del Siglo XXI",24,"Bogotá región emprendedora e innovadora","Propósito 1: Hacer un nuevo contrato social para incrementar la inclusión social, productiva y política"]
[null,"Un Nuevo Contrato Social y Ambiental para la Bogotá del Siglo XXI",25,"Bogotá región productiva y competitiva","Propósito 1: Hacer un nuevo contrato social para incrementar la inclusión social, productiva y política"]
[null,"Un Nuevo Contrato Social y Ambiental para la Bogotá del Siglo XXI",26,"Bogotá - región, el mejor destino para visitar","Propósito 1: Hacer un nuevo contrato social para incrementar la inclusión social, productiva y política"]
[null,"Un Nuevo Contrato Social y Ambiental para la Bogotá del Siglo XXI",27,"Cambio cultural para la gestión de la crisis climática","Propósito 2 : Cambiar Nuestros Hábitos de Vida para Reverdecer a Bogotá y Adaptarnos y Mitigar la Crisis Climática"]
[null,"Un Nuevo Contrato Social y Ambiental para la Bogotá del Siglo XXI",{"$f":"+C29+1","v":28},"Bogotá protectora de sus recursos naturales","Propósito 2 : Cambiar Nuestros Hábitos de Vida para Reverdecer a Bogotá y Adaptarnos y Mitigar la Crisis Climática"]
[null,"Un Nuevo Contrato Social y Ambiental para la Bogotá del Siglo XXI",{"$f":"+C30+1","v":29},"Asentamientos y entornos protectores","Propósito 2 : Cambiar Nuestros Hábitos de Vida para Reverdecer a Bogotá y Adaptarnos y Mitigar la Crisis Climática"]
[null,"Un Nuevo Contrato Social y Ambiental para la Bogotá del Siglo XXI",30,"Eficiencia en la atención de emergencias","Propósito 2 : Cambiar Nuestros Hábitos de Vida para Reverdecer a Bogotá y Adaptarnos y Mitigar la Crisis Climática"]
[null,"Un Nuevo Contrato Social y Ambiental para la Bogotá del Siglo XXI",31," Protección y valoración del patrimonio tangible e intangible en Bogotá y la región","Propósito 2 : Cambiar Nuestros Hábitos de Vida para Reverdecer a Bogotá y Adaptarnos y Mitigar la Crisis Climática"]
[null,"Un Nuevo Contrato Social y Ambiental para la Bogotá del Siglo XXI",32,"Revitalización urbana para la competitividad","Propósito 2 : Cambiar Nuestros Hábitos de Vida para Reverdecer a Bogotá y Adaptarnos y Mitigar la Crisis Climática"]
[null,"Un Nuevo Contrato Social y Ambiental para la Bogotá del Siglo XXI",33,"Más árboles y más y mejor espacio público","Propósito 2 : Cambiar Nuestros Hábitos de Vida para Reverdecer a Bogotá y Adaptarnos y Mitigar la Crisis Climática"]
[null,"Un Nuevo Contrato Social y Ambiental para la Bogotá del Siglo XXI",34,"Bogotá protectora de los animales","Propósito 2 : Cambiar Nuestros Hábitos de Vida para Reverdecer a Bogotá y Adaptarnos y Mitigar la Crisis Climática"]
[null,"Un Nuevo Contrato Social y Ambiental para la Bogotá del Siglo XXI",35,"Manejo y prevención de contaminación","Propósito 2 : Cambiar Nuestros Hábitos de Vida para Reverdecer a Bogotá y Adaptarnos y Mitigar la Crisis Climática"]
[null,"Un Nuevo Contrato Social y Ambiental para la Bogotá del Siglo XXI",36,"Manejo y saneamiento de los cuerpos de agua","Propósito 2 : Cambiar Nuestros Hábitos de Vida para Reverdecer a Bogotá y Adaptarnos y Mitigar la Crisis Climática"]
[null,"Un Nuevo Contrato Social y Ambiental para la Bogotá del Siglo XXI",37,"Provisión y mejoramiento de servicios públicos","Propósito 2 : Cambiar Nuestros Hábitos de Vida para Reverdecer a Bogotá y Adaptarnos y Mitigar la Crisis Climática"]
[null,"Un Nuevo Contrato Social y Ambiental para la Bogotá del Siglo XXI",38,"Ecoeficiencia, reciclaje, manejo de residuos e inclusión de la población recicladora","Propósito 2 : Cambiar Nuestros Hábitos de Vida para Reverdecer a Bogotá y Adaptarnos y Mitigar la Crisis Climática"]
[null,"Un Nuevo Contrato Social y Ambiental para la Bogotá del Siglo XXI",39,"Bogotá territorio de paz y atención integral a las víctimas del conflicto armado","Propósito 3: Inspirar confianza y legitimidad para vivir sin miedo y ser epicentro de cultura ciudadana, paz y reconciliación"]
[null,"Un Nuevo Contrato Social y Ambiental para la Bogotá del Siglo XXI",{"$f":"+C41+1","v":40},"Más mujeres viven una vida libre de violencias, se sienten seguras y acceden con confianza al sistema de justicia","Propósito 3: Inspirar confianza y legitimidad para vivir sin miedo y ser epicentro de cultura ciudadana, paz y reconciliación"]
[null,"Un Nuevo Contrato Social y Ambiental para la Bogotá del Siglo XXI",{"$f":"+C42+1","v":41},"Sin machismo ni violencias contra las mujeres, las niñas y los niños","Propósito 3: Inspirar confianza y legitimidad para vivir sin miedo y ser epicentro de cultura ciudadana, paz y reconciliación"]
[null,"Un Nuevo Contrato Social y Ambiental para la Bogotá del Siglo XXI",42,"Conciencia y cultura ciudadana para la seguridad, la convivencia y la construcción de confianza","Propósito 3: Inspirar confianza y legitimidad para vivir sin miedo y ser epicentro de cultura ciudadana, paz y reconciliación"]
[null,"Un Nuevo Contrato Social y Ambiental para la Bogotá del Siglo XXI",43,"Cultura ciudadana para la confianza, la convivencia y la participación desde la vida cotidiana","Propósito 3: Inspirar confianza y legitimidad para vivir sin miedo y ser epicentro de cultura ciudadana, paz y reconciliación"]
[null,"Un Nuevo Contrato Social y Ambiental para la Bogotá del Siglo XXI",44,"Autoconciencia, respeto y cuidado en el espacio público","Propósito 3: Inspirar confianza y legitimidad para vivir sin miedo y ser epicentro de cultura ciudadana, paz y reconciliación"]
[null,"Un Nuevo Contrato Social y Ambiental para la Bogotá del Siglo XXI",45,"Espacio público más seguro y construido colectivamente","Propósito 3: Inspirar confianza y legitimidad para vivir sin miedo y ser epicentro de cultura ciudadana, paz y reconciliación"]
[null,"Un Nuevo Contrato Social y Ambiental para la Bogotá del Siglo XXI",46,"Atención a jóvenes y adultos infractores con impacto en su proyecto de vida","Propósito 3: Inspirar confianza y legitimidad para vivir sin miedo y ser epicentro de cultura ciudadana, paz y reconciliación"]
[null,"Un Nuevo Contrato Social y Ambiental para la Bogotá del Siglo XXI",47,"Calidad de Vida y Derechos de la Población privada de la libertad","Propósito 3: Inspirar confianza y legitimidad para vivir sin miedo y ser epicentro de cultura ciudadana, paz y reconciliación"]
[null,"Un Nuevo Contrato Social y Ambiental para la Bogotá del Siglo XXI",48,"Plataforma institucional para la seguridad y justicia","Propósito 3: Inspirar confianza y legitimidad para vivir sin miedo y ser epicentro de cultura ciudadana, paz y reconciliación"]
[null,"Un Nuevo Contrato Social y Ambiental para la Bogotá del Siglo XXI",49,"Movilidad segura, sostenible y accesible","Propósito 4: Hacer de Bogotá Región un modelo de movilidad multimodal, incluyente y sostenible"]
[null,"Un Nuevo Contrato Social y Ambiental para la Bogotá del Siglo XXI",{"$f":"+C51+1","v":50},"Red de metros","Propósito 4: Hacer de Bogotá Región un modelo de movilidad multimodal, incluyente y sostenible"]
[null,"Un Nuevo Contrato Social y Ambiental para la Bogotá del Siglo XXI",51,"Gobierno Abierto","Propósito 5: Construir Bogotá - Región con gobierno abierto, transparente y ciudadanía consciente"]
[null,"Un Nuevo Contrato Social y Ambiental para la Bogotá del Siglo XXI",{"$f":"+C53+1","v":52},"Integración regional, distrital y local","Propósito 5: Construir Bogotá - Región con gobierno abierto, transparente y ciudadanía consciente"]
[null,"Un Nuevo Contrato Social y Ambiental para la Bogotá del Siglo XXI",{"$f":"+C54+1","v":53},"Información para la toma de decisiones","Propósito 5: Construir Bogotá - Región con gobierno abierto, transparente y ciudadanía consciente"]
[null,"Un Nuevo Contrato Social y Ambiental para la Bogotá del Siglo XXI",54,"Transformación digital y gestión de TIC para un territorio inteligente","Propósito 5: Construir Bogotá - Región con gobierno abierto, transparente y ciudadanía consciente"]
[null,"Un Nuevo Contrato Social y Ambiental para la Bogotá del Siglo XXI",55,"Fortalecimiento de cultura ciudadana y su institucionalidad","Propósito 5: Construir Bogotá - Región con gobierno abierto, transparente y ciudadanía consciente"]
[null,"Un Nuevo Contrato Social y Ambiental para la Bogotá del Siglo XXI",56,"Gestión pública efectiva","Propósito 5: Construir Bogotá - Región con gobierno abierto, transparente y ciudadanía consciente"]
[null,"Un Nuevo Contrato Social y Ambiental para la Bogotá del Siglo XXI",57,"Gestión pública local","Propósito 5: Construir Bogotá - Región con gobierno abierto, transparente y ciudadanía consciente"]

{"sheet":"Tipo","index":9,"n_rows":40,"n_cols":5,"rows_kept":40,"cut":false,"hidden":true,"merged":[]}
[null,"Tipo","Modalidad de Selección","afectacion","Naturaleza Jurídica"]
[1,"Obra pública","Concurso de méritos","Funcionamiento","Persona Natural"]
[2,"Consultoría","Contratación directa","Inversión","Persona Jurídica"]
[3,"Interventoría","Contratación mínima cuantia","Operación","Unión Temporal"]
[4,"Contratos de prestación de servicios","Selección abreviada",null,"Consorcio"]
[5,"Contratos de prestación de servicios profesionales y de apoyo a la gestión","Licitación pública"]
[6,"Compraventa de bienes muebles","Régimen privado"]
[7,"Compraventa de bienes inmuebles","Régimen especial"]
[8,"Arrendamiento de bienes muebles"]
[9,"Arrendamiento de bienes inmuebles"]
[10,"Seguros","Selección abreviada"]
[11,"Suministro","Subasta inversa "]
[12,"Empréstitos","Bolsas de productos"]
[13,"Fiducia mercantil o encargo fiduciario","Acuerdo marco de precios "]
[14,"Concesión ","Selección abreviada por menor cuantía "]
[15,"Convenios de cooperacion"]
[16,"Contratos interadministrativos","contratacion directa"]
[17,"Convenios de apoyo y/o convenios de asociación ","Urgencia manifiesta"]
[18,"Asociaciones público privadas","Contratación de empréstitos"]
[19,"Otros","Contratos interadministrativos"]
[20,"Otros gastos","Contratación de bienes y servicios en el sector Defensa y en el Departamento Administrativo de Seguridad, DAS"]
[null,"SECTOR","Contratos para el desarrollo de actividades científicas y tecnológicas"]
[1,"Gestión Pública","Contratos de encargo fiduciario que celebren las entidades territoriales cuando inician el Acuerdo de Reestructuración de Pasivos"]
[{"$f":"+A23+1","v":2},"Gobierno","Cuando no exista pluralidad de oferentes en el mercado"]
[{"$f":"+A24+1","v":3},"Hacienda","Prestación de servicios profesionales y de apoyo a la gestión, o para la ejecución de trabajos artísticos que sólo puedan encomendarse a determinadas personas naturales;"]
[4,"Planeación","El arrendamiento o adquisición de inmuebles"]
[5,"Desarrollo Económico, Industria y Turismo","Contratación de bienes y servicios de la Dirección Nacional de Inteligencia (DNI)"]
[6,"Educación"]
[7,"Salud"]
[8,"Integración Social","Decreto 92 de 2017"]
[9,"Cultura, Recreación y Deporte","No aplica"]
[10,"Ambiente"]
[11,"Movilidad","SECOP I"]
[12,"Hábitat","SECOP II"]
[13,"Mujeres"]
[14,"Seguridad, Convivencia y Justicia","Bogotá Mejor para Todos"]
[15,"Gestión Juridíca","Un Nuevo Contrato Social y Ambiental para la Bogotá del Siglo XXI"]
[16,"descentralizado territorialmente"]
[]
[null,"16 - AL"]

{"sheet":"Eje_Pilar_Prop1","index":10,"n_rows":104,"n_cols":5,"rows_kept":104,"cut":false,"hidden":true,"merged":[]}
[]
[null,"PDD","No. Programa","Programa","Pilar /Eje / propósito"]
[null,"Bogotá Mejor para Todos",1,"Prevención y atención de la maternidad y la paternidad tempranas","Pilar 1 Igualdad de Calidad de Vida"]
[null,"Bogotá Mejor para Todos",2,"Desarrollo integral desde la gestación hasta la adolescencia","Pilar 1 Igualdad de Calidad de Vida"]
[null,"Bogotá Mejor para Todos",3,"Igualdad y autonomía para una Bogotá incluyente","Pilar 1 Igualdad de Calidad de Vida"]
[null,"Bogotá Mejor para Todos",4,"Familias protegidas y adaptadas al cambio climático","Pilar 1 Igualdad de Calidad de Vida"]
[null,"Bogotá Mejor para Todos",5,"Desarrollo integral para la felicidad y el ejercicio de la ciudadanía","Pilar 1 Igualdad de Calidad de Vida"]
[null,"Bogotá Mejor para Todos",6,"Calidad educativa para todos","Pilar 1 Igualdad de Calidad de Vida"]
[null,"Bogotá Mejor para Todos",7,"Inclusión educativa para la equidad","Pilar 1 Igualdad de Calidad de Vida"]
[null,"Bogotá Mejor para Todos",8,"Acceso con calidad a la educación superior","Pilar 1 Igualdad de Calidad de Vida"]
[null,"Bogotá Mejor para Todos",9,"Atención integral y eficiente en salud","Pilar 1 Igualdad de Calidad de Vida"]
[null,"Bogotá Mejor para Todos",10,"Modernización de la infraestructura física y tecnológica en salud","Pilar 1 Igualdad de Calidad de Vida"]
[null,"Bogotá Mejor para Todos",11,"Mejores oportunidades para el desarrollo a través de la cultura, la recreación y el deporte","Pilar 1 Igualdad de Calidad de Vida"]
[null,"Bogotá Mejor para Todos",12,"Mujeres protagonistas, activas y empoderadas en el cierre de brechas de género","Pilar 1 Igualdad de Calidad de Vida"]
[null,"Bogotá Mejor para Todos",13,"Infraestructura para el desarrollo del hábitat","Pilar 2 Democracía Urbana"]
[null,"Bogotá Mejor para Todos",14,"Intervenciones integrales del hábitat","Pilar 2 Democracía Urbana"]
[null,"Bogotá Mejor para Todos",15,"Recuperación, incorporación, vida urbana y control de la ilegalidad","Pilar 2 Democracía Urbana"]
[null,"Bogotá Mejor para Todos",16,"Integración social para una ciudad de oportunidades","Pilar 2 Democracía Urbana"]
[null,"Bogotá Mejor para Todos",17,"Espacio público, derecho de todos","Pilar 2 Democracía Urbana"]
[null,"Bogotá Mejor para Todos",18,"Mejor movilidad para todos","Pilar 2 Democracía Urbana"]
[null,"Bogotá Mejor para Todos",19,"Seguridad y convivencia para todos","Pilar 3 Construcción de Comunidad y Cultura Ciudadana"]
[null,"Bogotá Mejor para Todos",20,"Fortalecimiento del Sistema de Protección Integral a Mujeres Víctimas de Violencia - SOFIA","Pilar 3 Construcción de Comunidad y Cultura Ciudadana"]
[null,"Bogotá Mejor para Todos",21,"Justicia para todos: consolidación del Sistema Distrital de Justicia","Pilar 3 Construcción de Comunidad y Cultura Ciudadana"]
[null,"Bogotá Mejor para Todos",22,"Bogotá vive los derechos humanos","Pilar 3 Construcción de Comunidad y Cultura Ciudadana"]
[null,"Bogotá Mejor para Todos",23,"Bogotá mejor para las víctimas, la paz y la reconciliación","Pilar 3 Construcción de Comunidad y Cultura Ciudadana"]
[null,"Bogotá Mejor para Todos",24,"Equipo por la educación para el reencuentro, la reconciliación y la paz","Pilar 3 Construcción de Comunidad y Cultura Ciudadana"]
[null,"Bogotá Mejor para Todos",25,"Cambio cultural y construcción del tejido social para la vida","Pilar 3 Construcción de Comunidad y Cultura Ciudadana"]
[null,"Bogotá Mejor para Todos",26,"Información relevante e integral para la planeación territorial","Eje Transversal 1 Nuevo Ordenamiento Territorial"]
[null,"Bogotá Mejor para Todos",27,"Proyectos urbanos integrales con visión de ciudad","Eje Transversal 1 Nuevo Ordenamiento Territorial"]
[null,"Bogotá Mejor para Todos",28,"Suelo para reducir el déficit habitacional de suelo urbanizable, vivienda y soportes urbanos","Eje Transversal 1 Nuevo Ordenamiento Territorial"]
[null,"Bogotá Mejor para Todos",29,"Articulación regional y planeación integral del transporte","Eje Transversal 1 Nuevo Ordenamiento Territorial"]
[null,"Bogotá Mejor para Todos",30,"Financiación para el Desarrollo Territorial","Eje Transversal 1 Nuevo Ordenamiento Territorial"]
[null,"Bogotá Mejor para Todos",31,"Fundamentar el desarrollo económico en la generación y uso del conocimiento para mejorar la competitividad de la Ciudad Región","Eje Transversal 2 Desarrollo Económico basado en el conocimiento"]
[null,"Bogotá Mejor para Todos",32,"Generar alternativas de ingreso y empleo de mejor calidad","Eje Transversal 2 Desarrollo Económico basado en el conocimiento"]
[null,"Bogotá Mejor para Todos",33,"Elevar la eficiencia de los mercados de la ciudad","Eje Transversal 2 Desarrollo Económico basado en el conocimiento"]
[null,"Bogotá Mejor para Todos",34,"Mejorar y fortalecer el recaudo tributario de la ciudad e impulsar el uso de mecanismos de vinculación de capital privado","Eje Transversal 2 Desarrollo Económico basado en el conocimiento"]
[null,"Bogotá Mejor para Todos",35,"Bogotá, ciudad inteligente","Eje Transversal 2 Desarrollo Económico basado en el conocimiento"]
[null,"Bogotá Mejor para Todos",36,"Bogotá, una ciudad digital","Eje Transversal 2 Desarrollo Económico basado en el conocimiento"]
[null,"Bogotá Mejor para Todos",37,"Consolidar el turismo como factor de desarrollo, confianza y felicidad para Bogotá Región","Eje Transversal 2 Desarrollo Económico basado en el conocimiento"]
[null,"Bogotá Mejor para Todos",38,"Recuperación y manejo de la Estructura Ecológica Principal","Eje Transversal 3 Sostenibilidad Ambiental basada en la eficiencia energética"]
[null,"Bogotá Mejor para Todos",39,"Ambiente sano para la equidad y disfrute del ciudadano","Eje Transversal 3 Sostenibilidad Ambiental basada en la eficiencia energética"]
[null,"Bogotá Mejor para Todos",40,"Gestión de la huella ambiental urbana","Eje Transversal 3 Sostenibilidad Ambiental basada en la eficiencia energética"]
[null,"Bogotá Mejor para Todos",41,"Desarrollo rural sostenible","Eje Transversal 3 Sostenibilidad Ambiental basada en la eficiencia energética"]
[null,"Bogotá Mejor para Todos",42,"Transparencia, gestión pública y servicio a la ciudadanía","Eje Transversal 4 Gobierno Legitimo, Fortalecimiento Local y Eficiencia"]
[null,"Bogotá Mejor para Todos",43,"Modernización institucional","Eje Transversal 4 Gobierno Legitimo, Fortalecimiento Local y Eficiencia"]
[null,"Bogotá Mejor para Todos",44,"Gobierno y ciudadanía digital","Eje Transversal 4 Gobierno Legitimo, Fortalecimiento Local y Eficiencia"]
[null,"Bogotá Mejor para Todos",45,"Gobernanza e influencia local, regional e internacional","Eje Transversal 4 Gobierno Legitimo, Fortalecimiento Local y Eficiencia"]
["Acuerdo 761 2020","Un Nuevo Contrato Social y Ambiental para la Bogotá del Siglo XXI","1.","Subsidios y transferencias para la equidad","Propósito 1: Hacer un nuevo contrato social para incrementar la inclusión social, productiva y política"]
["Pag. 51","Un Nuevo Contrato Social y Ambiental para la Bogotá del Siglo XXI","2.","Igualdad de oportunidades y desarrollo de capacidades para las mujeres","Propósito 1: Hacer un nuevo contrato social para incrementar la inclusión social, productiva y política"]
[null,"Un Nuevo Contrato Social y Ambiental para la Bogotá del Siglo XXI","3.","Movilidad social integral","Propósito 1: Hacer un nuevo contrato social para incrementar la inclusión social, productiva y política"]
[null,"Un Nuevo Contrato Social y Ambiental para la Bogotá del Siglo XXI","4.","Prevención de la exclusión por razones étnicas, religiosas, sociales, políticas y de orientación sexual","Propósito 1: Hacer un nuevo contrato social para incrementar la inclusión social, productiva y política"]
[null,"Un Nuevo Contrato Social y Ambiental para la Bogotá del Siglo XXI","5.","Promoción de la igualdad, el desarrollo de capacidades y el reconocimiento de las mujeres","Propósito 1: Hacer un nuevo contrato social para incrementar la inclusión social, productiva y política"]
[null,"Un Nuevo Contrato Social y Ambiental para la Bogotá del Siglo XXI","6.","Sistema Distrital de Cuidado","Propósito 1: Hacer un nuevo contrato social para incrementar la inclusión social, productiva y política"]
[null,"Un Nuevo Contrato Social y Ambiental para la Bogotá del Siglo XXI","7.","Mejora de la gestión de instituciones de salud","Propósito 1: Hacer un nuevo contrato social para incrementar la inclusión social, productiva y política"]
[null,"Un Nuevo Contrato Social y Ambiental para la Bogotá del Siglo XXI","8.","Prevención y atención de maternidad temprana","Propósito 1: Hacer un nuevo contrato social para incrementar la inclusión social, productiva y política"]
[null,"Un Nuevo Contrato Social y Ambiental para la Bogotá del Siglo XXI","9.","Prevención y cambios para mejorar la salud de la población","Propósito 1: Hacer un nuevo contrato social para incrementar la inclusión social, productiva y política"]
[null,"Un Nuevo Contrato Social y Ambiental para la Bogotá del Siglo XXI","10.","Salud para la vida y el bienestar","Propósito 1: Hacer un nuevo contrato social para incrementar la inclusión social, productiva y política"]
[null,"Un Nuevo Contrato Social y Ambiental para la Bogotá del Siglo XXI","11.","Salud y bienestar para niñas y niños","Propósito 1: Hacer un nuevo contrato social para incrementar la inclusión social, productiva y política"]
[null,"Un Nuevo Contrato Social y Ambiental para la Bogotá del Siglo XXI","12.","Educación inicial: Bases sólidas para la vida.","Propósito 1: Hacer un nuevo contrato social para incrementar la inclusión social, productiva y política"]
[null,"Un Nuevo Contrato Social y Ambiental para la Bogotá del Siglo XXI","13.","Educación para todos y todas: acceso y permanencia con equidad y énfasis en educación rural","Propósito 1: Hacer un nuevo contrato social para incrementar la inclusión social, productiva y política"]
[null,"Un Nuevo Contrato Social y Ambiental para la Bogotá del Siglo XXI","14.","Formación integral: más y mejor tiempo en los colegios","Propósito 1: Hacer un nuevo contrato social para incrementar la inclusión social, productiva y política"]
[null,"Un Nuevo Contrato Social y Ambiental para la Bogotá del Siglo XXI","15.","Plan Distrital de Lectura, Escritura y Oralidad: \"Leer para la vida\"","Propósito 1: Hacer un nuevo contrato social para incrementar la inclusión social, productiva y política"]
[null,"Un Nuevo Contrato Social y Ambiental para la Bogotá del Siglo XXI","16.","Transformación pedagógica y mejoramiento de la gestión educativa. Es con los maestros y maestras.","Propósito 1: Hacer un nuevo contrato social para incrementar la inclusión social, productiva y política"]
[null,"Un Nuevo Contrato Social y Ambiental para la Bogotá del Siglo XXI","17.","Jóvenes con capacidades: Proyecto de vida para la ciudadanía, la innovación y el trabajo del siglo XXI","Propósito 1: Hacer un nuevo contrato social para incrementar la inclusión social, productiva y política"]
[null,"Un Nuevo Contrato Social y Ambiental para la Bogotá del Siglo XXI","18.","Cierre de brechas para la inclusión productiva urbano rural","Propósito 1: Hacer un nuevo contrato social para incrementar la inclusión social, productiva y política"]
[null,"Un Nuevo Contrato Social y Ambiental para la Bogotá del Siglo XXI","19.","Vivienda y entornos dignos en el territorio urbano y rural","Propósito 1: Hacer un nuevo contrato social para incrementar la inclusión social, productiva y política"]
[null,"Un Nuevo Contrato Social y Ambiental para la Bogotá del Siglo XXI","20.","Bogotá, referente en cultura, deporte, recreación y actividad física, con parques para el desarrollo y la salud","Propósito 1: Hacer un nuevo contrato social para incrementar la inclusión social, productiva y política"]
[null,"Un Nuevo Contrato Social y Ambiental para la Bogotá del Siglo XXI","21.","Creación y vida cotidiana: Apropiación ciudadana del arte, la cultura y el patrimonio, para la democracia cultural","Propósito 1: Hacer un nuevo contrato social para incrementar la inclusión social, productiva y política"]
[null,"Un Nuevo Contrato Social y Ambiental para la Bogotá del Siglo XXI","22.","Transformación cultural para la conciencia ambiental y el cuidado de la fauna doméstica","Propósito 1: Hacer un nuevo contrato social para incrementar la inclusión social, productiva y política"]
[null,"Un Nuevo Contrato Social y Ambiental para la Bogotá del Siglo XXI","23.","Bogotá rural","Propósito 1: Hacer un nuevo contrato social para incrementar la inclusión social, productiva y política"]
[null,"Un Nuevo Contrato Social y Ambiental para la Bogotá del Siglo XXI","24.","Bogotá región emprendedora e innovadora","Propósito 1: Hacer un nuevo contrato social para incrementar la inclusión social, productiva y política"]
[null,"Un Nuevo Contrato Social y Ambiental para la Bogotá del Siglo XXI","25.","Bogotá región productiva y competitiva","Propósito 1: Hacer un nuevo contrato social para incrementar la inclusión social, productiva y política"]
[null,"Un Nuevo Contrato Social y Ambiental para la Bogotá del Siglo XXI","26.","Bogotá - región, el mejor destino para visitar","Propósito 1: Hacer un nuevo contrato social para incrementar la inclusión social, productiva y política"]
[null,"Un Nuevo Contrato Social y Ambiental para la Bogotá del Siglo XXI","27.","Cambio cultural para la gestión de la crisis climática","Propósito 2 : Cambiar Nuestros Hábitos de Vida para Reverdecer a Bogotá y Adaptarnos y Mitigar la Crisis Climática"]
[null,"Un Nuevo Contrato Social y Ambiental para la Bogotá del Siglo XXI","28.","Bogotá protectora de sus recursos naturales","Propósito 2 : Cambiar Nuestros Hábitos de Vida para Reverdecer a Bogotá y Adaptarnos y Mitigar la Crisis Climática"]
[null,"Un Nuevo Contrato Social y Ambiental para la Bogotá del Siglo XXI","29.","Asentamientos y entornos protectores","Propósito 2 : Cambiar Nuestros Hábitos de Vida para Reverdecer a Bogotá y Adaptarnos y Mitigar la Crisis Climática"]
[null,"Un Nuevo Contrato Social y Ambiental para la Bogotá del Siglo XXI","30.","Eficiencia en la atención de emergencias","Propósito 2 : Cambiar Nuestros Hábitos de Vida para Reverdecer a Bogotá y Adaptarnos y Mitigar la Crisis Climática"]
[null,"Un Nuevo Contrato Social y Ambiental para la Bogotá del Siglo XXI","31."," Protección y valoración del patrimonio tangible e intangible en Bogotá y la región","Propósito 2 : Cambiar Nuestros Hábitos de Vida para Reverdecer a Bogotá y Adaptarnos y Mitigar la Crisis Climática"]
[null,"Un Nuevo Contrato Social y Ambiental para la Bogotá del Siglo XXI","32.","Revitalización urbana para la competitividad","Propósito 2 : Cambiar Nuestros Hábitos de Vida para Reverdecer a Bogotá y Adaptarnos y Mitigar la Crisis Climática"]
[null,"Un Nuevo Contrato Social y Ambiental para la Bogotá del Siglo XXI","33.","Más árboles y más y mejor espacio público","Propósito 2 : Cambiar Nuestros Hábitos de Vida para Reverdecer a Bogotá y Adaptarnos y Mitigar la Crisis Climática"]
[null,"Un Nuevo Contrato Social y Ambiental para la Bogotá del Siglo XXI","34.","Bogotá protectora de los animales","Propósito 2 : Cambiar Nuestros Hábitos de Vida para Reverdecer a Bogotá y Adaptarnos y Mitigar la Crisis Climática"]
[null,"Un Nuevo Contrato Social y Ambiental para la Bogotá del Siglo XXI","35.","Manejo y prevención de contaminación","Propósito 2 : Cambiar Nuestros Hábitos de Vida para Reverdecer a Bogotá y Adaptarnos y Mitigar la Crisis Climática"]
[null,"Un Nuevo Contrato Social y Ambiental para la Bogotá del Siglo XXI","36.","Manejo y saneamiento de los cuerpos de agua","Propósito 2 : Cambiar Nuestros Hábitos de Vida para Reverdecer a Bogotá y Adaptarnos y Mitigar la Crisis Climática"]
[null,"Un Nuevo Contrato Social y Ambiental para la Bogotá del Siglo XXI","37.","Provisión y mejoramiento de servicios públicos","Propósito 2 : Cambiar Nuestros Hábitos de Vida para Reverdecer a Bogotá y Adaptarnos y Mitigar la Crisis Climática"]
[null,"Un Nuevo Contrato Social y Ambiental para la Bogotá del Siglo XXI","38.","Ecoeficiencia, reciclaje, manejo de residuos e inclusión de la población recicladora","Propósito 2 : Cambiar Nuestros Hábitos de Vida para Reverdecer a Bogotá y Adaptarnos y Mitigar la Crisis Climática"]
[null,"Un Nuevo Contrato Social y Ambiental para la Bogotá del Siglo XXI","39.","Bogotá territorio de paz y atención integral a las víctimas del conflicto armado","Propósito 3: Inspirar confianza y legitimidad para vivir sin miedo y ser epicentro de cultura ciudadana, paz y reconciliación"]
[null,"Un Nuevo Contrato Social y Ambiental para la Bogotá del Siglo XXI","40.","Más mujeres viven una vida libre de violencias, se sienten seguras y acceden con confianza al sistema de justicia","Propósito 3: Inspirar confianza y legitimidad para vivir sin miedo y ser epicentro de cultura ciudadana, paz y reconciliación"]
[null,"Un Nuevo Contrato Social y Ambiental para la Bogotá del Siglo XXI","41.","Sin machismo ni violencias contra las mujeres, las niñas y los niños","Propósito 3: Inspirar confianza y legitimidad para vivir sin miedo y ser epicentro de cultura ciudadana, paz y reconciliación"]
[null,"Un Nuevo Contrato Social y Ambiental para la Bogotá del Siglo XXI","42.","Conciencia y cultura ciudadana para la seguridad, la convivencia y la construcción de confianza","Propósito 3: Inspirar confianza y legitimidad para vivir sin miedo y ser epicentro de cultura ciudadana, paz y reconciliación"]
[null,"Un Nuevo Contrato Social y Ambiental para la Bogotá del Siglo XXI","43.","Cultura ciudadana para la confianza, la convivencia y la participación desde la vida cotidiana","Propósito 3: Inspirar confianza y legitimidad para vivir sin miedo y ser epicentro de cultura ciudadana, paz y reconciliación"]
[null,"Un Nuevo Contrato Social y Ambiental para la Bogotá del Siglo XXI","44.","Autoconciencia, respeto y cuidado en el espacio público","Propósito 3: Inspirar confianza y legitimidad para vivir sin miedo y ser epicentro de cultura ciudadana, paz y reconciliación"]
[null,"Un Nuevo Contrato Social y Ambiental para la Bogotá del Siglo XXI","45.","Espacio público más seguro y construido colectivamente","Propósito 3: Inspirar confianza y legitimidad para vivir sin miedo y ser epicentro de cultura ciudadana, paz y reconciliación"]
[null,"Un Nuevo Contrato Social y Ambiental para la Bogotá del Siglo XXI","46.","Atención a jóvenes y adultos infractores con impacto en su proyecto de vida","Propósito 3: Inspirar confianza y legitimidad para vivir sin miedo y ser epicentro de cultura ciudadana, paz y reconciliación"]
[null,"Un Nuevo Contrato Social y Ambiental para la Bogotá del Siglo XXI","47.","Calidad de Vida y Derechos de la Población privada de la libertad","Propósito 3: Inspirar confianza y legitimidad para vivir sin miedo y ser epicentro de cultura ciudadana, paz y reconciliación"]
[null,"Un Nuevo Contrato Social y Ambiental para la Bogotá del Siglo XXI","48.","Plataforma institucional para la seguridad y justicia","Propósito 3: Inspirar confianza y legitimidad para vivir sin miedo y ser epicentro de cultura ciudadana, paz y reconciliación"]
[null,"Un Nuevo Contrato Social y Ambiental para la Bogotá del Siglo XXI","49.","Movilidad segura, sostenible y accesible","Propósito 4: Hacer de Bogotá Región un modelo de movilidad multimodal, incluyente y sostenible"]
[null,"Un Nuevo Contrato Social y Ambiental para la Bogotá del Siglo XXI","50.","Red de metros","Propósito 4: Hacer de Bogotá Región un modelo de movilidad multimodal, incluyente y sostenible"]
[null,"Un Nuevo Contrato Social y Ambiental para la Bogotá del Siglo XXI","51.","Gobierno Abierto","Propósito 5: Construir Bogotá - Región con gobierno abierto, transparente y ciudadanía consciente"]
[null,"Un Nuevo Contrato Social y Ambiental para la Bogotá del Siglo XXI","52.","Integración regional, distrital y local","Propósito 5: Construir Bogotá - Región con gobierno abierto, transparente y ciudadanía consciente"]
[null,"Un Nuevo Contrato Social y Ambiental para la Bogotá del Siglo XXI","53.","Información para la toma de decisiones","Propósito 5: Construir Bogotá - Región con gobierno abierto, transparente y ciudadanía consciente"]
[null,"Un Nuevo Contrato Social y Ambiental para la Bogotá del Siglo XXI","54.","Transformación digital y gestión de TIC para un territorio inteligente","Propósito 5: Construir Bogotá - Región con gobierno abierto, transparente y ciudadanía consciente"]
[null,"Un Nuevo Contrato Social y Ambiental para la Bogotá del Siglo XXI","55.","Fortalecimiento de cultura ciudadana y su institucionalidad","Propósito 5: Construir Bogotá - Región con gobierno abierto, transparente y ciudadanía consciente"]
[null,"Un Nuevo Contrato Social y Ambiental para la Bogotá del Siglo XXI","56.","Gestión pública efectiva","Propósito 5: Construir Bogotá - Región con gobierno abierto, transparente y ciudadanía consciente"]
[null,"Un Nuevo Contrato Social y Ambiental para la Bogotá del Siglo XXI","57.","Gestión pública local","Propósito 5: Construir Bogotá - Región con gobierno abierto, transparente y ciudadanía consciente"]