{"text_format":"1","workbook":"xlsx","n_sheets":4,"sheets":["Formato a Dici 31 de 2016","Instructivo","Equivalencia BH-BMPT","Tipo "],"not_rendered":{"charts":0,"images":0,"macros":1,"external_links":5,"defined_names":9,"comments":0,"pivot_tables":0},"unopened":[],"bounds":{"document_bytes":16777216,"sheet_cells":100000,"rows_first":2000,"rows_last":500,"rows_between":2000,"halvings":0,"cell_chars":16384,"cell_head_chars":4096},"cells_cut":0,"cells_raw":0,"read":"whole","date_system":"1900"}

{"sheet":"Formato a Dici 31 de 2016","index":0,"n_rows":156,"n_cols":33,"rows_kept":156,"cut":false,"hidden":false,"merged":[[149,11,149,13],[10,26,10,30],[11,31,12,31],[11,21,12,21],[11,22,12,22],[11,23,12,23],[11,24,12,24],[11,27,12,27],[9,0,9,13],[9,14,9,20],[9,21,9,25],[10,12,10,13],[10,3,10,4],[10,8,10,10],[11,2,12,2],[11,3,12,3],[11,9,11,11],[11,0,12,0],[11,28,12,28],[11,5,12,5],[11,7,12,7],[11,12,11,13],[11,14,12,14],[11,16,12,16],[11,18,12,18],[11,19,12,19],[11,20,12,20],[1,0,1,31],[2,0,2,31],[3,0,3,3],[3,12,3,13],[4,0,4,3],[4,9,4,10],[4,21,4,31],[3,20,3,31],[5,0,5,3],[3,9,3,10],[9,26,9,30],[11,30,12,30],[11,29,12,29],[5,9,5,10],[5,21,5,31],[6,0,6,13],[6,21,6,31],[7,0,7,3],[7,5,7,7],[7,9,8,13],[7,21,7,31],[8,0,8,3],[8,5,8,7],[8,21,8,31]]}
[]
["VEEDURIA DISTRITAL - RENDICION DE CUENTAS DE LA GESTION CONTRACTUAL EN EL DISTRITO CAPITAL (Acuerdo 380 de 2009)"]
["INFORMACION GENERAL DE CONTRATACION ENTIDADES DISTRITALES -  ENERO 1 A DICIEMBRE 31 DE 2017"]
["1, Entidad:",null,null,null,"ALCALDIA LOCAL DE LA CANDELARIA",null,null,"2, Sector:","GOBIERNO",null,null,null,null,null,null,null,null,null,null,null,"9, Nombre de quien diligencia el formato:"]
["3, Presupuesto Disponible Inversión directa PREDIS:",null,null,null,10766455097,null,null,"5, Presupuesto Disponible Funcionamiento PREDIS:",1389803187,null,null,null,null,null,null,null,null,null,null,null,null,"XIOMARA MELISSA SIERRA OSPINA"]
["4, Presupuesto comprometido de inversión según PREDIS :",null,null,null,9565844316,null,null,"6, Presupuesto comprometido funcionamiento según PREDIS",1289186851,null,null,null,null,null,null,null,null,null,null,null,"Cargo:","PROFESIONAL UNIVERSITARIO GRADO 18"]
[null,null,null,null,null,null,null,null,null,null,null,null,null,null,null,null,null,null,null,null,"Dependencia","OFICINA DE CONTRATACIÓN"]
["7, Presupuesto Disponible Operación (Regimen Privado):",null,null,null,null,null,null,null,null,null,null,null,null,null,null,null,null,null,null,null,"Teléfono: ","3416009 EXT. 127"]
["8, Presupuesto comprometido operación mediante contratos:",null,null,null,null,null,null,null,null,null,null,null,null,null,null,null,null,null,null,null,"Correo Electrónico","xiomara.sierra@gobiernobogota.gov.co"]
["1- INFORMACION GENERAL",null,null,null,null,null,null,null,null,null,null,null,null,null,"2- INFORMACION FINANCIERA",null,null,null,null,null,null,"3 - PLAZOS ",null,null,null,null,"4 - ESTADO ",null,null,null,null,"5. %  Avance y/o cumplimiento"]
[1,2,3,4,null,5,6,7,8,null,null,9,10,null,11,12,13,14,15,16,17,18,19,20,21,22,23,null,null,null,null,24]
["Número Contrato",null,"Número de proceso SECOP","Tipo de Contrato        ",null,"Modalidad de Selección",null,"Objeto",null,"Presupuesto",null,null,"Contratista",null,"Valor Inicial del contrato",null,"Valor total reducciones (En valor negativo)",null,"Valor total de adiciones ","Valor Final ","Giros\n(Valor en pesos)","Fecha de suscripción (DD/MM/AAAA)","Fecha de inicio (DD/MM/AAAA)","Fecha de terminación (DD/MM/AAAA)","Plazo en días","Prórroga",null,"Celebrado o por iniciar","En Ejecución","Terminado","Liquidado","% Avance y/o Cumplimiento"]
[null,"Año",null,null,"Equivalencia Tipo de contrato ",null,"Procedimiento o causal",null,"Afectación ","Número Programa","Equivalencia número de programa","Número Proyecto","Número  de Identificación\ndel contratista","Nombre del contratista",null,"Número de reducciones en valor",null,"Número de adiciones en valor",null,null,null,null,null,null,null,"Prorroga en días","Anulado"]
[10,2016,null,null,"CONTRATO DE PRESTACION DE SERVICIOS","Licitación pública","No aplica","PRESTACIÓN DE SERVICIOS CUYO OBJETO ES: PRESTAR EL SERVICIO DE VIGILANCIA Y SEGURIDAD PRIVADA EN LA MODALIDAD DE VIGILANCIA  FIJA CON ARMAS Y MEDIOS TECNOLÓGICOS EN LAS INSTALACIONES QUE DESIGNE EL FONDO DE DESARROLLO LOCAL DE LA CANDELARIA CON EL FIN DE ASEGURAR LA PROTECCIÓN  DE LAS PERSONAS Y LOS BIENES MUEBLES E INMUEBLES DE PROPIEDAD DE LA ENTIDAD, Y DE LOS QUE LEGALMENTE SEA O LLEGARE A SER RESPONSABLE.","Funcionamiento",null,{"$f":"IF(J14=1,'Equivalencia BH-BMPT'!$D$2,IF(J14=2,'Equivalencia BH-BMPT'!$D$3,IF(J14=3,'Equivalencia BH-BMPT'!$D$4,IF(J14=4,'Equivalencia BH-BMPT'!$D$5,IF(J14=5,'Equivalencia BH-BMPT'!$D$6,IF(J14=6,'Equivalencia BH-BMPT'!$D$7,IF(J14=7,'Equivalencia BH-BMPT'!$D$8,IF(J14=8,'Equivalencia BH-BMPT'!$D$9,IF(J14=9,'Equivalencia BH-BMPT'!$D$10,IF(J14=10,'Equivalencia BH-BMPT'!$D$11,IF(J14=11,'Equivalencia BH-BMPT'!$D$12,IF(J14=12,'Equivalencia BH-BMPT'!$D$13,IF(J14=13,'Equivalencia BH-BMPT'!$D$14,IF(J14=14,'Equivalencia BH-BMPT'!$D$15,IF(J14=15,'Equivalencia BH-BMPT'!$D$16,IF(J14=16,'Equivalencia BH-BMPT'!$D$17,IF(J14=17,'Equivalencia BH-BMPT'!$D$18,IF(J14=18,'Equivalencia BH-BMPT'!$D$19,IF(J14=19,'Equivalencia BH-BMPT'!$D$20,IF(J14=20,'Equivalencia BH-BMPT'!$D$21,IF(J14=21,'Equivalencia BH-BMPT'!$D$22,IF(J14=22,'Equivalencia BH-BMPT'!$D$23,IF(J14=23,'Equivalencia BH-BMPT'!#REF!,IF(J14=24,'Equivalencia BH-BMPT'!$D$25,IF(J14=25,'Equivalencia BH-BMPT'!$D$26,IF(J14=26,'Equivalencia BH-BMPT'!$D$27,IF(J14=27,'Equivalencia BH-BMPT'!$D$28,IF(J14=28,'Equivalencia BH-BMPT'!$D$29,IF(J14=29,'Equivalencia BH-BMPT'!$D$30,IF(J14=30,'Equivalencia BH-BMPT'!$D$31,IF(J14=31,'Equivalencia BH-BMPT'!$D$32,IF(J14=32,'Equivalencia BH-BMPT'!$D$33,IF(J14=33,'Equivalencia BH-BMPT'!$D$34,IF(J14=34,'Equivalencia BH-BMPT'!$D$35,IF(J14=35,'Equivalencia BH-BMPT'!$D$36,IF(J14=36,'Equivalencia BH-BMPT'!$D$37,IF(J14=37,'Equivalencia BH-BMPT'!$D$38,IF(J14=38,'Equivalencia BH-BMPT'!#REF!,IF(J14=39,'Equivalencia BH-BMPT'!$D$40,IF(J14=40,'Equivalencia BH-BMPT'!$D$41,IF(J14=41,'Equivalencia BH-BMPT'!$D$42,IF(J14=42,'Equivalencia BH-BMPT'!$D$43,IF(J14=43,'Equivalencia BH-BMPT'!$D$44,IF(J14=44,'Equivalencia BH-BMPT'!$D$45,IF(J14=45,'Equivalencia BH-BMPT'!$D$46,\"No ha seleccionado un número de programa\")))))))))))))))))))))))))))))))))))))))))))))","v":"No ha seleccionado un número de programa"},"0000",null,"SEGURIDAD PRIVADA ASESORIAS Y SERVICIOS LTDA VIGIASER LTDA",null,null,null,null,34963934,{"$f":"O14+Q14+S14","v":34963934},33442277,null,null,null,null,null,null,null,null,"X",null,{"$f":"SUM(U14/T14)","v":0.95647923943569968},{"$f":"IF(I14=\"Funcionamiento\",J14=0,J14=\"\")","v":true}]
[44,2017,"17-13-6072314",10,{"$f":"IF(D15=1,'[1]Tipo '!$B$2,IF(D15=2,'[1]Tipo '!$B$3,IF(D15=3,'[1]Tipo '!$B$4,IF(D15=4,'[1]Tipo '!$B$5,IF(D15=5,'[1]Tipo '!$B$6,IF(D15=6,'[1]Tipo '!$B$7,IF(D15=7,'[1]Tipo '!$B$8,IF(D15=8,'[1]Tipo '!$B$9,IF(D15=9,'[1]Tipo '!$B$10,IF(D15=10,'[1]Tipo '!$B$11,IF(D15=11,'[1]Tipo '!$B$12,IF(D15=12,'[1]Tipo '!$B$13,IF(D15=13,'[1]Tipo '!$B$14,IF(D15=14,'[1]Tipo '!$B$15,IF(D15=15,'[1]Tipo '!$B$16,IF(D15=16,'[1]Tipo '!$B$17,IF(D15=17,'[1]Tipo '!$B$18,IF(D15=18,'[1]Tipo '!$B$19,IF(D15=19,'[1]Tipo '!$B$20,\"No ha seleccionado un tipo de contrato válido\")))))))))))))))))))","v":"SEGUROS"},"Contratación mínima cuantia ","No aplica","CONTRATAR EL PROGRAMA DE SEGUROS PARA AMPARAR LOS BIENES E INTERESES PATRIMONIALES DE  PROPIEDAD DEL FONDO DE DESARROLLO LOCAL DE LA CANDELARIA y POR LOS QUE SEA O LLEGARE A SER RESPONSABLE","Funcionamiento",45,{"$f":"IF(J15=1,'[1]Equivalencia BH-BMPT'!$D$2,IF(J15=2,'[1]Equivalencia BH-BMPT'!$D$3,IF(J15=3,'[1]Equivalencia BH-BMPT'!$D$4,IF(J15=4,'[1]Equivalencia BH-BMPT'!$D$5,IF(J15=5,'[1]Equivalencia BH-BMPT'!$D$6,IF(J15=6,'[1]Equivalencia BH-BMPT'!$D$7,IF(J15=7,'[1]Equivalencia BH-BMPT'!$D$8,IF(J15=8,'[1]Equivalencia BH-BMPT'!$D$9,IF(J15=9,'[1]Equivalencia BH-BMPT'!$D$10,IF(J15=10,'[1]Equivalencia BH-BMPT'!$D$11,IF(J15=11,'[1]Equivalencia BH-BMPT'!$D$12,IF(J15=12,'[1]Equivalencia BH-BMPT'!$D$13,IF(J15=13,'[1]Equivalencia BH-BMPT'!$D$14,IF(J15=14,'[1]Equivalencia BH-BMPT'!$D$15,IF(J15=15,'[1]Equivalencia BH-BMPT'!$D$16,IF(J15=16,'[1]Equivalencia BH-BMPT'!$D$17,IF(J15=17,'[1]Equivalencia BH-BMPT'!$D$18,IF(J15=18,'[1]Equivalencia BH-BMPT'!$D$19,IF(J15=19,'[1]Equivalencia BH-BMPT'!$D$20,IF(J15=20,'[1]Equivalencia BH-BMPT'!$D$21,IF(J15=21,'[1]Equivalencia BH-BMPT'!$D$22,IF(J15=22,'[1]Equivalencia BH-BMPT'!$D$23,IF(J15=23,'[1]Equivalencia BH-BMPT'!#REF!,IF(J15=24,'[1]Equivalencia BH-BMPT'!$D$25,IF(J15=25,'[1]Equivalencia BH-BMPT'!$D$26,IF(J15=26,'[1]Equivalencia BH-BMPT'!$D$27,IF(J15=27,'[1]Equivalencia BH-BMPT'!$D$28,IF(J15=28,'[1]Equivalencia BH-BMPT'!$D$29,IF(J15=29,'[1]Equivalencia BH-BMPT'!$D$30,IF(J15=30,'[1]Equivalencia BH-BMPT'!$D$31,IF(J15=31,'[1]Equivalencia BH-BMPT'!$D$32,IF(J15=32,'[1]Equivalencia BH-BMPT'!$D$33,IF(J15=33,'[1]Equivalencia BH-BMPT'!$D$34,IF(J15=34,'[1]Equivalencia BH-BMPT'!$D$35,IF(J15=35,'[1]Equivalencia BH-BMPT'!$D$36,IF(J15=36,'[1]Equivalencia BH-BMPT'!$D$37,IF(J15=37,'[1]Equivalencia BH-BMPT'!$D$38,IF(J15=38,'[1]Equivalencia BH-BMPT'!#REF!,IF(J15=39,'[1]Equivalencia BH-BMPT'!$D$40,IF(J15=40,'[1]Equivalencia BH-BMPT'!$D$41,IF(J15=41,'[1]Equivalencia BH-BMPT'!$D$42,IF(J15=42,'[1]Equivalencia BH-BMPT'!$D$43,IF(J15=43,'[1]Equivalencia BH-BMPT'!$D$44,IF(J15=44,'[1]Equivalencia BH-BMPT'!$D$45,IF(J15=45,'[1]Equivalencia BH-BMPT'!$D$46,\"No ha seleccionado un número de programa\")))))))))))))))))))))))))))))))))))))))))))))","v":"Gobernanza e influencia local, regional e internacional"},"0000",8600021846,"AXXA Colpatria S.A.",20624382,null,null,null,10277485,{"$f":"O15+Q15+S15","v":30901867},30901867,"2017-02-08","2017-02-08","2017-10-07",95,null,null,null,null,null,"X",1,false]
[56,2017,"ORDEN DE COMPRA 14755",11,{"$f":"IF(D16=1,'[1]Tipo '!$B$2,IF(D16=2,'[1]Tipo '!$B$3,IF(D16=3,'[1]Tipo '!$B$4,IF(D16=4,'[1]Tipo '!$B$5,IF(D16=5,'[1]Tipo '!$B$6,IF(D16=6,'[1]Tipo '!$B$7,IF(D16=7,'[1]Tipo '!$B$8,IF(D16=8,'[1]Tipo '!$B$9,IF(D16=9,'[1]Tipo '!$B$10,IF(D16=10,'[1]Tipo '!$B$11,IF(D16=11,'[1]Tipo '!$B$12,IF(D16=12,'[1]Tipo '!$B$13,IF(D16=13,'[1]Tipo '!$B$14,IF(D16=14,'[1]Tipo '!$B$15,IF(D16=15,'[1]Tipo '!$B$16,IF(D16=16,'[1]Tipo '!$B$17,IF(D16=17,'[1]Tipo '!$B$18,IF(D16=18,'[1]Tipo '!$B$19,IF(D16=19,'[1]Tipo '!$B$20,\"No ha seleccionado un tipo de contrato válido\")))))))))))))))))))","v":"SUMINISTRO"},"Selección abreviada ","Acuerdo marco de precios ","CONTRATAR EL SUMINISTRO DE SERVICIO DE COMBUSTIBLE DE GASOLINA Y A.C.P PARA LOS VEHICULOS DE PROPIEDAD DEL FONDO DE DESARROLLO LOCAL DE LA CANDELARIA ","Funcionamiento",null,{"$f":"IF(J16=1,'[1]Equivalencia BH-BMPT'!$D$2,IF(J16=2,'[1]Equivalencia BH-BMPT'!$D$3,IF(J16=3,'[1]Equivalencia BH-BMPT'!$D$4,IF(J16=4,'[1]Equivalencia BH-BMPT'!$D$5,IF(J16=5,'[1]Equivalencia BH-BMPT'!$D$6,IF(J16=6,'[1]Equivalencia BH-BMPT'!$D$7,IF(J16=7,'[1]Equivalencia BH-BMPT'!$D$8,IF(J16=8,'[1]Equivalencia BH-BMPT'!$D$9,IF(J16=9,'[1]Equivalencia BH-BMPT'!$D$10,IF(J16=10,'[1]Equivalencia BH-BMPT'!$D$11,IF(J16=11,'[1]Equivalencia BH-BMPT'!$D$12,IF(J16=12,'[1]Equivalencia BH-BMPT'!$D$13,IF(J16=13,'[1]Equivalencia BH-BMPT'!$D$14,IF(J16=14,'[1]Equivalencia BH-BMPT'!$D$15,IF(J16=15,'[1]Equivalencia BH-BMPT'!$D$16,IF(J16=16,'[1]Equivalencia BH-BMPT'!$D$17,IF(J16=17,'[1]Equivalencia BH-BMPT'!$D$18,IF(J16=18,'[1]Equivalencia BH-BMPT'!$D$19,IF(J16=19,'[1]Equivalencia BH-BMPT'!$D$20,IF(J16=20,'[1]Equivalencia BH-BMPT'!$D$21,IF(J16=21,'[1]Equivalencia BH-BMPT'!$D$22,IF(J16=22,'[1]Equivalencia BH-BMPT'!$D$23,IF(J16=23,'[1]Equivalencia BH-BMPT'!#REF!,IF(J16=24,'[1]Equivalencia BH-BMPT'!$D$25,IF(J16=25,'[1]Equivalencia BH-BMPT'!$D$26,IF(J16=26,'[1]Equivalencia BH-BMPT'!$D$27,IF(J16=27,'[1]Equivalencia BH-BMPT'!$D$28,IF(J16=28,'[1]Equivalencia BH-BMPT'!$D$29,IF(J16=29,'[1]Equivalencia BH-BMPT'!$D$30,IF(J16=30,'[1]Equivalencia BH-BMPT'!$D$31,IF(J16=31,'[1]Equivalencia BH-BMPT'!$D$32,IF(J16=32,'[1]Equivalencia BH-BMPT'!$D$33,IF(J16=33,'[1]Equivalencia BH-BMPT'!$D$34,IF(J16=34,'[1]Equivalencia BH-BMPT'!$D$35,IF(J16=35,'[1]Equivalencia BH-BMPT'!$D$36,IF(J16=36,'[1]Equivalencia BH-BMPT'!$D$37,IF(J16=37,'[1]Equivalencia BH-BMPT'!$D$38,IF(J16=38,'[1]Equivalencia BH-BMPT'!#REF!,IF(J16=39,'[1]Equivalencia BH-BMPT'!$D$40,IF(J16=40,'[1]Equivalencia BH-BMPT'!$D$41,IF(J16=41,'[1]Equivalencia BH-BMPT'!$D$42,IF(J16=42,'[1]Equivalencia BH-BMPT'!$D$43,IF(J16=43,'[1]Equivalencia BH-BMPT'!$D$44,IF(J16=44,'[1]Equivalencia BH-BMPT'!$D$45,IF(J16=45,'[1]Equivalencia BH-BMPT'!$D$46,\"No ha seleccionado un número de programa\")))))))))))))))))))))))))))))))))))))))))))))","v":"No ha seleccionado un número de programa"},"0000",9004597375,"GRUPO EDS AUTOGAS S.A.S",12000000,null,null,null,null,{"$f":"O16+Q16+S16","v":12000000},8927200,"2017-03-03","2017-03-03","2018-02-28",360,null,null,null,"X",null,null,0.74393333333333334,true]
[57,2017,"17-12-6686271",9,{"$f":"IF(D17=1,'[1]Tipo '!$B$2,IF(D17=2,'[1]Tipo '!$B$3,IF(D17=3,'[1]Tipo '!$B$4,IF(D17=4,'[1]Tipo '!$B$5,IF(D17=5,'[1]Tipo '!$B$6,IF(D17=6,'[1]Tipo '!$B$7,IF(D17=7,'[1]Tipo '!$B$8,IF(D17=8,'[1]Tipo '!$B$9,IF(D17=9,'[1]Tipo '!$B$10,IF(D17=10,'[1]Tipo '!$B$11,IF(D17=11,'[1]Tipo '!$B$12,IF(D17=12,'[1]Tipo '!$B$13,IF(D17=13,'[1]Tipo '!$B$14,IF(D17=14,'[1]Tipo '!$B$15,IF(D17=15,'[1]Tipo '!$B$16,IF(D17=16,'[1]Tipo '!$B$17,IF(D17=17,'[1]Tipo '!$B$18,IF(D17=18,'[1]Tipo '!$B$19,IF(D17=19,'[1]Tipo '!$B$20,\"No ha seleccionado un tipo de contrato válido\")))))))))))))))))))","v":"ARRENDAMIENTO DE BIENES INMUEBLES"},"Contratación directa","El arrendamiento o adquisición de inmuebles","ARRENDAMIENTO DE INMUEBLE PARA EL DÉPOSITO DE BIENES INCAUTADOS","Funcionamiento",null,{"$f":"IF(J17=1,'[1]Equivalencia BH-BMPT'!$D$2,IF(J17=2,'[1]Equivalencia BH-BMPT'!$D$3,IF(J17=3,'[1]Equivalencia BH-BMPT'!$D$4,IF(J17=4,'[1]Equivalencia BH-BMPT'!$D$5,IF(J17=5,'[1]Equivalencia BH-BMPT'!$D$6,IF(J17=6,'[1]Equivalencia BH-BMPT'!$D$7,IF(J17=7,'[1]Equivalencia BH-BMPT'!$D$8,IF(J17=8,'[1]Equivalencia BH-BMPT'!$D$9,IF(J17=9,'[1]Equivalencia BH-BMPT'!$D$10,IF(J17=10,'[1]Equivalencia BH-BMPT'!$D$11,IF(J17=11,'[1]Equivalencia BH-BMPT'!$D$12,IF(J17=12,'[1]Equivalencia BH-BMPT'!$D$13,IF(J17=13,'[1]Equivalencia BH-BMPT'!$D$14,IF(J17=14,'[1]Equivalencia BH-BMPT'!$D$15,IF(J17=15,'[1]Equivalencia BH-BMPT'!$D$16,IF(J17=16,'[1]Equivalencia BH-BMPT'!$D$17,IF(J17=17,'[1]Equivalencia BH-BMPT'!$D$18,IF(J17=18,'[1]Equivalencia BH-BMPT'!$D$19,IF(J17=19,'[1]Equivalencia BH-BMPT'!$D$20,IF(J17=20,'[1]Equivalencia BH-BMPT'!$D$21,IF(J17=21,'[1]Equivalencia BH-BMPT'!$D$22,IF(J17=22,'[1]Equivalencia BH-BMPT'!$D$23,IF(J17=23,'[1]Equivalencia BH-BMPT'!#REF!,IF(J17=24,'[1]Equivalencia BH-BMPT'!$D$25,IF(J17=25,'[1]Equivalencia BH-BMPT'!$D$26,IF(J17=26,'[1]Equivalencia BH-BMPT'!$D$27,IF(J17=27,'[1]Equivalencia BH-BMPT'!$D$28,IF(J17=28,'[1]Equivalencia BH-BMPT'!$D$29,IF(J17=29,'[1]Equivalencia BH-BMPT'!$D$30,IF(J17=30,'[1]Equivalencia BH-BMPT'!$D$31,IF(J17=31,'[1]Equivalencia BH-BMPT'!$D$32,IF(J17=32,'[1]Equivalencia BH-BMPT'!$D$33,IF(J17=33,'[1]Equivalencia BH-BMPT'!$D$34,IF(J17=34,'[1]Equivalencia BH-BMPT'!$D$35,IF(J17=35,'[1]Equivalencia BH-BMPT'!$D$36,IF(J17=36,'[1]Equivalencia BH-BMPT'!$D$37,IF(J17=37,'[1]Equivalencia BH-BMPT'!$D$38,IF(J17=38,'[1]Equivalencia BH-BMPT'!#REF!,IF(J17=39,'[1]Equivalencia BH-BMPT'!$D$40,IF(J17=40,'[1]Equivalencia BH-BMPT'!$D$41,IF(J17=41,'[1]Equivalencia BH-BMPT'!$D$42,IF(J17=42,'[1]Equivalencia BH-BMPT'!$D$43,IF(J17=43,'[1]Equivalencia BH-BMPT'!$D$44,IF(J17=44,'[1]Equivalencia BH-BMPT'!$D$45,IF(J17=45,'[1]Equivalencia BH-BMPT'!$D$46,\"No ha seleccionado un número de programa\")))))))))))))))))))))))))))))))))))))))))))))","v":"No ha seleccionado un número de programa"},"0000",79141451,"Hugo Fidel Pineda",14400000,null,null,null,null,{"$f":"O17+Q17+S17","v":14400000},14400000,"2017-03-10","2017-03-10","2017-12-11",270,null,null,null,null,"X",null,1,true]
[59,2017,"17-13-6348895",11,{"$f":"IF(D18=1,'[1]Tipo '!$B$2,IF(D18=2,'[1]Tipo '!$B$3,IF(D18=3,'[1]Tipo '!$B$4,IF(D18=4,'[1]Tipo '!$B$5,IF(D18=5,'[1]Tipo '!$B$6,IF(D18=6,'[1]Tipo '!$B$7,IF(D18=7,'[1]Tipo '!$B$8,IF(D18=8,'[1]Tipo '!$B$9,IF(D18=9,'[1]Tipo '!$B$10,IF(D18=10,'[1]Tipo '!$B$11,IF(D18=11,'[1]Tipo '!$B$12,IF(D18=12,'[1]Tipo '!$B$13,IF(D18=13,'[1]Tipo '!$B$14,IF(D18=14,'[1]Tipo '!$B$15,IF(D18=15,'[1]Tipo '!$B$16,IF(D18=16,'[1]Tipo '!$B$17,IF(D18=17,'[1]Tipo '!$B$18,IF(D18=18,'[1]Tipo '!$B$19,IF(D18=19,'[1]Tipo '!$B$20,\"No ha seleccionado un tipo de contrato válido\")))))))))))))))))))","v":"SUMINISTRO"},"Contratación mínima cuantia ","No aplica","SUMINISTRO DE BIENES PARA EL FORTALECIMIENTO DE LAS ACTIVIDADES DE PROMOCIÓN INSTITUCIONAL DE LA ALCALDÍA LOCAL DE LA CANDELARIA","Funcionamiento",43,{"$f":"IF(J18=1,'[1]Equivalencia BH-BMPT'!$D$2,IF(J18=2,'[1]Equivalencia BH-BMPT'!$D$3,IF(J18=3,'[1]Equivalencia BH-BMPT'!$D$4,IF(J18=4,'[1]Equivalencia BH-BMPT'!$D$5,IF(J18=5,'[1]Equivalencia BH-BMPT'!$D$6,IF(J18=6,'[1]Equivalencia BH-BMPT'!$D$7,IF(J18=7,'[1]Equivalencia BH-BMPT'!$D$8,IF(J18=8,'[1]Equivalencia BH-BMPT'!$D$9,IF(J18=9,'[1]Equivalencia BH-BMPT'!$D$10,IF(J18=10,'[1]Equivalencia BH-BMPT'!$D$11,IF(J18=11,'[1]Equivalencia BH-BMPT'!$D$12,IF(J18=12,'[1]Equivalencia BH-BMPT'!$D$13,IF(J18=13,'[1]Equivalencia BH-BMPT'!$D$14,IF(J18=14,'[1]Equivalencia BH-BMPT'!$D$15,IF(J18=15,'[1]Equivalencia BH-BMPT'!$D$16,IF(J18=16,'[1]Equivalencia BH-BMPT'!$D$17,IF(J18=17,'[1]Equivalencia BH-BMPT'!$D$18,IF(J18=18,'[1]Equivalencia BH-BMPT'!$D$19,IF(J18=19,'[1]Equivalencia BH-BMPT'!$D$20,IF(J18=20,'[1]Equivalencia BH-BMPT'!$D$21,IF(J18=21,'[1]Equivalencia BH-BMPT'!$D$22,IF(J18=22,'[1]Equivalencia BH-BMPT'!$D$23,IF(J18=23,'[1]Equivalencia BH-BMPT'!#REF!,IF(J18=24,'[1]Equivalencia BH-BMPT'!$D$25,IF(J18=25,'[1]Equivalencia BH-BMPT'!$D$26,IF(J18=26,'[1]Equivalencia BH-BMPT'!$D$27,IF(J18=27,'[1]Equivalencia BH-BMPT'!$D$28,IF(J18=28,'[1]Equivalencia BH-BMPT'!$D$29,IF(J18=29,'[1]Equivalencia BH-BMPT'!$D$30,IF(J18=30,'[1]Equivalencia BH-BMPT'!$D$31,IF(J18=31,'[1]Equivalencia BH-BMPT'!$D$32,IF(J18=32,'[1]Equivalencia BH-BMPT'!$D$33,IF(J18=33,'[1]Equivalencia BH-BMPT'!$D$34,IF(J18=34,'[1]Equivalencia BH-BMPT'!$D$35,IF(J18=35,'[1]Equivalencia BH-BMPT'!$D$36,IF(J18=36,'[1]Equivalencia BH-BMPT'!$D$37,IF(J18=37,'[1]Equivalencia BH-BMPT'!$D$38,IF(J18=38,'[1]Equivalencia BH-BMPT'!#REF!,IF(J18=39,'[1]Equivalencia BH-BMPT'!$D$40,IF(J18=40,'[1]Equivalencia BH-BMPT'!$D$41,IF(J18=41,'[1]Equivalencia BH-BMPT'!$D$42,IF(J18=42,'[1]Equivalencia BH-BMPT'!$D$43,IF(J18=43,'[1]Equivalencia BH-BMPT'!$D$44,IF(J18=44,'[1]Equivalencia BH-BMPT'!$D$45,IF(J18=45,'[1]Equivalencia BH-BMPT'!$D$46,\"No ha seleccionado un número de programa\")))))))))))))))))))))))))))))))))))))))))))))","v":"Modernización institucional"},"0000",9002944159,"FUNDACION JUVENTUD Y VIDA ",12000000,900,null,null,null,{"$f":"O18+Q18+S18-P18","v":11999100},11999100,"2017-03-23","2017-03-27","2017-07-26",120,null,null,null,null,"X",null,1,false]
[62,2017,"ORDEN DE COMPRA 15432",4,{"$f":"IF(D19=1,'[1]Tipo '!$B$2,IF(D19=2,'[1]Tipo '!$B$3,IF(D19=3,'[1]Tipo '!$B$4,IF(D19=4,'[1]Tipo '!$B$5,IF(D19=5,'[1]Tipo '!$B$6,IF(D19=6,'[1]Tipo '!$B$7,IF(D19=7,'[1]Tipo '!$B$8,IF(D19=8,'[1]Tipo '!$B$9,IF(D19=9,'[1]Tipo '!$B$10,IF(D19=10,'[1]Tipo '!$B$11,IF(D19=11,'[1]Tipo '!$B$12,IF(D19=12,'[1]Tipo '!$B$13,IF(D19=13,'[1]Tipo '!$B$14,IF(D19=14,'[1]Tipo '!$B$15,IF(D19=15,'[1]Tipo '!$B$16,IF(D19=16,'[1]Tipo '!$B$17,IF(D19=17,'[1]Tipo '!$B$18,IF(D19=18,'[1]Tipo '!$B$19,IF(D19=19,'[1]Tipo '!$B$20,\"No ha seleccionado un tipo de contrato válido\")))))))))))))))))))","v":"CONTRATOS DE PRESTACIÓN DE SERVICIOS"},"Selección abreviada ","Acuerdo marco de precios ","ADQUISICION DEL SERVICIO INTEGRAL DE ASEO Y CAFETERIA PARA LAS INSTALACIONES DE PROPIEDAD DEL FONDO DE DESARROLLO LOCAL DE LA ALCALDIA LOCALO DE LA CANDELARIA ","Funcionamiento",null,{"$f":"IF(J19=1,'[1]Equivalencia BH-BMPT'!$D$2,IF(J19=2,'[1]Equivalencia BH-BMPT'!$D$3,IF(J19=3,'[1]Equivalencia BH-BMPT'!$D$4,IF(J19=4,'[1]Equivalencia BH-BMPT'!$D$5,IF(J19=5,'[1]Equivalencia BH-BMPT'!$D$6,IF(J19=6,'[1]Equivalencia BH-BMPT'!$D$7,IF(J19=7,'[1]Equivalencia BH-BMPT'!$D$8,IF(J19=8,'[1]Equivalencia BH-BMPT'!$D$9,IF(J19=9,'[1]Equivalencia BH-BMPT'!$D$10,IF(J19=10,'[1]Equivalencia BH-BMPT'!$D$11,IF(J19=11,'[1]Equivalencia BH-BMPT'!$D$12,IF(J19=12,'[1]Equivalencia BH-BMPT'!$D$13,IF(J19=13,'[1]Equivalencia BH-BMPT'!$D$14,IF(J19=14,'[1]Equivalencia BH-BMPT'!$D$15,IF(J19=15,'[1]Equivalencia BH-BMPT'!$D$16,IF(J19=16,'[1]Equivalencia BH-BMPT'!$D$17,IF(J19=17,'[1]Equivalencia BH-BMPT'!$D$18,IF(J19=18,'[1]Equivalencia BH-BMPT'!$D$19,IF(J19=19,'[1]Equivalencia BH-BMPT'!$D$20,IF(J19=20,'[1]Equivalencia BH-BMPT'!$D$21,IF(J19=21,'[1]Equivalencia BH-BMPT'!$D$22,IF(J19=22,'[1]Equivalencia BH-BMPT'!$D$23,IF(J19=23,'[1]Equivalencia BH-BMPT'!#REF!,IF(J19=24,'[1]Equivalencia BH-BMPT'!$D$25,IF(J19=25,'[1]Equivalencia BH-BMPT'!$D$26,IF(J19=26,'[1]Equivalencia BH-BMPT'!$D$27,IF(J19=27,'[1]Equivalencia BH-BMPT'!$D$28,IF(J19=28,'[1]Equivalencia BH-BMPT'!$D$29,IF(J19=29,'[1]Equivalencia BH-BMPT'!$D$30,IF(J19=30,'[1]Equivalencia BH-BMPT'!$D$31,IF(J19=31,'[1]Equivalencia BH-BMPT'!$D$32,IF(J19=32,'[1]Equivalencia BH-BMPT'!$D$33,IF(J19=33,'[1]Equivalencia BH-BMPT'!$D$34,IF(J19=34,'[1]Equivalencia BH-BMPT'!$D$35,IF(J19=35,'[1]Equivalencia BH-BMPT'!$D$36,IF(J19=36,'[1]Equivalencia BH-BMPT'!$D$37,IF(J19=37,'[1]Equivalencia BH-BMPT'!$D$38,IF(J19=38,'[1]Equivalencia BH-BMPT'!#REF!,IF(J19=39,'[1]Equivalencia BH-BMPT'!$D$40,IF(J19=40,'[1]Equivalencia BH-BMPT'!$D$41,IF(J19=41,'[1]Equivalencia BH-BMPT'!$D$42,IF(J19=42,'[1]Equivalencia BH-BMPT'!$D$43,IF(J19=43,'[1]Equivalencia BH-BMPT'!$D$44,IF(J19=44,'[1]Equivalencia BH-BMPT'!$D$45,IF(J19=45,'[1]Equivalencia BH-BMPT'!$D$46,\"No ha seleccionado un número de programa\")))))))))))))))))))))))))))))))))))))))))))))","v":"No ha seleccionado un número de programa"},"0000",8600674792,"SERVIASEO S.A.",130175191,null,null,null,28926100,{"$f":"O19+Q19+S19","v":159101291},96216494,"2017-03-28","2017-04-03","2018-03-02",330,null,null,null,"X",null,null,0.60474992625924073,true]
[63,2017,"17-1-168953",4,{"$f":"IF(D20=1,'[1]Tipo '!$B$2,IF(D20=2,'[1]Tipo '!$B$3,IF(D20=3,'[1]Tipo '!$B$4,IF(D20=4,'[1]Tipo '!$B$5,IF(D20=5,'[1]Tipo '!$B$6,IF(D20=6,'[1]Tipo '!$B$7,IF(D20=7,'[1]Tipo '!$B$8,IF(D20=8,'[1]Tipo '!$B$9,IF(D20=9,'[1]Tipo '!$B$10,IF(D20=10,'[1]Tipo '!$B$11,IF(D20=11,'[1]Tipo '!$B$12,IF(D20=12,'[1]Tipo '!$B$13,IF(D20=13,'[1]Tipo '!$B$14,IF(D20=14,'[1]Tipo '!$B$15,IF(D20=15,'[1]Tipo '!$B$16,IF(D20=16,'[1]Tipo '!$B$17,IF(D20=17,'[1]Tipo '!$B$18,IF(D20=18,'[1]Tipo '!$B$19,IF(D20=19,'[1]Tipo '!$B$20,\"No ha seleccionado un tipo de contrato válido\")))))))))))))))))))","v":"CONTRATOS DE PRESTACIÓN DE SERVICIOS"},"Licitación pública","No aplica","PRESTAR EL SERVICIO DE VIGILANCIA Y SEGURIDAD PRIVADA EN LA MODALIDAD DE VIGILANCIA FIJA CON  ARMAS Y MEDIOS TECNOLOGICOS EN LAS INSTALACIONES QUE DESIGNE EL FONDO DE DESARROLLO LOCAL DE LA CANDELARIA CON EL  FIN DE ASEGURAR LA PROTECCIÓN DE LAS PERSONAS Y DE LOS BIENES MUEBLES E INMUEBLES DE PROPIEDAD DE LA ENTIDAD, Y DE LOS QUE LEGALMENTE SEA O LLEGARE A SER RESPONSABLE","Funcionamiento",null,{"$f":"IF(J20=1,'[1]Equivalencia BH-BMPT'!$D$2,IF(J20=2,'[1]Equivalencia BH-BMPT'!$D$3,IF(J20=3,'[1]Equivalencia BH-BMPT'!$D$4,IF(J20=4,'[1]Equivalencia BH-BMPT'!$D$5,IF(J20=5,'[1]Equivalencia BH-BMPT'!$D$6,IF(J20=6,'[1]Equivalencia BH-BMPT'!$D$7,IF(J20=7,'[1]Equivalencia BH-BMPT'!$D$8,IF(J20=8,'[1]Equivalencia BH-BMPT'!$D$9,IF(J20=9,'[1]Equivalencia BH-BMPT'!$D$10,IF(J20=10,'[1]Equivalencia BH-BMPT'!$D$11,IF(J20=11,'[1]Equivalencia BH-BMPT'!$D$12,IF(J20=12,'[1]Equivalencia BH-BMPT'!$D$13,IF(J20=13,'[1]Equivalencia BH-BMPT'!$D$14,IF(J20=14,'[1]Equivalencia BH-BMPT'!$D$15,IF(J20=15,'[1]Equivalencia BH-BMPT'!$D$16,IF(J20=16,'[1]Equivalencia BH-BMPT'!$D$17,IF(J20=17,'[1]Equivalencia BH-BMPT'!$D$18,IF(J20=18,'[1]Equivalencia BH-BMPT'!$D$19,IF(J20=19,'[1]Equivalencia BH-BMPT'!$D$20,IF(J20=20,'[1]Equivalencia BH-BMPT'!$D$21,IF(J20=21,'[1]Equivalencia BH-BMPT'!$D$22,IF(J20=22,'[1]Equivalencia BH-BMPT'!$D$23,IF(J20=23,'[1]Equivalencia BH-BMPT'!#REF!,IF(J20=24,'[1]Equivalencia BH-BMPT'!$D$25,IF(J20=25,'[1]Equivalencia BH-BMPT'!$D$26,IF(J20=26,'[1]Equivalencia BH-BMPT'!$D$27,IF(J20=27,'[1]Equivalencia BH-BMPT'!$D$28,IF(J20=28,'[1]Equivalencia BH-BMPT'!$D$29,IF(J20=29,'[1]Equivalencia BH-BMPT'!$D$30,IF(J20=30,'[1]Equivalencia BH-BMPT'!$D$31,IF(J20=31,'[1]Equivalencia BH-BMPT'!$D$32,IF(J20=32,'[1]Equivalencia BH-BMPT'!$D$33,IF(J20=33,'[1]Equivalencia BH-BMPT'!$D$34,IF(J20=34,'[1]Equivalencia BH-BMPT'!$D$35,IF(J20=35,'[1]Equivalencia BH-BMPT'!$D$36,IF(J20=36,'[1]Equivalencia BH-BMPT'!$D$37,IF(J20=37,'[1]Equivalencia BH-BMPT'!$D$38,IF(J20=38,'[1]Equivalencia BH-BMPT'!#REF!,IF(J20=39,'[1]Equivalencia BH-BMPT'!$D$40,IF(J20=40,'[1]Equivalencia BH-BMPT'!$D$41,IF(J20=41,'[1]Equivalencia BH-BMPT'!$D$42,IF(J20=42,'[1]Equivalencia BH-BMPT'!$D$43,IF(J20=43,'[1]Equivalencia BH-BMPT'!$D$44,IF(J20=44,'[1]Equivalencia BH-BMPT'!$D$45,IF(J20=45,'[1]Equivalencia BH-BMPT'!$D$46,\"No ha seleccionado un número de programa\")))))))))))))))))))))))))))))))))))))))))))))","v":"No ha seleccionado un número de programa"},"0000",8605175603,"EMPRESA DE SEGURIDAD Y VIGILANCIA SERVICONFORD LIMITADA",753008774,null,null,null,null,753008774,547642744,"2017-03-28","2017-04-01","2018-02-28",330,null,null,null,"X",null,null,0.72727272630690487,true]
[64,2017,"17-13-6414134",10,{"$f":"IF(D21=1,'[1]Tipo '!$B$2,IF(D21=2,'[1]Tipo '!$B$3,IF(D21=3,'[1]Tipo '!$B$4,IF(D21=4,'[1]Tipo '!$B$5,IF(D21=5,'[1]Tipo '!$B$6,IF(D21=6,'[1]Tipo '!$B$7,IF(D21=7,'[1]Tipo '!$B$8,IF(D21=8,'[1]Tipo '!$B$9,IF(D21=9,'[1]Tipo '!$B$10,IF(D21=10,'[1]Tipo '!$B$11,IF(D21=11,'[1]Tipo '!$B$12,IF(D21=12,'[1]Tipo '!$B$13,IF(D21=13,'[1]Tipo '!$B$14,IF(D21=14,'[1]Tipo '!$B$15,IF(D21=15,'[1]Tipo '!$B$16,IF(D21=16,'[1]Tipo '!$B$17,IF(D21=17,'[1]Tipo '!$B$18,IF(D21=18,'[1]Tipo '!$B$19,IF(D21=19,'[1]Tipo '!$B$20,\"No ha seleccionado un tipo de contrato válido\")))))))))))))))))))","v":"SEGUROS"},"Contratación mínima cuantia ","No aplica","CONTRATAR UN SEGURO DE VIDA-GRUPO QUE AMPARE A LOS SIETE (7) EDILES DE JUNTA ADMINISTRADORA LOCAL DE LA LOCALIDAD DE LA CANDELARIA","Funcionamiento",null,{"$f":"IF(J21=1,'[1]Equivalencia BH-BMPT'!$D$2,IF(J21=2,'[1]Equivalencia BH-BMPT'!$D$3,IF(J21=3,'[1]Equivalencia BH-BMPT'!$D$4,IF(J21=4,'[1]Equivalencia BH-BMPT'!$D$5,IF(J21=5,'[1]Equivalencia BH-BMPT'!$D$6,IF(J21=6,'[1]Equivalencia BH-BMPT'!$D$7,IF(J21=7,'[1]Equivalencia BH-BMPT'!$D$8,IF(J21=8,'[1]Equivalencia BH-BMPT'!$D$9,IF(J21=9,'[1]Equivalencia BH-BMPT'!$D$10,IF(J21=10,'[1]Equivalencia BH-BMPT'!$D$11,IF(J21=11,'[1]Equivalencia BH-BMPT'!$D$12,IF(J21=12,'[1]Equivalencia BH-BMPT'!$D$13,IF(J21=13,'[1]Equivalencia BH-BMPT'!$D$14,IF(J21=14,'[1]Equivalencia BH-BMPT'!$D$15,IF(J21=15,'[1]Equivalencia BH-BMPT'!$D$16,IF(J21=16,'[1]Equivalencia BH-BMPT'!$D$17,IF(J21=17,'[1]Equivalencia BH-BMPT'!$D$18,IF(J21=18,'[1]Equivalencia BH-BMPT'!$D$19,IF(J21=19,'[1]Equivalencia BH-BMPT'!$D$20,IF(J21=20,'[1]Equivalencia BH-BMPT'!$D$21,IF(J21=21,'[1]Equivalencia BH-BMPT'!$D$22,IF(J21=22,'[1]Equivalencia BH-BMPT'!$D$23,IF(J21=23,'[1]Equivalencia BH-BMPT'!#REF!,IF(J21=24,'[1]Equivalencia BH-BMPT'!$D$25,IF(J21=25,'[1]Equivalencia BH-BMPT'!$D$26,IF(J21=26,'[1]Equivalencia BH-BMPT'!$D$27,IF(J21=27,'[1]Equivalencia BH-BMPT'!$D$28,IF(J21=28,'[1]Equivalencia BH-BMPT'!$D$29,IF(J21=29,'[1]Equivalencia BH-BMPT'!$D$30,IF(J21=30,'[1]Equivalencia BH-BMPT'!$D$31,IF(J21=31,'[1]Equivalencia BH-BMPT'!$D$32,IF(J21=32,'[1]Equivalencia BH-BMPT'!$D$33,IF(J21=33,'[1]Equivalencia BH-BMPT'!$D$34,IF(J21=34,'[1]Equivalencia BH-BMPT'!$D$35,IF(J21=35,'[1]Equivalencia BH-BMPT'!$D$36,IF(J21=36,'[1]Equivalencia BH-BMPT'!$D$37,IF(J21=37,'[1]Equivalencia BH-BMPT'!$D$38,IF(J21=38,'[1]Equivalencia BH-BMPT'!#REF!,IF(J21=39,'[1]Equivalencia BH-BMPT'!$D$40,IF(J21=40,'[1]Equivalencia BH-BMPT'!$D$41,IF(J21=41,'[1]Equivalencia BH-BMPT'!$D$42,IF(J21=42,'[1]Equivalencia BH-BMPT'!$D$43,IF(J21=43,'[1]Equivalencia BH-BMPT'!$D$44,IF(J21=44,'[1]Equivalencia BH-BMPT'!$D$45,IF(J21=45,'[1]Equivalencia BH-BMPT'!$D$46,\"No ha seleccionado un número de programa\")))))))))))))))))))))))))))))))))))))))))))))","v":"No ha seleccionado un número de programa"},"0000",8600024002,"LA PREVISORA S.A",6000000,null,null,null,null,6000000,6000000,"2017-04-05","2017-04-07","2018-04-07",360,null,null,null,"X",null,null,1,true]
[87,2017,"17-12-7060169",16,{"$f":"IF(D22=1,'[2]Tipo '!$B$2,IF(D22=2,'[2]Tipo '!$B$3,IF(D22=3,'[2]Tipo '!$B$4,IF(D22=4,'[2]Tipo '!$B$5,IF(D22=5,'[2]Tipo '!$B$6,IF(D22=6,'[2]Tipo '!$B$7,IF(D22=7,'[2]Tipo '!$B$8,IF(D22=8,'[2]Tipo '!$B$9,IF(D22=9,'[2]Tipo '!$B$10,IF(D22=10,'[2]Tipo '!$B$11,IF(D22=11,'[2]Tipo '!$B$12,IF(D22=12,'[2]Tipo '!$B$13,IF(D22=13,'[2]Tipo '!$B$14,IF(D22=14,'[2]Tipo '!$B$15,IF(D22=15,'[2]Tipo '!$B$16,IF(D22=16,'[2]Tipo '!$B$17,IF(D22=17,'[2]Tipo '!$B$18,IF(D22=18,'[2]Tipo '!$B$19,IF(D22=19,'[2]Tipo '!$B$20,\"No ha seleccionado un tipo de contrato válido\")))))))))))))))))))","v":"CONTRATOS INTERADMINISTRATIVOS"},"Contratación directa","Contratos interadministrativos","REALIZAR EL PROCESO DE PREPRODUCCIÓN, PRODUCCIÓN Y POST PRODUCCIÓN DE PIEZAS AUDIOVISUALES Y EMISIÓN DE PROGRAMAS DE RADIO Y TELEVISIÓN QUE SE CONSIDEREN NECESARIAS E INHERENTES A LAS CAMPAÑAS DE COMUNICACIÓN Y DIVULGACIÓN DE LA ALCALDÍA LOCAL DE LA CANDELARIA","Funcionamiento",36,{"$f":"IF(J22=1,'[2]Equivalencia BH-BMPT'!$D$2,IF(J22=2,'[2]Equivalencia BH-BMPT'!$D$3,IF(J22=3,'[2]Equivalencia BH-BMPT'!$D$4,IF(J22=4,'[2]Equivalencia BH-BMPT'!$D$5,IF(J22=5,'[2]Equivalencia BH-BMPT'!$D$6,IF(J22=6,'[2]Equivalencia BH-BMPT'!$D$7,IF(J22=7,'[2]Equivalencia BH-BMPT'!$D$8,IF(J22=8,'[2]Equivalencia BH-BMPT'!$D$9,IF(J22=9,'[2]Equivalencia BH-BMPT'!$D$10,IF(J22=10,'[2]Equivalencia BH-BMPT'!$D$11,IF(J22=11,'[2]Equivalencia BH-BMPT'!$D$12,IF(J22=12,'[2]Equivalencia BH-BMPT'!$D$13,IF(J22=13,'[2]Equivalencia BH-BMPT'!$D$14,IF(J22=14,'[2]Equivalencia BH-BMPT'!$D$15,IF(J22=15,'[2]Equivalencia BH-BMPT'!$D$16,IF(J22=16,'[2]Equivalencia BH-BMPT'!$D$17,IF(J22=17,'[2]Equivalencia BH-BMPT'!$D$18,IF(J22=18,'[2]Equivalencia BH-BMPT'!$D$19,IF(J22=19,'[2]Equivalencia BH-BMPT'!$D$20,IF(J22=20,'[2]Equivalencia BH-BMPT'!$D$21,IF(J22=21,'[2]Equivalencia BH-BMPT'!$D$22,IF(J22=22,'[2]Equivalencia BH-BMPT'!$D$23,IF(J22=23,'[2]Equivalencia BH-BMPT'!#REF!,IF(J22=24,'[2]Equivalencia BH-BMPT'!$D$25,IF(J22=25,'[2]Equivalencia BH-BMPT'!$D$26,IF(J22=26,'[2]Equivalencia BH-BMPT'!$D$27,IF(J22=27,'[2]Equivalencia BH-BMPT'!$D$28,IF(J22=28,'[2]Equivalencia BH-BMPT'!$D$29,IF(J22=29,'[2]Equivalencia BH-BMPT'!$D$30,IF(J22=30,'[2]Equivalencia BH-BMPT'!$D$31,IF(J22=31,'[2]Equivalencia BH-BMPT'!$D$32,IF(J22=32,'[2]Equivalencia BH-BMPT'!$D$33,IF(J22=33,'[2]Equivalencia BH-BMPT'!$D$34,IF(J22=34,'[2]Equivalencia BH-BMPT'!$D$35,IF(J22=35,'[2]Equivalencia BH-BMPT'!$D$36,IF(J22=36,'[2]Equivalencia BH-BMPT'!$D$37,IF(J22=37,'[2]Equivalencia BH-BMPT'!$D$38,IF(J22=38,'[2]Equivalencia BH-BMPT'!#REF!,IF(J22=39,'[2]Equivalencia BH-BMPT'!$D$40,IF(J22=40,'[2]Equivalencia BH-BMPT'!$D$41,IF(J22=41,'[2]Equivalencia BH-BMPT'!$D$42,IF(J22=42,'[2]Equivalencia BH-BMPT'!$D$43,IF(J22=43,'[2]Equivalencia BH-BMPT'!$D$44,IF(J22=44,'[2]Equivalencia BH-BMPT'!$D$45,IF(J22=45,'[2]Equivalencia BH-BMPT'!$D$46,\"No ha seleccionado un número de programa\")))))))))))))))))))))))))))))))))))))))))))))","v":"Bogotá, una ciudad digital"},"0000",8300125874,"CANAL CAPITAL",31837862,null,null,null,null,31837862,null,"2017-08-24","2017-09-14","2018-02-02",140,null,null,null,"X",null,null,0,false]
[95,2017,"SECOP II",11,{"$f":"IF(D23=1,'[3]Tipo '!$B$2,IF(D23=2,'[3]Tipo '!$B$3,IF(D23=3,'[3]Tipo '!$B$4,IF(D23=4,'[3]Tipo '!$B$5,IF(D23=5,'[3]Tipo '!$B$6,IF(D23=6,'[3]Tipo '!$B$7,IF(D23=7,'[3]Tipo '!$B$8,IF(D23=8,'[3]Tipo '!$B$9,IF(D23=9,'[3]Tipo '!$B$10,IF(D23=10,'[3]Tipo '!$B$11,IF(D23=11,'[3]Tipo '!$B$12,IF(D23=12,'[3]Tipo '!$B$13,IF(D23=13,'[3]Tipo '!$B$14,IF(D23=14,'[3]Tipo '!$B$15,IF(D23=15,'[3]Tipo '!$B$16,IF(D23=16,'[3]Tipo '!$B$17,IF(D23=17,'[3]Tipo '!$B$18,IF(D23=18,'[3]Tipo '!$B$19,IF(D23=19,'[3]Tipo '!$B$20,\"No ha seleccionado un tipo de contrato válido\")))))))))))))))))))","v":"SUMINISTRO"},"Contratación mínima cuantia ","No aplica","ADQUIRIR A TODO COSTO, EL SERVICIO DE MANTENIMIENTO PREVENTIVO Y CORRECTIVO INTEGRAL CON SUMINISTRO DE REPUESTOS Y MANO DE OBRA PARA LOS VEHÍCULOS QUE CONFORMAN EL PARQUE AUTOMOTOR DEL FONDO DE DESARROLLO LOCAL DE LA CANDELARIA","Funcionamiento",null,{"$f":"IF(J23=1,'[3]Equivalencia BH-BMPT'!$D$2,IF(J23=2,'[3]Equivalencia BH-BMPT'!$D$3,IF(J23=3,'[3]Equivalencia BH-BMPT'!$D$4,IF(J23=4,'[3]Equivalencia BH-BMPT'!$D$5,IF(J23=5,'[3]Equivalencia BH-BMPT'!$D$6,IF(J23=6,'[3]Equivalencia BH-BMPT'!$D$7,IF(J23=7,'[3]Equivalencia BH-BMPT'!$D$8,IF(J23=8,'[3]Equivalencia BH-BMPT'!$D$9,IF(J23=9,'[3]Equivalencia BH-BMPT'!$D$10,IF(J23=10,'[3]Equivalencia BH-BMPT'!$D$11,IF(J23=11,'[3]Equivalencia BH-BMPT'!$D$12,IF(J23=12,'[3]Equivalencia BH-BMPT'!$D$13,IF(J23=13,'[3]Equivalencia BH-BMPT'!$D$14,IF(J23=14,'[3]Equivalencia BH-BMPT'!$D$15,IF(J23=15,'[3]Equivalencia BH-BMPT'!$D$16,IF(J23=16,'[3]Equivalencia BH-BMPT'!$D$17,IF(J23=17,'[3]Equivalencia BH-BMPT'!$D$18,IF(J23=18,'[3]Equivalencia BH-BMPT'!$D$19,IF(J23=19,'[3]Equivalencia BH-BMPT'!$D$20,IF(J23=20,'[3]Equivalencia BH-BMPT'!$D$21,IF(J23=21,'[3]Equivalencia BH-BMPT'!$D$22,IF(J23=22,'[3]Equivalencia BH-BMPT'!$D$23,IF(J23=23,'[3]Equivalencia BH-BMPT'!#REF!,IF(J23=24,'[3]Equivalencia BH-BMPT'!$D$25,IF(J23=25,'[3]Equivalencia BH-BMPT'!$D$26,IF(J23=26,'[3]Equivalencia BH-BMPT'!$D$27,IF(J23=27,'[3]Equivalencia BH-BMPT'!$D$28,IF(J23=28,'[3]Equivalencia BH-BMPT'!$D$29,IF(J23=29,'[3]Equivalencia BH-BMPT'!$D$30,IF(J23=30,'[3]Equivalencia BH-BMPT'!$D$31,IF(J23=31,'[3]Equivalencia BH-BMPT'!$D$32,IF(J23=32,'[3]Equivalencia BH-BMPT'!$D$33,IF(J23=33,'[3]Equivalencia BH-BMPT'!$D$34,IF(J23=34,'[3]Equivalencia BH-BMPT'!$D$35,IF(J23=35,'[3]Equivalencia BH-BMPT'!$D$36,IF(J23=36,'[3]Equivalencia BH-BMPT'!$D$37,IF(J23=37,'[3]Equivalencia BH-BMPT'!$D$38,IF(J23=38,'[3]Equivalencia BH-BMPT'!#REF!,IF(J23=39,'[3]Equivalencia BH-BMPT'!$D$40,IF(J23=40,'[3]Equivalencia BH-BMPT'!$D$41,IF(J23=41,'[3]Equivalencia BH-BMPT'!$D$42,IF(J23=42,'[3]Equivalencia BH-BMPT'!$D$43,IF(J23=43,'[3]Equivalencia BH-BMPT'!$D$44,IF(J23=44,'[3]Equivalencia BH-BMPT'!$D$45,IF(J23=45,'[3]Equivalencia BH-BMPT'!$D$46,\"No ha seleccionado un número de programa\")))))))))))))))))))))))))))))))))))))))))))))","v":"No ha seleccionado un número de programa"},"0000",8002505891,"CENTRO CAR 19 LTDA",18540000,null,null,null,null,18540000,null,"2017-10-13","2017-10-24","2017-04-23",180,null,null,null,null,"X",null,0,true]
[96,2017,"17-12-7395630",4,{"$f":"IF(D24=1,'[3]Tipo '!$B$2,IF(D24=2,'[3]Tipo '!$B$3,IF(D24=3,'[3]Tipo '!$B$4,IF(D24=4,'[3]Tipo '!$B$5,IF(D24=5,'[3]Tipo '!$B$6,IF(D24=6,'[3]Tipo '!$B$7,IF(D24=7,'[3]Tipo '!$B$8,IF(D24=8,'[3]Tipo '!$B$9,IF(D24=9,'[3]Tipo '!$B$10,IF(D24=10,'[3]Tipo '!$B$11,IF(D24=11,'[3]Tipo '!$B$12,IF(D24=12,'[3]Tipo '!$B$13,IF(D24=13,'[3]Tipo '!$B$14,IF(D24=14,'[3]Tipo '!$B$15,IF(D24=15,'[3]Tipo '!$B$16,IF(D24=16,'[3]Tipo '!$B$17,IF(D24=17,'[3]Tipo '!$B$18,IF(D24=18,'[3]Tipo '!$B$19,IF(D24=19,'[3]Tipo '!$B$20,\"No ha seleccionado un tipo de contrato válido\")))))))))))))))))))","v":"CONTRATOS DE PRESTACIÓN DE SERVICIOS"},"Contratación directa","Prestación de servicios profesionales y de apoyo a la gestión, o para la ejecución de trabajos artísticos que sólo puedan encomendarse a determinadas personas naturales;","PRESTACIÓN DE SERVICIOS DE RECOLECCIÓN, CURSOS Y ENTREGA DE CORRESPONDENCIA Y DEMÁS ENVÍOS POSTALES QUE REQUIERAN EL FONDO DE DESARROLLO LOCAL LA CANDELARIA","Funcionamiento",null,{"$f":"IF(J24=1,'[3]Equivalencia BH-BMPT'!$D$2,IF(J24=2,'[3]Equivalencia BH-BMPT'!$D$3,IF(J24=3,'[3]Equivalencia BH-BMPT'!$D$4,IF(J24=4,'[3]Equivalencia BH-BMPT'!$D$5,IF(J24=5,'[3]Equivalencia BH-BMPT'!$D$6,IF(J24=6,'[3]Equivalencia BH-BMPT'!$D$7,IF(J24=7,'[3]Equivalencia BH-BMPT'!$D$8,IF(J24=8,'[3]Equivalencia BH-BMPT'!$D$9,IF(J24=9,'[3]Equivalencia BH-BMPT'!$D$10,IF(J24=10,'[3]Equivalencia BH-BMPT'!$D$11,IF(J24=11,'[3]Equivalencia BH-BMPT'!$D$12,IF(J24=12,'[3]Equivalencia BH-BMPT'!$D$13,IF(J24=13,'[3]Equivalencia BH-BMPT'!$D$14,IF(J24=14,'[3]Equivalencia BH-BMPT'!$D$15,IF(J24=15,'[3]Equivalencia BH-BMPT'!$D$16,IF(J24=16,'[3]Equivalencia BH-BMPT'!$D$17,IF(J24=17,'[3]Equivalencia BH-BMPT'!$D$18,IF(J24=18,'[3]Equivalencia BH-BMPT'!$D$19,IF(J24=19,'[3]Equivalencia BH-BMPT'!$D$20,IF(J24=20,'[3]Equivalencia BH-BMPT'!$D$21,IF(J24=21,'[3]Equivalencia BH-BMPT'!$D$22,IF(J24=22,'[3]Equivalencia BH-BMPT'!$D$23,IF(J24=23,'[3]Equivalencia BH-BMPT'!#REF!,IF(J24=24,'[3]Equivalencia BH-BMPT'!$D$25,IF(J24=25,'[3]Equivalencia BH-BMPT'!$D$26,IF(J24=26,'[3]Equivalencia BH-BMPT'!$D$27,IF(J24=27,'[3]Equivalencia BH-BMPT'!$D$28,IF(J24=28,'[3]Equivalencia BH-BMPT'!$D$29,IF(J24=29,'[3]Equivalencia BH-BMPT'!$D$30,IF(J24=30,'[3]Equivalencia BH-BMPT'!$D$31,IF(J24=31,'[3]Equivalencia BH-BMPT'!$D$32,IF(J24=32,'[3]Equivalencia BH-BMPT'!$D$33,IF(J24=33,'[3]Equivalencia BH-BMPT'!$D$34,IF(J24=34,'[3]Equivalencia BH-BMPT'!$D$35,IF(J24=35,'[3]Equivalencia BH-BMPT'!$D$36,IF(J24=36,'[3]Equivalencia BH-BMPT'!$D$37,IF(J24=37,'[3]Equivalencia BH-BMPT'!$D$38,IF(J24=38,'[3]Equivalencia BH-BMPT'!#REF!,IF(J24=39,'[3]Equivalencia BH-BMPT'!$D$40,IF(J24=40,'[3]Equivalencia BH-BMPT'!$D$41,IF(J24=41,'[3]Equivalencia BH-BMPT'!$D$42,IF(J24=42,'[3]Equivalencia BH-BMPT'!$D$43,IF(J24=43,'[3]Equivalencia BH-BMPT'!$D$44,IF(J24=44,'[3]Equivalencia BH-BMPT'!$D$45,IF(J24=45,'[3]Equivalencia BH-BMPT'!$D$46,\"No ha seleccionado un número de programa\")))))))))))))))))))))))))))))))))))))))))))))","v":"No ha seleccionado un número de programa"},"0000",9000629179,"Servicios Postales Nacionales s.a",3105600,null,null,null,null,3105600,null,"2017-11-02","2017-11-02","2018-11-15",360,null,null,null,"X",null,null,0,true]
[102,2017,"SECOP II",11,{"$f":"IF(D25=1,'[4]Tipo '!$B$2,IF(D25=2,'[4]Tipo '!$B$3,IF(D25=3,'[4]Tipo '!$B$4,IF(D25=4,'[4]Tipo '!$B$5,IF(D25=5,'[4]Tipo '!$B$6,IF(D25=6,'[4]Tipo '!$B$7,IF(D25=7,'[4]Tipo '!$B$8,IF(D25=8,'[4]Tipo '!$B$9,IF(D25=9,'[4]Tipo '!$B$10,IF(D25=10,'[4]Tipo '!$B$11,IF(D25=11,'[4]Tipo '!$B$12,IF(D25=12,'[4]Tipo '!$B$13,IF(D25=13,'[4]Tipo '!$B$14,IF(D25=14,'[4]Tipo '!$B$15,IF(D25=15,'[4]Tipo '!$B$16,IF(D25=16,'[4]Tipo '!$B$17,IF(D25=17,'[4]Tipo '!$B$18,IF(D25=18,'[4]Tipo '!$B$19,IF(D25=19,'[4]Tipo '!$B$20,\"No ha seleccionado un tipo de contrato válido\")))))))))))))))))))","v":"SUMINISTRO"},"Contratación mínima cuantia ","No aplica","SUMINISTRO DE BIENES Y CONDECORACIONES Y MEDALLAS","Funcionamiento",45,{"$f":"IF(J25=1,'[4]Equivalencia BH-BMPT'!$D$2,IF(J25=2,'[4]Equivalencia BH-BMPT'!$D$3,IF(J25=3,'[4]Equivalencia BH-BMPT'!$D$4,IF(J25=4,'[4]Equivalencia BH-BMPT'!$D$5,IF(J25=5,'[4]Equivalencia BH-BMPT'!$D$6,IF(J25=6,'[4]Equivalencia BH-BMPT'!$D$7,IF(J25=7,'[4]Equivalencia BH-BMPT'!$D$8,IF(J25=8,'[4]Equivalencia BH-BMPT'!$D$9,IF(J25=9,'[4]Equivalencia BH-BMPT'!$D$10,IF(J25=10,'[4]Equivalencia BH-BMPT'!$D$11,IF(J25=11,'[4]Equivalencia BH-BMPT'!$D$12,IF(J25=12,'[4]Equivalencia BH-BMPT'!$D$13,IF(J25=13,'[4]Equivalencia BH-BMPT'!$D$14,IF(J25=14,'[4]Equivalencia BH-BMPT'!$D$15,IF(J25=15,'[4]Equivalencia BH-BMPT'!$D$16,IF(J25=16,'[4]Equivalencia BH-BMPT'!$D$17,IF(J25=17,'[4]Equivalencia BH-BMPT'!$D$18,IF(J25=18,'[4]Equivalencia BH-BMPT'!$D$19,IF(J25=19,'[4]Equivalencia BH-BMPT'!$D$20,IF(J25=20,'[4]Equivalencia BH-BMPT'!$D$21,IF(J25=21,'[4]Equivalencia BH-BMPT'!$D$22,IF(J25=22,'[4]Equivalencia BH-BMPT'!$D$23,IF(J25=23,'[4]Equivalencia BH-BMPT'!#REF!,IF(J25=24,'[4]Equivalencia BH-BMPT'!$D$25,IF(J25=25,'[4]Equivalencia BH-BMPT'!$D$26,IF(J25=26,'[4]Equivalencia BH-BMPT'!$D$27,IF(J25=27,'[4]Equivalencia BH-BMPT'!$D$28,IF(J25=28,'[4]Equivalencia BH-BMPT'!$D$29,IF(J25=29,'[4]Equivalencia BH-BMPT'!$D$30,IF(J25=30,'[4]Equivalencia BH-BMPT'!$D$31,IF(J25=31,'[4]Equivalencia BH-BMPT'!$D$32,IF(J25=32,'[4]Equivalencia BH-BMPT'!$D$33,IF(J25=33,'[4]Equivalencia BH-BMPT'!$D$34,IF(J25=34,'[4]Equivalencia BH-BMPT'!$D$35,IF(J25=35,'[4]Equivalencia BH-BMPT'!$D$36,IF(J25=36,'[4]Equivalencia BH-BMPT'!$D$37,IF(J25=37,'[4]Equivalencia BH-BMPT'!$D$38,IF(J25=38,'[4]Equivalencia BH-BMPT'!#REF!,IF(J25=39,'[4]Equivalencia BH-BMPT'!$D$40,IF(J25=40,'[4]Equivalencia BH-BMPT'!$D$41,IF(J25=41,'[4]Equivalencia BH-BMPT'!$D$42,IF(J25=42,'[4]Equivalencia BH-BMPT'!$D$43,IF(J25=43,'[4]Equivalencia BH-BMPT'!$D$44,IF(J25=44,'[4]Equivalencia BH-BMPT'!$D$45,IF(J25=45,'[4]Equivalencia BH-BMPT'!$D$46,\"No ha seleccionado un número de programa\")))))))))))))))))))))))))))))))))))))))))))))","v":"Gobernanza e influencia local, regional e internacional"},"0000",9010814892,"METAL LINE SAS",7232000,null,null,null,null,7232000,7232000,"2017-11-16","2017-11-20","2017-12-19",30,null,null,null,null,null,"X",1,false]
[103,2017,"SECOP II",6,"COMPRAVENTA DE BIENES INMUEBLES","Contratación mínima cuantia ","No aplica","ADQUIRIR CARPA TIPO HANGAR Y PIE DE TARIMA PARA EL FONDO DE DESARROLLO LOCAL DE LA CANDELARIA DE LA ALCALDIA LOCAL LA CANDELARIA ","Funcionamiento",45,{"$f":"IF(J26=1,'[4]Equivalencia BH-BMPT'!$D$2,IF(J26=2,'[4]Equivalencia BH-BMPT'!$D$3,IF(J26=3,'[4]Equivalencia BH-BMPT'!$D$4,IF(J26=4,'[4]Equivalencia BH-BMPT'!$D$5,IF(J26=5,'[4]Equivalencia BH-BMPT'!$D$6,IF(J26=6,'[4]Equivalencia BH-BMPT'!$D$7,IF(J26=7,'[4]Equivalencia BH-BMPT'!$D$8,IF(J26=8,'[4]Equivalencia BH-BMPT'!$D$9,IF(J26=9,'[4]Equivalencia BH-BMPT'!$D$10,IF(J26=10,'[4]Equivalencia BH-BMPT'!$D$11,IF(J26=11,'[4]Equivalencia BH-BMPT'!$D$12,IF(J26=12,'[4]Equivalencia BH-BMPT'!$D$13,IF(J26=13,'[4]Equivalencia BH-BMPT'!$D$14,IF(J26=14,'[4]Equivalencia BH-BMPT'!$D$15,IF(J26=15,'[4]Equivalencia BH-BMPT'!$D$16,IF(J26=16,'[4]Equivalencia BH-BMPT'!$D$17,IF(J26=17,'[4]Equivalencia BH-BMPT'!$D$18,IF(J26=18,'[4]Equivalencia BH-BMPT'!$D$19,IF(J26=19,'[4]Equivalencia BH-BMPT'!$D$20,IF(J26=20,'[4]Equivalencia BH-BMPT'!$D$21,IF(J26=21,'[4]Equivalencia BH-BMPT'!$D$22,IF(J26=22,'[4]Equivalencia BH-BMPT'!$D$23,IF(J26=23,'[4]Equivalencia BH-BMPT'!#REF!,IF(J26=24,'[4]Equivalencia BH-BMPT'!$D$25,IF(J26=25,'[4]Equivalencia BH-BMPT'!$D$26,IF(J26=26,'[4]Equivalencia BH-BMPT'!$D$27,IF(J26=27,'[4]Equivalencia BH-BMPT'!$D$28,IF(J26=28,'[4]Equivalencia BH-BMPT'!$D$29,IF(J26=29,'[4]Equivalencia BH-BMPT'!$D$30,IF(J26=30,'[4]Equivalencia BH-BMPT'!$D$31,IF(J26=31,'[4]Equivalencia BH-BMPT'!$D$32,IF(J26=32,'[4]Equivalencia BH-BMPT'!$D$33,IF(J26=33,'[4]Equivalencia BH-BMPT'!$D$34,IF(J26=34,'[4]Equivalencia BH-BMPT'!$D$35,IF(J26=35,'[4]Equivalencia BH-BMPT'!$D$36,IF(J26=36,'[4]Equivalencia BH-BMPT'!$D$37,IF(J26=37,'[4]Equivalencia BH-BMPT'!$D$38,IF(J26=38,'[4]Equivalencia BH-BMPT'!#REF!,IF(J26=39,'[4]Equivalencia BH-BMPT'!$D$40,IF(J26=40,'[4]Equivalencia BH-BMPT'!$D$41,IF(J26=41,'[4]Equivalencia BH-BMPT'!$D$42,IF(J26=42,'[4]Equivalencia BH-BMPT'!$D$43,IF(J26=43,'[4]Equivalencia BH-BMPT'!$D$44,IF(J26=44,'[4]Equivalencia BH-BMPT'!$D$45,IF(J26=45,'[4]Equivalencia BH-BMPT'!$D$46,\"No ha seleccionado un número de programa\")))))))))))))))))))))))))))))))))))))))))))))","v":"Gobernanza e influencia local, regional e internacional"},"0000",9002204760,"CARPAS Y PROYECTOS ZEKO SAS ",5804177,null,null,null,null,5804177,null,"2017-11-21","2017-11-24","2017-01-23",60,null,null,null,null,"X",null,0,false]
[110,2017,"17-13-7438974",10,{"$f":"IF(D27=1,'[4]Tipo '!$B$2,IF(D27=2,'[4]Tipo '!$B$3,IF(D27=3,'[4]Tipo '!$B$4,IF(D27=4,'[4]Tipo '!$B$5,IF(D27=5,'[4]Tipo '!$B$6,IF(D27=6,'[4]Tipo '!$B$7,IF(D27=7,'[4]Tipo '!$B$8,IF(D27=8,'[4]Tipo '!$B$9,IF(D27=9,'[4]Tipo '!$B$10,IF(D27=10,'[4]Tipo '!$B$11,IF(D27=11,'[4]Tipo '!$B$12,IF(D27=12,'[4]Tipo '!$B$13,IF(D27=13,'[4]Tipo '!$B$14,IF(D27=14,'[4]Tipo '!$B$15,IF(D27=15,'[4]Tipo '!$B$16,IF(D27=16,'[4]Tipo '!$B$17,IF(D27=17,'[4]Tipo '!$B$18,IF(D27=18,'[4]Tipo '!$B$19,IF(D27=19,'[4]Tipo '!$B$20,\"No ha seleccionado un tipo de contrato válido\")))))))))))))))))))","v":"SEGUROS"},"Contratación mínima cuantia ","No aplica","CONTRATAR EL PROGRAMA DE SEGUROS PARA AMPARAR LOS BIENES E INTERESES PATRIMONIALES DE  PROPIEDAD DEL FONDO DE DESARROLLO LOCAL DE LA CANDELARIA y POR LOS QUE SEA O LLEGARE A SER RESPONSABLE","Funcionamiento",null,{"$f":"IF(J27=1,'[4]Equivalencia BH-BMPT'!$D$2,IF(J27=2,'[4]Equivalencia BH-BMPT'!$D$3,IF(J27=3,'[4]Equivalencia BH-BMPT'!$D$4,IF(J27=4,'[4]Equivalencia BH-BMPT'!$D$5,IF(J27=5,'[4]Equivalencia BH-BMPT'!$D$6,IF(J27=6,'[4]Equivalencia BH-BMPT'!$D$7,IF(J27=7,'[4]Equivalencia BH-BMPT'!$D$8,IF(J27=8,'[4]Equivalencia BH-BMPT'!$D$9,IF(J27=9,'[4]Equivalencia BH-BMPT'!$D$10,IF(J27=10,'[4]Equivalencia BH-BMPT'!$D$11,IF(J27=11,'[4]Equivalencia BH-BMPT'!$D$12,IF(J27=12,'[4]Equivalencia BH-BMPT'!$D$13,IF(J27=13,'[4]Equivalencia BH-BMPT'!$D$14,IF(J27=14,'[4]Equivalencia BH-BMPT'!$D$15,IF(J27=15,'[4]Equivalencia BH-BMPT'!$D$16,IF(J27=16,'[4]Equivalencia BH-BMPT'!$D$17,IF(J27=17,'[4]Equivalencia BH-BMPT'!$D$18,IF(J27=18,'[4]Equivalencia BH-BMPT'!$D$19,IF(J27=19,'[4]Equivalencia BH-BMPT'!$D$20,IF(J27=20,'[4]Equivalencia BH-BMPT'!$D$21,IF(J27=21,'[4]Equivalencia BH-BMPT'!$D$22,IF(J27=22,'[4]Equivalencia BH-BMPT'!$D$23,IF(J27=23,'[4]Equivalencia BH-BMPT'!#REF!,IF(J27=24,'[4]Equivalencia BH-BMPT'!$D$25,IF(J27=25,'[4]Equivalencia BH-BMPT'!$D$26,IF(J27=26,'[4]Equivalencia BH-BMPT'!$D$27,IF(J27=27,'[4]Equivalencia BH-BMPT'!$D$28,IF(J27=28,'[4]Equivalencia BH-BMPT'!$D$29,IF(J27=29,'[4]Equivalencia BH-BMPT'!$D$30,IF(J27=30,'[4]Equivalencia BH-BMPT'!$D$31,IF(J27=31,'[4]Equivalencia BH-BMPT'!$D$32,IF(J27=32,'[4]Equivalencia BH-BMPT'!$D$33,IF(J27=33,'[4]Equivalencia BH-BMPT'!$D$34,IF(J27=34,'[4]Equivalencia BH-BMPT'!$D$35,IF(J27=35,'[4]Equivalencia BH-BMPT'!$D$36,IF(J27=36,'[4]Equivalencia BH-BMPT'!$D$37,IF(J27=37,'[4]Equivalencia BH-BMPT'!$D$38,IF(J27=38,'[4]Equivalencia BH-BMPT'!#REF!,IF(J27=39,'[4]Equivalencia BH-BMPT'!$D$40,IF(J27=40,'[4]Equivalencia BH-BMPT'!$D$41,IF(J27=41,'[4]Equivalencia BH-BMPT'!$D$42,IF(J27=42,'[4]Equivalencia BH-BMPT'!$D$43,IF(J27=43,'[4]Equivalencia BH-BMPT'!$D$44,IF(J27=44,'[4]Equivalencia BH-BMPT'!$D$45,IF(J27=45,'[4]Equivalencia BH-BMPT'!$D$46,\"No ha seleccionado un número de programa\")))))))))))))))))))))))))))))))))))))))))))))","v":"No ha seleccionado un número de programa"},"0000",8605246546,"ASEGURADORA SOLIDARIA DE COLOMBIA ",16856043,null,null,null,null,16856043,null,"2017-12-26","2017-12-26","2018-06-03",159,null,null,null,null,"X",null,0,true]
[114,2017,"SECOP II",4,{"$f":"IF(D28=1,'[4]Tipo '!$B$2,IF(D28=2,'[4]Tipo '!$B$3,IF(D28=3,'[4]Tipo '!$B$4,IF(D28=4,'[4]Tipo '!$B$5,IF(D28=5,'[4]Tipo '!$B$6,IF(D28=6,'[4]Tipo '!$B$7,IF(D28=7,'[4]Tipo '!$B$8,IF(D28=8,'[4]Tipo '!$B$9,IF(D28=9,'[4]Tipo '!$B$10,IF(D28=10,'[4]Tipo '!$B$11,IF(D28=11,'[4]Tipo '!$B$12,IF(D28=12,'[4]Tipo '!$B$13,IF(D28=13,'[4]Tipo '!$B$14,IF(D28=14,'[4]Tipo '!$B$15,IF(D28=15,'[4]Tipo '!$B$16,IF(D28=16,'[4]Tipo '!$B$17,IF(D28=17,'[4]Tipo '!$B$18,IF(D28=18,'[4]Tipo '!$B$19,IF(D28=19,'[4]Tipo '!$B$20,\"No ha seleccionado un tipo de contrato válido\")))))))))))))))))))","v":"CONTRATOS DE PRESTACIÓN DE SERVICIOS"},"Contratación mínima cuantia ","No aplica","Prestar el servicio de mantenimiento preventivo y correctivo, incluyendo repuestos, para las impresoras, fotocopiadoras, sistema ininterrumpido de potencia (UPS) y plotter de propiedad del Fondo de Desarrollo Local de La alcaldía local de La Candelaria.","Funcionamiento",10,{"$f":"IF(J28=1,'[4]Equivalencia BH-BMPT'!$D$2,IF(J28=2,'[4]Equivalencia BH-BMPT'!$D$3,IF(J28=3,'[4]Equivalencia BH-BMPT'!$D$4,IF(J28=4,'[4]Equivalencia BH-BMPT'!$D$5,IF(J28=5,'[4]Equivalencia BH-BMPT'!$D$6,IF(J28=6,'[4]Equivalencia BH-BMPT'!$D$7,IF(J28=7,'[4]Equivalencia BH-BMPT'!$D$8,IF(J28=8,'[4]Equivalencia BH-BMPT'!$D$9,IF(J28=9,'[4]Equivalencia BH-BMPT'!$D$10,IF(J28=10,'[4]Equivalencia BH-BMPT'!$D$11,IF(J28=11,'[4]Equivalencia BH-BMPT'!$D$12,IF(J28=12,'[4]Equivalencia BH-BMPT'!$D$13,IF(J28=13,'[4]Equivalencia BH-BMPT'!$D$14,IF(J28=14,'[4]Equivalencia BH-BMPT'!$D$15,IF(J28=15,'[4]Equivalencia BH-BMPT'!$D$16,IF(J28=16,'[4]Equivalencia BH-BMPT'!$D$17,IF(J28=17,'[4]Equivalencia BH-BMPT'!$D$18,IF(J28=18,'[4]Equivalencia BH-BMPT'!$D$19,IF(J28=19,'[4]Equivalencia BH-BMPT'!$D$20,IF(J28=20,'[4]Equivalencia BH-BMPT'!$D$21,IF(J28=21,'[4]Equivalencia BH-BMPT'!$D$22,IF(J28=22,'[4]Equivalencia BH-BMPT'!$D$23,IF(J28=23,'[4]Equivalencia BH-BMPT'!#REF!,IF(J28=24,'[4]Equivalencia BH-BMPT'!$D$25,IF(J28=25,'[4]Equivalencia BH-BMPT'!$D$26,IF(J28=26,'[4]Equivalencia BH-BMPT'!$D$27,IF(J28=27,'[4]Equivalencia BH-BMPT'!$D$28,IF(J28=28,'[4]Equivalencia BH-BMPT'!$D$29,IF(J28=29,'[4]Equivalencia BH-BMPT'!$D$30,IF(J28=30,'[4]Equivalencia BH-BMPT'!$D$31,IF(J28=31,'[4]Equivalencia BH-BMPT'!$D$32,IF(J28=32,'[4]Equivalencia BH-BMPT'!$D$33,IF(J28=33,'[4]Equivalencia BH-BMPT'!$D$34,IF(J28=34,'[4]Equivalencia BH-BMPT'!$D$35,IF(J28=35,'[4]Equivalencia BH-BMPT'!$D$36,IF(J28=36,'[4]Equivalencia BH-BMPT'!$D$37,IF(J28=37,'[4]Equivalencia BH-BMPT'!$D$38,IF(J28=38,'[4]Equivalencia BH-BMPT'!#REF!,IF(J28=39,'[4]Equivalencia BH-BMPT'!$D$40,IF(J28=40,'[4]Equivalencia BH-BMPT'!$D$41,IF(J28=41,'[4]Equivalencia BH-BMPT'!$D$42,IF(J28=42,'[4]Equivalencia BH-BMPT'!$D$43,IF(J28=43,'[4]Equivalencia BH-BMPT'!$D$44,IF(J28=44,'[4]Equivalencia BH-BMPT'!$D$45,IF(J28=45,'[4]Equivalencia BH-BMPT'!$D$46,\"No ha seleccionado un número de programa\")))))))))))))))))))))))))))))))))))))))))))))","v":"Modernización de la infraestructura física y tecnológica en salud"},"0000",9006863787,"HELP SOLUCIONES INFORMATICAS HSI SAS",10641344,null,null,null,null,10641344,null,"2017-12-29","2018-01-15","2019-01-14",360,null,null,null,"X",null,null,0,false]
[115,2017,"SECOP II",6,"COMPRAVENTA DE BIENES INMUEBLES","Contratación mínima cuantia ","No aplica","Adquisición de repuestos para computadores con el propósito de fortalecer las diferentes áreas de la alcaldía local de la candelaria","Funcionamiento",10,{"$f":"IF(J29=1,'[4]Equivalencia BH-BMPT'!$D$2,IF(J29=2,'[4]Equivalencia BH-BMPT'!$D$3,IF(J29=3,'[4]Equivalencia BH-BMPT'!$D$4,IF(J29=4,'[4]Equivalencia BH-BMPT'!$D$5,IF(J29=5,'[4]Equivalencia BH-BMPT'!$D$6,IF(J29=6,'[4]Equivalencia BH-BMPT'!$D$7,IF(J29=7,'[4]Equivalencia BH-BMPT'!$D$8,IF(J29=8,'[4]Equivalencia BH-BMPT'!$D$9,IF(J29=9,'[4]Equivalencia BH-BMPT'!$D$10,IF(J29=10,'[4]Equivalencia BH-BMPT'!$D$11,IF(J29=11,'[4]Equivalencia BH-BMPT'!$D$12,IF(J29=12,'[4]Equivalencia BH-BMPT'!$D$13,IF(J29=13,'[4]Equivalencia BH-BMPT'!$D$14,IF(J29=14,'[4]Equivalencia BH-BMPT'!$D$15,IF(J29=15,'[4]Equivalencia BH-BMPT'!$D$16,IF(J29=16,'[4]Equivalencia BH-BMPT'!$D$17,IF(J29=17,'[4]Equivalencia BH-BMPT'!$D$18,IF(J29=18,'[4]Equivalencia BH-BMPT'!$D$19,IF(J29=19,'[4]Equivalencia BH-BMPT'!$D$20,IF(J29=20,'[4]Equivalencia BH-BMPT'!$D$21,IF(J29=21,'[4]Equivalencia BH-BMPT'!$D$22,IF(J29=22,'[4]Equivalencia BH-BMPT'!$D$23,IF(J29=23,'[4]Equivalencia BH-BMPT'!#REF!,IF(J29=24,'[4]Equivalencia BH-BMPT'!$D$25,IF(J29=25,'[4]Equivalencia BH-BMPT'!$D$26,IF(J29=26,'[4]Equivalencia BH-BMPT'!$D$27,IF(J29=27,'[4]Equivalencia BH-BMPT'!$D$28,IF(J29=28,'[4]Equivalencia BH-BMPT'!$D$29,IF(J29=29,'[4]Equivalencia BH-BMPT'!$D$30,IF(J29=30,'[4]Equivalencia BH-BMPT'!$D$31,IF(J29=31,'[4]Equivalencia BH-BMPT'!$D$32,IF(J29=32,'[4]Equivalencia BH-BMPT'!$D$33,IF(J29=33,'[4]Equivalencia BH-BMPT'!$D$34,IF(J29=34,'[4]Equivalencia BH-BMPT'!$D$35,IF(J29=35,'[4]Equivalencia BH-BMPT'!$D$36,IF(J29=36,'[4]Equivalencia BH-BMPT'!$D$37,IF(J29=37,'[4]Equivalencia BH-BMPT'!$D$38,IF(J29=38,'[4]Equivalencia BH-BMPT'!#REF!,IF(J29=39,'[4]Equivalencia BH-BMPT'!$D$40,IF(J29=40,'[4]Equivalencia BH-BMPT'!$D$41,IF(J29=41,'[4]Equivalencia BH-BMPT'!$D$42,IF(J29=42,'[4]Equivalencia BH-BMPT'!$D$43,IF(J29=43,'[4]Equivalencia BH-BMPT'!$D$44,IF(J29=44,'[4]Equivalencia BH-BMPT'!$D$45,IF(J29=45,'[4]Equivalencia BH-BMPT'!$D$46,\"No ha seleccionado un número de programa\")))))))))))))))))))))))))))))))))))))))))))))","v":"Modernización de la infraestructura física y tecnológica en salud"},"0000",9001834231,"QUALITY COPIERS SAS",11611736,null,null,null,null,11611736,null,"2017-12-29","2018-01-15","2018-03-14",60,null,null,null,"X",null,null,0,false]
[116,2017,"SECOP II",6,"COMPRAVENTA DE BIENES INMUEBLES","Contratación mínima cuantia ","No aplica","ADQUIRIR LOS EQUIPOS DE VIDEO BEAM, SCANNER PARA EL FONDO DE DESARROLLO LOCAL DE LA CANDELARIA","Funcionamiento",10,{"$f":"IF(J30=1,'[4]Equivalencia BH-BMPT'!$D$2,IF(J30=2,'[4]Equivalencia BH-BMPT'!$D$3,IF(J30=3,'[4]Equivalencia BH-BMPT'!$D$4,IF(J30=4,'[4]Equivalencia BH-BMPT'!$D$5,IF(J30=5,'[4]Equivalencia BH-BMPT'!$D$6,IF(J30=6,'[4]Equivalencia BH-BMPT'!$D$7,IF(J30=7,'[4]Equivalencia BH-BMPT'!$D$8,IF(J30=8,'[4]Equivalencia BH-BMPT'!$D$9,IF(J30=9,'[4]Equivalencia BH-BMPT'!$D$10,IF(J30=10,'[4]Equivalencia BH-BMPT'!$D$11,IF(J30=11,'[4]Equivalencia BH-BMPT'!$D$12,IF(J30=12,'[4]Equivalencia BH-BMPT'!$D$13,IF(J30=13,'[4]Equivalencia BH-BMPT'!$D$14,IF(J30=14,'[4]Equivalencia BH-BMPT'!$D$15,IF(J30=15,'[4]Equivalencia BH-BMPT'!$D$16,IF(J30=16,'[4]Equivalencia BH-BMPT'!$D$17,IF(J30=17,'[4]Equivalencia BH-BMPT'!$D$18,IF(J30=18,'[4]Equivalencia BH-BMPT'!$D$19,IF(J30=19,'[4]Equivalencia BH-BMPT'!$D$20,IF(J30=20,'[4]Equivalencia BH-BMPT'!$D$21,IF(J30=21,'[4]Equivalencia BH-BMPT'!$D$22,IF(J30=22,'[4]Equivalencia BH-BMPT'!$D$23,IF(J30=23,'[4]Equivalencia BH-BMPT'!#REF!,IF(J30=24,'[4]Equivalencia BH-BMPT'!$D$25,IF(J30=25,'[4]Equivalencia BH-BMPT'!$D$26,IF(J30=26,'[4]Equivalencia BH-BMPT'!$D$27,IF(J30=27,'[4]Equivalencia BH-BMPT'!$D$28,IF(J30=28,'[4]Equivalencia BH-BMPT'!$D$29,IF(J30=29,'[4]Equivalencia BH-BMPT'!$D$30,IF(J30=30,'[4]Equivalencia BH-BMPT'!$D$31,IF(J30=31,'[4]Equivalencia BH-BMPT'!$D$32,IF(J30=32,'[4]Equivalencia BH-BMPT'!$D$33,IF(J30=33,'[4]Equivalencia BH-BMPT'!$D$34,IF(J30=34,'[4]Equivalencia BH-BMPT'!$D$35,IF(J30=35,'[4]Equivalencia BH-BMPT'!$D$36,IF(J30=36,'[4]Equivalencia BH-BMPT'!$D$37,IF(L129J129=37,'[4]Equivalencia BH-BMPT'!$D$38,IF(J30=38,'[4]Equivalencia BH-BMPT'!#REF!,IF(J30=39,'[4]Equivalencia BH-BMPT'!$D$40,IF(J30=40,'[4]Equivalencia BH-BMPT'!$D$41,IF(J30=41,'[4]Equivalencia BH-BMPT'!$D$42,IF(J30=42,'[4]Equivalencia BH-BMPT'!$D$43,IF(J30=43,'[4]Equivalencia BH-BMPT'!$D$44,IF(J30=44,'[4]Equivalencia BH-BMPT'!$D$45,IF(J30=45,'[4]Equivalencia BH-BMPT'!$D$46,\"No ha seleccionado un número de programa\")))))))))))))))))))))))))))))))))))))))))))))","v":"Modernización de la infraestructura física y tecnológica en salud"},"0000",9005644591,"GRUPO EMPRESARIAL CREAR COLOMBIA S.A.S",9393319,null,null,null,null,9393319,null,"2017-12-29","2017-01-15","2018-03-14",60,null,null,null,"X",null,null,0,false]
[119,2016,null,11,{"$f":"IF(D31=1,'Tipo '!$B$2,IF(D31=2,'Tipo '!$B$3,IF(D31=3,'Tipo '!$B$4,IF(D31=4,'Tipo '!$B$5,IF(D31=5,'Tipo '!$B$6,IF(D31=6,'Tipo '!$B$7,IF(D31=7,'Tipo '!$B$8,IF(D31=8,'Tipo '!$B$9,IF(D31=9,'Tipo '!$B$10,IF(D31=10,'Tipo '!$B$11,IF(D31=11,'Tipo '!$B$12,IF(D31=12,'Tipo '!$B$13,IF(D31=13,'Tipo '!$B$14,IF(D31=14,'Tipo '!$B$15,IF(D31=15,'Tipo '!$B$16,IF(D31=16,'Tipo '!$B$17,IF(D31=17,'Tipo '!$B$18,IF(D31=18,'Tipo '!$B$19,IF(D31=19,'Tipo '!$B$20,\"No ha seleccionado un tipo de contrato válido\")))))))))))))))))))","v":"SUMINISTRO"},"Contratación mínima cuantia ","No aplica","SUMINISTRO DE ELEMENTOS Y MATERIALES DE FERRETERIA PARA EL MANTENIMIENTO DE LAS INSTALACIONES DE LA ALCALDIA LOCAL DE LA CANDELARIA Y LOS BIENES INMUBLES DE PROPIEDAD DEL FONDO DE DESARROLLO LOCAL ","Funcionamiento",null,{"$f":"IF(J31=1,'Equivalencia BH-BMPT'!$D$2,IF(J31=2,'Equivalencia BH-BMPT'!$D$3,IF(J31=3,'Equivalencia BH-BMPT'!$D$4,IF(J31=4,'Equivalencia BH-BMPT'!$D$5,IF(J31=5,'Equivalencia BH-BMPT'!$D$6,IF(J31=6,'Equivalencia BH-BMPT'!$D$7,IF(J31=7,'Equivalencia BH-BMPT'!$D$8,IF(J31=8,'Equivalencia BH-BMPT'!$D$9,IF(J31=9,'Equivalencia BH-BMPT'!$D$10,IF(J31=10,'Equivalencia BH-BMPT'!$D$11,IF(J31=11,'Equivalencia BH-BMPT'!$D$12,IF(J31=12,'Equivalencia BH-BMPT'!$D$13,IF(J31=13,'Equivalencia BH-BMPT'!$D$14,IF(J31=14,'Equivalencia BH-BMPT'!$D$15,IF(J31=15,'Equivalencia BH-BMPT'!$D$16,IF(J31=16,'Equivalencia BH-BMPT'!$D$17,IF(J31=17,'Equivalencia BH-BMPT'!$D$18,IF(J31=18,'Equivalencia BH-BMPT'!$D$19,IF(J31=19,'Equivalencia BH-BMPT'!$D$20,IF(J31=20,'Equivalencia BH-BMPT'!$D$21,IF(J31=21,'Equivalencia BH-BMPT'!$D$22,IF(J31=22,'Equivalencia BH-BMPT'!$D$23,IF(J31=23,'Equivalencia BH-BMPT'!#REF!,IF(J31=24,'Equivalencia BH-BMPT'!$D$25,IF(J31=25,'Equivalencia BH-BMPT'!$D$26,IF(J31=26,'Equivalencia BH-BMPT'!$D$27,IF(J31=27,'Equivalencia BH-BMPT'!$D$28,IF(J31=28,'Equivalencia BH-BMPT'!$D$29,IF(J31=29,'Equivalencia BH-BMPT'!$D$30,IF(J31=30,'Equivalencia BH-BMPT'!$D$31,IF(J31=31,'Equivalencia BH-BMPT'!$D$32,IF(J31=32,'Equivalencia BH-BMPT'!$D$33,IF(J31=33,'Equivalencia BH-BMPT'!$D$34,IF(J31=34,'Equivalencia BH-BMPT'!$D$35,IF(J31=35,'Equivalencia BH-BMPT'!$D$36,IF(J31=36,'Equivalencia BH-BMPT'!$D$37,IF(J31=37,'Equivalencia BH-BMPT'!$D$38,IF(J31=38,'Equivalencia BH-BMPT'!#REF!,IF(J31=39,'Equivalencia BH-BMPT'!$D$40,IF(J31=40,'Equivalencia BH-BMPT'!$D$41,IF(J31=41,'Equivalencia BH-BMPT'!$D$42,IF(J31=42,'Equivalencia BH-BMPT'!$D$43,IF(J31=43,'Equivalencia BH-BMPT'!$D$44,IF(J31=44,'Equivalencia BH-BMPT'!$D$45,IF(J31=45,'Equivalencia BH-BMPT'!$D$46,\"No ha seleccionado un número de programa\")))))))))))))))))))))))))))))))))))))))))))))","v":"No ha seleccionado un número de programa"},"0000",9002014611,"ORION CONIC S.A.S",null,null,null,null,2500000,2500000,null,"2016-12-13","2017-01-16","2017-03-15",420,null,null,null,"X",null,null,0,true]
[null,2017,"RESOLUCION",null,null,null,"No aplica","CONSTITUCION DE LA CAJA MENOR DEL FONDO DE DESARROLLO LOCAL DE LA CANDELARIA","Funcionamiento",null,{"$f":"IF(J32=1,'Equivalencia BH-BMPT'!$D$2,IF(J32=2,'Equivalencia BH-BMPT'!$D$3,IF(J32=3,'Equivalencia BH-BMPT'!$D$4,IF(J32=4,'Equivalencia BH-BMPT'!$D$5,IF(J32=5,'Equivalencia BH-BMPT'!$D$6,IF(J32=6,'Equivalencia BH-BMPT'!$D$7,IF(J32=7,'Equivalencia BH-BMPT'!$D$8,IF(J32=8,'Equivalencia BH-BMPT'!$D$9,IF(J32=9,'Equivalencia BH-BMPT'!$D$10,IF(J32=10,'Equivalencia BH-BMPT'!$D$11,IF(J32=11,'Equivalencia BH-BMPT'!$D$12,IF(J32=12,'Equivalencia BH-BMPT'!$D$13,IF(J32=13,'Equivalencia BH-BMPT'!$D$14,IF(J32=14,'Equivalencia BH-BMPT'!$D$15,IF(J32=15,'Equivalencia BH-BMPT'!$D$16,IF(J32=16,'Equivalencia BH-BMPT'!$D$17,IF(J32=17,'Equivalencia BH-BMPT'!$D$18,IF(J32=18,'Equivalencia BH-BMPT'!$D$19,IF(J32=19,'Equivalencia BH-BMPT'!$D$20,IF(J32=20,'Equivalencia BH-BMPT'!$D$21,IF(J32=21,'Equivalencia BH-BMPT'!$D$22,IF(J32=22,'Equivalencia BH-BMPT'!$D$23,IF(J32=23,'Equivalencia BH-BMPT'!#REF!,IF(J32=24,'Equivalencia BH-BMPT'!$D$25,IF(J32=25,'Equivalencia BH-BMPT'!$D$26,IF(J32=26,'Equivalencia BH-BMPT'!$D$27,IF(J32=27,'Equivalencia BH-BMPT'!$D$28,IF(J32=28,'Equivalencia BH-BMPT'!$D$29,IF(J32=29,'Equivalencia BH-BMPT'!$D$30,IF(J32=30,'Equivalencia BH-BMPT'!$D$31,IF(J32=31,'Equivalencia BH-BMPT'!$D$32,IF(J32=32,'Equivalencia BH-BMPT'!$D$33,IF(J32=33,'Equivalencia BH-BMPT'!$D$34,IF(J32=34,'Equivalencia BH-BMPT'!$D$35,IF(J32=35,'Equivalencia BH-BMPT'!$D$36,IF(J32=36,'Equivalencia BH-BMPT'!$D$37,IF(J32=37,'Equivalencia BH-BMPT'!$D$38,IF(J32=38,'Equivalencia BH-BMPT'!#REF!,IF(J32=39,'Equivalencia BH-BMPT'!$D$40,IF(J32=40,'Equivalencia BH-BMPT'!$D$41,IF(J32=41,'Equivalencia BH-BMPT'!$D$42,IF(J32=42,'Equivalencia BH-BMPT'!$D$43,IF(J32=43,'Equivalencia BH-BMPT'!$D$44,IF(J32=44,'Equivalencia BH-BMPT'!$D$45,IF(J32=45,'Equivalencia BH-BMPT'!$D$46,\"No ha seleccionado un número de programa\")))))))))))))))))))))))))))))))))))))))))))))","v":"No ha seleccionado un número de programa"},"0000",null,"FONDO DE DESARROLLO LOCAL DE LA CANDELARIA",null,null,null,null,2500000,2500000,2500000,"2017-01-20","2017-01-20","2018-01-19",365,null,null,null,null,"X",null,1,true]
[null,null,"FACTURAS",null,{"$f":"IF(D33=1,'Tipo '!$B$2,IF(D33=2,'Tipo '!$B$3,IF(D33=3,'Tipo '!$B$4,IF(D33=4,'Tipo '!$B$5,IF(D33=5,'Tipo '!$B$6,IF(D33=6,'Tipo '!$B$7,IF(D33=7,'Tipo '!$B$8,IF(D33=8,'Tipo '!$B$9,IF(D33=9,'Tipo '!$B$10,IF(D33=10,'Tipo '!$B$11,IF(D33=11,'Tipo '!$B$12,IF(D33=12,'Tipo '!$B$13,IF(D33=13,'Tipo '!$B$14,IF(D33=14,'Tipo '!$B$15,IF(D33=15,'Tipo '!$B$16,IF(D33=16,'Tipo '!$B$17,IF(D33=17,'Tipo '!$B$18,IF(D33=18,'Tipo '!$B$19,IF(D33=19,'Tipo '!$B$20,\"No ha seleccionado un tipo de contrato válido\")))))))))))))))))))","v":"No ha seleccionado un tipo de contrato válido"},null,null,"SERVICIOS PUBLICOS","Funcionamiento",null,{"$f":"IF(J33=1,'Equivalencia BH-BMPT'!$D$2,IF(J33=2,'Equivalencia BH-BMPT'!$D$3,IF(J33=3,'Equivalencia BH-BMPT'!$D$4,IF(J33=4,'Equivalencia BH-BMPT'!$D$5,IF(J33=5,'Equivalencia BH-BMPT'!$D$6,IF(J33=6,'Equivalencia BH-BMPT'!$D$7,IF(J33=7,'Equivalencia BH-BMPT'!$D$8,IF(J33=8,'Equivalencia BH-BMPT'!$D$9,IF(J33=9,'Equivalencia BH-BMPT'!$D$10,IF(J33=10,'Equivalencia BH-BMPT'!$D$11,IF(J33=11,'Equivalencia BH-BMPT'!$D$12,IF(J33=12,'Equivalencia BH-BMPT'!$D$13,IF(J33=13,'Equivalencia BH-BMPT'!$D$14,IF(J33=14,'Equivalencia BH-BMPT'!$D$15,IF(J33=15,'Equivalencia BH-BMPT'!$D$16,IF(J33=16,'Equivalencia BH-BMPT'!$D$17,IF(J33=17,'Equivalencia BH-BMPT'!$D$18,IF(J33=18,'Equivalencia BH-BMPT'!$D$19,IF(J33=19,'Equivalencia BH-BMPT'!$D$20,IF(J33=20,'Equivalencia BH-BMPT'!$D$21,IF(J33=21,'Equivalencia BH-BMPT'!$D$22,IF(J33=22,'Equivalencia BH-BMPT'!$D$23,IF(J33=23,'Equivalencia BH-BMPT'!#REF!,IF(J33=24,'Equivalencia BH-BMPT'!$D$25,IF(J33=25,'Equivalencia BH-BMPT'!$D$26,IF(J33=26,'Equivalencia BH-BMPT'!$D$27,IF(J33=27,'Equivalencia BH-BMPT'!$D$28,IF(J33=28,'Equivalencia BH-BMPT'!$D$29,IF(J33=29,'Equivalencia BH-BMPT'!$D$30,IF(J33=30,'Equivalencia BH-BMPT'!$D$31,IF(J33=31,'Equivalencia BH-BMPT'!$D$32,IF(J33=32,'Equivalencia BH-BMPT'!$D$33,IF(J33=33,'Equivalencia BH-BMPT'!$D$34,IF(J33=34,'Equivalencia BH-BMPT'!$D$35,IF(J33=35,'Equivalencia BH-BMPT'!$D$36,IF(J33=36,'Equivalencia BH-BMPT'!$D$37,IF(J33=37,'Equivalencia BH-BMPT'!$D$38,IF(J33=38,'Equivalencia BH-BMPT'!#REF!,IF(J33=39,'Equivalencia BH-BMPT'!$D$40,IF(J33=40,'Equivalencia BH-BMPT'!$D$41,IF(J33=41,'Equivalencia BH-BMPT'!$D$42,IF(J33=42,'Equivalencia BH-BMPT'!$D$43,IF(J33=43,'Equivalencia BH-BMPT'!$D$44,IF(J33=44,'Equivalencia BH-BMPT'!$D$45,IF(J33=45,'Equivalencia BH-BMPT'!$D$46,\"No ha seleccionado un número de programa\")))))))))))))))))))))))))))))))))))))))))))))","v":"No ha seleccionado un número de programa"},"0000",null,"PAGO DE SERVICIOS PUBLICOS",null,null,null,null,79211804,79211804,79211804,null,null,null,null,null,null,null,null,null,null,1,true]
[null,2017,"RESOLUCION",null,"COSTOS OPERATIVOS PARA EL PAGO DEL SUBSIDIO BONO TIPO C VIGENCIA 2017","RESOLUCIÓN","No aplica","COSTOS OPERATIVOS PARA EL PAGO DEL SUBSIDIO BONO TIPO C VIGENCIA 2017","Inversión",3,{"$f":"IF(J34=1,'Equivalencia BH-BMPT'!$D$2,IF(J34=2,'Equivalencia BH-BMPT'!$D$3,IF(J34=3,'Equivalencia BH-BMPT'!$D$4,IF(J34=4,'Equivalencia BH-BMPT'!$D$5,IF(J34=5,'Equivalencia BH-BMPT'!$D$6,IF(J34=6,'Equivalencia BH-BMPT'!$D$7,IF(J34=7,'Equivalencia BH-BMPT'!$D$8,IF(J34=8,'Equivalencia BH-BMPT'!$D$9,IF(J34=9,'Equivalencia BH-BMPT'!$D$10,IF(J34=10,'Equivalencia BH-BMPT'!$D$11,IF(J34=11,'Equivalencia BH-BMPT'!$D$12,IF(J34=12,'Equivalencia BH-BMPT'!$D$13,IF(J34=13,'Equivalencia BH-BMPT'!$D$14,IF(J34=14,'Equivalencia BH-BMPT'!$D$15,IF(J34=15,'Equivalencia BH-BMPT'!$D$16,IF(J34=16,'Equivalencia BH-BMPT'!$D$17,IF(J34=17,'Equivalencia BH-BMPT'!$D$18,IF(J34=18,'Equivalencia BH-BMPT'!$D$19,IF(J34=19,'Equivalencia BH-BMPT'!$D$20,IF(J34=20,'Equivalencia BH-BMPT'!$D$21,IF(J34=21,'Equivalencia BH-BMPT'!$D$22,IF(J34=22,'Equivalencia BH-BMPT'!$D$23,IF(J34=23,'Equivalencia BH-BMPT'!D92,IF(J34=24,'Equivalencia BH-BMPT'!$D$25,IF(J34=25,'Equivalencia BH-BMPT'!$D$26,IF(J34=26,'Equivalencia BH-BMPT'!$D$27,IF(J34=27,'Equivalencia BH-BMPT'!$D$28,IF(J34=28,'Equivalencia BH-BMPT'!$D$29,IF(J34=29,'Equivalencia BH-BMPT'!$D$30,IF(J34=30,'Equivalencia BH-BMPT'!$D$31,IF(J34=31,'Equivalencia BH-BMPT'!$D$32,IF(J34=32,'Equivalencia BH-BMPT'!$D$33,IF(J34=33,'Equivalencia BH-BMPT'!$D$34,IF(J34=34,'Equivalencia BH-BMPT'!$D$35,IF(J34=35,'Equivalencia BH-BMPT'!$D$36,IF(J34=36,'Equivalencia BH-BMPT'!$D$37,IF(J34=37,'Equivalencia BH-BMPT'!$D$38,IF(J34=38,'Equivalencia BH-BMPT'!D107,IF(J34=39,'Equivalencia BH-BMPT'!$D$40,IF(J34=40,'Equivalencia BH-BMPT'!$D$41,IF(J34=41,'Equivalencia BH-BMPT'!$D$42,IF(J34=42,'Equivalencia BH-BMPT'!$D$43,IF(J34=43,'Equivalencia BH-BMPT'!$D$44,IF(J34=44,'Equivalencia BH-BMPT'!$D$45,IF(J34=45,'Equivalencia BH-BMPT'!$D$46,\"No ha seleccionado un número de programa\")))))))))))))))))))))))))))))))))))))))))))))","v":"Igualdad y autonomía para una Bogotá incluyente"},"1386",null,"CAJA DE COMPENSACIÓN FAMILIAR",null,null,null,null,5966312,{"$f":"O34+Q34+S34","v":5966312},5647880,null,null,null,null,null,null,null,null,null,null,0.94662833589661421,false]
[34,2017,"17-12-6331865",5,{"$f":"IF(D35=1,'[1]Tipo '!$B$2,IF(D35=2,'[1]Tipo '!$B$3,IF(D35=3,'[1]Tipo '!$B$4,IF(D35=4,'[1]Tipo '!$B$5,IF(D35=5,'[1]Tipo '!$B$6,IF(D35=6,'[1]Tipo '!$B$7,IF(D35=7,'[1]Tipo '!$B$8,IF(D35=8,'[1]Tipo '!$B$9,IF(D35=9,'[1]Tipo '!$B$10,IF(D35=10,'[1]Tipo '!$B$11,IF(D35=11,'[1]Tipo '!$B$12,IF(D35=12,'[1]Tipo '!$B$13,IF(D35=13,'[1]Tipo '!$B$14,IF(D35=14,'[1]Tipo '!$B$15,IF(D35=15,'[1]Tipo '!$B$16,IF(D35=16,'[1]Tipo '!$B$17,IF(D35=17,'[1]Tipo '!$B$18,IF(D35=18,'[1]Tipo '!$B$19,IF(D35=19,'[1]Tipo '!$B$20,\"No ha seleccionado un tipo de contrato válido\")))))))))))))))))))","v":"CONTRATOS DE PRESTACIÓN DE SERVICIOS PROFESIONALES Y DE APOYO A LA GESTIÓN"},"Contratación directa","Prestación de servicios profesionales y de apoyo a la gestión, o para la ejecución de trabajos artísticos que sólo puedan encomendarse a determinadas personas naturales;","PRESTAR SERVICIOS PROFESIONALES EN LA ADMINISTRACIÓN DEL PROCESO DE FOCALIZACIÓN INICIAL DE LOS BENEFICIARIOS DEL SUBSIDIO TIPO C, EN EL MARCO DEL PROYECTO NO. 1386: SUBSIDIO BONO TIPO C, DE CONFORMIDAD CON LOS ESTUDIOS PREVIOS, DOCUMENTO QUE FORMA PARTE INTEGRAL DEL PROCESO","Inversión",3,{"$f":"IF(J35=1,'[1]Equivalencia BH-BMPT'!$D$2,IF(J35=2,'[1]Equivalencia BH-BMPT'!$D$3,IF(J35=3,'[1]Equivalencia BH-BMPT'!$D$4,IF(J35=4,'[1]Equivalencia BH-BMPT'!$D$5,IF(J35=5,'[1]Equivalencia BH-BMPT'!$D$6,IF(J35=6,'[1]Equivalencia BH-BMPT'!$D$7,IF(J35=7,'[1]Equivalencia BH-BMPT'!$D$8,IF(J35=8,'[1]Equivalencia BH-BMPT'!$D$9,IF(J35=9,'[1]Equivalencia BH-BMPT'!$D$10,IF(J35=10,'[1]Equivalencia BH-BMPT'!$D$11,IF(J35=11,'[1]Equivalencia BH-BMPT'!$D$12,IF(J35=12,'[1]Equivalencia BH-BMPT'!$D$13,IF(J35=13,'[1]Equivalencia BH-BMPT'!$D$14,IF(J35=14,'[1]Equivalencia BH-BMPT'!$D$15,IF(J35=15,'[1]Equivalencia BH-BMPT'!$D$16,IF(J35=16,'[1]Equivalencia BH-BMPT'!$D$17,IF(J35=17,'[1]Equivalencia BH-BMPT'!$D$18,IF(J35=18,'[1]Equivalencia BH-BMPT'!$D$19,IF(J35=19,'[1]Equivalencia BH-BMPT'!$D$20,IF(J35=20,'[1]Equivalencia BH-BMPT'!$D$21,IF(J35=21,'[1]Equivalencia BH-BMPT'!$D$22,IF(J35=22,'[1]Equivalencia BH-BMPT'!$D$23,IF(J35=23,'[1]Equivalencia BH-BMPT'!#REF!,IF(J35=24,'[1]Equivalencia BH-BMPT'!$D$25,IF(J35=25,'[1]Equivalencia BH-BMPT'!$D$26,IF(J35=26,'[1]Equivalencia BH-BMPT'!$D$27,IF(J35=27,'[1]Equivalencia BH-BMPT'!$D$28,IF(J35=28,'[1]Equivalencia BH-BMPT'!$D$29,IF(J35=29,'[1]Equivalencia BH-BMPT'!$D$30,IF(J35=30,'[1]Equivalencia BH-BMPT'!$D$31,IF(J35=31,'[1]Equivalencia BH-BMPT'!$D$32,IF(J35=32,'[1]Equivalencia BH-BMPT'!$D$33,IF(J35=33,'[1]Equivalencia BH-BMPT'!$D$34,IF(J35=34,'[1]Equivalencia BH-BMPT'!$D$35,IF(J35=35,'[1]Equivalencia BH-BMPT'!$D$36,IF(J35=36,'[1]Equivalencia BH-BMPT'!$D$37,IF(J35=37,'[1]Equivalencia BH-BMPT'!$D$38,IF(J35=38,'[1]Equivalencia BH-BMPT'!#REF!,IF(J35=39,'[1]Equivalencia BH-BMPT'!$D$40,IF(J35=40,'[1]Equivalencia BH-BMPT'!$D$41,IF(J35=41,'[1]Equivalencia BH-BMPT'!$D$42,IF(J35=42,'[1]Equivalencia BH-BMPT'!$D$43,IF(J35=43,'[1]Equivalencia BH-BMPT'!$D$44,IF(J35=44,'[1]Equivalencia BH-BMPT'!$D$45,IF(J35=45,'[1]Equivalencia BH-BMPT'!$D$46,\"No ha seleccionado un número de programa\")))))))))))))))))))))))))))))))))))))))))))))","v":"Igualdad y autonomía para una Bogotá incluyente"},"1386",52845870,"JENNYFFER PAOLA GUIO VELOZA",44631879,null,null,null,null,{"$f":"O35+Q35+S35","v":44631879},40980192,"2017-02-07","2017-02-07","2018-12-30",325,null,null,null,null,"X",null,0.91818209132535067,false]
[35,2017,"17-12-6332091",5,{"$f":"IF(D36=1,'[1]Tipo '!$B$2,IF(D36=2,'[1]Tipo '!$B$3,IF(D36=3,'[1]Tipo '!$B$4,IF(D36=4,'[1]Tipo '!$B$5,IF(D36=5,'[1]Tipo '!$B$6,IF(D36=6,'[1]Tipo '!$B$7,IF(D36=7,'[1]Tipo '!$B$8,IF(D36=8,'[1]Tipo '!$B$9,IF(D36=9,'[1]Tipo '!$B$10,IF(D36=10,'[1]Tipo '!$B$11,IF(D36=11,'[1]Tipo '!$B$12,IF(D36=12,'[1]Tipo '!$B$13,IF(D36=13,'[1]Tipo '!$B$14,IF(D36=14,'[1]Tipo '!$B$15,IF(D36=15,'[1]Tipo '!$B$16,IF(D36=16,'[1]Tipo '!$B$17,IF(D36=17,'[1]Tipo '!$B$18,IF(D36=18,'[1]Tipo '!$B$19,IF(D36=19,'[1]Tipo '!$B$20,\"No ha seleccionado un tipo de contrato válido\")))))))))))))))))))","v":"CONTRATOS DE PRESTACIÓN DE SERVICIOS PROFESIONALES Y DE APOYO A LA GESTIÓN"},"Contratación directa","Prestación de servicios profesionales y de apoyo a la gestión, o para la ejecución de trabajos artísticos que sólo puedan encomendarse a determinadas personas naturales;","PRESTAR SERVICIOS PROFESIONALES EN LA ADMINISTRACIÓN DEL PROCESO DE FOCALIZACIÓN INICIAL DE LOS BENEFICIARIOS DEL SUBSIDIO TIPO C, EN EL MARCO DEL PROYECTO NO. 1386: SUBSIDIO BONO TIPO C, DE CONFORMIDAD CON LOS ESTUDIOS PREVIOS, DOCUMENTO QUE FORMA PARTE INTEGRAL DEL PROCESO","Inversión",3,{"$f":"IF(J36=1,'[1]Equivalencia BH-BMPT'!$D$2,IF(J36=2,'[1]Equivalencia BH-BMPT'!$D$3,IF(J36=3,'[1]Equivalencia BH-BMPT'!$D$4,IF(J36=4,'[1]Equivalencia BH-BMPT'!$D$5,IF(J36=5,'[1]Equivalencia BH-BMPT'!$D$6,IF(J36=6,'[1]Equivalencia BH-BMPT'!$D$7,IF(J36=7,'[1]Equivalencia BH-BMPT'!$D$8,IF(J36=8,'[1]Equivalencia BH-BMPT'!$D$9,IF(J36=9,'[1]Equivalencia BH-BMPT'!$D$10,IF(J36=10,'[1]Equivalencia BH-BMPT'!$D$11,IF(J36=11,'[1]Equivalencia BH-BMPT'!$D$12,IF(J36=12,'[1]Equivalencia BH-BMPT'!$D$13,IF(J36=13,'[1]Equivalencia BH-BMPT'!$D$14,IF(J36=14,'[1]Equivalencia BH-BMPT'!$D$15,IF(J36=15,'[1]Equivalencia BH-BMPT'!$D$16,IF(J36=16,'[1]Equivalencia BH-BMPT'!$D$17,IF(J36=17,'[1]Equivalencia BH-BMPT'!$D$18,IF(J36=18,'[1]Equivalencia BH-BMPT'!$D$19,IF(J36=19,'[1]Equivalencia BH-BMPT'!$D$20,IF(J36=20,'[1]Equivalencia BH-BMPT'!$D$21,IF(J36=21,'[1]Equivalencia BH-BMPT'!$D$22,IF(J36=22,'[1]Equivalencia BH-BMPT'!$D$23,IF(J36=23,'[1]Equivalencia BH-BMPT'!#REF!,IF(J36=24,'[1]Equivalencia BH-BMPT'!$D$25,IF(J36=25,'[1]Equivalencia BH-BMPT'!$D$26,IF(J36=26,'[1]Equivalencia BH-BMPT'!$D$27,IF(J36=27,'[1]Equivalencia BH-BMPT'!$D$28,IF(J36=28,'[1]Equivalencia BH-BMPT'!$D$29,IF(J36=29,'[1]Equivalencia BH-BMPT'!$D$30,IF(J36=30,'[1]Equivalencia BH-BMPT'!$D$31,IF(J36=31,'[1]Equivalencia BH-BMPT'!$D$32,IF(J36=32,'[1]Equivalencia BH-BMPT'!$D$33,IF(J36=33,'[1]Equivalencia BH-BMPT'!$D$34,IF(J36=34,'[1]Equivalencia BH-BMPT'!$D$35,IF(J36=35,'[1]Equivalencia BH-BMPT'!$D$36,IF(J36=36,'[1]Equivalencia BH-BMPT'!$D$37,IF(J36=37,'[1]Equivalencia BH-BMPT'!$D$38,IF(J36=38,'[1]Equivalencia BH-BMPT'!#REF!,IF(J36=39,'[1]Equivalencia BH-BMPT'!$D$40,IF(J36=40,'[1]Equivalencia BH-BMPT'!$D$41,IF(J36=41,'[1]Equivalencia BH-BMPT'!$D$42,IF(J36=42,'[1]Equivalencia BH-BMPT'!$D$43,IF(J36=43,'[1]Equivalencia BH-BMPT'!$D$44,IF(J36=44,'[1]Equivalencia BH-BMPT'!$D$45,IF(J36=45,'[1]Equivalencia BH-BMPT'!$D$46,\"No ha seleccionado un número de programa\")))))))))))))))))))))))))))))))))))))))))))))","v":"Igualdad y autonomía para una Bogotá incluyente"},"1386",1110445974,"DIANA CATALINA BONILLA ALCAZAR",44631879,8385373,null,null,null,{"$f":"O36+Q36+S36-P36","v":36246506},36246506,"2017-02-07","2017-02-07","2017-12-30",325,null,null,null,null,null,"X",1,false]
[37,2017,"17-12-6332604",5,{"$f":"IF(D37=1,'[1]Tipo '!$B$2,IF(D37=2,'[1]Tipo '!$B$3,IF(D37=3,'[1]Tipo '!$B$4,IF(D37=4,'[1]Tipo '!$B$5,IF(D37=5,'[1]Tipo '!$B$6,IF(D37=6,'[1]Tipo '!$B$7,IF(D37=7,'[1]Tipo '!$B$8,IF(D37=8,'[1]Tipo '!$B$9,IF(D37=9,'[1]Tipo '!$B$10,IF(D37=10,'[1]Tipo '!$B$11,IF(D37=11,'[1]Tipo '!$B$12,IF(D37=12,'[1]Tipo '!$B$13,IF(D37=13,'[1]Tipo '!$B$14,IF(D37=14,'[1]Tipo '!$B$15,IF(D37=15,'[1]Tipo '!$B$16,IF(D37=16,'[1]Tipo '!$B$17,IF(D37=17,'[1]Tipo '!$B$18,IF(D37=18,'[1]Tipo '!$B$19,IF(D37=19,'[1]Tipo '!$B$20,\"No ha seleccionado un tipo de contrato válido\")))))))))))))))))))","v":"CONTRATOS DE PRESTACIÓN DE SERVICIOS PROFESIONALES Y DE APOYO A LA GESTIÓN"},"Contratación directa","Prestación de servicios profesionales y de apoyo a la gestión, o para la ejecución de trabajos artísticos que sólo puedan encomendarse a determinadas personas naturales;","PRESTAR SERVICIOS PROFESIONALES EN  EL PROCESO DE FOCALIZACIÓN INICIAL DE LOS BENEFICIARIOS DEL SUBSIDIO TIPO C, EN EL MARCO DEL PROYECTO NO. 1386: SUBSIDIO BONO TIPO C, DE CONFORMIDAD CON LOS ESTUDIOS PREVIOS, DOCUMENTO QUE FORMA PARTE INTEGRAL DEL PROCESO","Inversión",3,{"$f":"IF(J37=1,'[1]Equivalencia BH-BMPT'!$D$2,IF(J37=2,'[1]Equivalencia BH-BMPT'!$D$3,IF(J37=3,'[1]Equivalencia BH-BMPT'!$D$4,IF(J37=4,'[1]Equivalencia BH-BMPT'!$D$5,IF(J37=5,'[1]Equivalencia BH-BMPT'!$D$6,IF(J37=6,'[1]Equivalencia BH-BMPT'!$D$7,IF(J37=7,'[1]Equivalencia BH-BMPT'!$D$8,IF(J37=8,'[1]Equivalencia BH-BMPT'!$D$9,IF(J37=9,'[1]Equivalencia BH-BMPT'!$D$10,IF(J37=10,'[1]Equivalencia BH-BMPT'!$D$11,IF(J37=11,'[1]Equivalencia BH-BMPT'!$D$12,IF(J37=12,'[1]Equivalencia BH-BMPT'!$D$13,IF(J37=13,'[1]Equivalencia BH-BMPT'!$D$14,IF(J37=14,'[1]Equivalencia BH-BMPT'!$D$15,IF(J37=15,'[1]Equivalencia BH-BMPT'!$D$16,IF(J37=16,'[1]Equivalencia BH-BMPT'!$D$17,IF(J37=17,'[1]Equivalencia BH-BMPT'!$D$18,IF(J37=18,'[1]Equivalencia BH-BMPT'!$D$19,IF(J37=19,'[1]Equivalencia BH-BMPT'!$D$20,IF(J37=20,'[1]Equivalencia BH-BMPT'!$D$21,IF(J37=21,'[1]Equivalencia BH-BMPT'!$D$22,IF(J37=22,'[1]Equivalencia BH-BMPT'!$D$23,IF(J37=23,'[1]Equivalencia BH-BMPT'!#REF!,IF(J37=24,'[1]Equivalencia BH-BMPT'!$D$25,IF(J37=25,'[1]Equivalencia BH-BMPT'!$D$26,IF(J37=26,'[1]Equivalencia BH-BMPT'!$D$27,IF(J37=27,'[1]Equivalencia BH-BMPT'!$D$28,IF(J37=28,'[1]Equivalencia BH-BMPT'!$D$29,IF(J37=29,'[1]Equivalencia BH-BMPT'!$D$30,IF(J37=30,'[1]Equivalencia BH-BMPT'!$D$31,IF(J37=31,'[1]Equivalencia BH-BMPT'!$D$32,IF(J37=32,'[1]Equivalencia BH-BMPT'!$D$33,IF(J37=33,'[1]Equivalencia BH-BMPT'!$D$34,IF(J37=34,'[1]Equivalencia BH-BMPT'!$D$35,IF(J37=35,'[1]Equivalencia BH-BMPT'!$D$36,IF(J37=36,'[1]Equivalencia BH-BMPT'!$D$37,IF(J37=37,'[1]Equivalencia BH-BMPT'!$D$38,IF(J37=38,'[1]Equivalencia BH-BMPT'!#REF!,IF(J37=39,'[1]Equivalencia BH-BMPT'!$D$40,IF(J37=40,'[1]Equivalencia BH-BMPT'!$D$41,IF(J37=41,'[1]Equivalencia BH-BMPT'!$D$42,IF(J37=42,'[1]Equivalencia BH-BMPT'!$D$43,IF(J37=43,'[1]Equivalencia BH-BMPT'!$D$44,IF(J37=44,'[1]Equivalencia BH-BMPT'!$D$45,IF(J37=45,'[1]Equivalencia BH-BMPT'!$D$46,\"No ha seleccionado un número de programa\")))))))))))))))))))))))))))))))))))))))))))))","v":"Igualdad y autonomía para una Bogotá incluyente"},"1386",52760226,"NUBIA CONSUELO CHAVARRO GALINDO",44631879,null,null,null,null,{"$f":"O37+Q37+S37","v":44631879},41756954,"2017-02-07","2017-02-07","2017-12-30",325,null,null,null,null,"X",null,0.93558583988812127,false]
[null,2017,"RESOLUCION",null,"RESOLUCION",null,"No aplica","PAGO SUBSIDIO TIPO C PARA EL ADULTO MAYOR DE LA LOCALIDAD DE LA CANDELARIA VIGENCIA 2016. REEMPLAZA EL RP No. 486 DEL 2016 POR CONSTITUIRSE COMO OBLIGACIONES POR PAGAR","Inversión",3,{"$f":"IF(J38=1,'Equivalencia BH-BMPT'!$D$2,IF(J38=2,'Equivalencia BH-BMPT'!$D$3,IF(J38=3,'Equivalencia BH-BMPT'!$D$4,IF(J38=4,'Equivalencia BH-BMPT'!$D$5,IF(J38=5,'Equivalencia BH-BMPT'!$D$6,IF(J38=6,'Equivalencia BH-BMPT'!$D$7,IF(J38=7,'Equivalencia BH-BMPT'!$D$8,IF(J38=8,'Equivalencia BH-BMPT'!$D$9,IF(J38=9,'Equivalencia BH-BMPT'!$D$10,IF(J38=10,'Equivalencia BH-BMPT'!$D$11,IF(J38=11,'Equivalencia BH-BMPT'!$D$12,IF(J38=12,'Equivalencia BH-BMPT'!$D$13,IF(J38=13,'Equivalencia BH-BMPT'!$D$14,IF(J38=14,'Equivalencia BH-BMPT'!$D$15,IF(J38=15,'Equivalencia BH-BMPT'!$D$16,IF(J38=16,'Equivalencia BH-BMPT'!$D$17,IF(J38=17,'Equivalencia BH-BMPT'!$D$18,IF(J38=18,'Equivalencia BH-BMPT'!$D$19,IF(J38=19,'Equivalencia BH-BMPT'!$D$20,IF(J38=20,'Equivalencia BH-BMPT'!$D$21,IF(J38=21,'Equivalencia BH-BMPT'!$D$22,IF(J38=22,'Equivalencia BH-BMPT'!$D$23,IF(J38=23,'Equivalencia BH-BMPT'!#REF!,IF(J38=24,'Equivalencia BH-BMPT'!$D$25,IF(J38=25,'Equivalencia BH-BMPT'!$D$26,IF(J38=26,'Equivalencia BH-BMPT'!$D$27,IF(J38=27,'Equivalencia BH-BMPT'!$D$28,IF(J38=28,'Equivalencia BH-BMPT'!$D$29,IF(J38=29,'Equivalencia BH-BMPT'!$D$30,IF(J38=30,'Equivalencia BH-BMPT'!$D$31,IF(J38=31,'Equivalencia BH-BMPT'!$D$32,IF(J38=32,'Equivalencia BH-BMPT'!$D$33,IF(J38=33,'Equivalencia BH-BMPT'!$D$34,IF(J38=34,'Equivalencia BH-BMPT'!$D$35,IF(J38=35,'Equivalencia BH-BMPT'!$D$36,IF(J38=36,'Equivalencia BH-BMPT'!$D$37,IF(J38=37,'Equivalencia BH-BMPT'!$D$38,IF(J38=38,'Equivalencia BH-BMPT'!#REF!,IF(J38=39,'Equivalencia BH-BMPT'!$D$40,IF(J38=40,'Equivalencia BH-BMPT'!$D$41,IF(J38=41,'Equivalencia BH-BMPT'!$D$42,IF(J38=42,'Equivalencia BH-BMPT'!$D$43,IF(J38=43,'Equivalencia BH-BMPT'!$D$44,IF(J38=44,'Equivalencia BH-BMPT'!$D$45,IF(J38=45,'Equivalencia BH-BMPT'!$D$46,\"No ha seleccionado un número de programa\")))))))))))))))))))))))))))))))))))))))))))))","v":"Igualdad y autonomía para una Bogotá incluyente"},"1386",null,"CAJA DE COMPENSACIÓN FAMILIAR",null,null,null,null,419760000,{"$f":"O38+Q38+S38","v":419760000},311520000,null,null,null,null,null,null,null,null,null,null,0.74213836477987416,false]
[98,2017,"17-12-7395063",16,{"$f":"IF(D39=1,'[3]Tipo '!$B$2,IF(D39=2,'[3]Tipo '!$B$3,IF(D39=3,'[3]Tipo '!$B$4,IF(D39=4,'[3]Tipo '!$B$5,IF(D39=5,'[3]Tipo '!$B$6,IF(D39=6,'[3]Tipo '!$B$7,IF(D39=7,'[3]Tipo '!$B$8,IF(D39=8,'[3]Tipo '!$B$9,IF(D39=9,'[3]Tipo '!$B$10,IF(D39=10,'[3]Tipo '!$B$11,IF(D39=11,'[3]Tipo '!$B$12,IF(D39=12,'[3]Tipo '!$B$13,IF(D39=13,'[3]Tipo '!$B$14,IF(D39=14,'[3]Tipo '!$B$15,IF(D39=15,'[3]Tipo '!$B$16,IF(D39=16,'[3]Tipo '!$B$17,IF(D39=17,'[3]Tipo '!$B$18,IF(D39=18,'[3]Tipo '!$B$19,IF(D39=19,'[3]Tipo '!$B$20,\"No ha seleccionado un tipo de contrato válido\")))))))))))))))))))","v":"CONTRATOS INTERADMINISTRATIVOS"},"Contratación directa","Contratos interadministrativos","AUNAR ESFUERZOS TÉCNICOS, ADMINISTRATIVOS Y ECONÓMICOS EN PROMOVER EL EJERCICIO Y LA RESTITUCIÓN DE LA AUTONOMÍA E INCLUSIÓN SOCIAL DE LAS PERSONAS CON DISCAPACIDAD POR MEDIO DEL OTORGAMIENTO DE AYUDAS TÉCNICAS DESDE UNA PERSPECTIVA DE DERECHOS HUMANOS QUE PERMITAN LA INCLUSIÓN SOCIAL EN LAS DIFERENTES ACCIONES DE LA VIDA COTIDIANA, DE CONFORMIDAD CON LA FORMULACIÓN DEL PROYECTO, ESTUDIOS PREVIOS, ANEXO TÉCNICO","Inversión",3,{"$f":"IF(J39=1,'[3]Equivalencia BH-BMPT'!$D$2,IF(J39=2,'[3]Equivalencia BH-BMPT'!$D$3,IF(J39=3,'[3]Equivalencia BH-BMPT'!$D$4,IF(J39=4,'[3]Equivalencia BH-BMPT'!$D$5,IF(J39=5,'[3]Equivalencia BH-BMPT'!$D$6,IF(J39=6,'[3]Equivalencia BH-BMPT'!$D$7,IF(J39=7,'[3]Equivalencia BH-BMPT'!$D$8,IF(J39=8,'[3]Equivalencia BH-BMPT'!$D$9,IF(J39=9,'[3]Equivalencia BH-BMPT'!$D$10,IF(J39=10,'[3]Equivalencia BH-BMPT'!$D$11,IF(J39=11,'[3]Equivalencia BH-BMPT'!$D$12,IF(J39=12,'[3]Equivalencia BH-BMPT'!$D$13,IF(J39=13,'[3]Equivalencia BH-BMPT'!$D$14,IF(J39=14,'[3]Equivalencia BH-BMPT'!$D$15,IF(J39=15,'[3]Equivalencia BH-BMPT'!$D$16,IF(J39=16,'[3]Equivalencia BH-BMPT'!$D$17,IF(J39=17,'[3]Equivalencia BH-BMPT'!$D$18,IF(J39=18,'[3]Equivalencia BH-BMPT'!$D$19,IF(J39=19,'[3]Equivalencia BH-BMPT'!$D$20,IF(J39=20,'[3]Equivalencia BH-BMPT'!$D$21,IF(J39=21,'[3]Equivalencia BH-BMPT'!$D$22,IF(J39=22,'[3]Equivalencia BH-BMPT'!$D$23,IF(J39=23,'[3]Equivalencia BH-BMPT'!#REF!,IF(J39=24,'[3]Equivalencia BH-BMPT'!$D$25,IF(J39=25,'[3]Equivalencia BH-BMPT'!$D$26,IF(J39=26,'[3]Equivalencia BH-BMPT'!$D$27,IF(J39=27,'[3]Equivalencia BH-BMPT'!$D$28,IF(J39=28,'[3]Equivalencia BH-BMPT'!$D$29,IF(J39=29,'[3]Equivalencia BH-BMPT'!$D$30,IF(J39=30,'[3]Equivalencia BH-BMPT'!$D$31,IF(J39=31,'[3]Equivalencia BH-BMPT'!$D$32,IF(J39=32,'[3]Equivalencia BH-BMPT'!$D$33,IF(J39=33,'[3]Equivalencia BH-BMPT'!$D$34,IF(J39=34,'[3]Equivalencia BH-BMPT'!$D$35,IF(J39=35,'[3]Equivalencia BH-BMPT'!$D$36,IF(J39=36,'[3]Equivalencia BH-BMPT'!$D$37,IF(J39=37,'[3]Equivalencia BH-BMPT'!$D$38,IF(J39=38,'[3]Equivalencia BH-BMPT'!#REF!,IF(J39=39,'[3]Equivalencia BH-BMPT'!$D$40,IF(J39=40,'[3]Equivalencia BH-BMPT'!$D$41,IF(J39=41,'[3]Equivalencia BH-BMPT'!$D$42,IF(J39=42,'[3]Equivalencia BH-BMPT'!$D$43,IF(J39=43,'[3]Equivalencia BH-BMPT'!$D$44,IF(J39=44,'[3]Equivalencia BH-BMPT'!$D$45,IF(J39=45,'[3]Equivalencia BH-BMPT'!$D$46,\"No ha seleccionado un número de programa\")))))))))))))))))))))))))))))))))))))))))))))","v":"Igualdad y autonomía para una Bogotá incluyente"},"1387",9009590517,"SUBRED INTEGRADA DE SERVICIOS DE SALUD CENTRO ORIENTE ESE",63000000,null,null,null,null,{"$f":"O39+Q39+S39","v":63000000},null,"2017-11-07",null,null,120,null,null,"X",null,null,null,0,false]
[112,2017,"17-13-7441904",3,{"$f":"IF(D40=1,'[4]Tipo '!$B$2,IF(D40=2,'[4]Tipo '!$B$3,IF(D40=3,'[4]Tipo '!$B$4,IF(D40=4,'[4]Tipo '!$B$5,IF(D40=5,'[4]Tipo '!$B$6,IF(D40=6,'[4]Tipo '!$B$7,IF(D40=7,'[4]Tipo '!$B$8,IF(D40=8,'[4]Tipo '!$B$9,IF(D40=9,'[4]Tipo '!$B$10,IF(D40=10,'[4]Tipo '!$B$11,IF(D40=11,'[4]Tipo '!$B$12,IF(D40=12,'[4]Tipo '!$B$13,IF(D40=13,'[4]Tipo '!$B$14,IF(D40=14,'[4]Tipo '!$B$15,IF(D40=15,'[4]Tipo '!$B$16,IF(D40=16,'[4]Tipo '!$B$17,IF(D40=17,'[4]Tipo '!$B$18,IF(D40=18,'[4]Tipo '!$B$19,IF(D40=19,'[4]Tipo '!$B$20,\"No ha seleccionado un tipo de contrato válido\")))))))))))))))))))","v":"INTERVENTORÍA"},"Concurso de Méritos","No aplica","REALIZAR LA INTERVENTORIA TÉCNICA, ADMINISTRATIVA, FINANCIERA AL CONTRATO INTERADMINISTRATIVO SUSCRITO CON LA SUBRED INTEGRADA DE SERVICIOS DE SALUD CENTRO ORIENTE, CUYO OBJETO ES AUNAR ESFUERZOS TÉCNICOS, ADMINISTRATIVOS Y ECONÓMICOS EN PROMOVER EL EJERCICIO Y LA RESTITUCIÓN DE LA AUTONOMÍA E INCLUSIÓN SOCIAL DE LAS PERSONAS CON DISCAPACIDAD POR MEDIO DE OTORGAMIENTO DE AYUDAS TÉCNICAS DESDE UNA PERPESPECTIVA DE DERECHOS HUMANOS QUE PERMITAN LA INCLUSIÓN SOCIAL EN LAS DIFERENTES ACCIONES  DE LA VIDA COTIDIANA, DE CONFORMIDAD CON LA FORMULACIÓN DEL PROYECTO, ESTUDIOS PREVIOS, ANEXO TÉCNICO","Inversión",3,{"$f":"IF(J40=1,'[4]Equivalencia BH-BMPT'!$D$2,IF(J40=2,'[4]Equivalencia BH-BMPT'!$D$3,IF(J40=3,'[4]Equivalencia BH-BMPT'!$D$4,IF(J40=4,'[4]Equivalencia BH-BMPT'!$D$5,IF(J40=5,'[4]Equivalencia BH-BMPT'!$D$6,IF(J40=6,'[4]Equivalencia BH-BMPT'!$D$7,IF(J40=7,'[4]Equivalencia BH-BMPT'!$D$8,IF(J40=8,'[4]Equivalencia BH-BMPT'!$D$9,IF(J40=9,'[4]Equivalencia BH-BMPT'!$D$10,IF(J40=10,'[4]Equivalencia BH-BMPT'!$D$11,IF(J40=11,'[4]Equivalencia BH-BMPT'!$D$12,IF(J40=12,'[4]Equivalencia BH-BMPT'!$D$13,IF(J40=13,'[4]Equivalencia BH-BMPT'!$D$14,IF(J40=14,'[4]Equivalencia BH-BMPT'!$D$15,IF(J40=15,'[4]Equivalencia BH-BMPT'!$D$16,IF(J40=16,'[4]Equivalencia BH-BMPT'!$D$17,IF(J40=17,'[4]Equivalencia BH-BMPT'!$D$18,IF(J40=18,'[4]Equivalencia BH-BMPT'!$D$19,IF(J40=19,'[4]Equivalencia BH-BMPT'!$D$20,IF(J40=20,'[4]Equivalencia BH-BMPT'!$D$21,IF(J40=21,'[4]Equivalencia BH-BMPT'!$D$22,IF(J40=22,'[4]Equivalencia BH-BMPT'!$D$23,IF(J40=23,'[4]Equivalencia BH-BMPT'!#REF!,IF(J40=24,'[4]Equivalencia BH-BMPT'!$D$25,IF(J40=25,'[4]Equivalencia BH-BMPT'!$D$26,IF(J40=26,'[4]Equivalencia BH-BMPT'!$D$27,IF(J40=27,'[4]Equivalencia BH-BMPT'!$D$28,IF(J40=28,'[4]Equivalencia BH-BMPT'!$D$29,IF(J40=29,'[4]Equivalencia BH-BMPT'!$D$30,IF(J40=30,'[4]Equivalencia BH-BMPT'!$D$31,IF(J40=31,'[4]Equivalencia BH-BMPT'!$D$32,IF(J40=32,'[4]Equivalencia BH-BMPT'!$D$33,IF(J40=33,'[4]Equivalencia BH-BMPT'!$D$34,IF(J40=34,'[4]Equivalencia BH-BMPT'!$D$35,IF(J40=35,'[4]Equivalencia BH-BMPT'!$D$36,IF(J40=36,'[4]Equivalencia BH-BMPT'!$D$37,IF(J40=37,'[4]Equivalencia BH-BMPT'!$D$38,IF(J40=38,'[4]Equivalencia BH-BMPT'!#REF!,IF(J40=39,'[4]Equivalencia BH-BMPT'!$D$40,IF(J40=40,'[4]Equivalencia BH-BMPT'!$D$41,IF(J40=41,'[4]Equivalencia BH-BMPT'!$D$42,IF(J40=42,'[4]Equivalencia BH-BMPT'!$D$43,IF(J40=43,'[4]Equivalencia BH-BMPT'!$D$44,IF(J40=44,'[4]Equivalencia BH-BMPT'!$D$45,IF(J40=45,'[4]Equivalencia BH-BMPT'!$D$46,\"No ha seleccionado un número de programa\")))))))))))))))))))))))))))))))))))))))))))))","v":"Igualdad y autonomía para una Bogotá incluyente"},"1387",8605246546,"MONICA NATALIA BASTIDAS CUENCA",6000000,null,null,null,null,{"$f":"O40+Q40+S40","v":6000000},null,"2017-12-28",null,null,120,null,"X",null,null,null,null,0,false]
[113,2017,"SECOP II",11,{"$f":"IF(D41=1,'[4]Tipo '!$B$2,IF(D41=2,'[4]Tipo '!$B$3,IF(D41=3,'[4]Tipo '!$B$4,IF(D41=4,'[4]Tipo '!$B$5,IF(D41=5,'[4]Tipo '!$B$6,IF(D41=6,'[4]Tipo '!$B$7,IF(D41=7,'[4]Tipo '!$B$8,IF(D41=8,'[4]Tipo '!$B$9,IF(D41=9,'[4]Tipo '!$B$10,IF(D41=10,'[4]Tipo '!$B$11,IF(D41=11,'[4]Tipo '!$B$12,IF(D41=12,'[4]Tipo '!$B$13,IF(D41=13,'[4]Tipo '!$B$14,IF(D41=14,'[4]Tipo '!$B$15,IF(D41=15,'[4]Tipo '!$B$16,IF(D41=16,'[4]Tipo '!$B$17,IF(D41=17,'[4]Tipo '!$B$18,IF(D41=18,'[4]Tipo '!$B$19,IF(D41=19,'[4]Tipo '!$B$20,\"No ha seleccionado un tipo de contrato válido\")))))))))))))))))))","v":"SUMINISTRO"},"Contratación mínima cuantia ","No aplica","Suministro de bienes y servicios logísticos para la Visibilización, reconocimiento e inclusión de las personas con Discapacidad de la Localidad de la Candelaria","Inversión",3,{"$f":"IF(J41=1,'[4]Equivalencia BH-BMPT'!$D$2,IF(J41=2,'[4]Equivalencia BH-BMPT'!$D$3,IF(J41=3,'[4]Equivalencia BH-BMPT'!$D$4,IF(J41=4,'[4]Equivalencia BH-BMPT'!$D$5,IF(J41=5,'[4]Equivalencia BH-BMPT'!$D$6,IF(J41=6,'[4]Equivalencia BH-BMPT'!$D$7,IF(J41=7,'[4]Equivalencia BH-BMPT'!$D$8,IF(J41=8,'[4]Equivalencia BH-BMPT'!$D$9,IF(J41=9,'[4]Equivalencia BH-BMPT'!$D$10,IF(J41=10,'[4]Equivalencia BH-BMPT'!$D$11,IF(J41=11,'[4]Equivalencia BH-BMPT'!$D$12,IF(J41=12,'[4]Equivalencia BH-BMPT'!$D$13,IF(J41=13,'[4]Equivalencia BH-BMPT'!$D$14,IF(J41=14,'[4]Equivalencia BH-BMPT'!$D$15,IF(J41=15,'[4]Equivalencia BH-BMPT'!$D$16,IF(J41=16,'[4]Equivalencia BH-BMPT'!$D$17,IF(J41=17,'[4]Equivalencia BH-BMPT'!$D$18,IF(J41=18,'[4]Equivalencia BH-BMPT'!$D$19,IF(J41=19,'[4]Equivalencia BH-BMPT'!$D$20,IF(J41=20,'[4]Equivalencia BH-BMPT'!$D$21,IF(J41=21,'[4]Equivalencia BH-BMPT'!$D$22,IF(J41=22,'[4]Equivalencia BH-BMPT'!$D$23,IF(J41=23,'[4]Equivalencia BH-BMPT'!#REF!,IF(J41=24,'[4]Equivalencia BH-BMPT'!$D$25,IF(J41=25,'[4]Equivalencia BH-BMPT'!$D$26,IF(J41=26,'[4]Equivalencia BH-BMPT'!$D$27,IF(J41=27,'[4]Equivalencia BH-BMPT'!$D$28,IF(J41=28,'[4]Equivalencia BH-BMPT'!$D$29,IF(J41=29,'[4]Equivalencia BH-BMPT'!$D$30,IF(J41=30,'[4]Equivalencia BH-BMPT'!$D$31,IF(J41=31,'[4]Equivalencia BH-BMPT'!$D$32,IF(J41=32,'[4]Equivalencia BH-BMPT'!$D$33,IF(J41=33,'[4]Equivalencia BH-BMPT'!$D$34,IF(J41=34,'[4]Equivalencia BH-BMPT'!$D$35,IF(J41=35,'[4]Equivalencia BH-BMPT'!$D$36,IF(J41=36,'[4]Equivalencia BH-BMPT'!$D$37,IF(J41=37,'[4]Equivalencia BH-BMPT'!$D$38,IF(J41=38,'[4]Equivalencia BH-BMPT'!#REF!,IF(J41=39,'[4]Equivalencia BH-BMPT'!$D$40,IF(J41=40,'[4]Equivalencia BH-BMPT'!$D$41,IF(J41=41,'[4]Equivalencia BH-BMPT'!$D$42,IF(J41=42,'[4]Equivalencia BH-BMPT'!$D$43,IF(J41=43,'[4]Equivalencia BH-BMPT'!$D$44,IF(J41=44,'[4]Equivalencia BH-BMPT'!$D$45,IF(J41=45,'[4]Equivalencia BH-BMPT'!$D$46,\"No ha seleccionado un número de programa\")))))))))))))))))))))))))))))))))))))))))))))","v":"Igualdad y autonomía para una Bogotá incluyente"},"1387",9000720408,"CORPORACION  PARA EL MEJORAMIENTO DE CALIDAD DE VIDA",15907768,null,null,null,null,{"$f":"O41+Q41+S41","v":15907768},null,"2017-12-29",null,null,60,null,"X",null,null,null,null,0,false]
[109,2016,"17-1-176042",11,{"$f":"IF(D42=1,'Tipo '!$B$2,IF(D42=2,'Tipo '!$B$3,IF(D42=3,'Tipo '!$B$4,IF(D42=4,'Tipo '!$B$5,IF(D42=5,'Tipo '!$B$6,IF(D42=6,'Tipo '!$B$7,IF(D42=7,'Tipo '!$B$8,IF(D42=8,'Tipo '!$B$9,IF(D42=9,'Tipo '!$B$10,IF(D42=10,'Tipo '!$B$11,IF(D42=11,'Tipo '!$B$12,IF(D42=12,'Tipo '!$B$13,IF(D42=13,'Tipo '!$B$14,IF(D42=14,'Tipo '!$B$15,IF(D42=15,'Tipo '!$B$16,IF(D42=16,'Tipo '!$B$17,IF(D42=17,'Tipo '!$B$18,IF(D42=18,'Tipo '!$B$19,IF(D42=19,'Tipo '!$B$20,\"No ha seleccionado un tipo de contrato válido\")))))))))))))))))))","v":"SUMINISTRO"},"Licitación pública","No aplica","CONMEMORACION DE LA FESTIVIDAD DE REYES MAGOS Y EPIFANIA EN EL BARRIO EGIPTO 2017","Inversión",11,{"$f":"IF(J42=1,'Equivalencia BH-BMPT'!$D$2,IF(J42=2,'Equivalencia BH-BMPT'!$D$3,IF(J42=3,'Equivalencia BH-BMPT'!$D$4,IF(J42=4,'Equivalencia BH-BMPT'!$D$5,IF(J42=5,'Equivalencia BH-BMPT'!$D$6,IF(J42=6,'Equivalencia BH-BMPT'!$D$7,IF(J42=7,'Equivalencia BH-BMPT'!$D$8,IF(J42=8,'Equivalencia BH-BMPT'!$D$9,IF(J42=9,'Equivalencia BH-BMPT'!$D$10,IF(J42=10,'Equivalencia BH-BMPT'!$D$11,IF(J42=11,'Equivalencia BH-BMPT'!$D$12,IF(J42=12,'Equivalencia BH-BMPT'!$D$13,IF(J42=13,'Equivalencia BH-BMPT'!$D$14,IF(J42=14,'Equivalencia BH-BMPT'!$D$15,IF(J42=15,'Equivalencia BH-BMPT'!$D$16,IF(J42=16,'Equivalencia BH-BMPT'!$D$17,IF(J42=17,'Equivalencia BH-BMPT'!$D$18,IF(J42=18,'Equivalencia BH-BMPT'!$D$19,IF(J42=19,'Equivalencia BH-BMPT'!$D$20,IF(J42=20,'Equivalencia BH-BMPT'!$D$21,IF(J42=21,'Equivalencia BH-BMPT'!$D$22,IF(J42=22,'Equivalencia BH-BMPT'!$D$23,IF(J42=23,'Equivalencia BH-BMPT'!#REF!,IF(J42=24,'Equivalencia BH-BMPT'!$D$25,IF(J42=25,'Equivalencia BH-BMPT'!$D$26,IF(J42=26,'Equivalencia BH-BMPT'!$D$27,IF(J42=27,'Equivalencia BH-BMPT'!$D$28,IF(J42=28,'Equivalencia BH-BMPT'!$D$29,IF(J42=29,'Equivalencia BH-BMPT'!$D$30,IF(J42=30,'Equivalencia BH-BMPT'!$D$31,IF(J42=31,'Equivalencia BH-BMPT'!$D$32,IF(J42=32,'Equivalencia BH-BMPT'!$D$33,IF(J42=33,'Equivalencia BH-BMPT'!$D$34,IF(J42=34,'Equivalencia BH-BMPT'!$D$35,IF(J42=35,'Equivalencia BH-BMPT'!$D$36,IF(J42=36,'Equivalencia BH-BMPT'!$D$37,IF(J42=37,'Equivalencia BH-BMPT'!$D$38,IF(J42=38,'Equivalencia BH-BMPT'!#REF!,IF(J42=39,'Equivalencia BH-BMPT'!$D$40,IF(J42=40,'Equivalencia BH-BMPT'!$D$41,IF(J42=41,'Equivalencia BH-BMPT'!$D$42,IF(J42=42,'Equivalencia BH-BMPT'!$D$43,IF(J42=43,'Equivalencia BH-BMPT'!$D$44,IF(J42=44,'Equivalencia BH-BMPT'!$D$45,IF(J42=45,'Equivalencia BH-BMPT'!$D$46,\"No ha seleccionado un número de programa\")))))))))))))))))))))))))))))))))))))))))))))","v":"Mejores oportunidades para el desarrollo a través de la cultura, la recreación y el deporte"},"1389",null,"PLATINO ENTERTAINMENTS S.A.S",null,50000,null,null,75568979,{"$f":"O42+Q42+S42-P42","v":75518979},75518979,null,null,null,null,null,null,null,null,null,"X",1,false]
[85,2017,"17-1-176042",11,{"$f":"IF(D43=1,'[2]Tipo '!$B$2,IF(D43=2,'[2]Tipo '!$B$3,IF(D43=3,'[2]Tipo '!$B$4,IF(D43=4,'[2]Tipo '!$B$5,IF(D43=5,'[2]Tipo '!$B$6,IF(D43=6,'[2]Tipo '!$B$7,IF(D43=7,'[2]Tipo '!$B$8,IF(D43=8,'[2]Tipo '!$B$9,IF(D43=9,'[2]Tipo '!$B$10,IF(D43=10,'[2]Tipo '!$B$11,IF(D43=11,'[2]Tipo '!$B$12,IF(D43=12,'[2]Tipo '!$B$13,IF(D43=13,'[2]Tipo '!$B$14,IF(D43=14,'[2]Tipo '!$B$15,IF(D43=15,'[2]Tipo '!$B$16,IF(D43=16,'[2]Tipo '!$B$17,IF(D43=17,'[2]Tipo '!$B$18,IF(D43=18,'[2]Tipo '!$B$19,IF(D43=19,'[2]Tipo '!$B$20,\"No ha seleccionado un tipo de contrato válido\")))))))))))))))))))","v":"SUMINISTRO"},"Licitación pública","No aplica","PREPRODUCCION, PRODUCCION, REALIZACIÓN Y POSTPRODUCCION TECNICA Y LOGISTICA DE LOS EVENTOS Y FESTIVALES DE LA LOCALIDAD DE LA CANDELARIA, A TRAVES DEL ALQUILER Y SUMINISTRO LOS BIENES Y SERVICIOS NECESARIOS PARA SU DESARROLLO","Inversión",11,{"$f":"IF(J43=1,'[2]Equivalencia BH-BMPT'!$D$2,IF(J43=2,'[2]Equivalencia BH-BMPT'!$D$3,IF(J43=3,'[2]Equivalencia BH-BMPT'!$D$4,IF(J43=4,'[2]Equivalencia BH-BMPT'!$D$5,IF(J43=5,'[2]Equivalencia BH-BMPT'!$D$6,IF(J43=6,'[2]Equivalencia BH-BMPT'!$D$7,IF(J43=7,'[2]Equivalencia BH-BMPT'!$D$8,IF(J43=8,'[2]Equivalencia BH-BMPT'!$D$9,IF(J43=9,'[2]Equivalencia BH-BMPT'!$D$10,IF(J43=10,'[2]Equivalencia BH-BMPT'!$D$11,IF(J43=11,'[2]Equivalencia BH-BMPT'!$D$12,IF(J43=12,'[2]Equivalencia BH-BMPT'!$D$13,IF(J43=13,'[2]Equivalencia BH-BMPT'!$D$14,IF(J43=14,'[2]Equivalencia BH-BMPT'!$D$15,IF(J43=15,'[2]Equivalencia BH-BMPT'!$D$16,IF(J43=16,'[2]Equivalencia BH-BMPT'!$D$17,IF(J43=17,'[2]Equivalencia BH-BMPT'!$D$18,IF(J43=18,'[2]Equivalencia BH-BMPT'!$D$19,IF(J43=19,'[2]Equivalencia BH-BMPT'!$D$20,IF(J43=20,'[2]Equivalencia BH-BMPT'!$D$21,IF(J43=21,'[2]Equivalencia BH-BMPT'!$D$22,IF(J43=22,'[2]Equivalencia BH-BMPT'!$D$23,IF(J43=23,'[2]Equivalencia BH-BMPT'!#REF!,IF(J43=24,'[2]Equivalencia BH-BMPT'!$D$25,IF(J43=25,'[2]Equivalencia BH-BMPT'!$D$26,IF(J43=26,'[2]Equivalencia BH-BMPT'!$D$27,IF(J43=27,'[2]Equivalencia BH-BMPT'!$D$28,IF(J43=28,'[2]Equivalencia BH-BMPT'!$D$29,IF(J43=29,'[2]Equivalencia BH-BMPT'!$D$30,IF(J43=30,'[2]Equivalencia BH-BMPT'!$D$31,IF(J43=31,'[2]Equivalencia BH-BMPT'!$D$32,IF(J43=32,'[2]Equivalencia BH-BMPT'!$D$33,IF(J43=33,'[2]Equivalencia BH-BMPT'!$D$34,IF(J43=34,'[2]Equivalencia BH-BMPT'!$D$35,IF(J43=35,'[2]Equivalencia BH-BMPT'!$D$36,IF(J43=36,'[2]Equivalencia BH-BMPT'!$D$37,IF(J43=37,'[2]Equivalencia BH-BMPT'!$D$38,IF(J43=38,'[2]Equivalencia BH-BMPT'!#REF!,IF(J43=39,'[2]Equivalencia BH-BMPT'!$D$40,IF(J43=40,'[2]Equivalencia BH-BMPT'!$D$41,IF(J43=41,'[2]Equivalencia BH-BMPT'!$D$42,IF(J43=42,'[2]Equivalencia BH-BMPT'!$D$43,IF(J43=43,'[2]Equivalencia BH-BMPT'!$D$44,IF(J43=44,'[2]Equivalencia BH-BMPT'!$D$45,IF(J43=45,'[2]Equivalencia BH-BMPT'!$D$46,\"No ha seleccionado un número de programa\")))))))))))))))))))))))))))))))))))))))))))))","v":"Mejores oportunidades para el desarrollo a través de la cultura, la recreación y el deporte"},"1389",8300027821,"ILUMINACIONES JAIME DUSSA SAS",693590328,null,null,null,45613537,{"$f":"O43+Q43+S43","v":739203865},26791610,"2017-08-22","2017-08-25","2017-02-24",180,null,null,null,"X",null,null,3.6243871641553176E-2,false]
[70,2017,"17-13-6729563",11,{"$f":"IF(D44=1,'[1]Tipo '!$B$2,IF(D44=2,'[1]Tipo '!$B$3,IF(D44=3,'[1]Tipo '!$B$4,IF(D44=4,'[1]Tipo '!$B$5,IF(D44=5,'[1]Tipo '!$B$6,IF(D44=6,'[1]Tipo '!$B$7,IF(D44=7,'[1]Tipo '!$B$8,IF(D44=8,'[1]Tipo '!$B$9,IF(D44=9,'[1]Tipo '!$B$10,IF(D44=10,'[1]Tipo '!$B$11,IF(D44=11,'[1]Tipo '!$B$12,IF(D44=12,'[1]Tipo '!$B$13,IF(D44=13,'[1]Tipo '!$B$14,IF(D44=14,'[1]Tipo '!$B$15,IF(D44=15,'[1]Tipo '!$B$16,IF(D44=16,'[1]Tipo '!$B$17,IF(D44=17,'[1]Tipo '!$B$18,IF(D44=18,'[1]Tipo '!$B$19,IF(D44=19,'[1]Tipo '!$B$20,\"No ha seleccionado un tipo de contrato válido\")))))))))))))))))))","v":"SUMINISTRO"},"Contratación mínima cuantia ","No aplica","SUMINISTRAR LOS BIENES Y SERVICIOS REQUERIDOS PARA LA CORRECTA REALIZACIÓN DE LAS VACACIONES RECREATIVAS DE LOS NIÑOS Y NIÑAS DE LA CANDELARIA 2017","Inversión",11,{"$f":"IF(J44=1,'[1]Equivalencia BH-BMPT'!$D$2,IF(J44=2,'[1]Equivalencia BH-BMPT'!$D$3,IF(J44=3,'[1]Equivalencia BH-BMPT'!$D$4,IF(J44=4,'[1]Equivalencia BH-BMPT'!$D$5,IF(J44=5,'[1]Equivalencia BH-BMPT'!$D$6,IF(J44=6,'[1]Equivalencia BH-BMPT'!$D$7,IF(J44=7,'[1]Equivalencia BH-BMPT'!$D$8,IF(J44=8,'[1]Equivalencia BH-BMPT'!$D$9,IF(J44=9,'[1]Equivalencia BH-BMPT'!$D$10,IF(J44=10,'[1]Equivalencia BH-BMPT'!$D$11,IF(J44=11,'[1]Equivalencia BH-BMPT'!$D$12,IF(J44=12,'[1]Equivalencia BH-BMPT'!$D$13,IF(J44=13,'[1]Equivalencia BH-BMPT'!$D$14,IF(J44=14,'[1]Equivalencia BH-BMPT'!$D$15,IF(J44=15,'[1]Equivalencia BH-BMPT'!$D$16,IF(J44=16,'[1]Equivalencia BH-BMPT'!$D$17,IF(J44=17,'[1]Equivalencia BH-BMPT'!$D$18,IF(J44=18,'[1]Equivalencia BH-BMPT'!$D$19,IF(J44=19,'[1]Equivalencia BH-BMPT'!$D$20,IF(J44=20,'[1]Equivalencia BH-BMPT'!$D$21,IF(J44=21,'[1]Equivalencia BH-BMPT'!$D$22,IF(J44=22,'[1]Equivalencia BH-BMPT'!$D$23,IF(J44=23,'[1]Equivalencia BH-BMPT'!#REF!,IF(J44=24,'[1]Equivalencia BH-BMPT'!$D$25,IF(J44=25,'[1]Equivalencia BH-BMPT'!$D$26,IF(J44=26,'[1]Equivalencia BH-BMPT'!$D$27,IF(J44=27,'[1]Equivalencia BH-BMPT'!$D$28,IF(J44=28,'[1]Equivalencia BH-BMPT'!$D$29,IF(J44=29,'[1]Equivalencia BH-BMPT'!$D$30,IF(J44=30,'[1]Equivalencia BH-BMPT'!$D$31,IF(J44=31,'[1]Equivalencia BH-BMPT'!$D$32,IF(J44=32,'[1]Equivalencia BH-BMPT'!$D$33,IF(J44=33,'[1]Equivalencia BH-BMPT'!$D$34,IF(J44=34,'[1]Equivalencia BH-BMPT'!$D$35,IF(J44=35,'[1]Equivalencia BH-BMPT'!$D$36,IF(J44=36,'[1]Equivalencia BH-BMPT'!$D$37,IF(J44=37,'[1]Equivalencia BH-BMPT'!$D$38,IF(J44=38,'[1]Equivalencia BH-BMPT'!#REF!,IF(J44=39,'[1]Equivalencia BH-BMPT'!$D$40,IF(J44=40,'[1]Equivalencia BH-BMPT'!$D$41,IF(J44=41,'[1]Equivalencia BH-BMPT'!$D$42,IF(J44=42,'[1]Equivalencia BH-BMPT'!$D$43,IF(J44=43,'[1]Equivalencia BH-BMPT'!$D$44,IF(J44=44,'[1]Equivalencia BH-BMPT'!$D$45,IF(J44=45,'[1]Equivalencia BH-BMPT'!$D$46,\"No ha seleccionado un número de programa\")))))))))))))))))))))))))))))))))))))))))))))","v":"Mejores oportunidades para el desarrollo a través de la cultura, la recreación y el deporte"},"1389",9001099481,"FUNDACIÓN DEPORTIVA ARNOLDO IGUARAN FUNDAI",11880000,824000,null,null,null,{"$f":"O44+Q44+S44-P44","v":11056000},11056000,"2017-06-30","2017-07-07","2017-09-06",60,null,null,null,"X",null,null,1,false]
[2,2017,"16-13-5982046",7,{"$f":"IF(D45=1,'[1]Tipo '!$B$2,IF(D45=2,'[1]Tipo '!$B$3,IF(D45=3,'[1]Tipo '!$B$4,IF(D45=4,'[1]Tipo '!$B$5,IF(D45=5,'[1]Tipo '!$B$6,IF(D45=6,'[1]Tipo '!$B$7,IF(D45=7,'[1]Tipo '!$B$8,IF(D45=8,'[1]Tipo '!$B$9,IF(D45=9,'[1]Tipo '!$B$10,IF(D45=10,'[1]Tipo '!$B$11,IF(D45=11,'[1]Tipo '!$B$12,IF(D45=12,'[1]Tipo '!$B$13,IF(D45=13,'[1]Tipo '!$B$14,IF(D45=14,'[1]Tipo '!$B$15,IF(D45=15,'[1]Tipo '!$B$16,IF(D45=16,'[1]Tipo '!$B$17,IF(D45=17,'[1]Tipo '!$B$18,IF(D45=18,'[1]Tipo '!$B$19,IF(D45=19,'[1]Tipo '!$B$20,\"No ha seleccionado un tipo de contrato válido\")))))))))))))))))))","v":"COMPRAVENTA DE BIENES INMUEBLES"},"Contratación mínima cuantia ","No aplica","REALIZAR LA DOTACIÓN AL CENTRO ORQUESTAL LOCAL DE LA CANDELARIA DE ACCESORIOS E INSTRUMENTOS MUSICALES, CON EL FIN DE FORTALECER LOS PROCESOS DE FORMACIÓN MUSICAL DE NIÑOS, NIÑAS, ADOLESCENTES Y JÓVENES BENEFICIARIOS","Inversión",11,{"$f":"IF(J45=1,'[1]Equivalencia BH-BMPT'!$D$2,IF(J45=2,'[1]Equivalencia BH-BMPT'!$D$3,IF(J45=3,'[1]Equivalencia BH-BMPT'!$D$4,IF(J45=4,'[1]Equivalencia BH-BMPT'!$D$5,IF(J45=5,'[1]Equivalencia BH-BMPT'!$D$6,IF(J45=6,'[1]Equivalencia BH-BMPT'!$D$7,IF(J45=7,'[1]Equivalencia BH-BMPT'!$D$8,IF(J45=8,'[1]Equivalencia BH-BMPT'!$D$9,IF(J45=9,'[1]Equivalencia BH-BMPT'!$D$10,IF(J45=10,'[1]Equivalencia BH-BMPT'!$D$11,IF(J45=11,'[1]Equivalencia BH-BMPT'!$D$12,IF(J45=12,'[1]Equivalencia BH-BMPT'!$D$13,IF(J45=13,'[1]Equivalencia BH-BMPT'!$D$14,IF(J45=14,'[1]Equivalencia BH-BMPT'!$D$15,IF(J45=15,'[1]Equivalencia BH-BMPT'!$D$16,IF(J45=16,'[1]Equivalencia BH-BMPT'!$D$17,IF(J45=17,'[1]Equivalencia BH-BMPT'!$D$18,IF(J45=18,'[1]Equivalencia BH-BMPT'!$D$19,IF(J45=19,'[1]Equivalencia BH-BMPT'!$D$20,IF(J45=20,'[1]Equivalencia BH-BMPT'!$D$21,IF(J45=21,'[1]Equivalencia BH-BMPT'!$D$22,IF(J45=22,'[1]Equivalencia BH-BMPT'!$D$23,IF(J45=23,'[1]Equivalencia BH-BMPT'!#REF!,IF(J45=24,'[1]Equivalencia BH-BMPT'!$D$25,IF(J45=25,'[1]Equivalencia BH-BMPT'!$D$26,IF(J45=26,'[1]Equivalencia BH-BMPT'!$D$27,IF(J45=27,'[1]Equivalencia BH-BMPT'!$D$28,IF(J45=28,'[1]Equivalencia BH-BMPT'!$D$29,IF(J45=29,'[1]Equivalencia BH-BMPT'!$D$30,IF(J45=30,'[1]Equivalencia BH-BMPT'!$D$31,IF(J45=31,'[1]Equivalencia BH-BMPT'!$D$32,IF(J45=32,'[1]Equivalencia BH-BMPT'!$D$33,IF(J45=33,'[1]Equivalencia BH-BMPT'!$D$34,IF(J45=34,'[1]Equivalencia BH-BMPT'!$D$35,IF(J45=35,'[1]Equivalencia BH-BMPT'!$D$36,IF(J45=36,'[1]Equivalencia BH-BMPT'!$D$37,IF(J45=37,'[1]Equivalencia BH-BMPT'!$D$38,IF(J45=38,'[1]Equivalencia BH-BMPT'!#REF!,IF(J45=39,'[1]Equivalencia BH-BMPT'!$D$40,IF(J45=40,'[1]Equivalencia BH-BMPT'!$D$41,IF(J45=41,'[1]Equivalencia BH-BMPT'!$D$42,IF(J45=42,'[1]Equivalencia BH-BMPT'!$D$43,IF(J45=43,'[1]Equivalencia BH-BMPT'!$D$44,IF(J45=44,'[1]Equivalencia BH-BMPT'!$D$45,IF(J45=45,'[1]Equivalencia BH-BMPT'!$D$46,\"No ha seleccionado un número de programa\")))))))))))))))))))))))))))))))))))))))))))))","v":"Mejores oportunidades para el desarrollo a través de la cultura, la recreación y el deporte"},"1389",90007911084,"AS INGENIEROS SAS",15800584,97593,null,null,null,15702901,15702901,"2017-01-16","2017-03-14","2017-04-13",30,null,null,null,null,"X",null,1,false]
[107,2017,"SECOP II",1,{"$f":"IF(D46=1,'[4]Tipo '!$B$2,IF(D46=2,'[4]Tipo '!$B$3,IF(D46=3,'[4]Tipo '!$B$4,IF(D46=4,'[4]Tipo '!$B$5,IF(D46=5,'[4]Tipo '!$B$6,IF(D46=6,'[4]Tipo '!$B$7,IF(D46=7,'[4]Tipo '!$B$8,IF(D46=8,'[4]Tipo '!$B$9,IF(D46=9,'[4]Tipo '!$B$10,IF(D46=10,'[4]Tipo '!$B$11,IF(D46=11,'[4]Tipo '!$B$12,IF(D46=12,'[4]Tipo '!$B$13,IF(D46=13,'[4]Tipo '!$B$14,IF(D46=14,'[4]Tipo '!$B$15,IF(D46=15,'[4]Tipo '!$B$16,IF(D46=16,'[4]Tipo '!$B$17,IF(D46=17,'[4]Tipo '!$B$18,IF(D46=18,'[4]Tipo '!$B$19,IF(D46=19,'[4]Tipo '!$B$20,\"No ha seleccionado un tipo de contrato válido\")))))))))))))))))))","v":"OBRA PÚBLICA"},"Licitación pública","No aplica","REALIZAR A PRECIO UNITARIOS FIJOS CON FORMULA DE REAJUSTE, EL MANTENIMIENTO Y/O REHABILITACION DE PARQUES ZONALES, VECINALES, Y DE BOSILLO DE LA LOCALIDAD DE LA CANDELARIA EN BOGOTA D.C, DE CONFORMIDAD CON LA DESCRIPCIÓN, ESPECIFICACIONES TECNICAS Y DÉMAS CONDICIONES ESTABLECIDAS EN LOS ESTUDIOS PREVIOS, PLIEGO DE CONDICIONES Y ANEXOS","Inversión",17,{"$f":"IF(J46=1,'[4]Equivalencia BH-BMPT'!$D$2,IF(J46=2,'[4]Equivalencia BH-BMPT'!$D$3,IF(J46=3,'[4]Equivalencia BH-BMPT'!$D$4,IF(J46=4,'[4]Equivalencia BH-BMPT'!$D$5,IF(J46=5,'[4]Equivalencia BH-BMPT'!$D$6,IF(J46=6,'[4]Equivalencia BH-BMPT'!$D$7,IF(J46=7,'[4]Equivalencia BH-BMPT'!$D$8,IF(J46=8,'[4]Equivalencia BH-BMPT'!$D$9,IF(J46=9,'[4]Equivalencia BH-BMPT'!$D$10,IF(J46=10,'[4]Equivalencia BH-BMPT'!$D$11,IF(J46=11,'[4]Equivalencia BH-BMPT'!$D$12,IF(J46=12,'[4]Equivalencia BH-BMPT'!$D$13,IF(J46=13,'[4]Equivalencia BH-BMPT'!$D$14,IF(J46=14,'[4]Equivalencia BH-BMPT'!$D$15,IF(J46=15,'[4]Equivalencia BH-BMPT'!$D$16,IF(J46=16,'[4]Equivalencia BH-BMPT'!$D$17,IF(J46=17,'[4]Equivalencia BH-BMPT'!$D$18,IF(J46=18,'[4]Equivalencia BH-BMPT'!$D$19,IF(J46=19,'[4]Equivalencia BH-BMPT'!$D$20,IF(J46=20,'[4]Equivalencia BH-BMPT'!$D$21,IF(J46=21,'[4]Equivalencia BH-BMPT'!$D$22,IF(J46=22,'[4]Equivalencia BH-BMPT'!$D$23,IF(J46=23,'[4]Equivalencia BH-BMPT'!#REF!,IF(J46=24,'[4]Equivalencia BH-BMPT'!$D$25,IF(J46=25,'[4]Equivalencia BH-BMPT'!$D$26,IF(J46=26,'[4]Equivalencia BH-BMPT'!$D$27,IF(J46=27,'[4]Equivalencia BH-BMPT'!$D$28,IF(J46=28,'[4]Equivalencia BH-BMPT'!$D$29,IF(J46=29,'[4]Equivalencia BH-BMPT'!$D$30,IF(J46=30,'[4]Equivalencia BH-BMPT'!$D$31,IF(J46=31,'[4]Equivalencia BH-BMPT'!$D$32,IF(J46=32,'[4]Equivalencia BH-BMPT'!$D$33,IF(J46=33,'[4]Equivalencia BH-BMPT'!$D$34,IF(J46=34,'[4]Equivalencia BH-BMPT'!$D$35,IF(J46=35,'[4]Equivalencia BH-BMPT'!$D$36,IF(J46=36,'[4]Equivalencia BH-BMPT'!$D$37,IF(J46=37,'[4]Equivalencia BH-BMPT'!$D$38,IF(J46=38,'[4]Equivalencia BH-BMPT'!#REF!,IF(J46=39,'[4]Equivalencia BH-BMPT'!$D$40,IF(J46=40,'[4]Equivalencia BH-BMPT'!$D$41,IF(J46=41,'[4]Equivalencia BH-BMPT'!$D$42,IF(J46=42,'[4]Equivalencia BH-BMPT'!$D$43,IF(J46=43,'[4]Equivalencia BH-BMPT'!$D$44,IF(J46=44,'[4]Equivalencia BH-BMPT'!$D$45,IF(J46=45,'[4]Equivalencia BH-BMPT'!$D$46,\"No ha seleccionado un número de programa\")))))))))))))))))))))))))))))))))))))))))))))","v":"Espacio público, derecho de todos"},"1390",8300321021,"ECOFLORA SAS",222023847,null,null,null,null,{"$f":"O46+Q46+S46","v":222023847},null,"2017-12-22",null,null,150,null,"X",null,null,null,null,{"$f":"SUM(U46/T46)","v":0},{"$f":"IF(I46=\"Funcionamiento\",J46=0,J46=\"\")","v":false}]
[39,2017,"17-12-6332773",5,{"$f":"IF(D47=1,'[1]Tipo '!$B$2,IF(D47=2,'[1]Tipo '!$B$3,IF(D47=3,'[1]Tipo '!$B$4,IF(D47=4,'[1]Tipo '!$B$5,IF(D47=5,'[1]Tipo '!$B$6,IF(D47=6,'[1]Tipo '!$B$7,IF(D47=7,'[1]Tipo '!$B$8,IF(D47=8,'[1]Tipo '!$B$9,IF(D47=9,'[1]Tipo '!$B$10,IF(D47=10,'[1]Tipo '!$B$11,IF(D47=11,'[1]Tipo '!$B$12,IF(D47=12,'[1]Tipo '!$B$13,IF(D47=13,'[1]Tipo '!$B$14,IF(D47=14,'[1]Tipo '!$B$15,IF(D47=15,'[1]Tipo '!$B$16,IF(D47=16,'[1]Tipo '!$B$17,IF(D47=17,'[1]Tipo '!$B$18,IF(D47=18,'[1]Tipo '!$B$19,IF(D47=19,'[1]Tipo '!$B$20,\"No ha seleccionado un tipo de contrato válido\")))))))))))))))))))","v":"CONTRATOS DE PRESTACIÓN DE SERVICIOS PROFESIONALES Y DE APOYO A LA GESTIÓN"},"Contratación directa","Prestación de servicios profesionales y de apoyo a la gestión, o para la ejecución de trabajos artísticos que sólo puedan encomendarse a determinadas personas naturales;","PRESTAR SUS SERVICIOS PROFESIONALES PARA APOYAR AL GRUPO DE GESTIÓN DE DESARROLLO LOCAL DEL FONDO DE DESARROLLO LOCAL DE LA CANDELARIA, EN LOS PROCESOS DE FORMULACIÓN Y SEGUIMIENTO DE INFRAESTRUCTURA Y PATRIMONIO DEL PLAN DE DESARROLLO LOCAL CON ENFASIS EN MALLA VIAL, ESPACIO PÚBLICO Y PARQUES - PROYECTO 1390 “PARQUES MESJORES PARA TODOS” Y PROYECTO 1391 “MOVILIDAD Y ESPACIO PÚBLICO MEJOR PARA TODOS","Inversión",18,{"$f":"IF(J47=1,'[1]Equivalencia BH-BMPT'!$D$2,IF(J47=2,'[1]Equivalencia BH-BMPT'!$D$3,IF(J47=3,'[1]Equivalencia BH-BMPT'!$D$4,IF(J47=4,'[1]Equivalencia BH-BMPT'!$D$5,IF(J47=5,'[1]Equivalencia BH-BMPT'!$D$6,IF(J47=6,'[1]Equivalencia BH-BMPT'!$D$7,IF(J47=7,'[1]Equivalencia BH-BMPT'!$D$8,IF(J47=8,'[1]Equivalencia BH-BMPT'!$D$9,IF(J47=9,'[1]Equivalencia BH-BMPT'!$D$10,IF(J47=10,'[1]Equivalencia BH-BMPT'!$D$11,IF(J47=11,'[1]Equivalencia BH-BMPT'!$D$12,IF(J47=12,'[1]Equivalencia BH-BMPT'!$D$13,IF(J47=13,'[1]Equivalencia BH-BMPT'!$D$14,IF(J47=14,'[1]Equivalencia BH-BMPT'!$D$15,IF(J47=15,'[1]Equivalencia BH-BMPT'!$D$16,IF(J47=16,'[1]Equivalencia BH-BMPT'!$D$17,IF(J47=17,'[1]Equivalencia BH-BMPT'!$D$18,IF(J47=18,'[1]Equivalencia BH-BMPT'!$D$19,IF(J47=19,'[1]Equivalencia BH-BMPT'!$D$20,IF(J47=20,'[1]Equivalencia BH-BMPT'!$D$21,IF(J47=21,'[1]Equivalencia BH-BMPT'!$D$22,IF(J47=22,'[1]Equivalencia BH-BMPT'!$D$23,IF(J47=23,'[1]Equivalencia BH-BMPT'!#REF!,IF(J47=24,'[1]Equivalencia BH-BMPT'!$D$25,IF(J47=25,'[1]Equivalencia BH-BMPT'!$D$26,IF(J47=26,'[1]Equivalencia BH-BMPT'!$D$27,IF(J47=27,'[1]Equivalencia BH-BMPT'!$D$28,IF(J47=28,'[1]Equivalencia BH-BMPT'!$D$29,IF(J47=29,'[1]Equivalencia BH-BMPT'!$D$30,IF(J47=30,'[1]Equivalencia BH-BMPT'!$D$31,IF(J47=31,'[1]Equivalencia BH-BMPT'!$D$32,IF(J47=32,'[1]Equivalencia BH-BMPT'!$D$33,IF(J47=33,'[1]Equivalencia BH-BMPT'!$D$34,IF(J47=34,'[1]Equivalencia BH-BMPT'!$D$35,IF(J47=35,'[1]Equivalencia BH-BMPT'!$D$36,IF(J47=36,'[1]Equivalencia BH-BMPT'!$D$37,IF(J47=37,'[1]Equivalencia BH-BMPT'!$D$38,IF(J47=38,'[1]Equivalencia BH-BMPT'!#REF!,IF(J47=39,'[1]Equivalencia BH-BMPT'!$D$40,IF(J47=40,'[1]Equivalencia BH-BMPT'!$D$41,IF(J47=41,'[1]Equivalencia BH-BMPT'!$D$42,IF(J47=42,'[1]Equivalencia BH-BMPT'!$D$43,IF(J47=43,'[1]Equivalencia BH-BMPT'!$D$44,IF(J47=44,'[1]Equivalencia BH-BMPT'!$D$45,IF(J47=45,'[1]Equivalencia BH-BMPT'!$D$46,\"No ha seleccionado un número de programa\")))))))))))))))))))))))))))))))))))))))))))))","v":"Mejor movilidad para todos"},"1391",80056009,"JOHE LOYS MOSQUERA PALACIO",49500811,null,null,null,3750062,53250873,46350740,"2017-02-06","2017-02-07","2018-01-24",350,null,null,null,"X",null,null,0.87042216190521426,false]
[42,2017,"17-12-6333240",5,{"$f":"IF(D48=1,'[1]Tipo '!$B$2,IF(D48=2,'[1]Tipo '!$B$3,IF(D48=3,'[1]Tipo '!$B$4,IF(D48=4,'[1]Tipo '!$B$5,IF(D48=5,'[1]Tipo '!$B$6,IF(D48=6,'[1]Tipo '!$B$7,IF(D48=7,'[1]Tipo '!$B$8,IF(D48=8,'[1]Tipo '!$B$9,IF(D48=9,'[1]Tipo '!$B$10,IF(D48=10,'[1]Tipo '!$B$11,IF(D48=11,'[1]Tipo '!$B$12,IF(D48=12,'[1]Tipo '!$B$13,IF(D48=13,'[1]Tipo '!$B$14,IF(D48=14,'[1]Tipo '!$B$15,IF(D48=15,'[1]Tipo '!$B$16,IF(D48=16,'[1]Tipo '!$B$17,IF(D48=17,'[1]Tipo '!$B$18,IF(D48=18,'[1]Tipo '!$B$19,IF(D48=19,'[1]Tipo '!$B$20,\"No ha seleccionado un tipo de contrato válido\")))))))))))))))))))","v":"CONTRATOS DE PRESTACIÓN DE SERVICIOS PROFESIONALES Y DE APOYO A LA GESTIÓN"},"Contratación directa","Prestación de servicios profesionales y de apoyo a la gestión, o para la ejecución de trabajos artísticos que sólo puedan encomendarse a determinadas personas naturales;","PRESTAR SUS SERVICIOS PROFESIONALES PARA APOYAR AL GRUPO DE GESTIÓN DE DESARROLLO LOCAL DEL FONDO DE DESARROLLO LOCAL DE LA CANDELARIA, EN LOS PROCESOS DE FORMULACIÓN Y SEGUIMIENTO DE INFRAESTRUCTURA Y PATRIMONIO DEL PLAN DE DESARROLLO LOCAL CON ENFASIS EN MALLA VIAL, ESPACIO PÚBLICO Y PARQUES - PROYECTO 1390 ¿PARQUES MESJORES PARA TODOS¿ Y PROYECTO 1391 ¿MOVILIDAD Y ESPACIO PÚBLICO MEJOR PARA TODOS","Inversión",18,{"$f":"IF(J48=1,'[1]Equivalencia BH-BMPT'!$D$2,IF(J48=2,'[1]Equivalencia BH-BMPT'!$D$3,IF(J48=3,'[1]Equivalencia BH-BMPT'!$D$4,IF(J48=4,'[1]Equivalencia BH-BMPT'!$D$5,IF(J48=5,'[1]Equivalencia BH-BMPT'!$D$6,IF(J48=6,'[1]Equivalencia BH-BMPT'!$D$7,IF(J48=7,'[1]Equivalencia BH-BMPT'!$D$8,IF(J48=8,'[1]Equivalencia BH-BMPT'!$D$9,IF(J48=9,'[1]Equivalencia BH-BMPT'!$D$10,IF(J48=10,'[1]Equivalencia BH-BMPT'!$D$11,IF(J48=11,'[1]Equivalencia BH-BMPT'!$D$12,IF(J48=12,'[1]Equivalencia BH-BMPT'!$D$13,IF(J48=13,'[1]Equivalencia BH-BMPT'!$D$14,IF(J48=14,'[1]Equivalencia BH-BMPT'!$D$15,IF(J48=15,'[1]Equivalencia BH-BMPT'!$D$16,IF(J48=16,'[1]Equivalencia BH-BMPT'!$D$17,IF(J48=17,'[1]Equivalencia BH-BMPT'!$D$18,IF(J48=18,'[1]Equivalencia BH-BMPT'!$D$19,IF(J48=19,'[1]Equivalencia BH-BMPT'!$D$20,IF(J48=20,'[1]Equivalencia BH-BMPT'!$D$21,IF(J48=21,'[1]Equivalencia BH-BMPT'!$D$22,IF(J48=22,'[1]Equivalencia BH-BMPT'!$D$23,IF(J48=23,'[1]Equivalencia BH-BMPT'!#REF!,IF(J48=24,'[1]Equivalencia BH-BMPT'!$D$25,IF(J48=25,'[1]Equivalencia BH-BMPT'!$D$26,IF(J48=26,'[1]Equivalencia BH-BMPT'!$D$27,IF(J48=27,'[1]Equivalencia BH-BMPT'!$D$28,IF(J48=28,'[1]Equivalencia BH-BMPT'!$D$29,IF(J48=29,'[1]Equivalencia BH-BMPT'!$D$30,IF(J48=30,'[1]Equivalencia BH-BMPT'!$D$31,IF(J48=31,'[1]Equivalencia BH-BMPT'!$D$32,IF(J48=32,'[1]Equivalencia BH-BMPT'!$D$33,IF(J48=33,'[1]Equivalencia BH-BMPT'!$D$34,IF(J48=34,'[1]Equivalencia BH-BMPT'!$D$35,IF(J48=35,'[1]Equivalencia BH-BMPT'!$D$36,IF(J48=36,'[1]Equivalencia BH-BMPT'!$D$37,IF(J48=37,'[1]Equivalencia BH-BMPT'!$D$38,IF(J48=38,'[1]Equivalencia BH-BMPT'!#REF!,IF(J48=39,'[1]Equivalencia BH-BMPT'!$D$40,IF(J48=40,'[1]Equivalencia BH-BMPT'!$D$41,IF(J48=41,'[1]Equivalencia BH-BMPT'!$D$42,IF(J48=42,'[1]Equivalencia BH-BMPT'!$D$43,IF(J48=43,'[1]Equivalencia BH-BMPT'!$D$44,IF(J48=44,'[1]Equivalencia BH-BMPT'!$D$45,IF(J48=45,'[1]Equivalencia BH-BMPT'!$D$46,\"No ha seleccionado un número de programa\")))))))))))))))))))))))))))))))))))))))))))))","v":"Mejor movilidad para todos"},"1391",1049611949,"CAMILO ANDRES RIAÑO RODRIGUEZ",47250774,null,null,null,4500074,51750848,42450698,"2017-02-08","2017-02-08","2018-01-21",354,null,null,null,"X",null,null,0.82028990133649593,false]
[106,2017,"17-11-7308765",11,{"$f":"IF(D49=1,'[4]Tipo '!$B$2,IF(D49=2,'[4]Tipo '!$B$3,IF(D49=3,'[4]Tipo '!$B$4,IF(D49=4,'[4]Tipo '!$B$5,IF(D49=5,'[4]Tipo '!$B$6,IF(D49=6,'[4]Tipo '!$B$7,IF(D49=7,'[4]Tipo '!$B$8,IF(D49=8,'[4]Tipo '!$B$9,IF(D49=9,'[4]Tipo '!$B$10,IF(D49=10,'[4]Tipo '!$B$11,IF(D49=11,'[4]Tipo '!$B$12,IF(D49=12,'[4]Tipo '!$B$13,IF(D49=13,'[4]Tipo '!$B$14,IF(D49=14,'[4]Tipo '!$B$15,IF(D49=15,'[4]Tipo '!$B$16,IF(D49=16,'[4]Tipo '!$B$17,IF(D49=17,'[4]Tipo '!$B$18,IF(D49=18,'[4]Tipo '!$B$19,IF(D49=19,'[4]Tipo '!$B$20,\"No ha seleccionado un tipo de contrato válido\")))))))))))))))))))","v":"SUMINISTRO"},"Selección abreviada ","Selección abreviada por menor cuantía ","REALIZAR A MONTO AGOTABLE EL SUMINISTRO Y TRABAJO PARA EMBELLECIMIENTO Y ENLUCINAMIENTO DE FACHADAS DE LOS INMUEBLES PRIORIZADOS POR EL FDLC SITUADOS EN LOCALIDAD DE LA CANDELARIA CENTRO TRADICIONAL DE BOGOTÁ","Inversión",18,{"$f":"IF(J49=1,'[4]Equivalencia BH-BMPT'!$D$2,IF(J49=2,'[4]Equivalencia BH-BMPT'!$D$3,IF(J49=3,'[4]Equivalencia BH-BMPT'!$D$4,IF(J49=4,'[4]Equivalencia BH-BMPT'!$D$5,IF(J49=5,'[4]Equivalencia BH-BMPT'!$D$6,IF(J49=6,'[4]Equivalencia BH-BMPT'!$D$7,IF(J49=7,'[4]Equivalencia BH-BMPT'!$D$8,IF(J49=8,'[4]Equivalencia BH-BMPT'!$D$9,IF(J49=9,'[4]Equivalencia BH-BMPT'!$D$10,IF(J49=10,'[4]Equivalencia BH-BMPT'!$D$11,IF(J49=11,'[4]Equivalencia BH-BMPT'!$D$12,IF(J49=12,'[4]Equivalencia BH-BMPT'!$D$13,IF(J49=13,'[4]Equivalencia BH-BMPT'!$D$14,IF(J49=14,'[4]Equivalencia BH-BMPT'!$D$15,IF(J49=15,'[4]Equivalencia BH-BMPT'!$D$16,IF(J49=16,'[4]Equivalencia BH-BMPT'!$D$17,IF(J49=17,'[4]Equivalencia BH-BMPT'!$D$18,IF(J49=18,'[4]Equivalencia BH-BMPT'!$D$19,IF(J49=19,'[4]Equivalencia BH-BMPT'!$D$20,IF(J49=20,'[4]Equivalencia BH-BMPT'!$D$21,IF(J49=21,'[4]Equivalencia BH-BMPT'!$D$22,IF(J49=22,'[4]Equivalencia BH-BMPT'!$D$23,IF(J49=23,'[4]Equivalencia BH-BMPT'!#REF!,IF(J49=24,'[4]Equivalencia BH-BMPT'!$D$25,IF(J49=25,'[4]Equivalencia BH-BMPT'!$D$26,IF(J49=26,'[4]Equivalencia BH-BMPT'!$D$27,IF(J49=27,'[4]Equivalencia BH-BMPT'!$D$28,IF(J49=28,'[4]Equivalencia BH-BMPT'!$D$29,IF(J49=29,'[4]Equivalencia BH-BMPT'!$D$30,IF(J49=30,'[4]Equivalencia BH-BMPT'!$D$31,IF(J49=31,'[4]Equivalencia BH-BMPT'!$D$32,IF(J49=32,'[4]Equivalencia BH-BMPT'!$D$33,IF(J49=33,'[4]Equivalencia BH-BMPT'!$D$34,IF(J49=34,'[4]Equivalencia BH-BMPT'!$D$35,IF(J49=35,'[4]Equivalencia BH-BMPT'!$D$36,IF(J49=36,'[4]Equivalencia BH-BMPT'!$D$37,IF(J49=37,'[4]Equivalencia BH-BMPT'!$D$38,IF(J49=38,'[4]Equivalencia BH-BMPT'!#REF!,IF(J49=39,'[4]Equivalencia BH-BMPT'!$D$40,IF(J49=40,'[4]Equivalencia BH-BMPT'!$D$41,IF(J49=41,'[4]Equivalencia BH-BMPT'!$D$42,IF(J49=42,'[4]Equivalencia BH-BMPT'!$D$43,IF(J49=43,'[4]Equivalencia BH-BMPT'!$D$44,IF(J49=44,'[4]Equivalencia BH-BMPT'!$D$45,IF(J49=45,'[4]Equivalencia BH-BMPT'!$D$46,\"No ha seleccionado un número de programa\")))))))))))))))))))))))))))))))))))))))))))))","v":"Mejor movilidad para todos"},"1391",800121733,"CBC INGENIERIA CIVIL Y MANTENIMIENTO SAS",189853500,null,null,null,null,189853500,null,"2017-12-21",null,null,120,null,"X",null,null,null,null,0,false]
[108,2017,"SECOP II",1,{"$f":"IF(D50=1,'[4]Tipo '!$B$2,IF(D50=2,'[4]Tipo '!$B$3,IF(D50=3,'[4]Tipo '!$B$4,IF(D50=4,'[4]Tipo '!$B$5,IF(D50=5,'[4]Tipo '!$B$6,IF(D50=6,'[4]Tipo '!$B$7,IF(D50=7,'[4]Tipo '!$B$8,IF(D50=8,'[4]Tipo '!$B$9,IF(D50=9,'[4]Tipo '!$B$10,IF(D50=10,'[4]Tipo '!$B$11,IF(D50=11,'[4]Tipo '!$B$12,IF(D50=12,'[4]Tipo '!$B$13,IF(D50=13,'[4]Tipo '!$B$14,IF(D50=14,'[4]Tipo '!$B$15,IF(D50=15,'[4]Tipo '!$B$16,IF(D50=16,'[4]Tipo '!$B$17,IF(D50=17,'[4]Tipo '!$B$18,IF(D50=18,'[4]Tipo '!$B$19,IF(D50=19,'[4]Tipo '!$B$20,\"No ha seleccionado un tipo de contrato válido\")))))))))))))))))))","v":"OBRA PÚBLICA"},"Licitación pública","No aplica","REALIZAR A PRECIO UNITARIOS FIJOS CON FORMULA DE REAJUSTE, EL MANTENIMIENTO Y/O REHABILITACION DE PARQUES ZONALES, VECINALES, Y DE BOSILLO DE LA LOCALIDAD DE LA CANDELARIA EN BOGOTA D.C, DE CONFORMIDAD CON LA DESCRIPCIÓN, ESPECIFICACIONES TECNICAS Y DÉMAS CONDICIONES ESTABLECIDAS EN LOS ESTUDIOS PREVIOS, PLIEGO DE CONDICIONES Y ANEXOS","Inversión",18,{"$f":"IF(J50=1,'[4]Equivalencia BH-BMPT'!$D$2,IF(J50=2,'[4]Equivalencia BH-BMPT'!$D$3,IF(J50=3,'[4]Equivalencia BH-BMPT'!$D$4,IF(J50=4,'[4]Equivalencia BH-BMPT'!$D$5,IF(J50=5,'[4]Equivalencia BH-BMPT'!$D$6,IF(J50=6,'[4]Equivalencia BH-BMPT'!$D$7,IF(J50=7,'[4]Equivalencia BH-BMPT'!$D$8,IF(J50=8,'[4]Equivalencia BH-BMPT'!$D$9,IF(J50=9,'[4]Equivalencia BH-BMPT'!$D$10,IF(J50=10,'[4]Equivalencia BH-BMPT'!$D$11,IF(J50=11,'[4]Equivalencia BH-BMPT'!$D$12,IF(J50=12,'[4]Equivalencia BH-BMPT'!$D$13,IF(J50=13,'[4]Equivalencia BH-BMPT'!$D$14,IF(J50=14,'[4]Equivalencia BH-BMPT'!$D$15,IF(J50=15,'[4]Equivalencia BH-BMPT'!$D$16,IF(J50=16,'[4]Equivalencia BH-BMPT'!$D$17,IF(J50=17,'[4]Equivalencia BH-BMPT'!$D$18,IF(J50=18,'[4]Equivalencia BH-BMPT'!$D$19,IF(J50=19,'[4]Equivalencia BH-BMPT'!$D$20,IF(J50=20,'[4]Equivalencia BH-BMPT'!$D$21,IF(J50=21,'[4]Equivalencia BH-BMPT'!$D$22,IF(J50=22,'[4]Equivalencia BH-BMPT'!$D$23,IF(J50=23,'[4]Equivalencia BH-BMPT'!#REF!,IF(J50=24,'[4]Equivalencia BH-BMPT'!$D$25,IF(J50=25,'[4]Equivalencia BH-BMPT'!$D$26,IF(J50=26,'[4]Equivalencia BH-BMPT'!$D$27,IF(J50=27,'[4]Equivalencia BH-BMPT'!$D$28,IF(J50=28,'[4]Equivalencia BH-BMPT'!$D$29,IF(J50=29,'[4]Equivalencia BH-BMPT'!$D$30,IF(J50=30,'[4]Equivalencia BH-BMPT'!$D$31,IF(J50=31,'[4]Equivalencia BH-BMPT'!$D$32,IF(J50=32,'[4]Equivalencia BH-BMPT'!$D$33,IF(J50=33,'[4]Equivalencia BH-BMPT'!$D$34,IF(J50=34,'[4]Equivalencia BH-BMPT'!$D$35,IF(J50=35,'[4]Equivalencia BH-BMPT'!$D$36,IF(J50=36,'[4]Equivalencia BH-BMPT'!$D$37,IF(J50=37,'[4]Equivalencia BH-BMPT'!$D$38,IF(J50=38,'[4]Equivalencia BH-BMPT'!#REF!,IF(J50=39,'[4]Equivalencia BH-BMPT'!$D$40,IF(J50=40,'[4]Equivalencia BH-BMPT'!$D$41,IF(J50=41,'[4]Equivalencia BH-BMPT'!$D$42,IF(J50=42,'[4]Equivalencia BH-BMPT'!$D$43,IF(J50=43,'[4]Equivalencia BH-BMPT'!$D$44,IF(J50=44,'[4]Equivalencia BH-BMPT'!$D$45,IF(J50=45,'[4]Equivalencia BH-BMPT'!$D$46,\"No ha seleccionado un número de programa\")))))))))))))))))))))))))))))))))))))))))))))","v":"Mejor movilidad para todos"},"1391",8300414110,"CONSULTORIA Y CONSTRUCCIÓN SAS",1463267831,null,null,null,330810258,1794078089,null,"2017-12-22","2017-12-28","2018-08-27",240,null,null,null,null,"X",null,0,false]
[109,2017,"17-15-7347685",3,{"$f":"IF(D51=1,'[4]Tipo '!$B$2,IF(D51=2,'[4]Tipo '!$B$3,IF(D51=3,'[4]Tipo '!$B$4,IF(D51=4,'[4]Tipo '!$B$5,IF(D51=5,'[4]Tipo '!$B$6,IF(D51=6,'[4]Tipo '!$B$7,IF(D51=7,'[4]Tipo '!$B$8,IF(D51=8,'[4]Tipo '!$B$9,IF(D51=9,'[4]Tipo '!$B$10,IF(D51=10,'[4]Tipo '!$B$11,IF(D51=11,'[4]Tipo '!$B$12,IF(D51=12,'[4]Tipo '!$B$13,IF(D51=13,'[4]Tipo '!$B$14,IF(D51=14,'[4]Tipo '!$B$15,IF(D51=15,'[4]Tipo '!$B$16,IF(D51=16,'[4]Tipo '!$B$17,IF(D51=17,'[4]Tipo '!$B$18,IF(D51=18,'[4]Tipo '!$B$19,IF(D51=19,'[4]Tipo '!$B$20,\"No ha seleccionado un tipo de contrato válido\")))))))))))))))))))","v":"INTERVENTORÍA"},"Concurso de Méritos","No aplica","REALIZAR LA INTERVENTORIA TÉCNICA, ADMINISTRATIVA, FINANCIERA, SOCIAL, AMBIENTAL, Y SISO DE LOS CONTRATOS CELEBRADOS PARA LA EJECUCIÓN DE OBRAS DE REHABILITACIÓN Y/O RECONSTRUCCIÓN Y/O MANTENIMIENTO Y/O SUMINISTRO DEL ESPACIO PUBLICO Y MOVILIDAD DE LA LOCALIDAD DE LA CANDELARIA","Inversión",18,{"$f":"IF(J51=1,'[4]Equivalencia BH-BMPT'!$D$2,IF(J51=2,'[4]Equivalencia BH-BMPT'!$D$3,IF(J51=3,'[4]Equivalencia BH-BMPT'!$D$4,IF(J51=4,'[4]Equivalencia BH-BMPT'!$D$5,IF(J51=5,'[4]Equivalencia BH-BMPT'!$D$6,IF(J51=6,'[4]Equivalencia BH-BMPT'!$D$7,IF(J51=7,'[4]Equivalencia BH-BMPT'!$D$8,IF(J51=8,'[4]Equivalencia BH-BMPT'!$D$9,IF(J51=9,'[4]Equivalencia BH-BMPT'!$D$10,IF(J51=10,'[4]Equivalencia BH-BMPT'!$D$11,IF(J51=11,'[4]Equivalencia BH-BMPT'!$D$12,IF(J51=12,'[4]Equivalencia BH-BMPT'!$D$13,IF(J51=13,'[4]Equivalencia BH-BMPT'!$D$14,IF(J51=14,'[4]Equivalencia BH-BMPT'!$D$15,IF(J51=15,'[4]Equivalencia BH-BMPT'!$D$16,IF(J51=16,'[4]Equivalencia BH-BMPT'!$D$17,IF(J51=17,'[4]Equivalencia BH-BMPT'!$D$18,IF(J51=18,'[4]Equivalencia BH-BMPT'!$D$19,IF(J51=19,'[4]Equivalencia BH-BMPT'!$D$20,IF(J51=20,'[4]Equivalencia BH-BMPT'!$D$21,IF(J51=21,'[4]Equivalencia BH-BMPT'!$D$22,IF(J51=22,'[4]Equivalencia BH-BMPT'!$D$23,IF(J51=23,'[4]Equivalencia BH-BMPT'!#REF!,IF(J51=24,'[4]Equivalencia BH-BMPT'!$D$25,IF(J51=25,'[4]Equivalencia BH-BMPT'!$D$26,IF(J51=26,'[4]Equivalencia BH-BMPT'!$D$27,IF(J51=27,'[4]Equivalencia BH-BMPT'!$D$28,IF(J51=28,'[4]Equivalencia BH-BMPT'!$D$29,IF(J51=29,'[4]Equivalencia BH-BMPT'!$D$30,IF(J51=30,'[4]Equivalencia BH-BMPT'!$D$31,IF(J51=31,'[4]Equivalencia BH-BMPT'!$D$32,IF(J51=32,'[4]Equivalencia BH-BMPT'!$D$33,IF(J51=33,'[4]Equivalencia BH-BMPT'!$D$34,IF(J51=34,'[4]Equivalencia BH-BMPT'!$D$35,IF(J51=35,'[4]Equivalencia BH-BMPT'!$D$36,IF(J51=36,'[4]Equivalencia BH-BMPT'!$D$37,IF(J51=37,'[4]Equivalencia BH-BMPT'!$D$38,IF(J51=38,'[4]Equivalencia BH-BMPT'!#REF!,IF(J51=39,'[4]Equivalencia BH-BMPT'!$D$40,IF(J51=40,'[4]Equivalencia BH-BMPT'!$D$41,IF(J51=41,'[4]Equivalencia BH-BMPT'!$D$42,IF(J51=42,'[4]Equivalencia BH-BMPT'!$D$43,IF(J51=43,'[4]Equivalencia BH-BMPT'!$D$44,IF(J51=44,'[4]Equivalencia BH-BMPT'!$D$45,IF(J51=45,'[4]Equivalencia BH-BMPT'!$D$46,\"No ha seleccionado un número de programa\")))))))))))))))))))))))))))))))))))))))))))))","v":"Mejor movilidad para todos"},"1391",901141577,"CONSORCIO VIAS CANDELARIA 2017",294859509,null,null,null,null,294859509,null,"2017-12-26","2017-12-28","2018-12-27",360,null,null,null,null,"X",null,0,false]
[112,2016,null,3,{"$f":"IF(D52=1,'Tipo '!$B$2,IF(D52=2,'Tipo '!$B$3,IF(D52=3,'Tipo '!$B$4,IF(D52=4,'Tipo '!$B$5,IF(D52=5,'Tipo '!$B$6,IF(D52=6,'Tipo '!$B$7,IF(D52=7,'Tipo '!$B$8,IF(D52=8,'Tipo '!$B$9,IF(D52=9,'Tipo '!$B$10,IF(D52=10,'Tipo '!$B$11,IF(D52=11,'Tipo '!$B$12,IF(D52=12,'Tipo '!$B$13,IF(D52=13,'Tipo '!$B$14,IF(D52=14,'Tipo '!$B$15,IF(D52=15,'Tipo '!$B$16,IF(D52=16,'Tipo '!$B$17,IF(D52=17,'Tipo '!$B$18,IF(D52=18,'Tipo '!$B$19,IF(D52=19,'Tipo '!$B$20,\"No ha seleccionado un tipo de contrato válido\")))))))))))))))))))","v":"INTERVENTORÍA"},"CONCURSO DE MÉRITOS","No aplica","INTERVENTORÍA TÉCNICA, ADMINISTRATIVA, FINANCIERA, SOCIAL, AMBIENTAL Y SISO DEL CONTRATO DE OBRA QUE SE DERIVE DE LA LICITACIÓN PUBLICA FDLC LP 021 DE 2016 O LA QUE HAGA SUS VECES, QUE REFIERE A ¿PRECIOS UNITARIOS FIJOS SIN FÓRMULA DE REAJUSTE, EL DIAGNOSTICO, DISEÑO, Y EJECUCION DE OBRAS PARA LA ADECUACIÓN Y/O REHABILITACION,  Y/O MANTENIMIENTO DE LA MALLA VIAL, PARQUES Y ANDENES  DE LA LOCALIDAD DE CANDELARIA EN BOGOTÁ D.C, DE CONFORMIDAD CON LA DESCRIPCIÓN, ESPECIFICACIONES TÉCNICAS Y DEMÁS CONDICIONES ESTABLECIDAS EN LOS ESTUDIOS PREVIOS, PLIEGO DE CONDICIONES Y ANEXOS, DOCUMENTOS QUE HACEN PARTE INTEGRAL DEL PRESENTE PROCESO.”","Inversión",18,{"$f":"IF(J52=1,'Equivalencia BH-BMPT'!$D$2,IF(J52=2,'Equivalencia BH-BMPT'!$D$3,IF(J52=3,'Equivalencia BH-BMPT'!$D$4,IF(J52=4,'Equivalencia BH-BMPT'!$D$5,IF(J52=5,'Equivalencia BH-BMPT'!$D$6,IF(J52=6,'Equivalencia BH-BMPT'!$D$7,IF(J52=7,'Equivalencia BH-BMPT'!$D$8,IF(J52=8,'Equivalencia BH-BMPT'!$D$9,IF(J52=9,'Equivalencia BH-BMPT'!$D$10,IF(J52=10,'Equivalencia BH-BMPT'!$D$11,IF(J52=11,'Equivalencia BH-BMPT'!$D$12,IF(J52=12,'Equivalencia BH-BMPT'!$D$13,IF(J52=13,'Equivalencia BH-BMPT'!$D$14,IF(J52=14,'Equivalencia BH-BMPT'!$D$15,IF(J52=15,'Equivalencia BH-BMPT'!$D$16,IF(J52=16,'Equivalencia BH-BMPT'!$D$17,IF(J52=17,'Equivalencia BH-BMPT'!$D$18,IF(J52=18,'Equivalencia BH-BMPT'!$D$19,IF(J52=19,'Equivalencia BH-BMPT'!$D$20,IF(J52=20,'Equivalencia BH-BMPT'!$D$21,IF(J52=21,'Equivalencia BH-BMPT'!$D$22,IF(J52=22,'Equivalencia BH-BMPT'!$D$23,IF(J52=23,'Equivalencia BH-BMPT'!#REF!,IF(J52=24,'Equivalencia BH-BMPT'!$D$25,IF(J52=25,'Equivalencia BH-BMPT'!$D$26,IF(J52=26,'Equivalencia BH-BMPT'!$D$27,IF(J52=27,'Equivalencia BH-BMPT'!$D$28,IF(J52=28,'Equivalencia BH-BMPT'!$D$29,IF(J52=29,'Equivalencia BH-BMPT'!$D$30,IF(J52=30,'Equivalencia BH-BMPT'!$D$31,IF(J52=31,'Equivalencia BH-BMPT'!$D$32,IF(J52=32,'Equivalencia BH-BMPT'!$D$33,IF(J52=33,'Equivalencia BH-BMPT'!$D$34,IF(J52=34,'Equivalencia BH-BMPT'!$D$35,IF(J52=35,'Equivalencia BH-BMPT'!$D$36,IF(J52=36,'Equivalencia BH-BMPT'!$D$37,IF(J52=37,'Equivalencia BH-BMPT'!$D$38,IF(J52=38,'Equivalencia BH-BMPT'!#REF!,IF(J52=39,'Equivalencia BH-BMPT'!$D$40,IF(J52=40,'Equivalencia BH-BMPT'!$D$41,IF(J52=41,'Equivalencia BH-BMPT'!$D$42,IF(J52=42,'Equivalencia BH-BMPT'!$D$43,IF(J52=43,'Equivalencia BH-BMPT'!$D$44,IF(J52=44,'Equivalencia BH-BMPT'!$D$45,IF(J52=45,'Equivalencia BH-BMPT'!$D$46,\"No ha seleccionado un número de programa\")))))))))))))))))))))))))))))))))))))))))))))","v":"Mejor movilidad para todos"},"1391",null,"GNG INGENIERIA S.A.S",null,null,null,null,106957200,106957200,null,"2016-12-20","2017-02-13","2018-04-05",270,null,null,null,"X",null,null,0,false]
[113,2016,null,null,"CONTRATO DE OBRA PUBLICA","Licitación pública",null,"REALIZAR A MONTO AGOTABLE A PRECIOS UNITARIOS FIJOS SIN FORMULA DE REAJUSTE EL DIAGNOSTICO , DISEÑOS Y EJECUCION DE OBRAS PARA LA ADECUACION Y/O REHABILITACION MANTENIMIENTO DE LA MALLA VIAL, ANDENES Y PARQUES DE LA LOCALIDAD DE LA CANDELARIA DE CONFORMIDAD CON LA DESCRIPCION ESPECIFICACIONES TECNICAS Y DEMAS CONDICIONES ESTABLECIDAD EN LOS ESTUDIOS PREVIOS PLIEGO DE CONDICIONES Y ANEXOS DOCUMENTOS QUE HACEN PARTE INTEGRAL DEL PRESENTE PROCESO","Inversión",18,{"$f":"IF(J53=1,'Equivalencia BH-BMPT'!$D$2,IF(J53=2,'Equivalencia BH-BMPT'!$D$3,IF(J53=3,'Equivalencia BH-BMPT'!$D$4,IF(J53=4,'Equivalencia BH-BMPT'!$D$5,IF(J53=5,'Equivalencia BH-BMPT'!$D$6,IF(J53=6,'Equivalencia BH-BMPT'!$D$7,IF(J53=7,'Equivalencia BH-BMPT'!$D$8,IF(J53=8,'Equivalencia BH-BMPT'!$D$9,IF(J53=9,'Equivalencia BH-BMPT'!$D$10,IF(J53=10,'Equivalencia BH-BMPT'!$D$11,IF(J53=11,'Equivalencia BH-BMPT'!$D$12,IF(J53=12,'Equivalencia BH-BMPT'!$D$13,IF(J53=13,'Equivalencia BH-BMPT'!$D$14,IF(J53=14,'Equivalencia BH-BMPT'!$D$15,IF(J53=15,'Equivalencia BH-BMPT'!$D$16,IF(J53=16,'Equivalencia BH-BMPT'!$D$17,IF(J53=17,'Equivalencia BH-BMPT'!$D$18,IF(J53=18,'Equivalencia BH-BMPT'!$D$19,IF(J53=19,'Equivalencia BH-BMPT'!$D$20,IF(J53=20,'Equivalencia BH-BMPT'!$D$21,IF(J53=21,'Equivalencia BH-BMPT'!$D$22,IF(J53=22,'Equivalencia BH-BMPT'!$D$23,IF(J53=23,'Equivalencia BH-BMPT'!#REF!,IF(J53=24,'Equivalencia BH-BMPT'!$D$25,IF(J53=25,'Equivalencia BH-BMPT'!$D$26,IF(J53=26,'Equivalencia BH-BMPT'!$D$27,IF(J53=27,'Equivalencia BH-BMPT'!$D$28,IF(J53=28,'Equivalencia BH-BMPT'!$D$29,IF(J53=29,'Equivalencia BH-BMPT'!$D$30,IF(J53=30,'Equivalencia BH-BMPT'!$D$31,IF(J53=31,'Equivalencia BH-BMPT'!$D$32,IF(J53=32,'Equivalencia BH-BMPT'!$D$33,IF(J53=33,'Equivalencia BH-BMPT'!$D$34,IF(J53=34,'Equivalencia BH-BMPT'!$D$35,IF(J53=35,'Equivalencia BH-BMPT'!$D$36,IF(J53=36,'Equivalencia BH-BMPT'!$D$37,IF(J53=37,'Equivalencia BH-BMPT'!$D$38,IF(J53=38,'Equivalencia BH-BMPT'!#REF!,IF(J53=39,'Equivalencia BH-BMPT'!$D$40,IF(J53=40,'Equivalencia BH-BMPT'!$D$41,IF(J53=41,'Equivalencia BH-BMPT'!$D$42,IF(J53=42,'Equivalencia BH-BMPT'!$D$43,IF(J53=43,'Equivalencia BH-BMPT'!$D$44,IF(J53=44,'Equivalencia BH-BMPT'!$D$45,IF(J53=45,'Equivalencia BH-BMPT'!$D$46,\"No ha seleccionado un número de programa\")))))))))))))))))))))))))))))))))))))))))))))","v":"Mejor movilidad para todos"},"1391",null,"UNION TEMPORAL CANDELARIA 2018",null,null,null,null,1103000000,1103000000,null,null,null,null,null,null,null,null,null,null,null,0,false]
[163,2014,null,null,"CONTRATO DE OBRA PUBLICA","Licitación pública","No aplica","REALIZAR A MONTO AGOTABLE, A PRECIOS UNITARIOS FIJOS, SIN FÓRMULA DE REAJUSTE, EL DIAGNÓSTICO, LOS ESTUDIOS Y DISEÑOS, EL MANTENIMIENTO Y/O REHABILITACIÓN DE LA MALLA VIAL LOCAL DE LA LOCALIDAD DE LA CANDELARIA, DE CONFORMIDAD CON LOS PLIEGOS DE CONDICIONES, ESTUDIOS PREVIOS Y DEMÁS CONDICIONES ESTABLECIDAS EN EL ANEXO TÉCNICO.RADICADO 20176720003723 DEL 30-03-2017RADICADO CDP 20176720003763 DEL 03-04-2017.","Inversión",18,{"$f":"IF(J54=1,'Equivalencia BH-BMPT'!$D$2,IF(J54=2,'Equivalencia BH-BMPT'!$D$3,IF(J54=3,'Equivalencia BH-BMPT'!$D$4,IF(J54=4,'Equivalencia BH-BMPT'!$D$5,IF(J54=5,'Equivalencia BH-BMPT'!$D$6,IF(J54=6,'Equivalencia BH-BMPT'!$D$7,IF(J54=7,'Equivalencia BH-BMPT'!$D$8,IF(J54=8,'Equivalencia BH-BMPT'!$D$9,IF(J54=9,'Equivalencia BH-BMPT'!$D$10,IF(J54=10,'Equivalencia BH-BMPT'!$D$11,IF(J54=11,'Equivalencia BH-BMPT'!$D$12,IF(J54=12,'Equivalencia BH-BMPT'!$D$13,IF(J54=13,'Equivalencia BH-BMPT'!$D$14,IF(J54=14,'Equivalencia BH-BMPT'!$D$15,IF(J54=15,'Equivalencia BH-BMPT'!$D$16,IF(J54=16,'Equivalencia BH-BMPT'!$D$17,IF(J54=17,'Equivalencia BH-BMPT'!$D$18,IF(J54=18,'Equivalencia BH-BMPT'!$D$19,IF(J54=19,'Equivalencia BH-BMPT'!$D$20,IF(J54=20,'Equivalencia BH-BMPT'!$D$21,IF(J54=21,'Equivalencia BH-BMPT'!$D$22,IF(J54=22,'Equivalencia BH-BMPT'!$D$23,IF(J54=23,'Equivalencia BH-BMPT'!D91,IF(J54=24,'Equivalencia BH-BMPT'!$D$25,IF(J54=25,'Equivalencia BH-BMPT'!$D$26,IF(J54=26,'Equivalencia BH-BMPT'!$D$27,IF(J54=27,'Equivalencia BH-BMPT'!$D$28,IF(J54=28,'Equivalencia BH-BMPT'!$D$29,IF(J54=29,'Equivalencia BH-BMPT'!$D$30,IF(J54=30,'Equivalencia BH-BMPT'!$D$31,IF(J54=31,'Equivalencia BH-BMPT'!$D$32,IF(J54=32,'Equivalencia BH-BMPT'!$D$33,IF(J54=33,'Equivalencia BH-BMPT'!$D$34,IF(J54=34,'Equivalencia BH-BMPT'!$D$35,IF(J54=35,'Equivalencia BH-BMPT'!$D$36,IF(J54=36,'Equivalencia BH-BMPT'!$D$37,IF(J54=37,'Equivalencia BH-BMPT'!$D$38,IF(J54=38,'Equivalencia BH-BMPT'!D106,IF(J54=39,'Equivalencia BH-BMPT'!$D$40,IF(J54=40,'Equivalencia BH-BMPT'!$D$41,IF(J54=41,'Equivalencia BH-BMPT'!$D$42,IF(J54=42,'Equivalencia BH-BMPT'!$D$43,IF(J54=43,'Equivalencia BH-BMPT'!$D$44,IF(J54=44,'Equivalencia BH-BMPT'!$D$45,IF(J54=45,'Equivalencia BH-BMPT'!$D$46,\"No ha seleccionado un número de programa\")))))))))))))))))))))))))))))))))))))))))))))","v":"Mejor movilidad para todos"},"1391",null,"UNION TEMPORAL VIAS CANDELARIA 2015",null,null,null,null,150914714,150914714,150914714,null,null,null,null,null,null,null,null,null,null,1,false]
[111,2017,"ACUERDO MARCO",6,"COMPRAVENTA DE BIENES INMUEBLES","Selección abreviada ","Acuerdo marco de precios ","ADQUISICIÓN DEL SISTEMAS DE VIDEO VIGILANCIA DEL DISTRITO A TRAVÉS DE LA OPERACIÓN SECUNDARIA DEL INSTRUMENTO DE AGREGACIÓN DE DEMANDA LP-151-AG-2017 DE COLOMBIA COMPRA EFICIENTE PARA LA LOCALIDAD DE LA CANDELARIA","Inversión",19,{"$f":"IF(J55=1,'[4]Equivalencia BH-BMPT'!$D$2,IF(J55=2,'[4]Equivalencia BH-BMPT'!$D$3,IF(J55=3,'[4]Equivalencia BH-BMPT'!$D$4,IF(J55=4,'[4]Equivalencia BH-BMPT'!$D$5,IF(J55=5,'[4]Equivalencia BH-BMPT'!$D$6,IF(J55=6,'[4]Equivalencia BH-BMPT'!$D$7,IF(J55=7,'[4]Equivalencia BH-BMPT'!$D$8,IF(J55=8,'[4]Equivalencia BH-BMPT'!$D$9,IF(J55=9,'[4]Equivalencia BH-BMPT'!$D$10,IF(J55=10,'[4]Equivalencia BH-BMPT'!$D$11,IF(J55=11,'[4]Equivalencia BH-BMPT'!$D$12,IF(J55=12,'[4]Equivalencia BH-BMPT'!$D$13,IF(J55=13,'[4]Equivalencia BH-BMPT'!$D$14,IF(J55=14,'[4]Equivalencia BH-BMPT'!$D$15,IF(J55=15,'[4]Equivalencia BH-BMPT'!$D$16,IF(J55=16,'[4]Equivalencia BH-BMPT'!$D$17,IF(J55=17,'[4]Equivalencia BH-BMPT'!$D$18,IF(J55=18,'[4]Equivalencia BH-BMPT'!$D$19,IF(J55=19,'[4]Equivalencia BH-BMPT'!$D$20,IF(J55=20,'[4]Equivalencia BH-BMPT'!$D$21,IF(J55=21,'[4]Equivalencia BH-BMPT'!$D$22,IF(J55=22,'[4]Equivalencia BH-BMPT'!$D$23,IF(J55=23,'[4]Equivalencia BH-BMPT'!#REF!,IF(J55=24,'[4]Equivalencia BH-BMPT'!$D$25,IF(J55=25,'[4]Equivalencia BH-BMPT'!$D$26,IF(J55=26,'[4]Equivalencia BH-BMPT'!$D$27,IF(J55=27,'[4]Equivalencia BH-BMPT'!$D$28,IF(J55=28,'[4]Equivalencia BH-BMPT'!$D$29,IF(J55=29,'[4]Equivalencia BH-BMPT'!$D$30,IF(J55=30,'[4]Equivalencia BH-BMPT'!$D$31,IF(J55=31,'[4]Equivalencia BH-BMPT'!$D$32,IF(J55=32,'[4]Equivalencia BH-BMPT'!$D$33,IF(J55=33,'[4]Equivalencia BH-BMPT'!$D$34,IF(J55=34,'[4]Equivalencia BH-BMPT'!$D$35,IF(J55=35,'[4]Equivalencia BH-BMPT'!$D$36,IF(J55=36,'[4]Equivalencia BH-BMPT'!$D$37,IF(J55=37,'[4]Equivalencia BH-BMPT'!$D$38,IF(J55=38,'[4]Equivalencia BH-BMPT'!#REF!,IF(J55=39,'[4]Equivalencia BH-BMPT'!$D$40,IF(J55=40,'[4]Equivalencia BH-BMPT'!$D$41,IF(J55=41,'[4]Equivalencia BH-BMPT'!$D$42,IF(J55=42,'[4]Equivalencia BH-BMPT'!$D$43,IF(J55=43,'[4]Equivalencia BH-BMPT'!$D$44,IF(J55=44,'[4]Equivalencia BH-BMPT'!$D$45,IF(J55=45,'[4]Equivalencia BH-BMPT'!$D$46,\"No ha seleccionado un número de programa\")))))))))))))))))))))))))))))))))))))))))))))","v":"Seguridad y convivencia para todos"},"1392",901134817,"UNIÓN TEMPORAL BOGOTA ALCALDIAS SEGURIDAD CIUDADANA ",474633000,null,null,null,null,474633000,null,"2017-12-27",null,null,720,null,"X",null,null,null,null,0,false]
[91,2017,"17-15-6987218",3,{"$f":"IF(D56=1,'[3]Tipo '!$B$2,IF(D56=2,'[3]Tipo '!$B$3,IF(D56=3,'[3]Tipo '!$B$4,IF(D56=4,'[3]Tipo '!$B$5,IF(D56=5,'[3]Tipo '!$B$6,IF(D56=6,'[3]Tipo '!$B$7,IF(D56=7,'[3]Tipo '!$B$8,IF(D56=8,'[3]Tipo '!$B$9,IF(D56=9,'[3]Tipo '!$B$10,IF(D56=10,'[3]Tipo '!$B$11,IF(D56=11,'[3]Tipo '!$B$12,IF(D56=12,'[3]Tipo '!$B$13,IF(D56=13,'[3]Tipo '!$B$14,IF(D56=14,'[3]Tipo '!$B$15,IF(D56=15,'[3]Tipo '!$B$16,IF(D56=16,'[3]Tipo '!$B$17,IF(D56=17,'[3]Tipo '!$B$18,IF(D56=18,'[3]Tipo '!$B$19,IF(D56=19,'[3]Tipo '!$B$20,\"No ha seleccionado un tipo de contrato válido\")))))))))))))))))))","v":"INTERVENTORÍA"},"Concurso de Méritos","No aplica","EJECUTAR LA INTERVENTORIA TECNICA, ADMINISTRATIVA, FINANCIERA A EVENTOS CULTURALES Y/O FIESTAS Y/O AMBIENTAL Y/O INNOVACIÓN DEL FONDO DE DESARROLLO LOCAL DE LA CANDELARIA ","Inversión",11,{"$f":"IF(J56=1,'[3]Equivalencia BH-BMPT'!$D$2,IF(J56=2,'[3]Equivalencia BH-BMPT'!$D$3,IF(J56=3,'[3]Equivalencia BH-BMPT'!$D$4,IF(J56=4,'[3]Equivalencia BH-BMPT'!$D$5,IF(J56=5,'[3]Equivalencia BH-BMPT'!$D$6,IF(J56=6,'[3]Equivalencia BH-BMPT'!$D$7,IF(J56=7,'[3]Equivalencia BH-BMPT'!$D$8,IF(J56=8,'[3]Equivalencia BH-BMPT'!$D$9,IF(J56=9,'[3]Equivalencia BH-BMPT'!$D$10,IF(J56=10,'[3]Equivalencia BH-BMPT'!$D$11,IF(J56=11,'[3]Equivalencia BH-BMPT'!$D$12,IF(J56=12,'[3]Equivalencia BH-BMPT'!$D$13,IF(J56=13,'[3]Equivalencia BH-BMPT'!$D$14,IF(J56=14,'[3]Equivalencia BH-BMPT'!$D$15,IF(J56=15,'[3]Equivalencia BH-BMPT'!$D$16,IF(J56=16,'[3]Equivalencia BH-BMPT'!$D$17,IF(J56=17,'[3]Equivalencia BH-BMPT'!$D$18,IF(J56=18,'[3]Equivalencia BH-BMPT'!$D$19,IF(J56=19,'[3]Equivalencia BH-BMPT'!$D$20,IF(J56=20,'[3]Equivalencia BH-BMPT'!$D$21,IF(J56=21,'[3]Equivalencia BH-BMPT'!$D$22,IF(J56=22,'[3]Equivalencia BH-BMPT'!$D$23,IF(J56=23,'[3]Equivalencia BH-BMPT'!#REF!,IF(J56=24,'[3]Equivalencia BH-BMPT'!$D$25,IF(J56=25,'[3]Equivalencia BH-BMPT'!$D$26,IF(J56=26,'[3]Equivalencia BH-BMPT'!$D$27,IF(J56=27,'[3]Equivalencia BH-BMPT'!$D$28,IF(J56=28,'[3]Equivalencia BH-BMPT'!$D$29,IF(J56=29,'[3]Equivalencia BH-BMPT'!$D$30,IF(J56=30,'[3]Equivalencia BH-BMPT'!$D$31,IF(J56=31,'[3]Equivalencia BH-BMPT'!$D$32,IF(J56=32,'[3]Equivalencia BH-BMPT'!$D$33,IF(J56=33,'[3]Equivalencia BH-BMPT'!$D$34,IF(J56=34,'[3]Equivalencia BH-BMPT'!$D$35,IF(J56=35,'[3]Equivalencia BH-BMPT'!$D$36,IF(J56=36,'[3]Equivalencia BH-BMPT'!$D$37,IF(J56=37,'[3]Equivalencia BH-BMPT'!$D$38,IF(J56=38,'[3]Equivalencia BH-BMPT'!#REF!,IF(J56=39,'[3]Equivalencia BH-BMPT'!$D$40,IF(J56=40,'[3]Equivalencia BH-BMPT'!$D$41,IF(J56=41,'[3]Equivalencia BH-BMPT'!$D$42,IF(J56=42,'[3]Equivalencia BH-BMPT'!$D$43,IF(J56=43,'[3]Equivalencia BH-BMPT'!$D$44,IF(J56=44,'[3]Equivalencia BH-BMPT'!$D$45,IF(J56=45,'[3]Equivalencia BH-BMPT'!$D$46,\"No ha seleccionado un número de programa\")))))))))))))))))))))))))))))))))))))))))))))","v":"Mejores oportunidades para el desarrollo a través de la cultura, la recreación y el deporte"},"1389",9006418412,"SOLUCIONES AVANZADA DE INGENIERIA Y CONSTRUCCION SAS ",69360054,null,null,null,null,69360054,29807120,"2017-09-27","2017-10-05","2018-05-04",210,null,null,null,"X",null,null,0.42974476346284274,false]
[91,2017,"17-15-6987218",3,{"$f":"IF(D57=1,'[3]Tipo '!$B$2,IF(D57=2,'[3]Tipo '!$B$3,IF(D57=3,'[3]Tipo '!$B$4,IF(D57=4,'[3]Tipo '!$B$5,IF(D57=5,'[3]Tipo '!$B$6,IF(D57=6,'[3]Tipo '!$B$7,IF(D57=7,'[3]Tipo '!$B$8,IF(D57=8,'[3]Tipo '!$B$9,IF(D57=9,'[3]Tipo '!$B$10,IF(D57=10,'[3]Tipo '!$B$11,IF(D57=11,'[3]Tipo '!$B$12,IF(D57=12,'[3]Tipo '!$B$13,IF(D57=13,'[3]Tipo '!$B$14,IF(D57=14,'[3]Tipo '!$B$15,IF(D57=15,'[3]Tipo '!$B$16,IF(D57=16,'[3]Tipo '!$B$17,IF(D57=17,'[3]Tipo '!$B$18,IF(D57=18,'[3]Tipo '!$B$19,IF(D57=19,'[3]Tipo '!$B$20,\"No ha seleccionado un tipo de contrato válido\")))))))))))))))))))","v":"INTERVENTORÍA"},"Concurso de Méritos","No aplica","EJECUTAR LA INTERVENTORIA TECNICA, ADMINISTRATIVA, FINANCIERA A EVENTOS CULTURALES Y/O FIESTAS Y/O AMBIENTAL Y/O INNOVACIÓN DEL FONDO DE DESARROLLO LOCAL DE LA CANDELARIA ","Inversión",37,{"$f":"IF(J57=1,'[3]Equivalencia BH-BMPT'!$D$2,IF(J57=2,'[3]Equivalencia BH-BMPT'!$D$3,IF(J57=3,'[3]Equivalencia BH-BMPT'!$D$4,IF(J57=4,'[3]Equivalencia BH-BMPT'!$D$5,IF(J57=5,'[3]Equivalencia BH-BMPT'!$D$6,IF(J57=6,'[3]Equivalencia BH-BMPT'!$D$7,IF(J57=7,'[3]Equivalencia BH-BMPT'!$D$8,IF(J57=8,'[3]Equivalencia BH-BMPT'!$D$9,IF(J57=9,'[3]Equivalencia BH-BMPT'!$D$10,IF(J57=10,'[3]Equivalencia BH-BMPT'!$D$11,IF(J57=11,'[3]Equivalencia BH-BMPT'!$D$12,IF(J57=12,'[3]Equivalencia BH-BMPT'!$D$13,IF(J57=13,'[3]Equivalencia BH-BMPT'!$D$14,IF(J57=14,'[3]Equivalencia BH-BMPT'!$D$15,IF(J57=15,'[3]Equivalencia BH-BMPT'!$D$16,IF(J57=16,'[3]Equivalencia BH-BMPT'!$D$17,IF(J57=17,'[3]Equivalencia BH-BMPT'!$D$18,IF(J57=18,'[3]Equivalencia BH-BMPT'!$D$19,IF(J57=19,'[3]Equivalencia BH-BMPT'!$D$20,IF(J57=20,'[3]Equivalencia BH-BMPT'!$D$21,IF(J57=21,'[3]Equivalencia BH-BMPT'!$D$22,IF(J57=22,'[3]Equivalencia BH-BMPT'!$D$23,IF(J57=23,'[3]Equivalencia BH-BMPT'!#REF!,IF(J57=24,'[3]Equivalencia BH-BMPT'!$D$25,IF(J57=25,'[3]Equivalencia BH-BMPT'!$D$26,IF(J57=26,'[3]Equivalencia BH-BMPT'!$D$27,IF(J57=27,'[3]Equivalencia BH-BMPT'!$D$28,IF(J57=28,'[3]Equivalencia BH-BMPT'!$D$29,IF(J57=29,'[3]Equivalencia BH-BMPT'!$D$30,IF(J57=30,'[3]Equivalencia BH-BMPT'!$D$31,IF(J57=31,'[3]Equivalencia BH-BMPT'!$D$32,IF(J57=32,'[3]Equivalencia BH-BMPT'!$D$33,IF(J57=33,'[3]Equivalencia BH-BMPT'!$D$34,IF(J57=34,'[3]Equivalencia BH-BMPT'!$D$35,IF(J57=35,'[3]Equivalencia BH-BMPT'!$D$36,IF(J57=36,'[3]Equivalencia BH-BMPT'!$D$37,IF(J57=37,'[3]Equivalencia BH-BMPT'!$D$38,IF(J57=38,'[3]Equivalencia BH-BMPT'!#REF!,IF(J57=39,'[3]Equivalencia BH-BMPT'!$D$40,IF(J57=40,'[3]Equivalencia BH-BMPT'!$D$41,IF(J57=41,'[3]Equivalencia BH-BMPT'!$D$42,IF(J57=42,'[3]Equivalencia BH-BMPT'!$D$43,IF(J57=43,'[3]Equivalencia BH-BMPT'!$D$44,IF(J57=44,'[3]Equivalencia BH-BMPT'!$D$45,IF(J57=45,'[3]Equivalencia BH-BMPT'!$D$46,\"No ha seleccionado un número de programa\")))))))))))))))))))))))))))))))))))))))))))))","v":"Consolidar el turismo como factor de desarrollo, confianza y felicidad para Bogotá Región"},"1394",9006418412,"SOLUCIONES AVANZADA DE INGENIERIA Y CONSTRUCCION SAS ",17023726,null,null,null,null,17023726,null,"2017-09-27","2017-10-05","2018-05-04",210,null,null,null,"X",null,null,0,false]
[91,2017,"17-15-6987218",3,{"$f":"IF(D58=1,'[3]Tipo '!$B$2,IF(D58=2,'[3]Tipo '!$B$3,IF(D58=3,'[3]Tipo '!$B$4,IF(D58=4,'[3]Tipo '!$B$5,IF(D58=5,'[3]Tipo '!$B$6,IF(D58=6,'[3]Tipo '!$B$7,IF(D58=7,'[3]Tipo '!$B$8,IF(D58=8,'[3]Tipo '!$B$9,IF(D58=9,'[3]Tipo '!$B$10,IF(D58=10,'[3]Tipo '!$B$11,IF(D58=11,'[3]Tipo '!$B$12,IF(D58=12,'[3]Tipo '!$B$13,IF(D58=13,'[3]Tipo '!$B$14,IF(D58=14,'[3]Tipo '!$B$15,IF(D58=15,'[3]Tipo '!$B$16,IF(D58=16,'[3]Tipo '!$B$17,IF(D58=17,'[3]Tipo '!$B$18,IF(D58=18,'[3]Tipo '!$B$19,IF(D58=19,'[3]Tipo '!$B$20,\"No ha seleccionado un tipo de contrato válido\")))))))))))))))))))","v":"INTERVENTORÍA"},"Concurso de Méritos","No aplica","EJECUTAR LA INTERVENTORIA TECNICA, ADMINISTRATIVA, FINANCIERA A EVENTOS CULTURALES Y/O FIESTAS Y/O AMBIENTAL Y/O INNOVACIÓN DEL FONDO DE DESARROLLO LOCAL DE LA CANDELARIA ","Inversión",39,{"$f":"IF(J58=1,'[3]Equivalencia BH-BMPT'!$D$2,IF(J58=2,'[3]Equivalencia BH-BMPT'!$D$3,IF(J58=3,'[3]Equivalencia BH-BMPT'!$D$4,IF(J58=4,'[3]Equivalencia BH-BMPT'!$D$5,IF(J58=5,'[3]Equivalencia BH-BMPT'!$D$6,IF(J58=6,'[3]Equivalencia BH-BMPT'!$D$7,IF(J58=7,'[3]Equivalencia BH-BMPT'!$D$8,IF(J58=8,'[3]Equivalencia BH-BMPT'!$D$9,IF(J58=9,'[3]Equivalencia BH-BMPT'!$D$10,IF(J58=10,'[3]Equivalencia BH-BMPT'!$D$11,IF(J58=11,'[3]Equivalencia BH-BMPT'!$D$12,IF(J58=12,'[3]Equivalencia BH-BMPT'!$D$13,IF(J58=13,'[3]Equivalencia BH-BMPT'!$D$14,IF(J58=14,'[3]Equivalencia BH-BMPT'!$D$15,IF(J58=15,'[3]Equivalencia BH-BMPT'!$D$16,IF(J58=16,'[3]Equivalencia BH-BMPT'!$D$17,IF(J58=17,'[3]Equivalencia BH-BMPT'!$D$18,IF(J58=18,'[3]Equivalencia BH-BMPT'!$D$19,IF(J58=19,'[3]Equivalencia BH-BMPT'!$D$20,IF(J58=20,'[3]Equivalencia BH-BMPT'!$D$21,IF(J58=21,'[3]Equivalencia BH-BMPT'!$D$22,IF(J58=22,'[3]Equivalencia BH-BMPT'!$D$23,IF(J58=23,'[3]Equivalencia BH-BMPT'!#REF!,IF(J58=24,'[3]Equivalencia BH-BMPT'!$D$25,IF(J58=25,'[3]Equivalencia BH-BMPT'!$D$26,IF(J58=26,'[3]Equivalencia BH-BMPT'!$D$27,IF(J58=27,'[3]Equivalencia BH-BMPT'!$D$28,IF(J58=28,'[3]Equivalencia BH-BMPT'!$D$29,IF(J58=29,'[3]Equivalencia BH-BMPT'!$D$30,IF(J58=30,'[3]Equivalencia BH-BMPT'!$D$31,IF(J58=31,'[3]Equivalencia BH-BMPT'!$D$32,IF(J58=32,'[3]Equivalencia BH-BMPT'!$D$33,IF(J58=33,'[3]Equivalencia BH-BMPT'!$D$34,IF(J58=34,'[3]Equivalencia BH-BMPT'!$D$35,IF(J58=35,'[3]Equivalencia BH-BMPT'!$D$36,IF(J58=36,'[3]Equivalencia BH-BMPT'!$D$37,IF(J58=37,'[3]Equivalencia BH-BMPT'!$D$38,IF(J58=38,'[3]Equivalencia BH-BMPT'!#REF!,IF(J58=39,'[3]Equivalencia BH-BMPT'!$D$40,IF(J58=40,'[3]Equivalencia BH-BMPT'!$D$41,IF(J58=41,'[3]Equivalencia BH-BMPT'!$D$42,IF(J58=42,'[3]Equivalencia BH-BMPT'!$D$43,IF(J58=43,'[3]Equivalencia BH-BMPT'!$D$44,IF(J58=44,'[3]Equivalencia BH-BMPT'!$D$45,IF(J58=45,'[3]Equivalencia BH-BMPT'!$D$46,\"No ha seleccionado un número de programa\")))))))))))))))))))))))))))))))))))))))))))))","v":"Ambiente sano para la equidad y disfrute del ciudadano"},"1393",9006418412,"SOLUCIONES AVANZADA DE INGENIERIA Y CONSTRUCCION SAS ",17941140,null,null,null,null,17941140,null,"2017-09-27","2017-10-05","2018-05-04",210,null,null,null,"X",null,null,0,false]
[100,2017,"17-12-7470011",16,{"$f":"IF(D59=1,'[4]Tipo '!$B$2,IF(D59=2,'[4]Tipo '!$B$3,IF(D59=3,'[4]Tipo '!$B$4,IF(D59=4,'[4]Tipo '!$B$5,IF(D59=5,'[4]Tipo '!$B$6,IF(D59=6,'[4]Tipo '!$B$7,IF(D59=7,'[4]Tipo '!$B$8,IF(D59=8,'[4]Tipo '!$B$9,IF(D59=9,'[4]Tipo '!$B$10,IF(D59=10,'[4]Tipo '!$B$11,IF(D59=11,'[4]Tipo '!$B$12,IF(D59=12,'[4]Tipo '!$B$13,IF(D59=13,'[4]Tipo '!$B$14,IF(D59=14,'[4]Tipo '!$B$15,IF(D59=15,'[4]Tipo '!$B$16,IF(D59=16,'[4]Tipo '!$B$17,IF(D59=17,'[4]Tipo '!$B$18,IF(D59=18,'[4]Tipo '!$B$19,IF(D59=19,'[4]Tipo '!$B$20,\"No ha seleccionado un tipo de contrato válido\")))))))))))))))))))","v":"CONTRATOS INTERADMINISTRATIVOS"},"Contratación directa","Contratos interadministrativos","REALIZAR LAS ACCIONES DE EMBELLECIMIENTO, RECUPERACIÓN Y MANTENIMIENTO DE ZONAS VERDES, PUNTOS CRITICOS, SANITARIOS Y ACUMULACIÓN, EN LA LOCALIDAD DE LA CANDELARIA","Inversión",39,{"$f":"IF(J59=1,'[4]Equivalencia BH-BMPT'!$D$2,IF(J59=2,'[4]Equivalencia BH-BMPT'!$D$3,IF(J59=3,'[4]Equivalencia BH-BMPT'!$D$4,IF(J59=4,'[4]Equivalencia BH-BMPT'!$D$5,IF(J59=5,'[4]Equivalencia BH-BMPT'!$D$6,IF(J59=6,'[4]Equivalencia BH-BMPT'!$D$7,IF(J59=7,'[4]Equivalencia BH-BMPT'!$D$8,IF(J59=8,'[4]Equivalencia BH-BMPT'!$D$9,IF(J59=9,'[4]Equivalencia BH-BMPT'!$D$10,IF(J59=10,'[4]Equivalencia BH-BMPT'!$D$11,IF(J59=11,'[4]Equivalencia BH-BMPT'!$D$12,IF(J59=12,'[4]Equivalencia BH-BMPT'!$D$13,IF(J59=13,'[4]Equivalencia BH-BMPT'!$D$14,IF(J59=14,'[4]Equivalencia BH-BMPT'!$D$15,IF(J59=15,'[4]Equivalencia BH-BMPT'!$D$16,IF(J59=16,'[4]Equivalencia BH-BMPT'!$D$17,IF(J59=17,'[4]Equivalencia BH-BMPT'!$D$18,IF(J59=18,'[4]Equivalencia BH-BMPT'!$D$19,IF(J59=19,'[4]Equivalencia BH-BMPT'!$D$20,IF(J59=20,'[4]Equivalencia BH-BMPT'!$D$21,IF(J59=21,'[4]Equivalencia BH-BMPT'!$D$22,IF(J59=22,'[4]Equivalencia BH-BMPT'!$D$23,IF(J59=23,'[4]Equivalencia BH-BMPT'!#REF!,IF(J59=24,'[4]Equivalencia BH-BMPT'!$D$25,IF(J59=25,'[4]Equivalencia BH-BMPT'!$D$26,IF(J59=26,'[4]Equivalencia BH-BMPT'!$D$27,IF(J59=27,'[4]Equivalencia BH-BMPT'!$D$28,IF(J59=28,'[4]Equivalencia BH-BMPT'!$D$29,IF(J59=29,'[4]Equivalencia BH-BMPT'!$D$30,IF(J59=30,'[4]Equivalencia BH-BMPT'!$D$31,IF(J59=31,'[4]Equivalencia BH-BMPT'!$D$32,IF(J59=32,'[4]Equivalencia BH-BMPT'!$D$33,IF(J59=33,'[4]Equivalencia BH-BMPT'!$D$34,IF(J59=34,'[4]Equivalencia BH-BMPT'!$D$35,IF(J59=35,'[4]Equivalencia BH-BMPT'!$D$36,IF(J59=36,'[4]Equivalencia BH-BMPT'!$D$37,IF(J59=37,'[4]Equivalencia BH-BMPT'!$D$38,IF(J59=38,'[4]Equivalencia BH-BMPT'!#REF!,IF(J59=39,'[4]Equivalencia BH-BMPT'!$D$40,IF(J59=40,'[4]Equivalencia BH-BMPT'!$D$41,IF(J59=41,'[4]Equivalencia BH-BMPT'!$D$42,IF(J59=42,'[4]Equivalencia BH-BMPT'!$D$43,IF(J59=43,'[4]Equivalencia BH-BMPT'!$D$44,IF(J59=44,'[4]Equivalencia BH-BMPT'!$D$45,IF(J59=45,'[4]Equivalencia BH-BMPT'!$D$46,\"No ha seleccionado un número de programa\")))))))))))))))))))))))))))))))))))))))))))))","v":"Ambiente sano para la equidad y disfrute del ciudadano"},"1393",830128286,"AGUAS BOGOTA SA ESP",131626940,null,null,null,null,131626940,null,"2017-10-10","2018-01-15","2018-03-14",90,null,null,"X",null,null,null,0,false]
[105,2016,null,null,"INTERVENTORIA","Concurso de Méritos","No aplica","EJECUTAR LA INTERVENTORIA TECNICA, ADMINISTRATIVA, FINANCIERA Y SISO A EVENTOS Y/O FIESTAS Y/O CUMBRES Y/O AMBIENTAL Y/O DEPORTES Y/O POBLACIONES DEL FDLLC.","Inversión",39,"Ambiente sano para la equidad y disfrute del ciudadano","1393",null,"CONSORCIO INTER CANDELARIA 030",null,null,null,null,49777920,49777920,49777920,null,null,null,null,null,null,null,null,null,null,1,false]
[82,2017,"17-12-6978100",5,{"$f":"IF(D61=1,'[2]Tipo '!$B$2,IF(D61=2,'[2]Tipo '!$B$3,IF(D61=3,'[2]Tipo '!$B$4,IF(D61=4,'[2]Tipo '!$B$5,IF(D61=5,'[2]Tipo '!$B$6,IF(D61=6,'[2]Tipo '!$B$7,IF(D61=7,'[2]Tipo '!$B$8,IF(D61=8,'[2]Tipo '!$B$9,IF(D61=9,'[2]Tipo '!$B$10,IF(D61=10,'[2]Tipo '!$B$11,IF(D61=11,'[2]Tipo '!$B$12,IF(D61=12,'[2]Tipo '!$B$13,IF(D61=13,'[2]Tipo '!$B$14,IF(D61=14,'[2]Tipo '!$B$15,IF(D61=15,'[2]Tipo '!$B$16,IF(D61=16,'[2]Tipo '!$B$17,IF(D61=17,'[2]Tipo '!$B$18,IF(D61=18,'[2]Tipo '!$B$19,IF(D61=19,'[2]Tipo '!$B$20,\"No ha seleccionado un tipo de contrato válido\")))))))))))))))))))","v":"CONTRATOS DE PRESTACIÓN DE SERVICIOS PROFESIONALES Y DE APOYO A LA GESTIÓN"},"Contratación directa","Prestación de servicios profesionales y de apoyo a la gestión, o para la ejecución de trabajos artísticos que sólo puedan encomendarse a determinadas personas naturales;","PRESTACIÓN DE SERVICIOS PROFESIONALES PARA LA PROMOCIÓN Y FORTALECIMIENTO DEL TURISMO CULTURAL EN LA LOCALIDAD 17 DE LA CANDELARIA A TRAVÉS DE LA GESTIÓN, ARTICULACIÓN E INTERLOCUCIÓN CON CIUDADANÍA Y ENTIDADES PÚBLICAS Y PRIVADAS”","Inversión",37,{"$f":"IF(J61=1,'[2]Equivalencia BH-BMPT'!$D$2,IF(J61=2,'[2]Equivalencia BH-BMPT'!$D$3,IF(J61=3,'[2]Equivalencia BH-BMPT'!$D$4,IF(J61=4,'[2]Equivalencia BH-BMPT'!$D$5,IF(J61=5,'[2]Equivalencia BH-BMPT'!$D$6,IF(J61=6,'[2]Equivalencia BH-BMPT'!$D$7,IF(J61=7,'[2]Equivalencia BH-BMPT'!$D$8,IF(J61=8,'[2]Equivalencia BH-BMPT'!$D$9,IF(J61=9,'[2]Equivalencia BH-BMPT'!$D$10,IF(J61=10,'[2]Equivalencia BH-BMPT'!$D$11,IF(J61=11,'[2]Equivalencia BH-BMPT'!$D$12,IF(J61=12,'[2]Equivalencia BH-BMPT'!$D$13,IF(J61=13,'[2]Equivalencia BH-BMPT'!$D$14,IF(J61=14,'[2]Equivalencia BH-BMPT'!$D$15,IF(J61=15,'[2]Equivalencia BH-BMPT'!$D$16,IF(J61=16,'[2]Equivalencia BH-BMPT'!$D$17,IF(J61=17,'[2]Equivalencia BH-BMPT'!$D$18,IF(J61=18,'[2]Equivalencia BH-BMPT'!$D$19,IF(J61=19,'[2]Equivalencia BH-BMPT'!$D$20,IF(J61=20,'[2]Equivalencia BH-BMPT'!$D$21,IF(J61=21,'[2]Equivalencia BH-BMPT'!$D$22,IF(J61=22,'[2]Equivalencia BH-BMPT'!$D$23,IF(J61=23,'[2]Equivalencia BH-BMPT'!#REF!,IF(J61=24,'[2]Equivalencia BH-BMPT'!$D$25,IF(J61=25,'[2]Equivalencia BH-BMPT'!$D$26,IF(J61=26,'[2]Equivalencia BH-BMPT'!$D$27,IF(J61=27,'[2]Equivalencia BH-BMPT'!$D$28,IF(J61=28,'[2]Equivalencia BH-BMPT'!$D$29,IF(J61=29,'[2]Equivalencia BH-BMPT'!$D$30,IF(J61=30,'[2]Equivalencia BH-BMPT'!$D$31,IF(J61=31,'[2]Equivalencia BH-BMPT'!$D$32,IF(J61=32,'[2]Equivalencia BH-BMPT'!$D$33,IF(J61=33,'[2]Equivalencia BH-BMPT'!$D$34,IF(J61=34,'[2]Equivalencia BH-BMPT'!$D$35,IF(J61=35,'[2]Equivalencia BH-BMPT'!$D$36,IF(J61=36,'[2]Equivalencia BH-BMPT'!$D$37,IF(J61=37,'[2]Equivalencia BH-BMPT'!$D$38,IF(J61=38,'[2]Equivalencia BH-BMPT'!#REF!,IF(J61=39,'[2]Equivalencia BH-BMPT'!$D$40,IF(J61=40,'[2]Equivalencia BH-BMPT'!$D$41,IF(J61=41,'[2]Equivalencia BH-BMPT'!$D$42,IF(J61=42,'[2]Equivalencia BH-BMPT'!$D$43,IF(J61=43,'[2]Equivalencia BH-BMPT'!$D$44,IF(J61=44,'[2]Equivalencia BH-BMPT'!$D$45,IF(J61=45,'[2]Equivalencia BH-BMPT'!$D$46,\"No ha seleccionado un número de programa\")))))))))))))))))))))))))))))))))))))))))))))","v":"Consolidar el turismo como factor de desarrollo, confianza y felicidad para Bogotá Región"},"1394",1026580236,"LAURA ESTHER NIETO ROMERO",17926524,null,null,null,null,17926524,14872375,"2017-08-17","2017-08-24","2017-12-30",126,null,null,null,null,"X",null,0.82962960359744031,false]
[84,2017,"17-13-6897075",2,{"$f":"IF(D62=1,'[2]Tipo '!$B$2,IF(D62=2,'[2]Tipo '!$B$3,IF(D62=3,'[2]Tipo '!$B$4,IF(D62=4,'[2]Tipo '!$B$5,IF(D62=5,'[2]Tipo '!$B$6,IF(D62=6,'[2]Tipo '!$B$7,IF(D62=7,'[2]Tipo '!$B$8,IF(D62=8,'[2]Tipo '!$B$9,IF(D62=9,'[2]Tipo '!$B$10,IF(D62=10,'[2]Tipo '!$B$11,IF(D62=11,'[2]Tipo '!$B$12,IF(D62=12,'[2]Tipo '!$B$13,IF(D62=13,'[2]Tipo '!$B$14,IF(D62=14,'[2]Tipo '!$B$15,IF(D62=15,'[2]Tipo '!$B$16,IF(D62=16,'[2]Tipo '!$B$17,IF(D62=17,'[2]Tipo '!$B$18,IF(D62=18,'[2]Tipo '!$B$19,IF(D62=19,'[2]Tipo '!$B$20,\"No ha seleccionado un tipo de contrato válido\")))))))))))))))))))","v":"CONSULTORÍA"},"Contratación mínima cuantia ","No aplica","“REALIZAR EL RECONOCIMIENTO HISTÓRICO DE LAS CALLES PATRIMONIALES CON EL FIN DE PRESERVAR LA MEMORIA CULTURAL Y EL FOMENTAR EL TURISMO EN LA LOCALIDAD DE LA CANDELARIA”","Inversión",37,{"$f":"IF(J62=1,'[2]Equivalencia BH-BMPT'!$D$2,IF(J62=2,'[2]Equivalencia BH-BMPT'!$D$3,IF(J62=3,'[2]Equivalencia BH-BMPT'!$D$4,IF(J62=4,'[2]Equivalencia BH-BMPT'!$D$5,IF(J62=5,'[2]Equivalencia BH-BMPT'!$D$6,IF(J62=6,'[2]Equivalencia BH-BMPT'!$D$7,IF(J62=7,'[2]Equivalencia BH-BMPT'!$D$8,IF(J62=8,'[2]Equivalencia BH-BMPT'!$D$9,IF(J62=9,'[2]Equivalencia BH-BMPT'!$D$10,IF(J62=10,'[2]Equivalencia BH-BMPT'!$D$11,IF(J62=11,'[2]Equivalencia BH-BMPT'!$D$12,IF(J62=12,'[2]Equivalencia BH-BMPT'!$D$13,IF(J62=13,'[2]Equivalencia BH-BMPT'!$D$14,IF(J62=14,'[2]Equivalencia BH-BMPT'!$D$15,IF(J62=15,'[2]Equivalencia BH-BMPT'!$D$16,IF(J62=16,'[2]Equivalencia BH-BMPT'!$D$17,IF(J62=17,'[2]Equivalencia BH-BMPT'!$D$18,IF(J62=18,'[2]Equivalencia BH-BMPT'!$D$19,IF(J62=19,'[2]Equivalencia BH-BMPT'!$D$20,IF(J62=20,'[2]Equivalencia BH-BMPT'!$D$21,IF(J62=21,'[2]Equivalencia BH-BMPT'!$D$22,IF(J62=22,'[2]Equivalencia BH-BMPT'!$D$23,IF(J62=23,'[2]Equivalencia BH-BMPT'!#REF!,IF(J62=24,'[2]Equivalencia BH-BMPT'!$D$25,IF(J62=25,'[2]Equivalencia BH-BMPT'!$D$26,IF(J62=26,'[2]Equivalencia BH-BMPT'!$D$27,IF(J62=27,'[2]Equivalencia BH-BMPT'!$D$28,IF(J62=28,'[2]Equivalencia BH-BMPT'!$D$29,IF(J62=29,'[2]Equivalencia BH-BMPT'!$D$30,IF(J62=30,'[2]Equivalencia BH-BMPT'!$D$31,IF(J62=31,'[2]Equivalencia BH-BMPT'!$D$32,IF(J62=32,'[2]Equivalencia BH-BMPT'!$D$33,IF(J62=33,'[2]Equivalencia BH-BMPT'!$D$34,IF(J62=34,'[2]Equivalencia BH-BMPT'!$D$35,IF(J62=35,'[2]Equivalencia BH-BMPT'!$D$36,IF(J62=36,'[2]Equivalencia BH-BMPT'!$D$37,IF(J62=37,'[2]Equivalencia BH-BMPT'!$D$38,IF(J62=38,'[2]Equivalencia BH-BMPT'!#REF!,IF(J62=39,'[2]Equivalencia BH-BMPT'!$D$40,IF(J62=40,'[2]Equivalencia BH-BMPT'!$D$41,IF(J62=41,'[2]Equivalencia BH-BMPT'!$D$42,IF(J62=42,'[2]Equivalencia BH-BMPT'!$D$43,IF(J62=43,'[2]Equivalencia BH-BMPT'!$D$44,IF(J62=44,'[2]Equivalencia BH-BMPT'!$D$45,IF(J62=45,'[2]Equivalencia BH-BMPT'!$D$46,\"No ha seleccionado un número de programa\")))))))))))))))))))))))))))))))))))))))))))))","v":"Consolidar el turismo como factor de desarrollo, confianza y felicidad para Bogotá Región"},"1394",8301426547,"FUNDACION AFFIC",16263250,null,null,null,null,16263250,null,"2017-08-22","2017-08-28","2017-11-21",85,null,null,null,null,"X",null,0,false]
[93,2017,"17-116986615",11,{"$f":"IF(D63=1,'[3]Tipo '!$B$2,IF(D63=2,'[3]Tipo '!$B$3,IF(D63=3,'[3]Tipo '!$B$4,IF(D63=4,'[3]Tipo '!$B$5,IF(D63=5,'[3]Tipo '!$B$6,IF(D63=6,'[3]Tipo '!$B$7,IF(D63=7,'[3]Tipo '!$B$8,IF(D63=8,'[3]Tipo '!$B$9,IF(D63=9,'[3]Tipo '!$B$10,IF(D63=10,'[3]Tipo '!$B$11,IF(D63=11,'[3]Tipo '!$B$12,IF(D63=12,'[3]Tipo '!$B$13,IF(D63=13,'[3]Tipo '!$B$14,IF(D63=14,'[3]Tipo '!$B$15,IF(D63=15,'[3]Tipo '!$B$16,IF(D63=16,'[3]Tipo '!$B$17,IF(D63=17,'[3]Tipo '!$B$18,IF(D63=18,'[3]Tipo '!$B$19,IF(D63=19,'[3]Tipo '!$B$20,\"No ha seleccionado un tipo de contrato válido\")))))))))))))))))))","v":"SUMINISTRO"},"Selección abreviada ","Selección abreviada por menor cuantía ","DESARROLLAR EL LABORATORIO DE INNOVACIÓN LABITUR CANDELARIA PARA FORTALECER EL PROYECTO TURÍSTICO DE LA CANDELARIA","Inversión",37,{"$f":"IF(J63=1,'[3]Equivalencia BH-BMPT'!$D$2,IF(J63=2,'[3]Equivalencia BH-BMPT'!$D$3,IF(J63=3,'[3]Equivalencia BH-BMPT'!$D$4,IF(J63=4,'[3]Equivalencia BH-BMPT'!$D$5,IF(J63=5,'[3]Equivalencia BH-BMPT'!$D$6,IF(J63=6,'[3]Equivalencia BH-BMPT'!$D$7,IF(J63=7,'[3]Equivalencia BH-BMPT'!$D$8,IF(J63=8,'[3]Equivalencia BH-BMPT'!$D$9,IF(J63=9,'[3]Equivalencia BH-BMPT'!$D$10,IF(J63=10,'[3]Equivalencia BH-BMPT'!$D$11,IF(J63=11,'[3]Equivalencia BH-BMPT'!$D$12,IF(J63=12,'[3]Equivalencia BH-BMPT'!$D$13,IF(J63=13,'[3]Equivalencia BH-BMPT'!$D$14,IF(J63=14,'[3]Equivalencia BH-BMPT'!$D$15,IF(J63=15,'[3]Equivalencia BH-BMPT'!$D$16,IF(J63=16,'[3]Equivalencia BH-BMPT'!$D$17,IF(J63=17,'[3]Equivalencia BH-BMPT'!$D$18,IF(J63=18,'[3]Equivalencia BH-BMPT'!$D$19,IF(J63=19,'[3]Equivalencia BH-BMPT'!$D$20,IF(J63=20,'[3]Equivalencia BH-BMPT'!$D$21,IF(J63=21,'[3]Equivalencia BH-BMPT'!$D$22,IF(J63=22,'[3]Equivalencia BH-BMPT'!$D$23,IF(J63=23,'[3]Equivalencia BH-BMPT'!#REF!,IF(J63=24,'[3]Equivalencia BH-BMPT'!$D$25,IF(J63=25,'[3]Equivalencia BH-BMPT'!$D$26,IF(J63=26,'[3]Equivalencia BH-BMPT'!$D$27,IF(J63=27,'[3]Equivalencia BH-BMPT'!$D$28,IF(J63=28,'[3]Equivalencia BH-BMPT'!$D$29,IF(J63=29,'[3]Equivalencia BH-BMPT'!$D$30,IF(J63=30,'[3]Equivalencia BH-BMPT'!$D$31,IF(J63=31,'[3]Equivalencia BH-BMPT'!$D$32,IF(J63=32,'[3]Equivalencia BH-BMPT'!$D$33,IF(J63=33,'[3]Equivalencia BH-BMPT'!$D$34,IF(J63=34,'[3]Equivalencia BH-BMPT'!$D$35,IF(J63=35,'[3]Equivalencia BH-BMPT'!$D$36,IF(J63=36,'[3]Equivalencia BH-BMPT'!$D$37,IF(J63=37,'[3]Equivalencia BH-BMPT'!$D$38,IF(J63=38,'[3]Equivalencia BH-BMPT'!#REF!,IF(J63=39,'[3]Equivalencia BH-BMPT'!$D$40,IF(J63=40,'[3]Equivalencia BH-BMPT'!$D$41,IF(J63=41,'[3]Equivalencia BH-BMPT'!$D$42,IF(J63=42,'[3]Equivalencia BH-BMPT'!$D$43,IF(J63=43,'[3]Equivalencia BH-BMPT'!$D$44,IF(J63=44,'[3]Equivalencia BH-BMPT'!$D$45,IF(J63=45,'[3]Equivalencia BH-BMPT'!$D$46,\"No ha seleccionado un número de programa\")))))))))))))))))))))))))))))))))))))))))))))","v":"Consolidar el turismo como factor de desarrollo, confianza y felicidad para Bogotá Región"},"1394",8300896486,"CORPORACION TOPOFILIA",172463000,null,null,null,null,172463000,null,"2017-10-03","2017-10-05","2018-04-04",180,null,null,null,"X",null,null,0,false]
[1,2017,"16-13-5981831",7,{"$f":"IF(D64=1,'[1]Tipo '!$B$2,IF(D64=2,'[1]Tipo '!$B$3,IF(D64=3,'[1]Tipo '!$B$4,IF(D64=4,'[1]Tipo '!$B$5,IF(D64=5,'[1]Tipo '!$B$6,IF(D64=6,'[1]Tipo '!$B$7,IF(D64=7,'[1]Tipo '!$B$8,IF(D64=8,'[1]Tipo '!$B$9,IF(D64=9,'[1]Tipo '!$B$10,IF(D64=10,'[1]Tipo '!$B$11,IF(D64=11,'[1]Tipo '!$B$12,IF(D64=12,'[1]Tipo '!$B$13,IF(D64=13,'[1]Tipo '!$B$14,IF(D64=14,'[1]Tipo '!$B$15,IF(D64=15,'[1]Tipo '!$B$16,IF(D64=16,'[1]Tipo '!$B$17,IF(D64=17,'[1]Tipo '!$B$18,IF(D64=18,'[1]Tipo '!$B$19,IF(D64=19,'[1]Tipo '!$B$20,\"No ha seleccionado un tipo de contrato válido\")))))))))))))))))))","v":"COMPRAVENTA DE BIENES INMUEBLES"},"Contratación mínima cuantia ","No aplica","ADQUISICIÓN Y ENTREGA DE DOTACIÓN PARA LA JUNTA ADMINISTRADORA LOCAL DE LA CANDELARIA","Inversión",45,{"$f":"IF(J64=1,'[1]Equivalencia BH-BMPT'!$D$2,IF(J64=2,'[1]Equivalencia BH-BMPT'!$D$3,IF(J64=3,'[1]Equivalencia BH-BMPT'!$D$4,IF(J64=4,'[1]Equivalencia BH-BMPT'!$D$5,IF(J64=5,'[1]Equivalencia BH-BMPT'!$D$6,IF(J64=6,'[1]Equivalencia BH-BMPT'!$D$7,IF(J64=7,'[1]Equivalencia BH-BMPT'!$D$8,IF(J64=8,'[1]Equivalencia BH-BMPT'!$D$9,IF(J64=9,'[1]Equivalencia BH-BMPT'!$D$10,IF(J64=10,'[1]Equivalencia BH-BMPT'!$D$11,IF(J64=11,'[1]Equivalencia BH-BMPT'!$D$12,IF(J64=12,'[1]Equivalencia BH-BMPT'!$D$13,IF(J64=13,'[1]Equivalencia BH-BMPT'!$D$14,IF(J64=14,'[1]Equivalencia BH-BMPT'!$D$15,IF(J64=15,'[1]Equivalencia BH-BMPT'!$D$16,IF(J64=16,'[1]Equivalencia BH-BMPT'!$D$17,IF(J64=17,'[1]Equivalencia BH-BMPT'!$D$18,IF(J64=18,'[1]Equivalencia BH-BMPT'!$D$19,IF(J64=19,'[1]Equivalencia BH-BMPT'!$D$20,IF(J64=20,'[1]Equivalencia BH-BMPT'!$D$21,IF(J64=21,'[1]Equivalencia BH-BMPT'!$D$22,IF(J64=22,'[1]Equivalencia BH-BMPT'!$D$23,IF(J64=23,'[1]Equivalencia BH-BMPT'!D24,IF(J64=24,'[1]Equivalencia BH-BMPT'!$D$25,IF(J64=25,'[1]Equivalencia BH-BMPT'!$D$26,IF(J64=26,'[1]Equivalencia BH-BMPT'!$D$27,IF(J64=27,'[1]Equivalencia BH-BMPT'!$D$28,IF(J64=28,'[1]Equivalencia BH-BMPT'!$D$29,IF(J64=29,'[1]Equivalencia BH-BMPT'!$D$30,IF(J64=30,'[1]Equivalencia BH-BMPT'!$D$31,IF(J64=31,'[1]Equivalencia BH-BMPT'!$D$32,IF(J64=32,'[1]Equivalencia BH-BMPT'!$D$33,IF(J64=33,'[1]Equivalencia BH-BMPT'!$D$34,IF(J64=34,'[1]Equivalencia BH-BMPT'!$D$35,IF(J64=35,'[1]Equivalencia BH-BMPT'!$D$36,IF(J64=36,'[1]Equivalencia BH-BMPT'!$D$37,IF(J64=37,'[1]Equivalencia BH-BMPT'!$D$38,IF(J64=38,'[1]Equivalencia BH-BMPT'!D39,IF(J64=39,'[1]Equivalencia BH-BMPT'!$D$40,IF(J64=40,'[1]Equivalencia BH-BMPT'!$D$41,IF(J64=41,'[1]Equivalencia BH-BMPT'!$D$42,IF(J64=42,'[1]Equivalencia BH-BMPT'!$D$43,IF(J64=43,'[1]Equivalencia BH-BMPT'!$D$44,IF(J64=44,'[1]Equivalencia BH-BMPT'!$D$45,IF(J64=45,'[1]Equivalencia BH-BMPT'!$D$46,\"No ha seleccionado un número de programa\")))))))))))))))))))))))))))))))))))))))))))))","v":"Gobernanza e influencia local, regional e internacional"},"1395",1010161089,"JHONSON ALEXANDER PLAZAS",11577087,null,null,null,null,11577087,null,"2017-01-16","2017-02-16","2017-03-15",30,null,null,null,null,"X",null,0,false]
[3,2017,"17-12-6298820",5,{"$f":"IF(D65=1,'[1]Tipo '!$B$2,IF(D65=2,'[1]Tipo '!$B$3,IF(D65=3,'[1]Tipo '!$B$4,IF(D65=4,'[1]Tipo '!$B$5,IF(D65=5,'[1]Tipo '!$B$6,IF(D65=6,'[1]Tipo '!$B$7,IF(D65=7,'[1]Tipo '!$B$8,IF(D65=8,'[1]Tipo '!$B$9,IF(D65=9,'[1]Tipo '!$B$10,IF(D65=10,'[1]Tipo '!$B$11,IF(D65=11,'[1]Tipo '!$B$12,IF(D65=12,'[1]Tipo '!$B$13,IF(D65=13,'[1]Tipo '!$B$14,IF(D65=14,'[1]Tipo '!$B$15,IF(D65=15,'[1]Tipo '!$B$16,IF(D65=16,'[1]Tipo '!$B$17,IF(D65=17,'[1]Tipo '!$B$18,IF(D65=18,'[1]Tipo '!$B$19,IF(D65=19,'[1]Tipo '!$B$20,\"No ha seleccionado un tipo de contrato válido\")))))))))))))))))))","v":"CONTRATOS DE PRESTACIÓN DE SERVICIOS PROFESIONALES Y DE APOYO A LA GESTIÓN"},"Contratación directa","Prestación de servicios profesionales y de apoyo a la gestión, o para la ejecución de trabajos artísticos que sólo puedan encomendarse a determinadas personas naturales;","PRESTAR SUS SERVICIOS PROFESIONALES A LA GESTIÓN DE LA LOCALIDAD DE LA CANDELARIA PARA LOGRAR LA SOSTENIBILIDAD EN LA IMPLEMENTACIÓN Y EVALUACIÓN DEL SISTEMA DE GESTIÓN DE CALIDAD Y PLANES DE MEJORAMIENTO","Inversión",45,{"$f":"IF(J65=1,'[1]Equivalencia BH-BMPT'!$D$2,IF(J65=2,'[1]Equivalencia BH-BMPT'!$D$3,IF(J65=3,'[1]Equivalencia BH-BMPT'!$D$4,IF(J65=4,'[1]Equivalencia BH-BMPT'!$D$5,IF(J65=5,'[1]Equivalencia BH-BMPT'!$D$6,IF(J65=6,'[1]Equivalencia BH-BMPT'!$D$7,IF(J65=7,'[1]Equivalencia BH-BMPT'!$D$8,IF(J65=8,'[1]Equivalencia BH-BMPT'!$D$9,IF(J65=9,'[1]Equivalencia BH-BMPT'!$D$10,IF(J65=10,'[1]Equivalencia BH-BMPT'!$D$11,IF(J65=11,'[1]Equivalencia BH-BMPT'!$D$12,IF(J65=12,'[1]Equivalencia BH-BMPT'!$D$13,IF(J65=13,'[1]Equivalencia BH-BMPT'!$D$14,IF(J65=14,'[1]Equivalencia BH-BMPT'!$D$15,IF(J65=15,'[1]Equivalencia BH-BMPT'!$D$16,IF(J65=16,'[1]Equivalencia BH-BMPT'!$D$17,IF(J65=17,'[1]Equivalencia BH-BMPT'!$D$18,IF(J65=18,'[1]Equivalencia BH-BMPT'!$D$19,IF(J65=19,'[1]Equivalencia BH-BMPT'!$D$20,IF(J65=20,'[1]Equivalencia BH-BMPT'!$D$21,IF(J65=21,'[1]Equivalencia BH-BMPT'!$D$22,IF(J65=22,'[1]Equivalencia BH-BMPT'!$D$23,IF(J65=23,'[1]Equivalencia BH-BMPT'!#REF!,IF(J65=24,'[1]Equivalencia BH-BMPT'!$D$25,IF(J65=25,'[1]Equivalencia BH-BMPT'!$D$26,IF(J65=26,'[1]Equivalencia BH-BMPT'!$D$27,IF(J65=27,'[1]Equivalencia BH-BMPT'!$D$28,IF(J65=28,'[1]Equivalencia BH-BMPT'!$D$29,IF(J65=29,'[1]Equivalencia BH-BMPT'!$D$30,IF(J65=30,'[1]Equivalencia BH-BMPT'!$D$31,IF(J65=31,'[1]Equivalencia BH-BMPT'!$D$32,IF(J65=32,'[1]Equivalencia BH-BMPT'!$D$33,IF(J65=33,'[1]Equivalencia BH-BMPT'!$D$34,IF(J65=34,'[1]Equivalencia BH-BMPT'!$D$35,IF(J65=35,'[1]Equivalencia BH-BMPT'!$D$36,IF(J65=36,'[1]Equivalencia BH-BMPT'!$D$37,IF(J65=37,'[1]Equivalencia BH-BMPT'!$D$38,IF(J65=38,'[1]Equivalencia BH-BMPT'!#REF!,IF(J65=39,'[1]Equivalencia BH-BMPT'!$D$40,IF(J65=40,'[1]Equivalencia BH-BMPT'!$D$41,IF(J65=41,'[1]Equivalencia BH-BMPT'!$D$42,IF(J65=42,'[1]Equivalencia BH-BMPT'!$D$43,IF(J65=43,'[1]Equivalencia BH-BMPT'!$D$44,IF(J65=44,'[1]Equivalencia BH-BMPT'!$D$45,IF(J65=45,'[1]Equivalencia BH-BMPT'!$D$46,\"No ha seleccionado un número de programa\")))))))))))))))))))))))))))))))))))))))))))))","v":"Gobernanza e influencia local, regional e internacional"},"1395",52960567,"Dimelza Mendoza Rueda",50312299,null,null,null,null,50312299,32931684,"2017-02-01","2017-02-02","2018-05-17",330,null,null,null,"X",null,null,{"$f":"SUM(U65/T65)","v":0.65454540250685023},false]
[4,2017,"17-12-6298879",5,{"$f":"IF(D66=1,'[1]Tipo '!$B$2,IF(D66=2,'[1]Tipo '!$B$3,IF(D66=3,'[1]Tipo '!$B$4,IF(D66=4,'[1]Tipo '!$B$5,IF(D66=5,'[1]Tipo '!$B$6,IF(D66=6,'[1]Tipo '!$B$7,IF(D66=7,'[1]Tipo '!$B$8,IF(D66=8,'[1]Tipo '!$B$9,IF(D66=9,'[1]Tipo '!$B$10,IF(D66=10,'[1]Tipo '!$B$11,IF(D66=11,'[1]Tipo '!$B$12,IF(D66=12,'[1]Tipo '!$B$13,IF(D66=13,'[1]Tipo '!$B$14,IF(D66=14,'[1]Tipo '!$B$15,IF(D66=15,'[1]Tipo '!$B$16,IF(D66=16,'[1]Tipo '!$B$17,IF(D66=17,'[1]Tipo '!$B$18,IF(D66=18,'[1]Tipo '!$B$19,IF(D66=19,'[1]Tipo '!$B$20,\"No ha seleccionado un tipo de contrato válido\")))))))))))))))))))","v":"CONTRATOS DE PRESTACIÓN DE SERVICIOS PROFESIONALES Y DE APOYO A LA GESTIÓN"},"Contratación directa","Prestación de servicios profesionales y de apoyo a la gestión, o para la ejecución de trabajos artísticos que sólo puedan encomendarse a determinadas personas naturales;","\"Contratar la prestación de servicios de un profesional para que coordine las instancias de participación y espacios que encuentren en cabeza del área de gestión de desarrollo local y gestión policial  de la Candelaria  y apoye los procesos de formulación y seguimiento de los programas y proyectos del plan de desarrollo local con énfasis en el programa \"GOBERNANZA E INFLUENCIA LOCAL, REGIONAL E INTERNACIONAL - PROYECTO 1396 CANDELARIA MAS PARTICIPATIVA\"","Inversión",45,{"$f":"IF(J66=1,'[1]Equivalencia BH-BMPT'!$D$2,IF(J66=2,'[1]Equivalencia BH-BMPT'!$D$3,IF(J66=3,'[1]Equivalencia BH-BMPT'!$D$4,IF(J66=4,'[1]Equivalencia BH-BMPT'!$D$5,IF(J66=5,'[1]Equivalencia BH-BMPT'!$D$6,IF(J66=6,'[1]Equivalencia BH-BMPT'!$D$7,IF(J66=7,'[1]Equivalencia BH-BMPT'!$D$8,IF(J66=8,'[1]Equivalencia BH-BMPT'!$D$9,IF(J66=9,'[1]Equivalencia BH-BMPT'!$D$10,IF(J66=10,'[1]Equivalencia BH-BMPT'!$D$11,IF(J66=11,'[1]Equivalencia BH-BMPT'!$D$12,IF(J66=12,'[1]Equivalencia BH-BMPT'!$D$13,IF(J66=13,'[1]Equivalencia BH-BMPT'!$D$14,IF(J66=14,'[1]Equivalencia BH-BMPT'!$D$15,IF(J66=15,'[1]Equivalencia BH-BMPT'!$D$16,IF(J66=16,'[1]Equivalencia BH-BMPT'!$D$17,IF(J66=17,'[1]Equivalencia BH-BMPT'!$D$18,IF(J66=18,'[1]Equivalencia BH-BMPT'!$D$19,IF(J66=19,'[1]Equivalencia BH-BMPT'!$D$20,IF(J66=20,'[1]Equivalencia BH-BMPT'!$D$21,IF(J66=21,'[1]Equivalencia BH-BMPT'!$D$22,IF(J66=22,'[1]Equivalencia BH-BMPT'!$D$23,IF(J66=23,'[1]Equivalencia BH-BMPT'!#REF!,IF(J66=24,'[1]Equivalencia BH-BMPT'!$D$25,IF(J66=25,'[1]Equivalencia BH-BMPT'!$D$26,IF(J66=26,'[1]Equivalencia BH-BMPT'!$D$27,IF(J66=27,'[1]Equivalencia BH-BMPT'!$D$28,IF(J66=28,'[1]Equivalencia BH-BMPT'!$D$29,IF(J66=29,'[1]Equivalencia BH-BMPT'!$D$30,IF(J66=30,'[1]Equivalencia BH-BMPT'!$D$31,IF(J66=31,'[1]Equivalencia BH-BMPT'!$D$32,IF(J66=32,'[1]Equivalencia BH-BMPT'!$D$33,IF(J66=33,'[1]Equivalencia BH-BMPT'!$D$34,IF(J66=34,'[1]Equivalencia BH-BMPT'!$D$35,IF(J66=35,'[1]Equivalencia BH-BMPT'!$D$36,IF(J66=36,'[1]Equivalencia BH-BMPT'!$D$37,IF(J66=37,'[1]Equivalencia BH-BMPT'!$D$38,IF(J66=38,'[1]Equivalencia BH-BMPT'!#REF!,IF(J66=39,'[1]Equivalencia BH-BMPT'!$D$40,IF(J66=40,'[1]Equivalencia BH-BMPT'!$D$41,IF(J66=41,'[1]Equivalencia BH-BMPT'!$D$42,IF(J66=42,'[1]Equivalencia BH-BMPT'!$D$43,IF(J66=43,'[1]Equivalencia BH-BMPT'!$D$44,IF(J66=44,'[1]Equivalencia BH-BMPT'!$D$45,IF(J66=45,'[1]Equivalencia BH-BMPT'!$D$46,\"No ha seleccionado un número de programa\")))))))))))))))))))))))))))))))))))))))))))))","v":"Gobernanza e influencia local, regional e internacional"},"1395",92533809,"Julio Cesar García Sierra",55181232,null,null,null,2508238,{"$f":"O66+Q66+S66","v":57689470},51836919,"2017-02-01","2017-02-06","2018-01-14",345,null,null,null,null,"X",null,0.8985507927183245,false]
[5,2017,"17-12-6298937",5,{"$f":"IF(D67=1,'[1]Tipo '!$B$2,IF(D67=2,'[1]Tipo '!$B$3,IF(D67=3,'[1]Tipo '!$B$4,IF(D67=4,'[1]Tipo '!$B$5,IF(D67=5,'[1]Tipo '!$B$6,IF(D67=6,'[1]Tipo '!$B$7,IF(D67=7,'[1]Tipo '!$B$8,IF(D67=8,'[1]Tipo '!$B$9,IF(D67=9,'[1]Tipo '!$B$10,IF(D67=10,'[1]Tipo '!$B$11,IF(D67=11,'[1]Tipo '!$B$12,IF(D67=12,'[1]Tipo '!$B$13,IF(D67=13,'[1]Tipo '!$B$14,IF(D67=14,'[1]Tipo '!$B$15,IF(D67=15,'[1]Tipo '!$B$16,IF(D67=16,'[1]Tipo '!$B$17,IF(D67=17,'[1]Tipo '!$B$18,IF(D67=18,'[1]Tipo '!$B$19,IF(D67=19,'[1]Tipo '!$B$20,\"No ha seleccionado un tipo de contrato válido\")))))))))))))))))))","v":"CONTRATOS DE PRESTACIÓN DE SERVICIOS PROFESIONALES Y DE APOYO A LA GESTIÓN"},"Contratación directa","Prestación de servicios profesionales y de apoyo a la gestión, o para la ejecución de trabajos artísticos que sólo puedan encomendarse a determinadas personas naturales;","PRESTAR LOS SERVICIOS COMO CONDUCTOR DE APOYO DE LOS VEHICULOS DE PROPIEDAD DEL FONDO DE DESARROLLO LOCAL DE LA CANDELARIA","Inversión",45,{"$f":"IF(J67=1,'[1]Equivalencia BH-BMPT'!$D$2,IF(J67=2,'[1]Equivalencia BH-BMPT'!$D$3,IF(J67=3,'[1]Equivalencia BH-BMPT'!$D$4,IF(J67=4,'[1]Equivalencia BH-BMPT'!$D$5,IF(J67=5,'[1]Equivalencia BH-BMPT'!$D$6,IF(J67=6,'[1]Equivalencia BH-BMPT'!$D$7,IF(J67=7,'[1]Equivalencia BH-BMPT'!$D$8,IF(J67=8,'[1]Equivalencia BH-BMPT'!$D$9,IF(J67=9,'[1]Equivalencia BH-BMPT'!$D$10,IF(J67=10,'[1]Equivalencia BH-BMPT'!$D$11,IF(J67=11,'[1]Equivalencia BH-BMPT'!$D$12,IF(J67=12,'[1]Equivalencia BH-BMPT'!$D$13,IF(J67=13,'[1]Equivalencia BH-BMPT'!$D$14,IF(J67=14,'[1]Equivalencia BH-BMPT'!$D$15,IF(J67=15,'[1]Equivalencia BH-BMPT'!$D$16,IF(J67=16,'[1]Equivalencia BH-BMPT'!$D$17,IF(J67=17,'[1]Equivalencia BH-BMPT'!$D$18,IF(J67=18,'[1]Equivalencia BH-BMPT'!$D$19,IF(J67=19,'[1]Equivalencia BH-BMPT'!$D$20,IF(J67=20,'[1]Equivalencia BH-BMPT'!$D$21,IF(J67=21,'[1]Equivalencia BH-BMPT'!$D$22,IF(J67=22,'[1]Equivalencia BH-BMPT'!$D$23,IF(J67=23,'[1]Equivalencia BH-BMPT'!#REF!,IF(J67=24,'[1]Equivalencia BH-BMPT'!$D$25,IF(J67=25,'[1]Equivalencia BH-BMPT'!$D$26,IF(J67=26,'[1]Equivalencia BH-BMPT'!$D$27,IF(J67=27,'[1]Equivalencia BH-BMPT'!$D$28,IF(J67=28,'[1]Equivalencia BH-BMPT'!$D$29,IF(J67=29,'[1]Equivalencia BH-BMPT'!$D$30,IF(J67=30,'[1]Equivalencia BH-BMPT'!$D$31,IF(J67=31,'[1]Equivalencia BH-BMPT'!$D$32,IF(J67=32,'[1]Equivalencia BH-BMPT'!$D$33,IF(J67=33,'[1]Equivalencia BH-BMPT'!$D$34,IF(J67=34,'[1]Equivalencia BH-BMPT'!$D$35,IF(J67=35,'[1]Equivalencia BH-BMPT'!$D$36,IF(J67=36,'[1]Equivalencia BH-BMPT'!$D$37,IF(J67=37,'[1]Equivalencia BH-BMPT'!$D$38,IF(J67=38,'[1]Equivalencia BH-BMPT'!#REF!,IF(J67=39,'[1]Equivalencia BH-BMPT'!$D$40,IF(J67=40,'[1]Equivalencia BH-BMPT'!$D$41,IF(J67=41,'[1]Equivalencia BH-BMPT'!$D$42,IF(J67=42,'[1]Equivalencia BH-BMPT'!$D$43,IF(J67=43,'[1]Equivalencia BH-BMPT'!$D$44,IF(J67=44,'[1]Equivalencia BH-BMPT'!$D$45,IF(J67=45,'[1]Equivalencia BH-BMPT'!$D$46,\"No ha seleccionado un número de programa\")))))))))))))))))))))))))))))))))))))))))))))","v":"Gobernanza e influencia local, regional e internacional"},"1395",17956185,"Carlos Arturo  Cardenas ",22721684,null,null,null,1032804,23754488,21688884,"2017-02-01","2017-02-01","2018-01-14",345,null,null,null,null,"X",null,0.91304363200756,false]
[6,2017,"17-12-6298990",5,{"$f":"IF(D68=1,'[1]Tipo '!$B$2,IF(D68=2,'[1]Tipo '!$B$3,IF(D68=3,'[1]Tipo '!$B$4,IF(D68=4,'[1]Tipo '!$B$5,IF(D68=5,'[1]Tipo '!$B$6,IF(D68=6,'[1]Tipo '!$B$7,IF(D68=7,'[1]Tipo '!$B$8,IF(D68=8,'[1]Tipo '!$B$9,IF(D68=9,'[1]Tipo '!$B$10,IF(D68=10,'[1]Tipo '!$B$11,IF(D68=11,'[1]Tipo '!$B$12,IF(D68=12,'[1]Tipo '!$B$13,IF(D68=13,'[1]Tipo '!$B$14,IF(D68=14,'[1]Tipo '!$B$15,IF(D68=15,'[1]Tipo '!$B$16,IF(D68=16,'[1]Tipo '!$B$17,IF(D68=17,'[1]Tipo '!$B$18,IF(D68=18,'[1]Tipo '!$B$19,IF(D68=19,'[1]Tipo '!$B$20,\"No ha seleccionado un tipo de contrato válido\")))))))))))))))))))","v":"CONTRATOS DE PRESTACIÓN DE SERVICIOS PROFESIONALES Y DE APOYO A LA GESTIÓN"},"Contratación directa","Prestación de servicios profesionales y de apoyo a la gestión, o para la ejecución de trabajos artísticos que sólo puedan encomendarse a determinadas personas naturales;","PRESTAR SUS SERVICIOS PROFESIONALES  PARA APOYAR AL GRUPO DE GESTIÓN DE DESARROLLO LOCAL DEL FONDO DE DESARROLLO LOCAL DE LA CANDELARIA, EN LOS PROCESOS DE FORMULACIÓN Y SEGUIMIENTO DE LOS PROGRAMAS Y PROYECTOS DEL PLAN DE DESARROLLO LOCAL CON ENFASIS EN EL PROGRAMA “SEGURIDAD Y CONVICENCIA PARA TODOS” - PROYECTO 1392 “CANDELARIA MAS SEGURA PARA TODOS","Inversión",45,{"$f":"IF(J68=1,'[1]Equivalencia BH-BMPT'!$D$2,IF(J68=2,'[1]Equivalencia BH-BMPT'!$D$3,IF(J68=3,'[1]Equivalencia BH-BMPT'!$D$4,IF(J68=4,'[1]Equivalencia BH-BMPT'!$D$5,IF(J68=5,'[1]Equivalencia BH-BMPT'!$D$6,IF(J68=6,'[1]Equivalencia BH-BMPT'!$D$7,IF(J68=7,'[1]Equivalencia BH-BMPT'!$D$8,IF(J68=8,'[1]Equivalencia BH-BMPT'!$D$9,IF(J68=9,'[1]Equivalencia BH-BMPT'!$D$10,IF(J68=10,'[1]Equivalencia BH-BMPT'!$D$11,IF(J68=11,'[1]Equivalencia BH-BMPT'!$D$12,IF(J68=12,'[1]Equivalencia BH-BMPT'!$D$13,IF(J68=13,'[1]Equivalencia BH-BMPT'!$D$14,IF(J68=14,'[1]Equivalencia BH-BMPT'!$D$15,IF(J68=15,'[1]Equivalencia BH-BMPT'!$D$16,IF(J68=16,'[1]Equivalencia BH-BMPT'!$D$17,IF(J68=17,'[1]Equivalencia BH-BMPT'!$D$18,IF(J68=18,'[1]Equivalencia BH-BMPT'!$D$19,IF(J68=19,'[1]Equivalencia BH-BMPT'!$D$20,IF(J68=20,'[1]Equivalencia BH-BMPT'!$D$21,IF(J68=21,'[1]Equivalencia BH-BMPT'!$D$22,IF(J68=22,'[1]Equivalencia BH-BMPT'!$D$23,IF(J68=23,'[1]Equivalencia BH-BMPT'!#REF!,IF(J68=24,'[1]Equivalencia BH-BMPT'!$D$25,IF(J68=25,'[1]Equivalencia BH-BMPT'!$D$26,IF(J68=26,'[1]Equivalencia BH-BMPT'!$D$27,IF(J68=27,'[1]Equivalencia BH-BMPT'!$D$28,IF(J68=28,'[1]Equivalencia BH-BMPT'!$D$29,IF(J68=29,'[1]Equivalencia BH-BMPT'!$D$30,IF(J68=30,'[1]Equivalencia BH-BMPT'!$D$31,IF(J68=31,'[1]Equivalencia BH-BMPT'!$D$32,IF(J68=32,'[1]Equivalencia BH-BMPT'!$D$33,IF(J68=33,'[1]Equivalencia BH-BMPT'!$D$34,IF(J68=34,'[1]Equivalencia BH-BMPT'!$D$35,IF(J68=35,'[1]Equivalencia BH-BMPT'!$D$36,IF(J68=36,'[1]Equivalencia BH-BMPT'!$D$37,IF(J68=37,'[1]Equivalencia BH-BMPT'!$D$38,IF(J68=38,'[1]Equivalencia BH-BMPT'!#REF!,IF(J68=39,'[1]Equivalencia BH-BMPT'!$D$40,IF(J68=40,'[1]Equivalencia BH-BMPT'!$D$41,IF(J68=41,'[1]Equivalencia BH-BMPT'!$D$42,IF(J68=42,'[1]Equivalencia BH-BMPT'!$D$43,IF(J68=43,'[1]Equivalencia BH-BMPT'!$D$44,IF(J68=44,'[1]Equivalencia BH-BMPT'!$D$45,IF(J68=45,'[1]Equivalencia BH-BMPT'!$D$46,\"No ha seleccionado un número de programa\")))))))))))))))))))))))))))))))))))))))))))))","v":"Gobernanza e influencia local, regional e internacional"},"1395",79753796,"Ismael Alberto Rengifo Pelaez",55181232,null,null,null,null,55181232,52505538,"2017-02-01","2017-02-02","2017-12-30",330,null,null,null,null,"X",null,0.95151079627943069,false]
[7,2017,"17-12-6299063",5,{"$f":"IF(D69=1,'[1]Tipo '!$B$2,IF(D69=2,'[1]Tipo '!$B$3,IF(D69=3,'[1]Tipo '!$B$4,IF(D69=4,'[1]Tipo '!$B$5,IF(D69=5,'[1]Tipo '!$B$6,IF(D69=6,'[1]Tipo '!$B$7,IF(D69=7,'[1]Tipo '!$B$8,IF(D69=8,'[1]Tipo '!$B$9,IF(D69=9,'[1]Tipo '!$B$10,IF(D69=10,'[1]Tipo '!$B$11,IF(D69=11,'[1]Tipo '!$B$12,IF(D69=12,'[1]Tipo '!$B$13,IF(D69=13,'[1]Tipo '!$B$14,IF(D69=14,'[1]Tipo '!$B$15,IF(D69=15,'[1]Tipo '!$B$16,IF(D69=16,'[1]Tipo '!$B$17,IF(D69=17,'[1]Tipo '!$B$18,IF(D69=18,'[1]Tipo '!$B$19,IF(D69=19,'[1]Tipo '!$B$20,\"No ha seleccionado un tipo de contrato válido\")))))))))))))))))))","v":"CONTRATOS DE PRESTACIÓN DE SERVICIOS PROFESIONALES Y DE APOYO A LA GESTIÓN"},"Contratación directa","Prestación de servicios profesionales y de apoyo a la gestión, o para la ejecución de trabajos artísticos que sólo puedan encomendarse a determinadas personas naturales;","PRESTAR SUS SERVICIOS PROFESIONALES DE APOYO COMO ADMINISTRADOR DE VOZ Y DATOS Y DEMÁS INFRAESTRUCTURA TECNOLÓGICA EN LA ALCADÍA LOCAL DE LA CANDELARIA","Inversión",45,{"$f":"IF(J69=1,'[1]Equivalencia BH-BMPT'!$D$2,IF(J69=2,'[1]Equivalencia BH-BMPT'!$D$3,IF(J69=3,'[1]Equivalencia BH-BMPT'!$D$4,IF(J69=4,'[1]Equivalencia BH-BMPT'!$D$5,IF(J69=5,'[1]Equivalencia BH-BMPT'!$D$6,IF(J69=6,'[1]Equivalencia BH-BMPT'!$D$7,IF(J69=7,'[1]Equivalencia BH-BMPT'!$D$8,IF(J69=8,'[1]Equivalencia BH-BMPT'!$D$9,IF(J69=9,'[1]Equivalencia BH-BMPT'!$D$10,IF(J69=10,'[1]Equivalencia BH-BMPT'!$D$11,IF(J69=11,'[1]Equivalencia BH-BMPT'!$D$12,IF(J69=12,'[1]Equivalencia BH-BMPT'!$D$13,IF(J69=13,'[1]Equivalencia BH-BMPT'!$D$14,IF(J69=14,'[1]Equivalencia BH-BMPT'!$D$15,IF(J69=15,'[1]Equivalencia BH-BMPT'!$D$16,IF(J69=16,'[1]Equivalencia BH-BMPT'!$D$17,IF(J69=17,'[1]Equivalencia BH-BMPT'!$D$18,IF(J69=18,'[1]Equivalencia BH-BMPT'!$D$19,IF(J69=19,'[1]Equivalencia BH-BMPT'!$D$20,IF(J69=20,'[1]Equivalencia BH-BMPT'!$D$21,IF(J69=21,'[1]Equivalencia BH-BMPT'!$D$22,IF(J69=22,'[1]Equivalencia BH-BMPT'!$D$23,IF(J69=23,'[1]Equivalencia BH-BMPT'!#REF!,IF(J69=24,'[1]Equivalencia BH-BMPT'!$D$25,IF(J69=25,'[1]Equivalencia BH-BMPT'!$D$26,IF(J69=26,'[1]Equivalencia BH-BMPT'!$D$27,IF(J69=27,'[1]Equivalencia BH-BMPT'!$D$28,IF(J69=28,'[1]Equivalencia BH-BMPT'!$D$29,IF(J69=29,'[1]Equivalencia BH-BMPT'!$D$30,IF(J69=30,'[1]Equivalencia BH-BMPT'!$D$31,IF(J69=31,'[1]Equivalencia BH-BMPT'!$D$32,IF(J69=32,'[1]Equivalencia BH-BMPT'!$D$33,IF(J69=33,'[1]Equivalencia BH-BMPT'!$D$34,IF(J69=34,'[1]Equivalencia BH-BMPT'!$D$35,IF(J69=35,'[1]Equivalencia BH-BMPT'!$D$36,IF(J69=36,'[1]Equivalencia BH-BMPT'!$D$37,IF(J69=37,'[1]Equivalencia BH-BMPT'!$D$38,IF(J69=38,'[1]Equivalencia BH-BMPT'!#REF!,IF(J69=39,'[1]Equivalencia BH-BMPT'!$D$40,IF(J69=40,'[1]Equivalencia BH-BMPT'!$D$41,IF(J69=41,'[1]Equivalencia BH-BMPT'!$D$42,IF(J69=42,'[1]Equivalencia BH-BMPT'!$D$43,IF(J69=43,'[1]Equivalencia BH-BMPT'!$D$44,IF(J69=44,'[1]Equivalencia BH-BMPT'!$D$45,IF(J69=45,'[1]Equivalencia BH-BMPT'!$D$46,\"No ha seleccionado un número de programa\")))))))))))))))))))))))))))))))))))))))))))))","v":"Gobernanza e influencia local, regional e internacional"},"1395",79814029,"Agustín Lara Beltrán",52746766,null,null,null,3995968,56742734,50189352,"2017-02-01","2017-02-02","2018-01-24",355,null,null,null,"X",null,null,0.88450711592430498,false]
[8,2017,"17-12-6299101",5,{"$f":"IF(D70=1,'[1]Tipo '!$B$2,IF(D70=2,'[1]Tipo '!$B$3,IF(D70=3,'[1]Tipo '!$B$4,IF(D70=4,'[1]Tipo '!$B$5,IF(D70=5,'[1]Tipo '!$B$6,IF(D70=6,'[1]Tipo '!$B$7,IF(D70=7,'[1]Tipo '!$B$8,IF(D70=8,'[1]Tipo '!$B$9,IF(D70=9,'[1]Tipo '!$B$10,IF(D70=10,'[1]Tipo '!$B$11,IF(D70=11,'[1]Tipo '!$B$12,IF(D70=12,'[1]Tipo '!$B$13,IF(D70=13,'[1]Tipo '!$B$14,IF(D70=14,'[1]Tipo '!$B$15,IF(D70=15,'[1]Tipo '!$B$16,IF(D70=16,'[1]Tipo '!$B$17,IF(D70=17,'[1]Tipo '!$B$18,IF(D70=18,'[1]Tipo '!$B$19,IF(D70=19,'[1]Tipo '!$B$20,\"No ha seleccionado un tipo de contrato válido\")))))))))))))))))))","v":"CONTRATOS DE PRESTACIÓN DE SERVICIOS PROFESIONALES Y DE APOYO A LA GESTIÓN"},"Contratación directa","Prestación de servicios profesionales y de apoyo a la gestión, o para la ejecución de trabajos artísticos que sólo puedan encomendarse a determinadas personas naturales;","PRESTAR LOS SERVICIOS PROFESIONALES AL DESPACHO DE LA ALCALDÍA LOCAL COMO ENLACE EN TEMAS DE GESTIÓN DE RIESGOS A CARGO DE LA LOCALIDAD DE LA CANDELARIA DE CONFORMIDAD CON EL MARCO NORMATIVO APLICABLE PARA LA MATERIA","Inversión",45,{"$f":"IF(J70=1,'[1]Equivalencia BH-BMPT'!$D$2,IF(J70=2,'[1]Equivalencia BH-BMPT'!$D$3,IF(J70=3,'[1]Equivalencia BH-BMPT'!$D$4,IF(J70=4,'[1]Equivalencia BH-BMPT'!$D$5,IF(J70=5,'[1]Equivalencia BH-BMPT'!$D$6,IF(J70=6,'[1]Equivalencia BH-BMPT'!$D$7,IF(J70=7,'[1]Equivalencia BH-BMPT'!$D$8,IF(J70=8,'[1]Equivalencia BH-BMPT'!$D$9,IF(J70=9,'[1]Equivalencia BH-BMPT'!$D$10,IF(J70=10,'[1]Equivalencia BH-BMPT'!$D$11,IF(J70=11,'[1]Equivalencia BH-BMPT'!$D$12,IF(J70=12,'[1]Equivalencia BH-BMPT'!$D$13,IF(J70=13,'[1]Equivalencia BH-BMPT'!$D$14,IF(J70=14,'[1]Equivalencia BH-BMPT'!$D$15,IF(J70=15,'[1]Equivalencia BH-BMPT'!$D$16,IF(J70=16,'[1]Equivalencia BH-BMPT'!$D$17,IF(J70=17,'[1]Equivalencia BH-BMPT'!$D$18,IF(J70=18,'[1]Equivalencia BH-BMPT'!$D$19,IF(J70=19,'[1]Equivalencia BH-BMPT'!$D$20,IF(J70=20,'[1]Equivalencia BH-BMPT'!$D$21,IF(J70=21,'[1]Equivalencia BH-BMPT'!$D$22,IF(J70=22,'[1]Equivalencia BH-BMPT'!$D$23,IF(J70=23,'[1]Equivalencia BH-BMPT'!#REF!,IF(J70=24,'[1]Equivalencia BH-BMPT'!$D$25,IF(J70=25,'[1]Equivalencia BH-BMPT'!$D$26,IF(J70=26,'[1]Equivalencia BH-BMPT'!$D$27,IF(J70=27,'[1]Equivalencia BH-BMPT'!$D$28,IF(J70=28,'[1]Equivalencia BH-BMPT'!$D$29,IF(J70=29,'[1]Equivalencia BH-BMPT'!$D$30,IF(J70=30,'[1]Equivalencia BH-BMPT'!$D$31,IF(J70=31,'[1]Equivalencia BH-BMPT'!$D$32,IF(J70=32,'[1]Equivalencia BH-BMPT'!$D$33,IF(J70=33,'[1]Equivalencia BH-BMPT'!$D$34,IF(J70=34,'[1]Equivalencia BH-BMPT'!$D$35,IF(J70=35,'[1]Equivalencia BH-BMPT'!$D$36,IF(J70=36,'[1]Equivalencia BH-BMPT'!$D$37,IF(J70=37,'[1]Equivalencia BH-BMPT'!$D$38,IF(J70=38,'[1]Equivalencia BH-BMPT'!#REF!,IF(J70=39,'[1]Equivalencia BH-BMPT'!$D$40,IF(J70=40,'[1]Equivalencia BH-BMPT'!$D$41,IF(J70=41,'[1]Equivalencia BH-BMPT'!$D$42,IF(J70=42,'[1]Equivalencia BH-BMPT'!$D$43,IF(J70=43,'[1]Equivalencia BH-BMPT'!$D$44,IF(J70=44,'[1]Equivalencia BH-BMPT'!$D$45,IF(J70=45,'[1]Equivalencia BH-BMPT'!$D$46,\"No ha seleccionado un número de programa\")))))))))))))))))))))))))))))))))))))))))))))","v":"Gobernanza e influencia local, regional e internacional"},"1395",79186980,"Luis Antonio Jaramillo Cuestas",62484630,null,null,null,2840211,65324841,59455073,"2017-02-01","2017-02-02","2018-01-14",345,null,null,null,null,"X",null,0.91014493246145056,false]
[9,2017,"17-12-6299128",5,{"$f":"IF(D71=1,'[1]Tipo '!$B$2,IF(D71=2,'[1]Tipo '!$B$3,IF(D71=3,'[1]Tipo '!$B$4,IF(D71=4,'[1]Tipo '!$B$5,IF(D71=5,'[1]Tipo '!$B$6,IF(D71=6,'[1]Tipo '!$B$7,IF(D71=7,'[1]Tipo '!$B$8,IF(D71=8,'[1]Tipo '!$B$9,IF(D71=9,'[1]Tipo '!$B$10,IF(D71=10,'[1]Tipo '!$B$11,IF(D71=11,'[1]Tipo '!$B$12,IF(D71=12,'[1]Tipo '!$B$13,IF(D71=13,'[1]Tipo '!$B$14,IF(D71=14,'[1]Tipo '!$B$15,IF(D71=15,'[1]Tipo '!$B$16,IF(D71=16,'[1]Tipo '!$B$17,IF(D71=17,'[1]Tipo '!$B$18,IF(D71=18,'[1]Tipo '!$B$19,IF(D71=19,'[1]Tipo '!$B$20,\"No ha seleccionado un tipo de contrato válido\")))))))))))))))))))","v":"CONTRATOS DE PRESTACIÓN DE SERVICIOS PROFESIONALES Y DE APOYO A LA GESTIÓN"},"Contratación directa","Prestación de servicios profesionales y de apoyo a la gestión, o para la ejecución de trabajos artísticos que sólo puedan encomendarse a determinadas personas naturales;","PRESTAR LOS SERVICIOS PROFESIONALES AL DESPACHO DE LA ALCALDÍA LOCAL COMO ENLACE EN TEMAS DE GESTIÓN DE RIESGOS A CARGO DE LA LOCALIDAD DE LA CANDELARIA DE CONFORMIDAD CON EL MARCO NORMATIVO APLICABLE PARA LA MATERIA","Inversión",39,{"$f":"IF(J71=1,'[1]Equivalencia BH-BMPT'!$D$2,IF(J71=2,'[1]Equivalencia BH-BMPT'!$D$3,IF(J71=3,'[1]Equivalencia BH-BMPT'!$D$4,IF(J71=4,'[1]Equivalencia BH-BMPT'!$D$5,IF(J71=5,'[1]Equivalencia BH-BMPT'!$D$6,IF(J71=6,'[1]Equivalencia BH-BMPT'!$D$7,IF(J71=7,'[1]Equivalencia BH-BMPT'!$D$8,IF(J71=8,'[1]Equivalencia BH-BMPT'!$D$9,IF(J71=9,'[1]Equivalencia BH-BMPT'!$D$10,IF(J71=10,'[1]Equivalencia BH-BMPT'!$D$11,IF(J71=11,'[1]Equivalencia BH-BMPT'!$D$12,IF(J71=12,'[1]Equivalencia BH-BMPT'!$D$13,IF(J71=13,'[1]Equivalencia BH-BMPT'!$D$14,IF(J71=14,'[1]Equivalencia BH-BMPT'!$D$15,IF(J71=15,'[1]Equivalencia BH-BMPT'!$D$16,IF(J71=16,'[1]Equivalencia BH-BMPT'!$D$17,IF(J71=17,'[1]Equivalencia BH-BMPT'!$D$18,IF(J71=18,'[1]Equivalencia BH-BMPT'!$D$19,IF(J71=19,'[1]Equivalencia BH-BMPT'!$D$20,IF(J71=20,'[1]Equivalencia BH-BMPT'!$D$21,IF(J71=21,'[1]Equivalencia BH-BMPT'!$D$22,IF(J71=22,'[1]Equivalencia BH-BMPT'!$D$23,IF(J71=23,'[1]Equivalencia BH-BMPT'!#REF!,IF(J71=24,'[1]Equivalencia BH-BMPT'!$D$25,IF(J71=25,'[1]Equivalencia BH-BMPT'!$D$26,IF(J71=26,'[1]Equivalencia BH-BMPT'!$D$27,IF(J71=27,'[1]Equivalencia BH-BMPT'!$D$28,IF(J71=28,'[1]Equivalencia BH-BMPT'!$D$29,IF(J71=29,'[1]Equivalencia BH-BMPT'!$D$30,IF(J71=30,'[1]Equivalencia BH-BMPT'!$D$31,IF(J71=31,'[1]Equivalencia BH-BMPT'!$D$32,IF(J71=32,'[1]Equivalencia BH-BMPT'!$D$33,IF(J71=33,'[1]Equivalencia BH-BMPT'!$D$34,IF(J71=34,'[1]Equivalencia BH-BMPT'!$D$35,IF(J71=35,'[1]Equivalencia BH-BMPT'!$D$36,IF(J71=36,'[1]Equivalencia BH-BMPT'!$D$37,IF(J71=37,'[1]Equivalencia BH-BMPT'!$D$38,IF(J71=38,'[1]Equivalencia BH-BMPT'!#REF!,IF(J71=39,'[1]Equivalencia BH-BMPT'!$D$40,IF(J71=40,'[1]Equivalencia BH-BMPT'!$D$41,IF(J71=41,'[1]Equivalencia BH-BMPT'!$D$42,IF(J71=42,'[1]Equivalencia BH-BMPT'!$D$43,IF(J71=43,'[1]Equivalencia BH-BMPT'!$D$44,IF(J71=44,'[1]Equivalencia BH-BMPT'!$D$45,IF(J71=45,'[1]Equivalencia BH-BMPT'!$D$46,\"No ha seleccionado un número de programa\")))))))))))))))))))))))))))))))))))))))))))))","v":"Ambiente sano para la equidad y disfrute del ciudadano"},"1395",1074416048,"LEIVER ALEXIS MORENO GUZMAN",50312299,null,null,null,2286923,52599222,47872911,"2017-02-01","2017-02-02","2018-01-14",345,null,null,null,null,"X",null,0.91014484967097042,false]
[10,2017,"17-12-6299158  ",5,{"$f":"IF(D72=1,'[1]Tipo '!$B$2,IF(D72=2,'[1]Tipo '!$B$3,IF(D72=3,'[1]Tipo '!$B$4,IF(D72=4,'[1]Tipo '!$B$5,IF(D72=5,'[1]Tipo '!$B$6,IF(D72=6,'[1]Tipo '!$B$7,IF(D72=7,'[1]Tipo '!$B$8,IF(D72=8,'[1]Tipo '!$B$9,IF(D72=9,'[1]Tipo '!$B$10,IF(D72=10,'[1]Tipo '!$B$11,IF(D72=11,'[1]Tipo '!$B$12,IF(D72=12,'[1]Tipo '!$B$13,IF(D72=13,'[1]Tipo '!$B$14,IF(D72=14,'[1]Tipo '!$B$15,IF(D72=15,'[1]Tipo '!$B$16,IF(D72=16,'[1]Tipo '!$B$17,IF(D72=17,'[1]Tipo '!$B$18,IF(D72=18,'[1]Tipo '!$B$19,IF(D72=19,'[1]Tipo '!$B$20,\"No ha seleccionado un tipo de contrato válido\")))))))))))))))))))","v":"CONTRATOS DE PRESTACIÓN DE SERVICIOS PROFESIONALES Y DE APOYO A LA GESTIÓN"},"Contratación directa","Prestación de servicios profesionales y de apoyo a la gestión, o para la ejecución de trabajos artísticos que sólo puedan encomendarse a determinadas personas naturales;","PRESTAR SUS SERVICIOS PROFESIONALES AL ÁREA DE GESTIÓN DE DESARROLLO LOCAL BRINDANDO APOYO EN LA FORMULACIÓN Y SEGUIMIENTO PARA EL CUMPLIMIENTO DE LAS METAS ESTABLECIDAS EN EL PLAN DE DESARROLLO LOCAL DE LA CANDELARIA CON ENFASIS EN EL PROGRAMA “MEJORES OPORTUNIDADES PARA EL DESARROLLO A TRAVÉS DE LA CULTURA, LA RECREACIÓN Y EL DEPORTE” – PROYECTO 1398 “CANDELARIA CULTURAL Y DEPORTIVA PARA TODOS","Inversión",45,{"$f":"IF(J72=1,'[1]Equivalencia BH-BMPT'!$D$2,IF(J72=2,'[1]Equivalencia BH-BMPT'!$D$3,IF(J72=3,'[1]Equivalencia BH-BMPT'!$D$4,IF(J72=4,'[1]Equivalencia BH-BMPT'!$D$5,IF(J72=5,'[1]Equivalencia BH-BMPT'!$D$6,IF(J72=6,'[1]Equivalencia BH-BMPT'!$D$7,IF(J72=7,'[1]Equivalencia BH-BMPT'!$D$8,IF(J72=8,'[1]Equivalencia BH-BMPT'!$D$9,IF(J72=9,'[1]Equivalencia BH-BMPT'!$D$10,IF(J72=10,'[1]Equivalencia BH-BMPT'!$D$11,IF(J72=11,'[1]Equivalencia BH-BMPT'!$D$12,IF(J72=12,'[1]Equivalencia BH-BMPT'!$D$13,IF(J72=13,'[1]Equivalencia BH-BMPT'!$D$14,IF(J72=14,'[1]Equivalencia BH-BMPT'!$D$15,IF(J72=15,'[1]Equivalencia BH-BMPT'!$D$16,IF(J72=16,'[1]Equivalencia BH-BMPT'!$D$17,IF(J72=17,'[1]Equivalencia BH-BMPT'!$D$18,IF(J72=18,'[1]Equivalencia BH-BMPT'!$D$19,IF(J72=19,'[1]Equivalencia BH-BMPT'!$D$20,IF(J72=20,'[1]Equivalencia BH-BMPT'!$D$21,IF(J72=21,'[1]Equivalencia BH-BMPT'!$D$22,IF(J72=22,'[1]Equivalencia BH-BMPT'!$D$23,IF(J72=23,'[1]Equivalencia BH-BMPT'!#REF!,IF(J72=24,'[1]Equivalencia BH-BMPT'!$D$25,IF(J72=25,'[1]Equivalencia BH-BMPT'!$D$26,IF(J72=26,'[1]Equivalencia BH-BMPT'!$D$27,IF(J72=27,'[1]Equivalencia BH-BMPT'!$D$28,IF(J72=28,'[1]Equivalencia BH-BMPT'!$D$29,IF(J72=29,'[1]Equivalencia BH-BMPT'!$D$30,IF(J72=30,'[1]Equivalencia BH-BMPT'!$D$31,IF(J72=31,'[1]Equivalencia BH-BMPT'!$D$32,IF(J72=32,'[1]Equivalencia BH-BMPT'!$D$33,IF(J72=33,'[1]Equivalencia BH-BMPT'!$D$34,IF(J72=34,'[1]Equivalencia BH-BMPT'!$D$35,IF(J72=35,'[1]Equivalencia BH-BMPT'!$D$36,IF(J72=36,'[1]Equivalencia BH-BMPT'!$D$37,IF(J72=37,'[1]Equivalencia BH-BMPT'!$D$38,IF(J72=38,'[1]Equivalencia BH-BMPT'!#REF!,IF(J72=39,'[1]Equivalencia BH-BMPT'!$D$40,IF(J72=40,'[1]Equivalencia BH-BMPT'!$D$41,IF(J72=41,'[1]Equivalencia BH-BMPT'!$D$42,IF(J72=42,'[1]Equivalencia BH-BMPT'!$D$43,IF(J72=43,'[1]Equivalencia BH-BMPT'!$D$44,IF(J72=44,'[1]Equivalencia BH-BMPT'!$D$45,IF(J72=45,'[1]Equivalencia BH-BMPT'!$D$46,\"No ha seleccionado un número de programa\")))))))))))))))))))))))))))))))))))))))))))))","v":"Gobernanza e influencia local, regional e internacional"},"1395",1026557127,"Juan Sebastián Sánchez Rodríguez",55181232,null,null,null,null,55181232,52338566,"2017-02-02","2017-02-03","2017-12-30",329,null,null,null,null,"X",null,0.94848491240645005,false]
[11,2017,"17-12-6299251",5,{"$f":"IF(D73=1,'[1]Tipo '!$B$2,IF(D73=2,'[1]Tipo '!$B$3,IF(D73=3,'[1]Tipo '!$B$4,IF(D73=4,'[1]Tipo '!$B$5,IF(D73=5,'[1]Tipo '!$B$6,IF(D73=6,'[1]Tipo '!$B$7,IF(D73=7,'[1]Tipo '!$B$8,IF(D73=8,'[1]Tipo '!$B$9,IF(D73=9,'[1]Tipo '!$B$10,IF(D73=10,'[1]Tipo '!$B$11,IF(D73=11,'[1]Tipo '!$B$12,IF(D73=12,'[1]Tipo '!$B$13,IF(D73=13,'[1]Tipo '!$B$14,IF(D73=14,'[1]Tipo '!$B$15,IF(D73=15,'[1]Tipo '!$B$16,IF(D73=16,'[1]Tipo '!$B$17,IF(D73=17,'[1]Tipo '!$B$18,IF(D73=18,'[1]Tipo '!$B$19,IF(D73=19,'[1]Tipo '!$B$20,\"No ha seleccionado un tipo de contrato válido\")))))))))))))))))))","v":"CONTRATOS DE PRESTACIÓN DE SERVICIOS PROFESIONALES Y DE APOYO A LA GESTIÓN"},"Contratación directa","Prestación de servicios profesionales y de apoyo a la gestión, o para la ejecución de trabajos artísticos que sólo puedan encomendarse a determinadas personas naturales;","PRESTAR SUS SERVICIOS PROFESIONALES ESPECIALIZADOS PARA APOYAR JURIDICAMENTE AL DESPACHO DEL ALCALDE LOCAL EN LOS ASUNTOS CONSTITUCIONALES, LEGALES Y REGLAMENTARIOS DE SU COMPETENCIA","Inversión",45,{"$f":"IF(J73=1,'[1]Equivalencia BH-BMPT'!$D$2,IF(J73=2,'[1]Equivalencia BH-BMPT'!$D$3,IF(J73=3,'[1]Equivalencia BH-BMPT'!$D$4,IF(J73=4,'[1]Equivalencia BH-BMPT'!$D$5,IF(J73=5,'[1]Equivalencia BH-BMPT'!$D$6,IF(J73=6,'[1]Equivalencia BH-BMPT'!$D$7,IF(J73=7,'[1]Equivalencia BH-BMPT'!$D$8,IF(J73=8,'[1]Equivalencia BH-BMPT'!$D$9,IF(J73=9,'[1]Equivalencia BH-BMPT'!$D$10,IF(J73=10,'[1]Equivalencia BH-BMPT'!$D$11,IF(J73=11,'[1]Equivalencia BH-BMPT'!$D$12,IF(J73=12,'[1]Equivalencia BH-BMPT'!$D$13,IF(J73=13,'[1]Equivalencia BH-BMPT'!$D$14,IF(J73=14,'[1]Equivalencia BH-BMPT'!$D$15,IF(J73=15,'[1]Equivalencia BH-BMPT'!$D$16,IF(J73=16,'[1]Equivalencia BH-BMPT'!$D$17,IF(J73=17,'[1]Equivalencia BH-BMPT'!$D$18,IF(J73=18,'[1]Equivalencia BH-BMPT'!$D$19,IF(J73=19,'[1]Equivalencia BH-BMPT'!$D$20,IF(J73=20,'[1]Equivalencia BH-BMPT'!$D$21,IF(J73=21,'[1]Equivalencia BH-BMPT'!$D$22,IF(J73=22,'[1]Equivalencia BH-BMPT'!$D$23,IF(J73=23,'[1]Equivalencia BH-BMPT'!#REF!,IF(J73=24,'[1]Equivalencia BH-BMPT'!$D$25,IF(J73=25,'[1]Equivalencia BH-BMPT'!$D$26,IF(J73=26,'[1]Equivalencia BH-BMPT'!$D$27,IF(J73=27,'[1]Equivalencia BH-BMPT'!$D$28,IF(J73=28,'[1]Equivalencia BH-BMPT'!$D$29,IF(J73=29,'[1]Equivalencia BH-BMPT'!$D$30,IF(J73=30,'[1]Equivalencia BH-BMPT'!$D$31,IF(J73=31,'[1]Equivalencia BH-BMPT'!$D$32,IF(J73=32,'[1]Equivalencia BH-BMPT'!$D$33,IF(J73=33,'[1]Equivalencia BH-BMPT'!$D$34,IF(J73=34,'[1]Equivalencia BH-BMPT'!$D$35,IF(J73=35,'[1]Equivalencia BH-BMPT'!$D$36,IF(J73=36,'[1]Equivalencia BH-BMPT'!$D$37,IF(J73=37,'[1]Equivalencia BH-BMPT'!$D$38,IF(J73=38,'[1]Equivalencia BH-BMPT'!#REF!,IF(J73=39,'[1]Equivalencia BH-BMPT'!$D$40,IF(J73=40,'[1]Equivalencia BH-BMPT'!$D$41,IF(J73=41,'[1]Equivalencia BH-BMPT'!$D$42,IF(J73=42,'[1]Equivalencia BH-BMPT'!$D$43,IF(J73=43,'[1]Equivalencia BH-BMPT'!$D$44,IF(J73=44,'[1]Equivalencia BH-BMPT'!$D$45,IF(J73=45,'[1]Equivalencia BH-BMPT'!$D$46,\"No ha seleccionado un número de programa\")))))))))))))))))))))))))))))))))))))))))))))","v":"Gobernanza e influencia local, regional e internacional"},"1395",80208621,"Michael Oyuela Vargas",96567155,null,null,null,null,96567155,87203064,"2017-02-02","2017-02-03","2017-01-14",329,null,null,null,null,"X",null,0.90303026945341824,false]
[12,2017,"17-12-6299281",5,{"$f":"IF(D74=1,'[1]Tipo '!$B$2,IF(D74=2,'[1]Tipo '!$B$3,IF(D74=3,'[1]Tipo '!$B$4,IF(D74=4,'[1]Tipo '!$B$5,IF(D74=5,'[1]Tipo '!$B$6,IF(D74=6,'[1]Tipo '!$B$7,IF(D74=7,'[1]Tipo '!$B$8,IF(D74=8,'[1]Tipo '!$B$9,IF(D74=9,'[1]Tipo '!$B$10,IF(D74=10,'[1]Tipo '!$B$11,IF(D74=11,'[1]Tipo '!$B$12,IF(D74=12,'[1]Tipo '!$B$13,IF(D74=13,'[1]Tipo '!$B$14,IF(D74=14,'[1]Tipo '!$B$15,IF(D74=15,'[1]Tipo '!$B$16,IF(D74=16,'[1]Tipo '!$B$17,IF(D74=17,'[1]Tipo '!$B$18,IF(D74=18,'[1]Tipo '!$B$19,IF(D74=19,'[1]Tipo '!$B$20,\"No ha seleccionado un tipo de contrato válido\")))))))))))))))))))","v":"CONTRATOS DE PRESTACIÓN DE SERVICIOS PROFESIONALES Y DE APOYO A LA GESTIÓN"},"Contratación directa","Prestación de servicios profesionales y de apoyo a la gestión, o para la ejecución de trabajos artísticos que sólo puedan encomendarse a determinadas personas naturales;","PRESTAR LOS SERVICIOS PROFESIONALES AL DESPACHO DE LA ALCALDÍA LOCAL Y AL ÁREA DE GESTIÓN POLICIVA, EN TEMAS DE SEGURIDAD, PREVENCIÓN Y CONVIVENCIA CIUDADANA EN LA LOCALIDAD, DE CONFORMIDAD CON EL MARCO NORMATIVO APLICABLE PARA LA MATERIA","Inversión",45,{"$f":"IF(J74=1,'[1]Equivalencia BH-BMPT'!$D$2,IF(J74=2,'[1]Equivalencia BH-BMPT'!$D$3,IF(J74=3,'[1]Equivalencia BH-BMPT'!$D$4,IF(J74=4,'[1]Equivalencia BH-BMPT'!$D$5,IF(J74=5,'[1]Equivalencia BH-BMPT'!$D$6,IF(J74=6,'[1]Equivalencia BH-BMPT'!$D$7,IF(J74=7,'[1]Equivalencia BH-BMPT'!$D$8,IF(J74=8,'[1]Equivalencia BH-BMPT'!$D$9,IF(J74=9,'[1]Equivalencia BH-BMPT'!$D$10,IF(J74=10,'[1]Equivalencia BH-BMPT'!$D$11,IF(J74=11,'[1]Equivalencia BH-BMPT'!$D$12,IF(J74=12,'[1]Equivalencia BH-BMPT'!$D$13,IF(J74=13,'[1]Equivalencia BH-BMPT'!$D$14,IF(J74=14,'[1]Equivalencia BH-BMPT'!$D$15,IF(J74=15,'[1]Equivalencia BH-BMPT'!$D$16,IF(J74=16,'[1]Equivalencia BH-BMPT'!$D$17,IF(J74=17,'[1]Equivalencia BH-BMPT'!$D$18,IF(J74=18,'[1]Equivalencia BH-BMPT'!$D$19,IF(J74=19,'[1]Equivalencia BH-BMPT'!$D$20,IF(J74=20,'[1]Equivalencia BH-BMPT'!$D$21,IF(J74=21,'[1]Equivalencia BH-BMPT'!$D$22,IF(J74=22,'[1]Equivalencia BH-BMPT'!$D$23,IF(J74=23,'[1]Equivalencia BH-BMPT'!#REF!,IF(J74=24,'[1]Equivalencia BH-BMPT'!$D$25,IF(J74=25,'[1]Equivalencia BH-BMPT'!$D$26,IF(J74=26,'[1]Equivalencia BH-BMPT'!$D$27,IF(J74=27,'[1]Equivalencia BH-BMPT'!$D$28,IF(J74=28,'[1]Equivalencia BH-BMPT'!$D$29,IF(J74=29,'[1]Equivalencia BH-BMPT'!$D$30,IF(J74=30,'[1]Equivalencia BH-BMPT'!$D$31,IF(J74=31,'[1]Equivalencia BH-BMPT'!$D$32,IF(J74=32,'[1]Equivalencia BH-BMPT'!$D$33,IF(J74=33,'[1]Equivalencia BH-BMPT'!$D$34,IF(J74=34,'[1]Equivalencia BH-BMPT'!$D$35,IF(J74=35,'[1]Equivalencia BH-BMPT'!$D$36,IF(J74=36,'[1]Equivalencia BH-BMPT'!$D$37,IF(J74=37,'[1]Equivalencia BH-BMPT'!$D$38,IF(J74=38,'[1]Equivalencia BH-BMPT'!#REF!,IF(J74=39,'[1]Equivalencia BH-BMPT'!$D$40,IF(J74=40,'[1]Equivalencia BH-BMPT'!$D$41,IF(J74=41,'[1]Equivalencia BH-BMPT'!$D$42,IF(J74=42,'[1]Equivalencia BH-BMPT'!$D$43,IF(J74=43,'[1]Equivalencia BH-BMPT'!$D$44,IF(J74=44,'[1]Equivalencia BH-BMPT'!$D$45,IF(J74=45,'[1]Equivalencia BH-BMPT'!$D$46,\"No ha seleccionado un número de programa\")))))))))))))))))))))))))))))))))))))))))))))","v":"Gobernanza e influencia local, regional e internacional"},"1395",52198868,"Zully Alejandra Cardozo Triana",49500811,null,null,null,2250037,51750848,46950772,"2017-02-02","2017-02-03","2017-01-14",329,null,null,null,null,"X",null,0.90724642811650158,false]
[13,2017,"17-12-6299314",5,{"$f":"IF(D75=1,'[1]Tipo '!$B$2,IF(D75=2,'[1]Tipo '!$B$3,IF(D75=3,'[1]Tipo '!$B$4,IF(D75=4,'[1]Tipo '!$B$5,IF(D75=5,'[1]Tipo '!$B$6,IF(D75=6,'[1]Tipo '!$B$7,IF(D75=7,'[1]Tipo '!$B$8,IF(D75=8,'[1]Tipo '!$B$9,IF(D75=9,'[1]Tipo '!$B$10,IF(D75=10,'[1]Tipo '!$B$11,IF(D75=11,'[1]Tipo '!$B$12,IF(D75=12,'[1]Tipo '!$B$13,IF(D75=13,'[1]Tipo '!$B$14,IF(D75=14,'[1]Tipo '!$B$15,IF(D75=15,'[1]Tipo '!$B$16,IF(D75=16,'[1]Tipo '!$B$17,IF(D75=17,'[1]Tipo '!$B$18,IF(D75=18,'[1]Tipo '!$B$19,IF(D75=19,'[1]Tipo '!$B$20,\"No ha seleccionado un tipo de contrato válido\")))))))))))))))))))","v":"CONTRATOS DE PRESTACIÓN DE SERVICIOS PROFESIONALES Y DE APOYO A LA GESTIÓN"},"Contratación directa","Prestación de servicios profesionales y de apoyo a la gestión, o para la ejecución de trabajos artísticos que sólo puedan encomendarse a determinadas personas naturales;","PRESTAR LOS SERVICIOS DE APOYO AL ÁREA DE GESTIÓN DE DESARROLLO LOCAL, PARA EL FORTALECIMIENTO INSTITUCIONAL EN TEMAS DE CONTABILIDAD EN LA ALCALDÍA LOCAL DE LA CANDELARIA","Inversión",45,{"$f":"IF(J75=1,'[1]Equivalencia BH-BMPT'!$D$2,IF(J75=2,'[1]Equivalencia BH-BMPT'!$D$3,IF(J75=3,'[1]Equivalencia BH-BMPT'!$D$4,IF(J75=4,'[1]Equivalencia BH-BMPT'!$D$5,IF(J75=5,'[1]Equivalencia BH-BMPT'!$D$6,IF(J75=6,'[1]Equivalencia BH-BMPT'!$D$7,IF(J75=7,'[1]Equivalencia BH-BMPT'!$D$8,IF(J75=8,'[1]Equivalencia BH-BMPT'!$D$9,IF(J75=9,'[1]Equivalencia BH-BMPT'!$D$10,IF(J75=10,'[1]Equivalencia BH-BMPT'!$D$11,IF(J75=11,'[1]Equivalencia BH-BMPT'!$D$12,IF(J75=12,'[1]Equivalencia BH-BMPT'!$D$13,IF(J75=13,'[1]Equivalencia BH-BMPT'!$D$14,IF(J75=14,'[1]Equivalencia BH-BMPT'!$D$15,IF(J75=15,'[1]Equivalencia BH-BMPT'!$D$16,IF(J75=16,'[1]Equivalencia BH-BMPT'!$D$17,IF(J75=17,'[1]Equivalencia BH-BMPT'!$D$18,IF(J75=18,'[1]Equivalencia BH-BMPT'!$D$19,IF(J75=19,'[1]Equivalencia BH-BMPT'!$D$20,IF(J75=20,'[1]Equivalencia BH-BMPT'!$D$21,IF(J75=21,'[1]Equivalencia BH-BMPT'!$D$22,IF(J75=22,'[1]Equivalencia BH-BMPT'!$D$23,IF(J75=23,'[1]Equivalencia BH-BMPT'!#REF!,IF(J75=24,'[1]Equivalencia BH-BMPT'!$D$25,IF(J75=25,'[1]Equivalencia BH-BMPT'!$D$26,IF(J75=26,'[1]Equivalencia BH-BMPT'!$D$27,IF(J75=27,'[1]Equivalencia BH-BMPT'!$D$28,IF(J75=28,'[1]Equivalencia BH-BMPT'!$D$29,IF(J75=29,'[1]Equivalencia BH-BMPT'!$D$30,IF(J75=30,'[1]Equivalencia BH-BMPT'!$D$31,IF(J75=31,'[1]Equivalencia BH-BMPT'!$D$32,IF(J75=32,'[1]Equivalencia BH-BMPT'!$D$33,IF(J75=33,'[1]Equivalencia BH-BMPT'!$D$34,IF(J75=34,'[1]Equivalencia BH-BMPT'!$D$35,IF(J75=35,'[1]Equivalencia BH-BMPT'!$D$36,IF(J75=36,'[1]Equivalencia BH-BMPT'!$D$37,IF(J75=37,'[1]Equivalencia BH-BMPT'!$D$38,IF(J75=38,'[1]Equivalencia BH-BMPT'!#REF!,IF(J75=39,'[1]Equivalencia BH-BMPT'!$D$40,IF(J75=40,'[1]Equivalencia BH-BMPT'!$D$41,IF(J75=41,'[1]Equivalencia BH-BMPT'!$D$42,IF(J75=42,'[1]Equivalencia BH-BMPT'!$D$43,IF(J75=43,'[1]Equivalencia BH-BMPT'!$D$44,IF(J75=44,'[1]Equivalencia BH-BMPT'!$D$45,IF(J75=45,'[1]Equivalencia BH-BMPT'!$D$46,\"No ha seleccionado un número de programa\")))))))))))))))))))))))))))))))))))))))))))))","v":"Gobernanza e influencia local, regional e internacional"},"1395",11312151,"LUIS CARLOS VANEGAS JIMENEZ",29434908,null,null,null,null,29434908,29248024,"2017-02-02","2017-02-03","2017-12-30",329,null,null,null,null,"X",null,0.99365093989762088,false]
[14,2017,"17-12-6315828",5,{"$f":"IF(D76=1,'[1]Tipo '!$B$2,IF(D76=2,'[1]Tipo '!$B$3,IF(D76=3,'[1]Tipo '!$B$4,IF(D76=4,'[1]Tipo '!$B$5,IF(D76=5,'[1]Tipo '!$B$6,IF(D76=6,'[1]Tipo '!$B$7,IF(D76=7,'[1]Tipo '!$B$8,IF(D76=8,'[1]Tipo '!$B$9,IF(D76=9,'[1]Tipo '!$B$10,IF(D76=10,'[1]Tipo '!$B$11,IF(D76=11,'[1]Tipo '!$B$12,IF(D76=12,'[1]Tipo '!$B$13,IF(D76=13,'[1]Tipo '!$B$14,IF(D76=14,'[1]Tipo '!$B$15,IF(D76=15,'[1]Tipo '!$B$16,IF(D76=16,'[1]Tipo '!$B$17,IF(D76=17,'[1]Tipo '!$B$18,IF(D76=18,'[1]Tipo '!$B$19,IF(D76=19,'[1]Tipo '!$B$20,\"No ha seleccionado un tipo de contrato válido\")))))))))))))))))))","v":"CONTRATOS DE PRESTACIÓN DE SERVICIOS PROFESIONALES Y DE APOYO A LA GESTIÓN"},"Contratación directa","Prestación de servicios profesionales y de apoyo a la gestión, o para la ejecución de trabajos artísticos que sólo puedan encomendarse a determinadas personas naturales;","Prestar los servicios de apoyo a la administración local en la gestión de las casas comunitarias de la localidad de la candelaria de conformidad con el Acuerdo local 006 de 2013","Inversión",45,{"$f":"IF(J76=1,'[1]Equivalencia BH-BMPT'!$D$2,IF(J76=2,'[1]Equivalencia BH-BMPT'!$D$3,IF(J76=3,'[1]Equivalencia BH-BMPT'!$D$4,IF(J76=4,'[1]Equivalencia BH-BMPT'!$D$5,IF(J76=5,'[1]Equivalencia BH-BMPT'!$D$6,IF(J76=6,'[1]Equivalencia BH-BMPT'!$D$7,IF(J76=7,'[1]Equivalencia BH-BMPT'!$D$8,IF(J76=8,'[1]Equivalencia BH-BMPT'!$D$9,IF(J76=9,'[1]Equivalencia BH-BMPT'!$D$10,IF(J76=10,'[1]Equivalencia BH-BMPT'!$D$11,IF(J76=11,'[1]Equivalencia BH-BMPT'!$D$12,IF(J76=12,'[1]Equivalencia BH-BMPT'!$D$13,IF(J76=13,'[1]Equivalencia BH-BMPT'!$D$14,IF(J76=14,'[1]Equivalencia BH-BMPT'!$D$15,IF(J76=15,'[1]Equivalencia BH-BMPT'!$D$16,IF(J76=16,'[1]Equivalencia BH-BMPT'!$D$17,IF(J76=17,'[1]Equivalencia BH-BMPT'!$D$18,IF(J76=18,'[1]Equivalencia BH-BMPT'!$D$19,IF(J76=19,'[1]Equivalencia BH-BMPT'!$D$20,IF(J76=20,'[1]Equivalencia BH-BMPT'!$D$21,IF(J76=21,'[1]Equivalencia BH-BMPT'!$D$22,IF(J76=22,'[1]Equivalencia BH-BMPT'!$D$23,IF(J76=23,'[1]Equivalencia BH-BMPT'!#REF!,IF(J76=24,'[1]Equivalencia BH-BMPT'!$D$25,IF(J76=25,'[1]Equivalencia BH-BMPT'!$D$26,IF(J76=26,'[1]Equivalencia BH-BMPT'!$D$27,IF(J76=27,'[1]Equivalencia BH-BMPT'!$D$28,IF(J76=28,'[1]Equivalencia BH-BMPT'!$D$29,IF(J76=29,'[1]Equivalencia BH-BMPT'!$D$30,IF(J76=30,'[1]Equivalencia BH-BMPT'!$D$31,IF(J76=31,'[1]Equivalencia BH-BMPT'!$D$32,IF(J76=32,'[1]Equivalencia BH-BMPT'!$D$33,IF(J76=33,'[1]Equivalencia BH-BMPT'!$D$34,IF(J76=34,'[1]Equivalencia BH-BMPT'!$D$35,IF(J76=35,'[1]Equivalencia BH-BMPT'!$D$36,IF(J76=36,'[1]Equivalencia BH-BMPT'!$D$37,IF(J76=37,'[1]Equivalencia BH-BMPT'!$D$38,IF(J76=38,'[1]Equivalencia BH-BMPT'!#REF!,IF(J76=39,'[1]Equivalencia BH-BMPT'!$D$40,IF(J76=40,'[1]Equivalencia BH-BMPT'!$D$41,IF(J76=41,'[1]Equivalencia BH-BMPT'!$D$42,IF(J76=42,'[1]Equivalencia BH-BMPT'!$D$43,IF(J76=43,'[1]Equivalencia BH-BMPT'!$D$44,IF(J76=44,'[1]Equivalencia BH-BMPT'!$D$45,IF(J76=45,'[1]Equivalencia BH-BMPT'!$D$46,\"No ha seleccionado un número de programa\")))))))))))))))))))))))))))))))))))))))))))))","v":"Gobernanza e influencia local, regional e internacional"},"1395",52532222,"ANGELA TATIANA ARDILA BOHORQUEZ",27590616,null,null,null,1254119,28844735,26169283,"2017-02-03","2017-02-03","2018-01-14",229,null,null,null,null,"X",null,0.90724643509465419,false]
[15,2017,"17-12-6315988",5,{"$f":"IF(D77=1,'[1]Tipo '!$B$2,IF(D77=2,'[1]Tipo '!$B$3,IF(D77=3,'[1]Tipo '!$B$4,IF(D77=4,'[1]Tipo '!$B$5,IF(D77=5,'[1]Tipo '!$B$6,IF(D77=6,'[1]Tipo '!$B$7,IF(D77=7,'[1]Tipo '!$B$8,IF(D77=8,'[1]Tipo '!$B$9,IF(D77=9,'[1]Tipo '!$B$10,IF(D77=10,'[1]Tipo '!$B$11,IF(D77=11,'[1]Tipo '!$B$12,IF(D77=12,'[1]Tipo '!$B$13,IF(D77=13,'[1]Tipo '!$B$14,IF(D77=14,'[1]Tipo '!$B$15,IF(D77=15,'[1]Tipo '!$B$16,IF(D77=16,'[1]Tipo '!$B$17,IF(D77=17,'[1]Tipo '!$B$18,IF(D77=18,'[1]Tipo '!$B$19,IF(D77=19,'[1]Tipo '!$B$20,\"No ha seleccionado un tipo de contrato válido\")))))))))))))))))))","v":"CONTRATOS DE PRESTACIÓN DE SERVICIOS PROFESIONALES Y DE APOYO A LA GESTIÓN"},"Contratación directa","Prestación de servicios profesionales y de apoyo a la gestión, o para la ejecución de trabajos artísticos que sólo puedan encomendarse a determinadas personas naturales;","Prestar los servicios de apoyo a la administración local en la gestión de las casas comunitarias de la localidad de la candelaria de conformidad con el Acuerdo local 006 de 2013","Inversión",45,{"$f":"IF(J77=1,'[1]Equivalencia BH-BMPT'!$D$2,IF(J77=2,'[1]Equivalencia BH-BMPT'!$D$3,IF(J77=3,'[1]Equivalencia BH-BMPT'!$D$4,IF(J77=4,'[1]Equivalencia BH-BMPT'!$D$5,IF(J77=5,'[1]Equivalencia BH-BMPT'!$D$6,IF(J77=6,'[1]Equivalencia BH-BMPT'!$D$7,IF(J77=7,'[1]Equivalencia BH-BMPT'!$D$8,IF(J77=8,'[1]Equivalencia BH-BMPT'!$D$9,IF(J77=9,'[1]Equivalencia BH-BMPT'!$D$10,IF(J77=10,'[1]Equivalencia BH-BMPT'!$D$11,IF(J77=11,'[1]Equivalencia BH-BMPT'!$D$12,IF(J77=12,'[1]Equivalencia BH-BMPT'!$D$13,IF(J77=13,'[1]Equivalencia BH-BMPT'!$D$14,IF(J77=14,'[1]Equivalencia BH-BMPT'!$D$15,IF(J77=15,'[1]Equivalencia BH-BMPT'!$D$16,IF(J77=16,'[1]Equivalencia BH-BMPT'!$D$17,IF(J77=17,'[1]Equivalencia BH-BMPT'!$D$18,IF(J77=18,'[1]Equivalencia BH-BMPT'!$D$19,IF(J77=19,'[1]Equivalencia BH-BMPT'!$D$20,IF(J77=20,'[1]Equivalencia BH-BMPT'!$D$21,IF(J77=21,'[1]Equivalencia BH-BMPT'!$D$22,IF(J77=22,'[1]Equivalencia BH-BMPT'!$D$23,IF(J77=23,'[1]Equivalencia BH-BMPT'!#REF!,IF(J77=24,'[1]Equivalencia BH-BMPT'!$D$25,IF(J77=25,'[1]Equivalencia BH-BMPT'!$D$26,IF(J77=26,'[1]Equivalencia BH-BMPT'!$D$27,IF(J77=27,'[1]Equivalencia BH-BMPT'!$D$28,IF(J77=28,'[1]Equivalencia BH-BMPT'!$D$29,IF(J77=29,'[1]Equivalencia BH-BMPT'!$D$30,IF(J77=30,'[1]Equivalencia BH-BMPT'!$D$31,IF(J77=31,'[1]Equivalencia BH-BMPT'!$D$32,IF(J77=32,'[1]Equivalencia BH-BMPT'!$D$33,IF(J77=33,'[1]Equivalencia BH-BMPT'!$D$34,IF(J77=34,'[1]Equivalencia BH-BMPT'!$D$35,IF(J77=35,'[1]Equivalencia BH-BMPT'!$D$36,IF(J77=36,'[1]Equivalencia BH-BMPT'!$D$37,IF(J77=37,'[1]Equivalencia BH-BMPT'!$D$38,IF(J77=38,'[1]Equivalencia BH-BMPT'!#REF!,IF(J77=39,'[1]Equivalencia BH-BMPT'!$D$40,IF(J77=40,'[1]Equivalencia BH-BMPT'!$D$41,IF(J77=41,'[1]Equivalencia BH-BMPT'!$D$42,IF(J77=42,'[1]Equivalencia BH-BMPT'!$D$43,IF(J77=43,'[1]Equivalencia BH-BMPT'!$D$44,IF(J77=44,'[1]Equivalencia BH-BMPT'!$D$45,IF(J77=45,'[1]Equivalencia BH-BMPT'!$D$46,\"No ha seleccionado un número de programa\")))))))))))))))))))))))))))))))))))))))))))))","v":"Gobernanza e influencia local, regional e internacional"},"1395",7729975,"ENRIQUE PADILLA VEGA ",27590616,null,null,null,1254119,28844735,26169283,"2017-02-03","2017-02-03","2018-01-14",344,null,null,null,null,"X",null,0.90724643509465419,false]
[16,2017,"17-12-6316261",5,{"$f":"IF(D78=1,'[1]Tipo '!$B$2,IF(D78=2,'[1]Tipo '!$B$3,IF(D78=3,'[1]Tipo '!$B$4,IF(D78=4,'[1]Tipo '!$B$5,IF(D78=5,'[1]Tipo '!$B$6,IF(D78=6,'[1]Tipo '!$B$7,IF(D78=7,'[1]Tipo '!$B$8,IF(D78=8,'[1]Tipo '!$B$9,IF(D78=9,'[1]Tipo '!$B$10,IF(D78=10,'[1]Tipo '!$B$11,IF(D78=11,'[1]Tipo '!$B$12,IF(D78=12,'[1]Tipo '!$B$13,IF(D78=13,'[1]Tipo '!$B$14,IF(D78=14,'[1]Tipo '!$B$15,IF(D78=15,'[1]Tipo '!$B$16,IF(D78=16,'[1]Tipo '!$B$17,IF(D78=17,'[1]Tipo '!$B$18,IF(D78=18,'[1]Tipo '!$B$19,IF(D78=19,'[1]Tipo '!$B$20,\"No ha seleccionado un tipo de contrato válido\")))))))))))))))))))","v":"CONTRATOS DE PRESTACIÓN DE SERVICIOS PROFESIONALES Y DE APOYO A LA GESTIÓN"},"Contratación directa","Prestación de servicios profesionales y de apoyo a la gestión, o para la ejecución de trabajos artísticos que sólo puedan encomendarse a determinadas personas naturales;","PRESTAR SUS SERVICIOS PROFESIONALES EN LA ADMINISTRACIÓN DEL PUNTO VIVE DIGITAL DE ACCESO A LAS TECNOLOGÍAS DE INFORMACIÓN Y LAS COMUNICACIONES – TIC","Inversión",45,{"$f":"IF(J78=1,'[1]Equivalencia BH-BMPT'!$D$2,IF(J78=2,'[1]Equivalencia BH-BMPT'!$D$3,IF(J78=3,'[1]Equivalencia BH-BMPT'!$D$4,IF(J78=4,'[1]Equivalencia BH-BMPT'!$D$5,IF(J78=5,'[1]Equivalencia BH-BMPT'!$D$6,IF(J78=6,'[1]Equivalencia BH-BMPT'!$D$7,IF(J78=7,'[1]Equivalencia BH-BMPT'!$D$8,IF(J78=8,'[1]Equivalencia BH-BMPT'!$D$9,IF(J78=9,'[1]Equivalencia BH-BMPT'!$D$10,IF(J78=10,'[1]Equivalencia BH-BMPT'!$D$11,IF(J78=11,'[1]Equivalencia BH-BMPT'!$D$12,IF(J78=12,'[1]Equivalencia BH-BMPT'!$D$13,IF(J78=13,'[1]Equivalencia BH-BMPT'!$D$14,IF(J78=14,'[1]Equivalencia BH-BMPT'!$D$15,IF(J78=15,'[1]Equivalencia BH-BMPT'!$D$16,IF(J78=16,'[1]Equivalencia BH-BMPT'!$D$17,IF(J78=17,'[1]Equivalencia BH-BMPT'!$D$18,IF(J78=18,'[1]Equivalencia BH-BMPT'!$D$19,IF(J78=19,'[1]Equivalencia BH-BMPT'!$D$20,IF(J78=20,'[1]Equivalencia BH-BMPT'!$D$21,IF(J78=21,'[1]Equivalencia BH-BMPT'!$D$22,IF(J78=22,'[1]Equivalencia BH-BMPT'!$D$23,IF(J78=23,'[1]Equivalencia BH-BMPT'!#REF!,IF(J78=24,'[1]Equivalencia BH-BMPT'!$D$25,IF(J78=25,'[1]Equivalencia BH-BMPT'!$D$26,IF(J78=26,'[1]Equivalencia BH-BMPT'!$D$27,IF(J78=27,'[1]Equivalencia BH-BMPT'!$D$28,IF(J78=28,'[1]Equivalencia BH-BMPT'!$D$29,IF(J78=29,'[1]Equivalencia BH-BMPT'!$D$30,IF(J78=30,'[1]Equivalencia BH-BMPT'!$D$31,IF(J78=31,'[1]Equivalencia BH-BMPT'!$D$32,IF(J78=32,'[1]Equivalencia BH-BMPT'!$D$33,IF(J78=33,'[1]Equivalencia BH-BMPT'!$D$34,IF(J78=34,'[1]Equivalencia BH-BMPT'!$D$35,IF(J78=35,'[1]Equivalencia BH-BMPT'!$D$36,IF(J78=36,'[1]Equivalencia BH-BMPT'!$D$37,IF(J78=37,'[1]Equivalencia BH-BMPT'!$D$38,IF(J78=38,'[1]Equivalencia BH-BMPT'!#REF!,IF(J78=39,'[1]Equivalencia BH-BMPT'!$D$40,IF(J78=40,'[1]Equivalencia BH-BMPT'!$D$41,IF(J78=41,'[1]Equivalencia BH-BMPT'!$D$42,IF(J78=42,'[1]Equivalencia BH-BMPT'!$D$43,IF(J78=43,'[1]Equivalencia BH-BMPT'!$D$44,IF(J78=44,'[1]Equivalencia BH-BMPT'!$D$45,IF(J78=45,'[1]Equivalencia BH-BMPT'!$D$46,\"No ha seleccionado un número de programa\")))))))))))))))))))))))))))))))))))))))))))))","v":"Gobernanza e influencia local, regional e internacional"},"1395",11811455,"AMANCIO VALOYES MOSQUERA",38951458,null,null,null,1770521,40721979,36944871,"2017-02-03","2017-02-03","2018-01-14",344,null,null,null,null,"X",null,0.90724645283079197,{"$f":"IF(I78=\"Funcionamiento\",J78=0,J78=\"\")","v":false}]
[17,2017,"17-12-6316568",5,{"$f":"IF(D79=1,'[1]Tipo '!$B$2,IF(D79=2,'[1]Tipo '!$B$3,IF(D79=3,'[1]Tipo '!$B$4,IF(D79=4,'[1]Tipo '!$B$5,IF(D79=5,'[1]Tipo '!$B$6,IF(D79=6,'[1]Tipo '!$B$7,IF(D79=7,'[1]Tipo '!$B$8,IF(D79=8,'[1]Tipo '!$B$9,IF(D79=9,'[1]Tipo '!$B$10,IF(D79=10,'[1]Tipo '!$B$11,IF(D79=11,'[1]Tipo '!$B$12,IF(D79=12,'[1]Tipo '!$B$13,IF(D79=13,'[1]Tipo '!$B$14,IF(D79=14,'[1]Tipo '!$B$15,IF(D79=15,'[1]Tipo '!$B$16,IF(D79=16,'[1]Tipo '!$B$17,IF(D79=17,'[1]Tipo '!$B$18,IF(D79=18,'[1]Tipo '!$B$19,IF(D79=19,'[1]Tipo '!$B$20,\"No ha seleccionado un tipo de contrato válido\")))))))))))))))))))","v":"CONTRATOS DE PRESTACIÓN DE SERVICIOS PROFESIONALES Y DE APOYO A LA GESTIÓN"},"Contratación directa","Prestación de servicios profesionales y de apoyo a la gestión, o para la ejecución de trabajos artísticos que sólo puedan encomendarse a determinadas personas naturales;","PRESTACIÓN DE SERVICIOS PROFESIONALES PARA EL APOYO A LA SUPERVISIÓN DE CONTRATOS Y/O CONVENIOS SUSCRITOS POR EL FONDO DE DESARROLLO LOCAL DE LA CANDELARIA","Inversión",45,{"$f":"IF(J79=1,'[1]Equivalencia BH-BMPT'!$D$2,IF(J79=2,'[1]Equivalencia BH-BMPT'!$D$3,IF(J79=3,'[1]Equivalencia BH-BMPT'!$D$4,IF(J79=4,'[1]Equivalencia BH-BMPT'!$D$5,IF(J79=5,'[1]Equivalencia BH-BMPT'!$D$6,IF(J79=6,'[1]Equivalencia BH-BMPT'!$D$7,IF(J79=7,'[1]Equivalencia BH-BMPT'!$D$8,IF(J79=8,'[1]Equivalencia BH-BMPT'!$D$9,IF(J79=9,'[1]Equivalencia BH-BMPT'!$D$10,IF(J79=10,'[1]Equivalencia BH-BMPT'!$D$11,IF(J79=11,'[1]Equivalencia BH-BMPT'!$D$12,IF(J79=12,'[1]Equivalencia BH-BMPT'!$D$13,IF(J79=13,'[1]Equivalencia BH-BMPT'!$D$14,IF(J79=14,'[1]Equivalencia BH-BMPT'!$D$15,IF(J79=15,'[1]Equivalencia BH-BMPT'!$D$16,IF(J79=16,'[1]Equivalencia BH-BMPT'!$D$17,IF(J79=17,'[1]Equivalencia BH-BMPT'!$D$18,IF(J79=18,'[1]Equivalencia BH-BMPT'!$D$19,IF(J79=19,'[1]Equivalencia BH-BMPT'!$D$20,IF(J79=20,'[1]Equivalencia BH-BMPT'!$D$21,IF(J79=21,'[1]Equivalencia BH-BMPT'!$D$22,IF(J79=22,'[1]Equivalencia BH-BMPT'!$D$23,IF(J79=23,'[1]Equivalencia BH-BMPT'!#REF!,IF(J79=24,'[1]Equivalencia BH-BMPT'!$D$25,IF(J79=25,'[1]Equivalencia BH-BMPT'!$D$26,IF(J79=26,'[1]Equivalencia BH-BMPT'!$D$27,IF(J79=27,'[1]Equivalencia BH-BMPT'!$D$28,IF(J79=28,'[1]Equivalencia BH-BMPT'!$D$29,IF(J79=29,'[1]Equivalencia BH-BMPT'!$D$30,IF(J79=30,'[1]Equivalencia BH-BMPT'!$D$31,IF(J79=31,'[1]Equivalencia BH-BMPT'!$D$32,IF(J79=32,'[1]Equivalencia BH-BMPT'!$D$33,IF(J79=33,'[1]Equivalencia BH-BMPT'!$D$34,IF(J79=34,'[1]Equivalencia BH-BMPT'!$D$35,IF(J79=35,'[1]Equivalencia BH-BMPT'!$D$36,IF(J79=36,'[1]Equivalencia BH-BMPT'!$D$37,IF(J79=37,'[1]Equivalencia BH-BMPT'!$D$38,IF(J79=38,'[1]Equivalencia BH-BMPT'!#REF!,IF(J79=39,'[1]Equivalencia BH-BMPT'!$D$40,IF(J79=40,'[1]Equivalencia BH-BMPT'!$D$41,IF(J79=41,'[1]Equivalencia BH-BMPT'!$D$42,IF(J79=42,'[1]Equivalencia BH-BMPT'!$D$43,IF(J79=43,'[1]Equivalencia BH-BMPT'!$D$44,IF(J79=44,'[1]Equivalencia BH-BMPT'!$D$45,IF(J79=45,'[1]Equivalencia BH-BMPT'!$D$46,\"No ha seleccionado un número de programa\")))))))))))))))))))))))))))))))))))))))))))))","v":"Gobernanza e influencia local, regional e internacional"},"1395",79652815,"SANDRO WILLIAM GONZALEZ ",44631879,null,null,null,2028722,46660601,42332655,"2017-02-03","2017-02-03","2018-01-14",344,null,null,null,null,"X",null,0.90724624399930043,false]
[18,2017,"17-12-6318409",5,{"$f":"IF(D80=1,'[1]Tipo '!$B$2,IF(D80=2,'[1]Tipo '!$B$3,IF(D80=3,'[1]Tipo '!$B$4,IF(D80=4,'[1]Tipo '!$B$5,IF(D80=5,'[1]Tipo '!$B$6,IF(D80=6,'[1]Tipo '!$B$7,IF(D80=7,'[1]Tipo '!$B$8,IF(D80=8,'[1]Tipo '!$B$9,IF(D80=9,'[1]Tipo '!$B$10,IF(D80=10,'[1]Tipo '!$B$11,IF(D80=11,'[1]Tipo '!$B$12,IF(D80=12,'[1]Tipo '!$B$13,IF(D80=13,'[1]Tipo '!$B$14,IF(D80=14,'[1]Tipo '!$B$15,IF(D80=15,'[1]Tipo '!$B$16,IF(D80=16,'[1]Tipo '!$B$17,IF(D80=17,'[1]Tipo '!$B$18,IF(D80=18,'[1]Tipo '!$B$19,IF(D80=19,'[1]Tipo '!$B$20,\"No ha seleccionado un tipo de contrato válido\")))))))))))))))))))","v":"CONTRATOS DE PRESTACIÓN DE SERVICIOS PROFESIONALES Y DE APOYO A LA GESTIÓN"},"Contratación directa","Prestación de servicios profesionales y de apoyo a la gestión, o para la ejecución de trabajos artísticos que sólo puedan encomendarse a determinadas personas naturales;","PRESTAR LOS SERVICIOS DE APOYO AL ÁREA DE GESTIÓN DE DESARROLLO LOCAL DE LA ALCALDÍA LOCAL DE LA CANDELARIA EN TEMAS CONCERNIENTES AL ALMACÉN","Inversión",45,{"$f":"IF(J80=1,'[1]Equivalencia BH-BMPT'!$D$2,IF(J80=2,'[1]Equivalencia BH-BMPT'!$D$3,IF(J80=3,'[1]Equivalencia BH-BMPT'!$D$4,IF(J80=4,'[1]Equivalencia BH-BMPT'!$D$5,IF(J80=5,'[1]Equivalencia BH-BMPT'!$D$6,IF(J80=6,'[1]Equivalencia BH-BMPT'!$D$7,IF(J80=7,'[1]Equivalencia BH-BMPT'!$D$8,IF(J80=8,'[1]Equivalencia BH-BMPT'!$D$9,IF(J80=9,'[1]Equivalencia BH-BMPT'!$D$10,IF(J80=10,'[1]Equivalencia BH-BMPT'!$D$11,IF(J80=11,'[1]Equivalencia BH-BMPT'!$D$12,IF(J80=12,'[1]Equivalencia BH-BMPT'!$D$13,IF(J80=13,'[1]Equivalencia BH-BMPT'!$D$14,IF(J80=14,'[1]Equivalencia BH-BMPT'!$D$15,IF(J80=15,'[1]Equivalencia BH-BMPT'!$D$16,IF(J80=16,'[1]Equivalencia BH-BMPT'!$D$17,IF(J80=17,'[1]Equivalencia BH-BMPT'!$D$18,IF(J80=18,'[1]Equivalencia BH-BMPT'!$D$19,IF(J80=19,'[1]Equivalencia BH-BMPT'!$D$20,IF(J80=20,'[1]Equivalencia BH-BMPT'!$D$21,IF(J80=21,'[1]Equivalencia BH-BMPT'!$D$22,IF(J80=22,'[1]Equivalencia BH-BMPT'!$D$23,IF(J80=23,'[1]Equivalencia BH-BMPT'!#REF!,IF(J80=24,'[1]Equivalencia BH-BMPT'!$D$25,IF(J80=25,'[1]Equivalencia BH-BMPT'!$D$26,IF(J80=26,'[1]Equivalencia BH-BMPT'!$D$27,IF(J80=27,'[1]Equivalencia BH-BMPT'!$D$28,IF(J80=28,'[1]Equivalencia BH-BMPT'!$D$29,IF(J80=29,'[1]Equivalencia BH-BMPT'!$D$30,IF(J80=30,'[1]Equivalencia BH-BMPT'!$D$31,IF(J80=31,'[1]Equivalencia BH-BMPT'!$D$32,IF(J80=32,'[1]Equivalencia BH-BMPT'!$D$33,IF(J80=33,'[1]Equivalencia BH-BMPT'!$D$34,IF(J80=34,'[1]Equivalencia BH-BMPT'!$D$35,IF(J80=35,'[1]Equivalencia BH-BMPT'!$D$36,IF(J80=36,'[1]Equivalencia BH-BMPT'!$D$37,IF(J80=37,'[1]Equivalencia BH-BMPT'!$D$38,IF(J80=38,'[1]Equivalencia BH-BMPT'!#REF!,IF(J80=39,'[1]Equivalencia BH-BMPT'!$D$40,IF(J80=40,'[1]Equivalencia BH-BMPT'!$D$41,IF(J80=41,'[1]Equivalencia BH-BMPT'!$D$42,IF(J80=42,'[1]Equivalencia BH-BMPT'!$D$43,IF(J80=43,'[1]Equivalencia BH-BMPT'!$D$44,IF(J80=44,'[1]Equivalencia BH-BMPT'!$D$45,IF(J80=45,'[1]Equivalencia BH-BMPT'!$D$46,\"No ha seleccionado un número de programa\")))))))))))))))))))))))))))))))))))))))))))))","v":"Gobernanza e influencia local, regional e internacional"},"1395",1019049295,"KAROL LIZETH MORENO VALERO",33271037,null,null,null,1512320,34783357,31557077,"2017-02-03","2017-02-03","2018-01-14",344,null,null,null,null,"X",null,0.90724644547678357,false]
[19,2017,"17-12-6318447",5,{"$f":"IF(D81=1,'[1]Tipo '!$B$2,IF(D81=2,'[1]Tipo '!$B$3,IF(D81=3,'[1]Tipo '!$B$4,IF(D81=4,'[1]Tipo '!$B$5,IF(D81=5,'[1]Tipo '!$B$6,IF(D81=6,'[1]Tipo '!$B$7,IF(D81=7,'[1]Tipo '!$B$8,IF(D81=8,'[1]Tipo '!$B$9,IF(D81=9,'[1]Tipo '!$B$10,IF(D81=10,'[1]Tipo '!$B$11,IF(D81=11,'[1]Tipo '!$B$12,IF(D81=12,'[1]Tipo '!$B$13,IF(D81=13,'[1]Tipo '!$B$14,IF(D81=14,'[1]Tipo '!$B$15,IF(D81=15,'[1]Tipo '!$B$16,IF(D81=16,'[1]Tipo '!$B$17,IF(D81=17,'[1]Tipo '!$B$18,IF(D81=18,'[1]Tipo '!$B$19,IF(D81=19,'[1]Tipo '!$B$20,\"No ha seleccionado un tipo de contrato válido\")))))))))))))))))))","v":"CONTRATOS DE PRESTACIÓN DE SERVICIOS PROFESIONALES Y DE APOYO A LA GESTIÓN"},"Contratación directa","Prestación de servicios profesionales y de apoyo a la gestión, o para la ejecución de trabajos artísticos que sólo puedan encomendarse a determinadas personas naturales;","PRESTACIÓN DE SERVICIOS PROFESIONALES PARA EL APOYO A LA SUPERVISIÓN DE CONTRATOS Y/O CONVENIOS SUSCRITOS POR EL FONDO DE DESARROLLO LOCAL DE LA CANDELARIA","Inversión",45,{"$f":"IF(J81=1,'[1]Equivalencia BH-BMPT'!$D$2,IF(J81=2,'[1]Equivalencia BH-BMPT'!$D$3,IF(J81=3,'[1]Equivalencia BH-BMPT'!$D$4,IF(J81=4,'[1]Equivalencia BH-BMPT'!$D$5,IF(J81=5,'[1]Equivalencia BH-BMPT'!$D$6,IF(J81=6,'[1]Equivalencia BH-BMPT'!$D$7,IF(J81=7,'[1]Equivalencia BH-BMPT'!$D$8,IF(J81=8,'[1]Equivalencia BH-BMPT'!$D$9,IF(J81=9,'[1]Equivalencia BH-BMPT'!$D$10,IF(J81=10,'[1]Equivalencia BH-BMPT'!$D$11,IF(J81=11,'[1]Equivalencia BH-BMPT'!$D$12,IF(J81=12,'[1]Equivalencia BH-BMPT'!$D$13,IF(J81=13,'[1]Equivalencia BH-BMPT'!$D$14,IF(J81=14,'[1]Equivalencia BH-BMPT'!$D$15,IF(J81=15,'[1]Equivalencia BH-BMPT'!$D$16,IF(J81=16,'[1]Equivalencia BH-BMPT'!$D$17,IF(J81=17,'[1]Equivalencia BH-BMPT'!$D$18,IF(J81=18,'[1]Equivalencia BH-BMPT'!$D$19,IF(J81=19,'[1]Equivalencia BH-BMPT'!$D$20,IF(J81=20,'[1]Equivalencia BH-BMPT'!$D$21,IF(J81=21,'[1]Equivalencia BH-BMPT'!$D$22,IF(J81=22,'[1]Equivalencia BH-BMPT'!$D$23,IF(J81=23,'[1]Equivalencia BH-BMPT'!#REF!,IF(J81=24,'[1]Equivalencia BH-BMPT'!$D$25,IF(J81=25,'[1]Equivalencia BH-BMPT'!$D$26,IF(J81=26,'[1]Equivalencia BH-BMPT'!$D$27,IF(J81=27,'[1]Equivalencia BH-BMPT'!$D$28,IF(J81=28,'[1]Equivalencia BH-BMPT'!$D$29,IF(J81=29,'[1]Equivalencia BH-BMPT'!$D$30,IF(J81=30,'[1]Equivalencia BH-BMPT'!$D$31,IF(J81=31,'[1]Equivalencia BH-BMPT'!$D$32,IF(J81=32,'[1]Equivalencia BH-BMPT'!$D$33,IF(J81=33,'[1]Equivalencia BH-BMPT'!$D$34,IF(J81=34,'[1]Equivalencia BH-BMPT'!$D$35,IF(J81=35,'[1]Equivalencia BH-BMPT'!$D$36,IF(J81=36,'[1]Equivalencia BH-BMPT'!$D$37,IF(J81=37,'[1]Equivalencia BH-BMPT'!$D$38,IF(J81=38,'[1]Equivalencia BH-BMPT'!#REF!,IF(J81=39,'[1]Equivalencia BH-BMPT'!$D$40,IF(J81=40,'[1]Equivalencia BH-BMPT'!$D$41,IF(J81=41,'[1]Equivalencia BH-BMPT'!$D$42,IF(J81=42,'[1]Equivalencia BH-BMPT'!$D$43,IF(J81=43,'[1]Equivalencia BH-BMPT'!$D$44,IF(J81=44,'[1]Equivalencia BH-BMPT'!$D$45,IF(J81=45,'[1]Equivalencia BH-BMPT'!$D$46,\"No ha seleccionado un número de programa\")))))))))))))))))))))))))))))))))))))))))))))","v":"Gobernanza e influencia local, regional e internacional"},"1395",52615874,"TULIA HILDA SANCHEZ MUÑOZ",49500811,null,null,null,null,49500811,44250716,"2017-02-03","2017-02-03","2018-01-17",329,null,null,null,null,"X",null,0.89393921243027719,false]
[20,2017,"17-12-6318505",5,{"$f":"IF(D82=1,'[1]Tipo '!$B$2,IF(D82=2,'[1]Tipo '!$B$3,IF(D82=3,'[1]Tipo '!$B$4,IF(D82=4,'[1]Tipo '!$B$5,IF(D82=5,'[1]Tipo '!$B$6,IF(D82=6,'[1]Tipo '!$B$7,IF(D82=7,'[1]Tipo '!$B$8,IF(D82=8,'[1]Tipo '!$B$9,IF(D82=9,'[1]Tipo '!$B$10,IF(D82=10,'[1]Tipo '!$B$11,IF(D82=11,'[1]Tipo '!$B$12,IF(D82=12,'[1]Tipo '!$B$13,IF(D82=13,'[1]Tipo '!$B$14,IF(D82=14,'[1]Tipo '!$B$15,IF(D82=15,'[1]Tipo '!$B$16,IF(D82=16,'[1]Tipo '!$B$17,IF(D82=17,'[1]Tipo '!$B$18,IF(D82=18,'[1]Tipo '!$B$19,IF(D82=19,'[1]Tipo '!$B$20,\"No ha seleccionado un tipo de contrato válido\")))))))))))))))))))","v":"CONTRATOS DE PRESTACIÓN DE SERVICIOS PROFESIONALES Y DE APOYO A LA GESTIÓN"},"Contratación directa","Prestación de servicios profesionales y de apoyo a la gestión, o para la ejecución de trabajos artísticos que sólo puedan encomendarse a determinadas personas naturales;","PRESTAR LOS SERVICIOS DE APOYO  AL DESPACHO DEL ALCALDE LOCAL DE LA CANDELARIA EN TEMAS ADMINISTRATIVOS, ASISTENCIALES Y DE INTERLOCUCIÓN CON LAS DEMÁS ÁREAS DE LA ALCALDÍA LOCAL","Inversión",45,{"$f":"IF(J82=1,'[1]Equivalencia BH-BMPT'!$D$2,IF(J82=2,'[1]Equivalencia BH-BMPT'!$D$3,IF(J82=3,'[1]Equivalencia BH-BMPT'!$D$4,IF(J82=4,'[1]Equivalencia BH-BMPT'!$D$5,IF(J82=5,'[1]Equivalencia BH-BMPT'!$D$6,IF(J82=6,'[1]Equivalencia BH-BMPT'!$D$7,IF(J82=7,'[1]Equivalencia BH-BMPT'!$D$8,IF(J82=8,'[1]Equivalencia BH-BMPT'!$D$9,IF(J82=9,'[1]Equivalencia BH-BMPT'!$D$10,IF(J82=10,'[1]Equivalencia BH-BMPT'!$D$11,IF(J82=11,'[1]Equivalencia BH-BMPT'!$D$12,IF(J82=12,'[1]Equivalencia BH-BMPT'!$D$13,IF(J82=13,'[1]Equivalencia BH-BMPT'!$D$14,IF(J82=14,'[1]Equivalencia BH-BMPT'!$D$15,IF(J82=15,'[1]Equivalencia BH-BMPT'!$D$16,IF(J82=16,'[1]Equivalencia BH-BMPT'!$D$17,IF(J82=17,'[1]Equivalencia BH-BMPT'!$D$18,IF(J82=18,'[1]Equivalencia BH-BMPT'!$D$19,IF(J82=19,'[1]Equivalencia BH-BMPT'!$D$20,IF(J82=20,'[1]Equivalencia BH-BMPT'!$D$21,IF(J82=21,'[1]Equivalencia BH-BMPT'!$D$22,IF(J82=22,'[1]Equivalencia BH-BMPT'!$D$23,IF(J82=23,'[1]Equivalencia BH-BMPT'!#REF!,IF(J82=24,'[1]Equivalencia BH-BMPT'!$D$25,IF(J82=25,'[1]Equivalencia BH-BMPT'!$D$26,IF(J82=26,'[1]Equivalencia BH-BMPT'!$D$27,IF(J82=27,'[1]Equivalencia BH-BMPT'!$D$28,IF(J82=28,'[1]Equivalencia BH-BMPT'!$D$29,IF(J82=29,'[1]Equivalencia BH-BMPT'!$D$30,IF(J82=30,'[1]Equivalencia BH-BMPT'!$D$31,IF(J82=31,'[1]Equivalencia BH-BMPT'!$D$32,IF(J82=32,'[1]Equivalencia BH-BMPT'!$D$33,IF(J82=33,'[1]Equivalencia BH-BMPT'!$D$34,IF(J82=34,'[1]Equivalencia BH-BMPT'!$D$35,IF(J82=35,'[1]Equivalencia BH-BMPT'!$D$36,IF(J82=36,'[1]Equivalencia BH-BMPT'!$D$37,IF(J82=37,'[1]Equivalencia BH-BMPT'!$D$38,IF(J82=38,'[1]Equivalencia BH-BMPT'!#REF!,IF(J82=39,'[1]Equivalencia BH-BMPT'!$D$40,IF(J82=40,'[1]Equivalencia BH-BMPT'!$D$41,IF(J82=41,'[1]Equivalencia BH-BMPT'!$D$42,IF(J82=42,'[1]Equivalencia BH-BMPT'!$D$43,IF(J82=43,'[1]Equivalencia BH-BMPT'!$D$44,IF(J82=44,'[1]Equivalencia BH-BMPT'!$D$45,IF(J82=45,'[1]Equivalencia BH-BMPT'!$D$46,\"No ha seleccionado un número de programa\")))))))))))))))))))))))))))))))))))))))))))))","v":"Gobernanza e influencia local, regional e internacional"},"1395",1023938431,"LAURA PAOLA BORDA GOMEZ ",23533172,null,null,null,1069690,24602862,22320854,"2017-02-03","2017-02-03","2018-01-14",344,null,null,null,null,"X",null,0.90724623826284923,false]
[21,2017,"17-12-6318698",5,{"$f":"IF(D83=1,'[1]Tipo '!$B$2,IF(D83=2,'[1]Tipo '!$B$3,IF(D83=3,'[1]Tipo '!$B$4,IF(D83=4,'[1]Tipo '!$B$5,IF(D83=5,'[1]Tipo '!$B$6,IF(D83=6,'[1]Tipo '!$B$7,IF(D83=7,'[1]Tipo '!$B$8,IF(D83=8,'[1]Tipo '!$B$9,IF(D83=9,'[1]Tipo '!$B$10,IF(D83=10,'[1]Tipo '!$B$11,IF(D83=11,'[1]Tipo '!$B$12,IF(D83=12,'[1]Tipo '!$B$13,IF(D83=13,'[1]Tipo '!$B$14,IF(D83=14,'[1]Tipo '!$B$15,IF(D83=15,'[1]Tipo '!$B$16,IF(D83=16,'[1]Tipo '!$B$17,IF(D83=17,'[1]Tipo '!$B$18,IF(D83=18,'[1]Tipo '!$B$19,IF(D83=19,'[1]Tipo '!$B$20,\"No ha seleccionado un tipo de contrato válido\")))))))))))))))))))","v":"CONTRATOS DE PRESTACIÓN DE SERVICIOS PROFESIONALES Y DE APOYO A LA GESTIÓN"},"Contratación directa","Prestación de servicios profesionales y de apoyo a la gestión, o para la ejecución de trabajos artísticos que sólo puedan encomendarse a determinadas personas naturales;","PRESTAR SUS SERVICIOS PROFESIONALES DE APOYO JURIDÍCO DE LOS PROCESOS A CARGO DEL ÁREA DE GESTIÓN POLICIVA DE LA ALCALDÍA LOCAL DE LA CANDELARÍA PARA TEMAS DE ESTABLECIMIENTOS DE COMERCIO, PROPIEDAD HORIZONTAL, ACCIONES CONSTITUCIONALES, OBRAS Y DERECHO DE PETICIÓN SEGÚN REPARTO","Inversión",45,{"$f":"IF(J83=1,'[1]Equivalencia BH-BMPT'!$D$2,IF(J83=2,'[1]Equivalencia BH-BMPT'!$D$3,IF(J83=3,'[1]Equivalencia BH-BMPT'!$D$4,IF(J83=4,'[1]Equivalencia BH-BMPT'!$D$5,IF(J83=5,'[1]Equivalencia BH-BMPT'!$D$6,IF(J83=6,'[1]Equivalencia BH-BMPT'!$D$7,IF(J83=7,'[1]Equivalencia BH-BMPT'!$D$8,IF(J83=8,'[1]Equivalencia BH-BMPT'!$D$9,IF(J83=9,'[1]Equivalencia BH-BMPT'!$D$10,IF(J83=10,'[1]Equivalencia BH-BMPT'!$D$11,IF(J83=11,'[1]Equivalencia BH-BMPT'!$D$12,IF(J83=12,'[1]Equivalencia BH-BMPT'!$D$13,IF(J83=13,'[1]Equivalencia BH-BMPT'!$D$14,IF(J83=14,'[1]Equivalencia BH-BMPT'!$D$15,IF(J83=15,'[1]Equivalencia BH-BMPT'!$D$16,IF(J83=16,'[1]Equivalencia BH-BMPT'!$D$17,IF(J83=17,'[1]Equivalencia BH-BMPT'!$D$18,IF(J83=18,'[1]Equivalencia BH-BMPT'!$D$19,IF(J83=19,'[1]Equivalencia BH-BMPT'!$D$20,IF(J83=20,'[1]Equivalencia BH-BMPT'!$D$21,IF(J83=21,'[1]Equivalencia BH-BMPT'!$D$22,IF(J83=22,'[1]Equivalencia BH-BMPT'!$D$23,IF(J83=23,'[1]Equivalencia BH-BMPT'!#REF!,IF(J83=24,'[1]Equivalencia BH-BMPT'!$D$25,IF(J83=25,'[1]Equivalencia BH-BMPT'!$D$26,IF(J83=26,'[1]Equivalencia BH-BMPT'!$D$27,IF(J83=27,'[1]Equivalencia BH-BMPT'!$D$28,IF(J83=28,'[1]Equivalencia BH-BMPT'!$D$29,IF(J83=29,'[1]Equivalencia BH-BMPT'!$D$30,IF(J83=30,'[1]Equivalencia BH-BMPT'!$D$31,IF(J83=31,'[1]Equivalencia BH-BMPT'!$D$32,IF(J83=32,'[1]Equivalencia BH-BMPT'!$D$33,IF(J83=33,'[1]Equivalencia BH-BMPT'!$D$34,IF(J83=34,'[1]Equivalencia BH-BMPT'!$D$35,IF(J83=35,'[1]Equivalencia BH-BMPT'!$D$36,IF(J83=36,'[1]Equivalencia BH-BMPT'!$D$37,IF(J83=37,'[1]Equivalencia BH-BMPT'!$D$38,IF(J83=38,'[1]Equivalencia BH-BMPT'!#REF!,IF(J83=39,'[1]Equivalencia BH-BMPT'!$D$40,IF(J83=40,'[1]Equivalencia BH-BMPT'!$D$41,IF(J83=41,'[1]Equivalencia BH-BMPT'!$D$42,IF(J83=42,'[1]Equivalencia BH-BMPT'!$D$43,IF(J83=43,'[1]Equivalencia BH-BMPT'!$D$44,IF(J83=44,'[1]Equivalencia BH-BMPT'!$D$45,IF(J83=45,'[1]Equivalencia BH-BMPT'!$D$46,\"No ha seleccionado un número de programa\")))))))))))))))))))))))))))))))))))))))))))))","v":"Gobernanza e influencia local, regional e internacional"},"1395",93238085,"Gadiel Fernando Carrillo Aldana ",49500811,null,null,null,2250037,51750848,46950772,"2017-02-03","2017-02-03","2018-01-14",344,null,null,null,null,"X",null,0.90724642811650158,false]
[22,2017,"17-12-6318831",5,{"$f":"IF(D84=1,'[1]Tipo '!$B$2,IF(D84=2,'[1]Tipo '!$B$3,IF(D84=3,'[1]Tipo '!$B$4,IF(D84=4,'[1]Tipo '!$B$5,IF(D84=5,'[1]Tipo '!$B$6,IF(D84=6,'[1]Tipo '!$B$7,IF(D84=7,'[1]Tipo '!$B$8,IF(D84=8,'[1]Tipo '!$B$9,IF(D84=9,'[1]Tipo '!$B$10,IF(D84=10,'[1]Tipo '!$B$11,IF(D84=11,'[1]Tipo '!$B$12,IF(D84=12,'[1]Tipo '!$B$13,IF(D84=13,'[1]Tipo '!$B$14,IF(D84=14,'[1]Tipo '!$B$15,IF(D84=15,'[1]Tipo '!$B$16,IF(D84=16,'[1]Tipo '!$B$17,IF(D84=17,'[1]Tipo '!$B$18,IF(D84=18,'[1]Tipo '!$B$19,IF(D84=19,'[1]Tipo '!$B$20,\"No ha seleccionado un tipo de contrato válido\")))))))))))))))))))","v":"CONTRATOS DE PRESTACIÓN DE SERVICIOS PROFESIONALES Y DE APOYO A LA GESTIÓN"},"Contratación directa","Prestación de servicios profesionales y de apoyo a la gestión, o para la ejecución de trabajos artísticos que sólo puedan encomendarse a determinadas personas naturales;","Prestar los servicios administrativos y asistenciales al área de gestión policiva de la alcaldía local de la candelaria en los temas concernientes a establecimientos de comercio, propiedad horizontal, acciones constitucionales, obras y derecho de petición","Inversión",45,{"$f":"IF(J84=1,'[1]Equivalencia BH-BMPT'!$D$2,IF(J84=2,'[1]Equivalencia BH-BMPT'!$D$3,IF(J84=3,'[1]Equivalencia BH-BMPT'!$D$4,IF(J84=4,'[1]Equivalencia BH-BMPT'!$D$5,IF(J84=5,'[1]Equivalencia BH-BMPT'!$D$6,IF(J84=6,'[1]Equivalencia BH-BMPT'!$D$7,IF(J84=7,'[1]Equivalencia BH-BMPT'!$D$8,IF(J84=8,'[1]Equivalencia BH-BMPT'!$D$9,IF(J84=9,'[1]Equivalencia BH-BMPT'!$D$10,IF(J84=10,'[1]Equivalencia BH-BMPT'!$D$11,IF(J84=11,'[1]Equivalencia BH-BMPT'!$D$12,IF(J84=12,'[1]Equivalencia BH-BMPT'!$D$13,IF(J84=13,'[1]Equivalencia BH-BMPT'!$D$14,IF(J84=14,'[1]Equivalencia BH-BMPT'!$D$15,IF(J84=15,'[1]Equivalencia BH-BMPT'!$D$16,IF(J84=16,'[1]Equivalencia BH-BMPT'!$D$17,IF(J84=17,'[1]Equivalencia BH-BMPT'!$D$18,IF(J84=18,'[1]Equivalencia BH-BMPT'!$D$19,IF(J84=19,'[1]Equivalencia BH-BMPT'!$D$20,IF(J84=20,'[1]Equivalencia BH-BMPT'!$D$21,IF(J84=21,'[1]Equivalencia BH-BMPT'!$D$22,IF(J84=22,'[1]Equivalencia BH-BMPT'!$D$23,IF(J84=23,'[1]Equivalencia BH-BMPT'!#REF!,IF(J84=24,'[1]Equivalencia BH-BMPT'!$D$25,IF(J84=25,'[1]Equivalencia BH-BMPT'!$D$26,IF(J84=26,'[1]Equivalencia BH-BMPT'!$D$27,IF(J84=27,'[1]Equivalencia BH-BMPT'!$D$28,IF(J84=28,'[1]Equivalencia BH-BMPT'!$D$29,IF(J84=29,'[1]Equivalencia BH-BMPT'!$D$30,IF(J84=30,'[1]Equivalencia BH-BMPT'!$D$31,IF(J84=31,'[1]Equivalencia BH-BMPT'!$D$32,IF(J84=32,'[1]Equivalencia BH-BMPT'!$D$33,IF(J84=33,'[1]Equivalencia BH-BMPT'!$D$34,IF(J84=34,'[1]Equivalencia BH-BMPT'!$D$35,IF(J84=35,'[1]Equivalencia BH-BMPT'!$D$36,IF(J84=36,'[1]Equivalencia BH-BMPT'!$D$37,IF(J84=37,'[1]Equivalencia BH-BMPT'!$D$38,IF(J84=38,'[1]Equivalencia BH-BMPT'!#REF!,IF(J84=39,'[1]Equivalencia BH-BMPT'!$D$40,IF(J84=40,'[1]Equivalencia BH-BMPT'!$D$41,IF(J84=41,'[1]Equivalencia BH-BMPT'!$D$42,IF(J84=42,'[1]Equivalencia BH-BMPT'!$D$43,IF(J84=43,'[1]Equivalencia BH-BMPT'!$D$44,IF(J84=44,'[1]Equivalencia BH-BMPT'!$D$45,IF(J84=45,'[1]Equivalencia BH-BMPT'!$D$46,\"No ha seleccionado un número de programa\")))))))))))))))))))))))))))))))))))))))))))))","v":"Gobernanza e influencia local, regional e internacional"},"1395",80442207,"Leonardo Guerra Ramirez",27590616,null,null,null,2090198,29680814,26169283,"2017-02-03","2017-02-03","2018-01-24",354,null,null,null,"X",null,null,0.88169020566619227,false]
[23,2017,"17-12-6319029",5,{"$f":"IF(D85=1,'[1]Tipo '!$B$2,IF(D85=2,'[1]Tipo '!$B$3,IF(D85=3,'[1]Tipo '!$B$4,IF(D85=4,'[1]Tipo '!$B$5,IF(D85=5,'[1]Tipo '!$B$6,IF(D85=6,'[1]Tipo '!$B$7,IF(D85=7,'[1]Tipo '!$B$8,IF(D85=8,'[1]Tipo '!$B$9,IF(D85=9,'[1]Tipo '!$B$10,IF(D85=10,'[1]Tipo '!$B$11,IF(D85=11,'[1]Tipo '!$B$12,IF(D85=12,'[1]Tipo '!$B$13,IF(D85=13,'[1]Tipo '!$B$14,IF(D85=14,'[1]Tipo '!$B$15,IF(D85=15,'[1]Tipo '!$B$16,IF(D85=16,'[1]Tipo '!$B$17,IF(D85=17,'[1]Tipo '!$B$18,IF(D85=18,'[1]Tipo '!$B$19,IF(D85=19,'[1]Tipo '!$B$20,\"No ha seleccionado un tipo de contrato válido\")))))))))))))))))))","v":"CONTRATOS DE PRESTACIÓN DE SERVICIOS PROFESIONALES Y DE APOYO A LA GESTIÓN"},"Contratación directa","Prestación de servicios profesionales y de apoyo a la gestión, o para la ejecución de trabajos artísticos que sólo puedan encomendarse a determinadas personas naturales;","PRESTAR LOS SERVICIOS ADMINISTRATIVOS Y ASISTENCIALES AL ÁREA DE GESTIÓN POLICIVA DE LA ALCALDÍA LOCAL DE LA CANDELARIA EN LOS TEMAS CONCERNIENTES A ESTABLECIMIENTOS DE COMERCIO, PROPIEDAD HORIZONTAL, ACCIONES CONSTITUCIONALES, OBRAS Y DERECHO DE PETICIÓN”, SEGÚN LOS ESTUDIOS PREVIOS Y LA PROPUESTA PRESENTADA QUE FORMAN PARTE INTEGRAL DEL PRESENTE CONTRATO","Inversión",45,{"$f":"IF(J85=1,'[1]Equivalencia BH-BMPT'!$D$2,IF(J85=2,'[1]Equivalencia BH-BMPT'!$D$3,IF(J85=3,'[1]Equivalencia BH-BMPT'!$D$4,IF(J85=4,'[1]Equivalencia BH-BMPT'!$D$5,IF(J85=5,'[1]Equivalencia BH-BMPT'!$D$6,IF(J85=6,'[1]Equivalencia BH-BMPT'!$D$7,IF(J85=7,'[1]Equivalencia BH-BMPT'!$D$8,IF(J85=8,'[1]Equivalencia BH-BMPT'!$D$9,IF(J85=9,'[1]Equivalencia BH-BMPT'!$D$10,IF(J85=10,'[1]Equivalencia BH-BMPT'!$D$11,IF(J85=11,'[1]Equivalencia BH-BMPT'!$D$12,IF(J85=12,'[1]Equivalencia BH-BMPT'!$D$13,IF(J85=13,'[1]Equivalencia BH-BMPT'!$D$14,IF(J85=14,'[1]Equivalencia BH-BMPT'!$D$15,IF(J85=15,'[1]Equivalencia BH-BMPT'!$D$16,IF(J85=16,'[1]Equivalencia BH-BMPT'!$D$17,IF(J85=17,'[1]Equivalencia BH-BMPT'!$D$18,IF(J85=18,'[1]Equivalencia BH-BMPT'!$D$19,IF(J85=19,'[1]Equivalencia BH-BMPT'!$D$20,IF(J85=20,'[1]Equivalencia BH-BMPT'!$D$21,IF(J85=21,'[1]Equivalencia BH-BMPT'!$D$22,IF(J85=22,'[1]Equivalencia BH-BMPT'!$D$23,IF(J85=23,'[1]Equivalencia BH-BMPT'!#REF!,IF(J85=24,'[1]Equivalencia BH-BMPT'!$D$25,IF(J85=25,'[1]Equivalencia BH-BMPT'!$D$26,IF(J85=26,'[1]Equivalencia BH-BMPT'!$D$27,IF(J85=27,'[1]Equivalencia BH-BMPT'!$D$28,IF(J85=28,'[1]Equivalencia BH-BMPT'!$D$29,IF(J85=29,'[1]Equivalencia BH-BMPT'!$D$30,IF(J85=30,'[1]Equivalencia BH-BMPT'!$D$31,IF(J85=31,'[1]Equivalencia BH-BMPT'!$D$32,IF(J85=32,'[1]Equivalencia BH-BMPT'!$D$33,IF(J85=33,'[1]Equivalencia BH-BMPT'!$D$34,IF(J85=34,'[1]Equivalencia BH-BMPT'!$D$35,IF(J85=35,'[1]Equivalencia BH-BMPT'!$D$36,IF(J85=36,'[1]Equivalencia BH-BMPT'!$D$37,IF(J85=37,'[1]Equivalencia BH-BMPT'!$D$38,IF(J85=38,'[1]Equivalencia BH-BMPT'!#REF!,IF(J85=39,'[1]Equivalencia BH-BMPT'!$D$40,IF(J85=40,'[1]Equivalencia BH-BMPT'!$D$41,IF(J85=41,'[1]Equivalencia BH-BMPT'!$D$42,IF(J85=42,'[1]Equivalencia BH-BMPT'!$D$43,IF(J85=43,'[1]Equivalencia BH-BMPT'!$D$44,IF(J85=44,'[1]Equivalencia BH-BMPT'!$D$45,IF(J85=45,'[1]Equivalencia BH-BMPT'!$D$46,\"No ha seleccionado un número de programa\")))))))))))))))))))))))))))))))))))))))))))))","v":"Gobernanza e influencia local, regional e internacional"},"1395",49729700,"Nereida Hernández Flórez",26336497,null,null,null,null,26336497,26169283,"2017-02-03","2017-02-03","2017-12-30",329,null,null,null,null,"X",null,0.99365086404619418,false]
[24,2017,"17-12-6329462",5,{"$f":"IF(D86=1,'[1]Tipo '!$B$2,IF(D86=2,'[1]Tipo '!$B$3,IF(D86=3,'[1]Tipo '!$B$4,IF(D86=4,'[1]Tipo '!$B$5,IF(D86=5,'[1]Tipo '!$B$6,IF(D86=6,'[1]Tipo '!$B$7,IF(D86=7,'[1]Tipo '!$B$8,IF(D86=8,'[1]Tipo '!$B$9,IF(D86=9,'[1]Tipo '!$B$10,IF(D86=10,'[1]Tipo '!$B$11,IF(D86=11,'[1]Tipo '!$B$12,IF(D86=12,'[1]Tipo '!$B$13,IF(D86=13,'[1]Tipo '!$B$14,IF(D86=14,'[1]Tipo '!$B$15,IF(D86=15,'[1]Tipo '!$B$16,IF(D86=16,'[1]Tipo '!$B$17,IF(D86=17,'[1]Tipo '!$B$18,IF(D86=18,'[1]Tipo '!$B$19,IF(D86=19,'[1]Tipo '!$B$20,\"No ha seleccionado un tipo de contrato válido\")))))))))))))))))))","v":"CONTRATOS DE PRESTACIÓN DE SERVICIOS PROFESIONALES Y DE APOYO A LA GESTIÓN"},"Contratación directa","Prestación de servicios profesionales y de apoyo a la gestión, o para la ejecución de trabajos artísticos que sólo puedan encomendarse a determinadas personas naturales;","“PRESTAR SUS SERVICIOS PROFESIONALES DE APOYO JURIDÍCO DE LOS PROCESOS A CARGO DEL ÁREA DE GESTIÓN POLICIVA DE LA ALCALDÍA LOCAL DE LA CANDELARÍA PARA TEMAS DE ESTABLECIMIENTOS DE COMERCIO, PROPIEDAD HORIZONTAL, ACCIONES CONSTITUCIONALES, OBRAS Y DERECHO DE PETICIÓN SEGUN REPARTO”","Inversión",45,{"$f":"IF(J86=1,'[1]Equivalencia BH-BMPT'!$D$2,IF(J86=2,'[1]Equivalencia BH-BMPT'!$D$3,IF(J86=3,'[1]Equivalencia BH-BMPT'!$D$4,IF(J86=4,'[1]Equivalencia BH-BMPT'!$D$5,IF(J86=5,'[1]Equivalencia BH-BMPT'!$D$6,IF(J86=6,'[1]Equivalencia BH-BMPT'!$D$7,IF(J86=7,'[1]Equivalencia BH-BMPT'!$D$8,IF(J86=8,'[1]Equivalencia BH-BMPT'!$D$9,IF(J86=9,'[1]Equivalencia BH-BMPT'!$D$10,IF(J86=10,'[1]Equivalencia BH-BMPT'!$D$11,IF(J86=11,'[1]Equivalencia BH-BMPT'!$D$12,IF(J86=12,'[1]Equivalencia BH-BMPT'!$D$13,IF(J86=13,'[1]Equivalencia BH-BMPT'!$D$14,IF(J86=14,'[1]Equivalencia BH-BMPT'!$D$15,IF(J86=15,'[1]Equivalencia BH-BMPT'!$D$16,IF(J86=16,'[1]Equivalencia BH-BMPT'!$D$17,IF(J86=17,'[1]Equivalencia BH-BMPT'!$D$18,IF(J86=18,'[1]Equivalencia BH-BMPT'!$D$19,IF(J86=19,'[1]Equivalencia BH-BMPT'!$D$20,IF(J86=20,'[1]Equivalencia BH-BMPT'!$D$21,IF(J86=21,'[1]Equivalencia BH-BMPT'!$D$22,IF(J86=22,'[1]Equivalencia BH-BMPT'!$D$23,IF(J86=23,'[1]Equivalencia BH-BMPT'!#REF!,IF(J86=24,'[1]Equivalencia BH-BMPT'!$D$25,IF(J86=25,'[1]Equivalencia BH-BMPT'!$D$26,IF(J86=26,'[1]Equivalencia BH-BMPT'!$D$27,IF(J86=27,'[1]Equivalencia BH-BMPT'!$D$28,IF(J86=28,'[1]Equivalencia BH-BMPT'!$D$29,IF(J86=29,'[1]Equivalencia BH-BMPT'!$D$30,IF(J86=30,'[1]Equivalencia BH-BMPT'!$D$31,IF(J86=31,'[1]Equivalencia BH-BMPT'!$D$32,IF(J86=32,'[1]Equivalencia BH-BMPT'!$D$33,IF(J86=33,'[1]Equivalencia BH-BMPT'!$D$34,IF(J86=34,'[1]Equivalencia BH-BMPT'!$D$35,IF(J86=35,'[1]Equivalencia BH-BMPT'!$D$36,IF(J86=36,'[1]Equivalencia BH-BMPT'!$D$37,IF(J86=37,'[1]Equivalencia BH-BMPT'!$D$38,IF(J86=38,'[1]Equivalencia BH-BMPT'!#REF!,IF(J86=39,'[1]Equivalencia BH-BMPT'!$D$40,IF(J86=40,'[1]Equivalencia BH-BMPT'!$D$41,IF(J86=41,'[1]Equivalencia BH-BMPT'!$D$42,IF(J86=42,'[1]Equivalencia BH-BMPT'!$D$43,IF(J86=43,'[1]Equivalencia BH-BMPT'!$D$44,IF(J86=44,'[1]Equivalencia BH-BMPT'!$D$45,IF(J86=45,'[1]Equivalencia BH-BMPT'!$D$46,\"No ha seleccionado un número de programa\")))))))))))))))))))))))))))))))))))))))))))))","v":"Gobernanza e influencia local, regional e internacional"},"1395",17344074,"JOSE JAVIER MESA CESPEDES EL",49500811,null,null,null,2250037,51750848,46950727,"2017-02-03","2017-02-03","2018-01-14",344,null,null,null,null,"X",null,0.90724555856553302,false]
[25,2017,"17-12-6329550",5,{"$f":"IF(D87=1,'[1]Tipo '!$B$2,IF(D87=2,'[1]Tipo '!$B$3,IF(D87=3,'[1]Tipo '!$B$4,IF(D87=4,'[1]Tipo '!$B$5,IF(D87=5,'[1]Tipo '!$B$6,IF(D87=6,'[1]Tipo '!$B$7,IF(D87=7,'[1]Tipo '!$B$8,IF(D87=8,'[1]Tipo '!$B$9,IF(D87=9,'[1]Tipo '!$B$10,IF(D87=10,'[1]Tipo '!$B$11,IF(D87=11,'[1]Tipo '!$B$12,IF(D87=12,'[1]Tipo '!$B$13,IF(D87=13,'[1]Tipo '!$B$14,IF(D87=14,'[1]Tipo '!$B$15,IF(D87=15,'[1]Tipo '!$B$16,IF(D87=16,'[1]Tipo '!$B$17,IF(D87=17,'[1]Tipo '!$B$18,IF(D87=18,'[1]Tipo '!$B$19,IF(D87=19,'[1]Tipo '!$B$20,\"No ha seleccionado un tipo de contrato válido\")))))))))))))))))))","v":"CONTRATOS DE PRESTACIÓN DE SERVICIOS PROFESIONALES Y DE APOYO A LA GESTIÓN"},"Contratación directa","Prestación de servicios profesionales y de apoyo a la gestión, o para la ejecución de trabajos artísticos que sólo puedan encomendarse a determinadas personas naturales;","PRESTAR SUS SERVICIOS PROFESIONALES ESPECIALIZADOS AL ÁREA DE GESTIÓN DE DESARROLLO LOCAL APOYANDO JURIDICAMENTE LOS TEMAS DE COMPETENCIA DE LA ALCALDÍA LOCAL Y EL FONDO DE DESARROLLO LOCAL DE LA CANDELARIA","Inversión",45,{"$f":"IF(J87=1,'[1]Equivalencia BH-BMPT'!$D$2,IF(J87=2,'[1]Equivalencia BH-BMPT'!$D$3,IF(J87=3,'[1]Equivalencia BH-BMPT'!$D$4,IF(J87=4,'[1]Equivalencia BH-BMPT'!$D$5,IF(J87=5,'[1]Equivalencia BH-BMPT'!$D$6,IF(J87=6,'[1]Equivalencia BH-BMPT'!$D$7,IF(J87=7,'[1]Equivalencia BH-BMPT'!$D$8,IF(J87=8,'[1]Equivalencia BH-BMPT'!$D$9,IF(J87=9,'[1]Equivalencia BH-BMPT'!$D$10,IF(J87=10,'[1]Equivalencia BH-BMPT'!$D$11,IF(J87=11,'[1]Equivalencia BH-BMPT'!$D$12,IF(J87=12,'[1]Equivalencia BH-BMPT'!$D$13,IF(J87=13,'[1]Equivalencia BH-BMPT'!$D$14,IF(J87=14,'[1]Equivalencia BH-BMPT'!$D$15,IF(J87=15,'[1]Equivalencia BH-BMPT'!$D$16,IF(J87=16,'[1]Equivalencia BH-BMPT'!$D$17,IF(J87=17,'[1]Equivalencia BH-BMPT'!$D$18,IF(J87=18,'[1]Equivalencia BH-BMPT'!$D$19,IF(J87=19,'[1]Equivalencia BH-BMPT'!$D$20,IF(J87=20,'[1]Equivalencia BH-BMPT'!$D$21,IF(J87=21,'[1]Equivalencia BH-BMPT'!$D$22,IF(J87=22,'[1]Equivalencia BH-BMPT'!$D$23,IF(J87=23,'[1]Equivalencia BH-BMPT'!#REF!,IF(J87=24,'[1]Equivalencia BH-BMPT'!$D$25,IF(J87=25,'[1]Equivalencia BH-BMPT'!$D$26,IF(J87=26,'[1]Equivalencia BH-BMPT'!$D$27,IF(J87=27,'[1]Equivalencia BH-BMPT'!$D$28,IF(J87=28,'[1]Equivalencia BH-BMPT'!$D$29,IF(J87=29,'[1]Equivalencia BH-BMPT'!$D$30,IF(J87=30,'[1]Equivalencia BH-BMPT'!$D$31,IF(J87=31,'[1]Equivalencia BH-BMPT'!$D$32,IF(J87=32,'[1]Equivalencia BH-BMPT'!$D$33,IF(J87=33,'[1]Equivalencia BH-BMPT'!$D$34,IF(J87=34,'[1]Equivalencia BH-BMPT'!$D$35,IF(J87=35,'[1]Equivalencia BH-BMPT'!$D$36,IF(J87=36,'[1]Equivalencia BH-BMPT'!$D$37,IF(J87=37,'[1]Equivalencia BH-BMPT'!$D$38,IF(J87=38,'[1]Equivalencia BH-BMPT'!#REF!,IF(J87=39,'[1]Equivalencia BH-BMPT'!$D$40,IF(J87=40,'[1]Equivalencia BH-BMPT'!$D$41,IF(J87=41,'[1]Equivalencia BH-BMPT'!$D$42,IF(J87=42,'[1]Equivalencia BH-BMPT'!$D$43,IF(J87=43,'[1]Equivalencia BH-BMPT'!$D$44,IF(J87=44,'[1]Equivalencia BH-BMPT'!$D$45,IF(J87=45,'[1]Equivalencia BH-BMPT'!$D$46,\"No ha seleccionado un número de programa\")))))))))))))))))))))))))))))))))))))))))))))","v":"Gobernanza e influencia local, regional e internacional"},"1395",79341582,"Ricardo Ayerbe Pino",77902915,null,null,null,3541042,81443957,73889733,"2017-02-03","2017-02-03","2018-01-14",344,null,null,null,null,"X",null,0.90724635346487403,false]
[26,2017,"17-12-6329610",5,{"$f":"IF(D88=1,'[1]Tipo '!$B$2,IF(D88=2,'[1]Tipo '!$B$3,IF(D88=3,'[1]Tipo '!$B$4,IF(D88=4,'[1]Tipo '!$B$5,IF(D88=5,'[1]Tipo '!$B$6,IF(D88=6,'[1]Tipo '!$B$7,IF(D88=7,'[1]Tipo '!$B$8,IF(D88=8,'[1]Tipo '!$B$9,IF(D88=9,'[1]Tipo '!$B$10,IF(D88=10,'[1]Tipo '!$B$11,IF(D88=11,'[1]Tipo '!$B$12,IF(D88=12,'[1]Tipo '!$B$13,IF(D88=13,'[1]Tipo '!$B$14,IF(D88=14,'[1]Tipo '!$B$15,IF(D88=15,'[1]Tipo '!$B$16,IF(D88=16,'[1]Tipo '!$B$17,IF(D88=17,'[1]Tipo '!$B$18,IF(D88=18,'[1]Tipo '!$B$19,IF(D88=19,'[1]Tipo '!$B$20,\"No ha seleccionado un tipo de contrato válido\")))))))))))))))))))","v":"CONTRATOS DE PRESTACIÓN DE SERVICIOS PROFESIONALES Y DE APOYO A LA GESTIÓN"},"Contratación directa","Prestación de servicios profesionales y de apoyo a la gestión, o para la ejecución de trabajos artísticos que sólo puedan encomendarse a determinadas personas naturales;","PRESTAR SERVICIOS PROFESIONALES PARA LA ESTRUCTURACIÓN DE LOS PROCESOS PRE-CONTRACTUALES, CONTRACTUALES, POS- CONTRACTUALES Y DEMÁS PROCEDIMIENTOS JURÍDICOS RELACIONADOS DEL FONDO DE DESARROLLO LOCAL DE LA CANDELARIA”","Inversión",45,{"$f":"IF(J88=1,'[1]Equivalencia BH-BMPT'!$D$2,IF(J88=2,'[1]Equivalencia BH-BMPT'!$D$3,IF(J88=3,'[1]Equivalencia BH-BMPT'!$D$4,IF(J88=4,'[1]Equivalencia BH-BMPT'!$D$5,IF(J88=5,'[1]Equivalencia BH-BMPT'!$D$6,IF(J88=6,'[1]Equivalencia BH-BMPT'!$D$7,IF(J88=7,'[1]Equivalencia BH-BMPT'!$D$8,IF(J88=8,'[1]Equivalencia BH-BMPT'!$D$9,IF(J88=9,'[1]Equivalencia BH-BMPT'!$D$10,IF(J88=10,'[1]Equivalencia BH-BMPT'!$D$11,IF(J88=11,'[1]Equivalencia BH-BMPT'!$D$12,IF(J88=12,'[1]Equivalencia BH-BMPT'!$D$13,IF(J88=13,'[1]Equivalencia BH-BMPT'!$D$14,IF(J88=14,'[1]Equivalencia BH-BMPT'!$D$15,IF(J88=15,'[1]Equivalencia BH-BMPT'!$D$16,IF(J88=16,'[1]Equivalencia BH-BMPT'!$D$17,IF(J88=17,'[1]Equivalencia BH-BMPT'!$D$18,IF(J88=18,'[1]Equivalencia BH-BMPT'!$D$19,IF(J88=19,'[1]Equivalencia BH-BMPT'!$D$20,IF(J88=20,'[1]Equivalencia BH-BMPT'!$D$21,IF(J88=21,'[1]Equivalencia BH-BMPT'!$D$22,IF(J88=22,'[1]Equivalencia BH-BMPT'!$D$23,IF(J88=23,'[1]Equivalencia BH-BMPT'!#REF!,IF(J88=24,'[1]Equivalencia BH-BMPT'!$D$25,IF(J88=25,'[1]Equivalencia BH-BMPT'!$D$26,IF(J88=26,'[1]Equivalencia BH-BMPT'!$D$27,IF(J88=27,'[1]Equivalencia BH-BMPT'!$D$28,IF(J88=28,'[1]Equivalencia BH-BMPT'!$D$29,IF(J88=29,'[1]Equivalencia BH-BMPT'!$D$30,IF(J88=30,'[1]Equivalencia BH-BMPT'!$D$31,IF(J88=31,'[1]Equivalencia BH-BMPT'!$D$32,IF(J88=32,'[1]Equivalencia BH-BMPT'!$D$33,IF(J88=33,'[1]Equivalencia BH-BMPT'!$D$34,IF(J88=34,'[1]Equivalencia BH-BMPT'!$D$35,IF(J88=35,'[1]Equivalencia BH-BMPT'!$D$36,IF(J88=36,'[1]Equivalencia BH-BMPT'!$D$37,IF(J88=37,'[1]Equivalencia BH-BMPT'!$D$38,IF(J88=38,'[1]Equivalencia BH-BMPT'!#REF!,IF(J88=39,'[1]Equivalencia BH-BMPT'!$D$40,IF(J88=40,'[1]Equivalencia BH-BMPT'!$D$41,IF(J88=41,'[1]Equivalencia BH-BMPT'!$D$42,IF(J88=42,'[1]Equivalencia BH-BMPT'!$D$43,IF(J88=43,'[1]Equivalencia BH-BMPT'!$D$44,IF(J88=44,'[1]Equivalencia BH-BMPT'!$D$45,IF(J88=45,'[1]Equivalencia BH-BMPT'!$D$46,\"No ha seleccionado un número de programa\")))))))))))))))))))))))))))))))))))))))))))))","v":"Gobernanza e influencia local, regional e internacional"},"1395",52966422,"JHOANA ANDREA SALOMON CASTRO",49500811,null,null,null,1800029,51300840,44250727,"2017-02-03","2017-02-07","2018-01-25",351,null,null,null,"X",null,null,0.86257314695042031,false]
[27,2017,"17-12-6329675",5,{"$f":"IF(D89=1,'[1]Tipo '!$B$2,IF(D89=2,'[1]Tipo '!$B$3,IF(D89=3,'[1]Tipo '!$B$4,IF(D89=4,'[1]Tipo '!$B$5,IF(D89=5,'[1]Tipo '!$B$6,IF(D89=6,'[1]Tipo '!$B$7,IF(D89=7,'[1]Tipo '!$B$8,IF(D89=8,'[1]Tipo '!$B$9,IF(D89=9,'[1]Tipo '!$B$10,IF(D89=10,'[1]Tipo '!$B$11,IF(D89=11,'[1]Tipo '!$B$12,IF(D89=12,'[1]Tipo '!$B$13,IF(D89=13,'[1]Tipo '!$B$14,IF(D89=14,'[1]Tipo '!$B$15,IF(D89=15,'[1]Tipo '!$B$16,IF(D89=16,'[1]Tipo '!$B$17,IF(D89=17,'[1]Tipo '!$B$18,IF(D89=18,'[1]Tipo '!$B$19,IF(D89=19,'[1]Tipo '!$B$20,\"No ha seleccionado un tipo de contrato válido\")))))))))))))))))))","v":"CONTRATOS DE PRESTACIÓN DE SERVICIOS PROFESIONALES Y DE APOYO A LA GESTIÓN"},"Contratación directa","Prestación de servicios profesionales y de apoyo a la gestión, o para la ejecución de trabajos artísticos que sólo puedan encomendarse a determinadas personas naturales;","CONTRATAR LOS SERVICIOS DE UN BACHILLER QUE CONTRIBUYA CON EL CUMPLIMIENTO LEGAL Y REGLAMENTARIO EN EL ÁREA DE GESTIÓN DE DESARROLLO LOCAL EN TEMAS DE RECEPCIÓN Y CENTRO DE DOCUMENTACIÓN E INFORMACIÓN - CDI DE LA ALCALDÍA LOCAL DE LA CANDELARIA DE CONFORMIDAD CON LOS ESTUDIOS PREVIOS ","Inversión",45,{"$f":"IF(J89=1,'[1]Equivalencia BH-BMPT'!$D$2,IF(J89=2,'[1]Equivalencia BH-BMPT'!$D$3,IF(J89=3,'[1]Equivalencia BH-BMPT'!$D$4,IF(J89=4,'[1]Equivalencia BH-BMPT'!$D$5,IF(J89=5,'[1]Equivalencia BH-BMPT'!$D$6,IF(J89=6,'[1]Equivalencia BH-BMPT'!$D$7,IF(J89=7,'[1]Equivalencia BH-BMPT'!$D$8,IF(J89=8,'[1]Equivalencia BH-BMPT'!$D$9,IF(J89=9,'[1]Equivalencia BH-BMPT'!$D$10,IF(J89=10,'[1]Equivalencia BH-BMPT'!$D$11,IF(J89=11,'[1]Equivalencia BH-BMPT'!$D$12,IF(J89=12,'[1]Equivalencia BH-BMPT'!$D$13,IF(J89=13,'[1]Equivalencia BH-BMPT'!$D$14,IF(J89=14,'[1]Equivalencia BH-BMPT'!$D$15,IF(J89=15,'[1]Equivalencia BH-BMPT'!$D$16,IF(J89=16,'[1]Equivalencia BH-BMPT'!$D$17,IF(J89=17,'[1]Equivalencia BH-BMPT'!$D$18,IF(J89=18,'[1]Equivalencia BH-BMPT'!$D$19,IF(J89=19,'[1]Equivalencia BH-BMPT'!$D$20,IF(J89=20,'[1]Equivalencia BH-BMPT'!$D$21,IF(J89=21,'[1]Equivalencia BH-BMPT'!$D$22,IF(J89=22,'[1]Equivalencia BH-BMPT'!$D$23,IF(J89=23,'[1]Equivalencia BH-BMPT'!#REF!,IF(J89=24,'[1]Equivalencia BH-BMPT'!$D$25,IF(J89=25,'[1]Equivalencia BH-BMPT'!$D$26,IF(J89=26,'[1]Equivalencia BH-BMPT'!$D$27,IF(J89=27,'[1]Equivalencia BH-BMPT'!$D$28,IF(J89=28,'[1]Equivalencia BH-BMPT'!$D$29,IF(J89=29,'[1]Equivalencia BH-BMPT'!$D$30,IF(J89=30,'[1]Equivalencia BH-BMPT'!$D$31,IF(J89=31,'[1]Equivalencia BH-BMPT'!$D$32,IF(J89=32,'[1]Equivalencia BH-BMPT'!$D$33,IF(J89=33,'[1]Equivalencia BH-BMPT'!$D$34,IF(J89=34,'[1]Equivalencia BH-BMPT'!$D$35,IF(J89=35,'[1]Equivalencia BH-BMPT'!$D$36,IF(J89=36,'[1]Equivalencia BH-BMPT'!$D$37,IF(J89=37,'[1]Equivalencia BH-BMPT'!$D$38,IF(J89=38,'[1]Equivalencia BH-BMPT'!#REF!,IF(J89=39,'[1]Equivalencia BH-BMPT'!$D$40,IF(J89=40,'[1]Equivalencia BH-BMPT'!$D$41,IF(J89=41,'[1]Equivalencia BH-BMPT'!$D$42,IF(J89=42,'[1]Equivalencia BH-BMPT'!$D$43,IF(J89=43,'[1]Equivalencia BH-BMPT'!$D$44,IF(J89=44,'[1]Equivalencia BH-BMPT'!$D$45,IF(J89=45,'[1]Equivalencia BH-BMPT'!$D$46,\"No ha seleccionado un número de programa\")))))))))))))))))))))))))))))))))))))))))))))","v":"Gobernanza e influencia local, regional e internacional"},"1395",1010227910,"Carlos Armando Gonzalez Rasgo",23533172,null,null,null,1069690,24602862,21964291,"2017-02-06","2017-02-08","2018-01-14",338,null,null,null,null,"X",null,0.89275349347567778,false]
[28,2017,"17-12-6329746",5,{"$f":"IF(D90=1,'[1]Tipo '!$B$2,IF(D90=2,'[1]Tipo '!$B$3,IF(D90=3,'[1]Tipo '!$B$4,IF(D90=4,'[1]Tipo '!$B$5,IF(D90=5,'[1]Tipo '!$B$6,IF(D90=6,'[1]Tipo '!$B$7,IF(D90=7,'[1]Tipo '!$B$8,IF(D90=8,'[1]Tipo '!$B$9,IF(D90=9,'[1]Tipo '!$B$10,IF(D90=10,'[1]Tipo '!$B$11,IF(D90=11,'[1]Tipo '!$B$12,IF(D90=12,'[1]Tipo '!$B$13,IF(D90=13,'[1]Tipo '!$B$14,IF(D90=14,'[1]Tipo '!$B$15,IF(D90=15,'[1]Tipo '!$B$16,IF(D90=16,'[1]Tipo '!$B$17,IF(D90=17,'[1]Tipo '!$B$18,IF(D90=18,'[1]Tipo '!$B$19,IF(D90=19,'[1]Tipo '!$B$20,\"No ha seleccionado un tipo de contrato válido\")))))))))))))))))))","v":"CONTRATOS DE PRESTACIÓN DE SERVICIOS PROFESIONALES Y DE APOYO A LA GESTIÓN"},"Contratación directa","Prestación de servicios profesionales y de apoyo a la gestión, o para la ejecución de trabajos artísticos que sólo puedan encomendarse a determinadas personas naturales;","PRESTAR LOS SERVICIOS TÉCNICOS AL ÁREA DE GESTIÓN DE DESARROLLO LOCAL PARA LA REVISIÓN Y ACTUALIZACIÓN DEL ARCHIVO DOCUMENTAL DE LA ALCALDÍA LOCA","Inversión",45,{"$f":"IF(J90=1,'[1]Equivalencia BH-BMPT'!$D$2,IF(J90=2,'[1]Equivalencia BH-BMPT'!$D$3,IF(J90=3,'[1]Equivalencia BH-BMPT'!$D$4,IF(J90=4,'[1]Equivalencia BH-BMPT'!$D$5,IF(J90=5,'[1]Equivalencia BH-BMPT'!$D$6,IF(J90=6,'[1]Equivalencia BH-BMPT'!$D$7,IF(J90=7,'[1]Equivalencia BH-BMPT'!$D$8,IF(J90=8,'[1]Equivalencia BH-BMPT'!$D$9,IF(J90=9,'[1]Equivalencia BH-BMPT'!$D$10,IF(J90=10,'[1]Equivalencia BH-BMPT'!$D$11,IF(J90=11,'[1]Equivalencia BH-BMPT'!$D$12,IF(J90=12,'[1]Equivalencia BH-BMPT'!$D$13,IF(J90=13,'[1]Equivalencia BH-BMPT'!$D$14,IF(J90=14,'[1]Equivalencia BH-BMPT'!$D$15,IF(J90=15,'[1]Equivalencia BH-BMPT'!$D$16,IF(J90=16,'[1]Equivalencia BH-BMPT'!$D$17,IF(J90=17,'[1]Equivalencia BH-BMPT'!$D$18,IF(J90=18,'[1]Equivalencia BH-BMPT'!$D$19,IF(J90=19,'[1]Equivalencia BH-BMPT'!$D$20,IF(J90=20,'[1]Equivalencia BH-BMPT'!$D$21,IF(J90=21,'[1]Equivalencia BH-BMPT'!$D$22,IF(J90=22,'[1]Equivalencia BH-BMPT'!$D$23,IF(J90=23,'[1]Equivalencia BH-BMPT'!#REF!,IF(J90=24,'[1]Equivalencia BH-BMPT'!$D$25,IF(J90=25,'[1]Equivalencia BH-BMPT'!$D$26,IF(J90=26,'[1]Equivalencia BH-BMPT'!$D$27,IF(J90=27,'[1]Equivalencia BH-BMPT'!$D$28,IF(J90=28,'[1]Equivalencia BH-BMPT'!$D$29,IF(J90=29,'[1]Equivalencia BH-BMPT'!$D$30,IF(J90=30,'[1]Equivalencia BH-BMPT'!$D$31,IF(J90=31,'[1]Equivalencia BH-BMPT'!$D$32,IF(J90=32,'[1]Equivalencia BH-BMPT'!$D$33,IF(J90=33,'[1]Equivalencia BH-BMPT'!$D$34,IF(J90=34,'[1]Equivalencia BH-BMPT'!$D$35,IF(J90=35,'[1]Equivalencia BH-BMPT'!$D$36,IF(J90=36,'[1]Equivalencia BH-BMPT'!$D$37,IF(J90=37,'[1]Equivalencia BH-BMPT'!$D$38,IF(J90=38,'[1]Equivalencia BH-BMPT'!#REF!,IF(J90=39,'[1]Equivalencia BH-BMPT'!$D$40,IF(J90=40,'[1]Equivalencia BH-BMPT'!$D$41,IF(J90=41,'[1]Equivalencia BH-BMPT'!$D$42,IF(J90=42,'[1]Equivalencia BH-BMPT'!$D$43,IF(J90=43,'[1]Equivalencia BH-BMPT'!$D$44,IF(J90=44,'[1]Equivalencia BH-BMPT'!$D$45,IF(J90=45,'[1]Equivalencia BH-BMPT'!$D$46,\"No ha seleccionado un número de programa\")))))))))))))))))))))))))))))))))))))))))))))","v":"Gobernanza e influencia local, regional e internacional"},"1395",1022352287,"Cindy Catalina Ojeda Lopez",31758717,null,null,null,3024640,34783357,31255117,"2017-02-06","2017-02-06","2018-01-19",356,null,null,null,"X",null,null,0.89856528224115917,false]
[29,2017,"17-12-6329805",5,{"$f":"IF(D91=1,'[1]Tipo '!$B$2,IF(D91=2,'[1]Tipo '!$B$3,IF(D91=3,'[1]Tipo '!$B$4,IF(D91=4,'[1]Tipo '!$B$5,IF(D91=5,'[1]Tipo '!$B$6,IF(D91=6,'[1]Tipo '!$B$7,IF(D91=7,'[1]Tipo '!$B$8,IF(D91=8,'[1]Tipo '!$B$9,IF(D91=9,'[1]Tipo '!$B$10,IF(D91=10,'[1]Tipo '!$B$11,IF(D91=11,'[1]Tipo '!$B$12,IF(D91=12,'[1]Tipo '!$B$13,IF(D91=13,'[1]Tipo '!$B$14,IF(D91=14,'[1]Tipo '!$B$15,IF(D91=15,'[1]Tipo '!$B$16,IF(D91=16,'[1]Tipo '!$B$17,IF(D91=17,'[1]Tipo '!$B$18,IF(D91=18,'[1]Tipo '!$B$19,IF(D91=19,'[1]Tipo '!$B$20,\"No ha seleccionado un tipo de contrato válido\")))))))))))))))))))","v":"CONTRATOS DE PRESTACIÓN DE SERVICIOS PROFESIONALES Y DE APOYO A LA GESTIÓN"},"Contratación directa","Prestación de servicios profesionales y de apoyo a la gestión, o para la ejecución de trabajos artísticos que sólo puedan encomendarse a determinadas personas naturales;","Prestar los servicios de apoyo logístico en todos los eventos y actividades de la administración local de la localidad 17 de La Candelaria","Inversión",45,{"$f":"IF(J91=1,'[1]Equivalencia BH-BMPT'!$D$2,IF(J91=2,'[1]Equivalencia BH-BMPT'!$D$3,IF(J91=3,'[1]Equivalencia BH-BMPT'!$D$4,IF(J91=4,'[1]Equivalencia BH-BMPT'!$D$5,IF(J91=5,'[1]Equivalencia BH-BMPT'!$D$6,IF(J91=6,'[1]Equivalencia BH-BMPT'!$D$7,IF(J91=7,'[1]Equivalencia BH-BMPT'!$D$8,IF(J91=8,'[1]Equivalencia BH-BMPT'!$D$9,IF(J91=9,'[1]Equivalencia BH-BMPT'!$D$10,IF(J91=10,'[1]Equivalencia BH-BMPT'!$D$11,IF(J91=11,'[1]Equivalencia BH-BMPT'!$D$12,IF(J91=12,'[1]Equivalencia BH-BMPT'!$D$13,IF(J91=13,'[1]Equivalencia BH-BMPT'!$D$14,IF(J91=14,'[1]Equivalencia BH-BMPT'!$D$15,IF(J91=15,'[1]Equivalencia BH-BMPT'!$D$16,IF(J91=16,'[1]Equivalencia BH-BMPT'!$D$17,IF(J91=17,'[1]Equivalencia BH-BMPT'!$D$18,IF(J91=18,'[1]Equivalencia BH-BMPT'!$D$19,IF(J91=19,'[1]Equivalencia BH-BMPT'!$D$20,IF(J91=20,'[1]Equivalencia BH-BMPT'!$D$21,IF(J91=21,'[1]Equivalencia BH-BMPT'!$D$22,IF(J91=22,'[1]Equivalencia BH-BMPT'!$D$23,IF(J91=23,'[1]Equivalencia BH-BMPT'!#REF!,IF(J91=24,'[1]Equivalencia BH-BMPT'!$D$25,IF(J91=25,'[1]Equivalencia BH-BMPT'!$D$26,IF(J91=26,'[1]Equivalencia BH-BMPT'!$D$27,IF(J91=27,'[1]Equivalencia BH-BMPT'!$D$28,IF(J91=28,'[1]Equivalencia BH-BMPT'!$D$29,IF(J91=29,'[1]Equivalencia BH-BMPT'!$D$30,IF(J91=30,'[1]Equivalencia BH-BMPT'!$D$31,IF(J91=31,'[1]Equivalencia BH-BMPT'!$D$32,IF(J91=32,'[1]Equivalencia BH-BMPT'!$D$33,IF(J91=33,'[1]Equivalencia BH-BMPT'!$D$34,IF(J91=34,'[1]Equivalencia BH-BMPT'!$D$35,IF(J91=35,'[1]Equivalencia BH-BMPT'!$D$36,IF(J91=36,'[1]Equivalencia BH-BMPT'!$D$37,IF(J91=37,'[1]Equivalencia BH-BMPT'!$D$38,IF(J91=38,'[1]Equivalencia BH-BMPT'!#REF!,IF(J91=39,'[1]Equivalencia BH-BMPT'!$D$40,IF(J91=40,'[1]Equivalencia BH-BMPT'!$D$41,IF(J91=41,'[1]Equivalencia BH-BMPT'!$D$42,IF(J91=42,'[1]Equivalencia BH-BMPT'!$D$43,IF(J91=43,'[1]Equivalencia BH-BMPT'!$D$44,IF(J91=44,'[1]Equivalencia BH-BMPT'!$D$45,IF(J91=45,'[1]Equivalencia BH-BMPT'!$D$46,\"No ha seleccionado un número de programa\")))))))))))))))))))))))))))))))))))))))))))))","v":"Gobernanza e influencia local, regional e internacional"},"1395",1010200869,"Johan Steven Robles Sandoval",22143000,null,null,null,1006500,23149500,20801000,"2017-02-06","2017-02-06","2018-01-14",341,null,null,null,null,"X",null,0.89855072463768115,false]
[30,2017,"17-12-6331062",5,{"$f":"IF(D92=1,'[1]Tipo '!$B$2,IF(D92=2,'[1]Tipo '!$B$3,IF(D92=3,'[1]Tipo '!$B$4,IF(D92=4,'[1]Tipo '!$B$5,IF(D92=5,'[1]Tipo '!$B$6,IF(D92=6,'[1]Tipo '!$B$7,IF(D92=7,'[1]Tipo '!$B$8,IF(D92=8,'[1]Tipo '!$B$9,IF(D92=9,'[1]Tipo '!$B$10,IF(D92=10,'[1]Tipo '!$B$11,IF(D92=11,'[1]Tipo '!$B$12,IF(D92=12,'[1]Tipo '!$B$13,IF(D92=13,'[1]Tipo '!$B$14,IF(D92=14,'[1]Tipo '!$B$15,IF(D92=15,'[1]Tipo '!$B$16,IF(D92=16,'[1]Tipo '!$B$17,IF(D92=17,'[1]Tipo '!$B$18,IF(D92=18,'[1]Tipo '!$B$19,IF(D92=19,'[1]Tipo '!$B$20,\"No ha seleccionado un tipo de contrato válido\")))))))))))))))))))","v":"CONTRATOS DE PRESTACIÓN DE SERVICIOS PROFESIONALES Y DE APOYO A LA GESTIÓN"},"Contratación directa","Prestación de servicios profesionales y de apoyo a la gestión, o para la ejecución de trabajos artísticos que sólo puedan encomendarse a determinadas personas naturales;","Prestar los servicios de apoyo logístico en todos los eventos y actividades de la administración local de la localidad 17 de La Candelaria","Inversión",45,{"$f":"IF(J92=1,'[1]Equivalencia BH-BMPT'!$D$2,IF(J92=2,'[1]Equivalencia BH-BMPT'!$D$3,IF(J92=3,'[1]Equivalencia BH-BMPT'!$D$4,IF(J92=4,'[1]Equivalencia BH-BMPT'!$D$5,IF(J92=5,'[1]Equivalencia BH-BMPT'!$D$6,IF(J92=6,'[1]Equivalencia BH-BMPT'!$D$7,IF(J92=7,'[1]Equivalencia BH-BMPT'!$D$8,IF(J92=8,'[1]Equivalencia BH-BMPT'!$D$9,IF(J92=9,'[1]Equivalencia BH-BMPT'!$D$10,IF(J92=10,'[1]Equivalencia BH-BMPT'!$D$11,IF(J92=11,'[1]Equivalencia BH-BMPT'!$D$12,IF(J92=12,'[1]Equivalencia BH-BMPT'!$D$13,IF(J92=13,'[1]Equivalencia BH-BMPT'!$D$14,IF(J92=14,'[1]Equivalencia BH-BMPT'!$D$15,IF(J92=15,'[1]Equivalencia BH-BMPT'!$D$16,IF(J92=16,'[1]Equivalencia BH-BMPT'!$D$17,IF(J92=17,'[1]Equivalencia BH-BMPT'!$D$18,IF(J92=18,'[1]Equivalencia BH-BMPT'!$D$19,IF(J92=19,'[1]Equivalencia BH-BMPT'!$D$20,IF(J92=20,'[1]Equivalencia BH-BMPT'!$D$21,IF(J92=21,'[1]Equivalencia BH-BMPT'!$D$22,IF(J92=22,'[1]Equivalencia BH-BMPT'!$D$23,IF(J92=23,'[1]Equivalencia BH-BMPT'!#REF!,IF(J92=24,'[1]Equivalencia BH-BMPT'!$D$25,IF(J92=25,'[1]Equivalencia BH-BMPT'!$D$26,IF(J92=26,'[1]Equivalencia BH-BMPT'!$D$27,IF(J92=27,'[1]Equivalencia BH-BMPT'!$D$28,IF(J92=28,'[1]Equivalencia BH-BMPT'!$D$29,IF(J92=29,'[1]Equivalencia BH-BMPT'!$D$30,IF(J92=30,'[1]Equivalencia BH-BMPT'!$D$31,IF(J92=31,'[1]Equivalencia BH-BMPT'!$D$32,IF(J92=32,'[1]Equivalencia BH-BMPT'!$D$33,IF(J92=33,'[1]Equivalencia BH-BMPT'!$D$34,IF(J92=34,'[1]Equivalencia BH-BMPT'!$D$35,IF(J92=35,'[1]Equivalencia BH-BMPT'!$D$36,IF(J92=36,'[1]Equivalencia BH-BMPT'!$D$37,IF(J92=37,'[1]Equivalencia BH-BMPT'!$D$38,IF(J92=38,'[1]Equivalencia BH-BMPT'!#REF!,IF(J92=39,'[1]Equivalencia BH-BMPT'!$D$40,IF(J92=40,'[1]Equivalencia BH-BMPT'!$D$41,IF(J92=41,'[1]Equivalencia BH-BMPT'!$D$42,IF(J92=42,'[1]Equivalencia BH-BMPT'!$D$43,IF(J92=43,'[1]Equivalencia BH-BMPT'!$D$44,IF(J92=44,'[1]Equivalencia BH-BMPT'!$D$45,IF(J92=45,'[1]Equivalencia BH-BMPT'!$D$46,\"No ha seleccionado un número de programa\")))))))))))))))))))))))))))))))))))))))))))))","v":"Gobernanza e influencia local, regional e internacional"},"1395",1085280532,"DEIVIS ARAVIT GORDILLO GUTIERREZ",22143000,null,null,null,1006984,23149984,20197100,"2017-02-06","2017-02-13","2018-01-14",334,null,null,null,null,"X",null,0.87244552739215719,false]
[31,2017,"17-12-6331391",5,{"$f":"IF(D93=1,'[1]Tipo '!$B$2,IF(D93=2,'[1]Tipo '!$B$3,IF(D93=3,'[1]Tipo '!$B$4,IF(D93=4,'[1]Tipo '!$B$5,IF(D93=5,'[1]Tipo '!$B$6,IF(D93=6,'[1]Tipo '!$B$7,IF(D93=7,'[1]Tipo '!$B$8,IF(D93=8,'[1]Tipo '!$B$9,IF(D93=9,'[1]Tipo '!$B$10,IF(D93=10,'[1]Tipo '!$B$11,IF(D93=11,'[1]Tipo '!$B$12,IF(D93=12,'[1]Tipo '!$B$13,IF(D93=13,'[1]Tipo '!$B$14,IF(D93=14,'[1]Tipo '!$B$15,IF(D93=15,'[1]Tipo '!$B$16,IF(D93=16,'[1]Tipo '!$B$17,IF(D93=17,'[1]Tipo '!$B$18,IF(D93=18,'[1]Tipo '!$B$19,IF(D93=19,'[1]Tipo '!$B$20,\"No ha seleccionado un tipo de contrato válido\")))))))))))))))))))","v":"CONTRATOS DE PRESTACIÓN DE SERVICIOS PROFESIONALES Y DE APOYO A LA GESTIÓN"},"Contratación directa","Prestación de servicios profesionales y de apoyo a la gestión, o para la ejecución de trabajos artísticos que sólo puedan encomendarse a determinadas personas naturales;","PRESTAR LOS SERVICIOS TÉCNICOS AL ÁREA DE GESTIÓN DE DESARROLLO LOCAL PARA LA REVISIÓN Y ACTUALIZACIÓN DEL ARCHIVO DOCUMENTAL DE LA ALCALDÍA LOCAL","Inversión",45,{"$f":"IF(J93=1,'[1]Equivalencia BH-BMPT'!$D$2,IF(J93=2,'[1]Equivalencia BH-BMPT'!$D$3,IF(J93=3,'[1]Equivalencia BH-BMPT'!$D$4,IF(J93=4,'[1]Equivalencia BH-BMPT'!$D$5,IF(J93=5,'[1]Equivalencia BH-BMPT'!$D$6,IF(J93=6,'[1]Equivalencia BH-BMPT'!$D$7,IF(J93=7,'[1]Equivalencia BH-BMPT'!$D$8,IF(J93=8,'[1]Equivalencia BH-BMPT'!$D$9,IF(J93=9,'[1]Equivalencia BH-BMPT'!$D$10,IF(J93=10,'[1]Equivalencia BH-BMPT'!$D$11,IF(J93=11,'[1]Equivalencia BH-BMPT'!$D$12,IF(J93=12,'[1]Equivalencia BH-BMPT'!$D$13,IF(J93=13,'[1]Equivalencia BH-BMPT'!$D$14,IF(J93=14,'[1]Equivalencia BH-BMPT'!$D$15,IF(J93=15,'[1]Equivalencia BH-BMPT'!$D$16,IF(J93=16,'[1]Equivalencia BH-BMPT'!$D$17,IF(J93=17,'[1]Equivalencia BH-BMPT'!$D$18,IF(J93=18,'[1]Equivalencia BH-BMPT'!$D$19,IF(J93=19,'[1]Equivalencia BH-BMPT'!$D$20,IF(J93=20,'[1]Equivalencia BH-BMPT'!$D$21,IF(J93=21,'[1]Equivalencia BH-BMPT'!$D$22,IF(J93=22,'[1]Equivalencia BH-BMPT'!$D$23,IF(J93=23,'[1]Equivalencia BH-BMPT'!#REF!,IF(J93=24,'[1]Equivalencia BH-BMPT'!$D$25,IF(J93=25,'[1]Equivalencia BH-BMPT'!$D$26,IF(J93=26,'[1]Equivalencia BH-BMPT'!$D$27,IF(J93=27,'[1]Equivalencia BH-BMPT'!$D$28,IF(J93=28,'[1]Equivalencia BH-BMPT'!$D$29,IF(J93=29,'[1]Equivalencia BH-BMPT'!$D$30,IF(J93=30,'[1]Equivalencia BH-BMPT'!$D$31,IF(J93=31,'[1]Equivalencia BH-BMPT'!$D$32,IF(J93=32,'[1]Equivalencia BH-BMPT'!$D$33,IF(J93=33,'[1]Equivalencia BH-BMPT'!$D$34,IF(J93=34,'[1]Equivalencia BH-BMPT'!$D$35,IF(J93=35,'[1]Equivalencia BH-BMPT'!$D$36,IF(J93=36,'[1]Equivalencia BH-BMPT'!$D$37,IF(J93=37,'[1]Equivalencia BH-BMPT'!$D$38,IF(J93=38,'[1]Equivalencia BH-BMPT'!#REF!,IF(J93=39,'[1]Equivalencia BH-BMPT'!$D$40,IF(J93=40,'[1]Equivalencia BH-BMPT'!$D$41,IF(J93=41,'[1]Equivalencia BH-BMPT'!$D$42,IF(J93=42,'[1]Equivalencia BH-BMPT'!$D$43,IF(J93=43,'[1]Equivalencia BH-BMPT'!$D$44,IF(J93=44,'[1]Equivalencia BH-BMPT'!$D$45,IF(J93=45,'[1]Equivalencia BH-BMPT'!$D$46,\"No ha seleccionado un número de programa\")))))))))))))))))))))))))))))))))))))))))))))","v":"Gobernanza e influencia local, regional e internacional"},"1395",1010175770,"Teofilo Leornardo Ramirez Hernandez",33271037,null,null,null,1512320,34783357,31254613,"2017-02-06","2017-02-06","2018-01-14",241,null,null,null,null,"X",null,0.89855079255288672,false]
[32,2017,"17-12-6331552",5,{"$f":"IF(D94=1,'[1]Tipo '!$B$2,IF(D94=2,'[1]Tipo '!$B$3,IF(D94=3,'[1]Tipo '!$B$4,IF(D94=4,'[1]Tipo '!$B$5,IF(D94=5,'[1]Tipo '!$B$6,IF(D94=6,'[1]Tipo '!$B$7,IF(D94=7,'[1]Tipo '!$B$8,IF(D94=8,'[1]Tipo '!$B$9,IF(D94=9,'[1]Tipo '!$B$10,IF(D94=10,'[1]Tipo '!$B$11,IF(D94=11,'[1]Tipo '!$B$12,IF(D94=12,'[1]Tipo '!$B$13,IF(D94=13,'[1]Tipo '!$B$14,IF(D94=14,'[1]Tipo '!$B$15,IF(D94=15,'[1]Tipo '!$B$16,IF(D94=16,'[1]Tipo '!$B$17,IF(D94=17,'[1]Tipo '!$B$18,IF(D94=18,'[1]Tipo '!$B$19,IF(D94=19,'[1]Tipo '!$B$20,\"No ha seleccionado un tipo de contrato válido\")))))))))))))))))))","v":"CONTRATOS DE PRESTACIÓN DE SERVICIOS PROFESIONALES Y DE APOYO A LA GESTIÓN"},"Contratación directa","Prestación de servicios profesionales y de apoyo a la gestión, o para la ejecución de trabajos artísticos que sólo puedan encomendarse a determinadas personas naturales;","Prestar los servicios de apoyo técnico y logístico en todos los eventos, actividades y temas de comunicaciones de la administración local de la localidad 17 de La Candelaria","Inversión",45,{"$f":"IF(J94=1,'[1]Equivalencia BH-BMPT'!$D$2,IF(J94=2,'[1]Equivalencia BH-BMPT'!$D$3,IF(J94=3,'[1]Equivalencia BH-BMPT'!$D$4,IF(J94=4,'[1]Equivalencia BH-BMPT'!$D$5,IF(J94=5,'[1]Equivalencia BH-BMPT'!$D$6,IF(J94=6,'[1]Equivalencia BH-BMPT'!$D$7,IF(J94=7,'[1]Equivalencia BH-BMPT'!$D$8,IF(J94=8,'[1]Equivalencia BH-BMPT'!$D$9,IF(J94=9,'[1]Equivalencia BH-BMPT'!$D$10,IF(J94=10,'[1]Equivalencia BH-BMPT'!$D$11,IF(J94=11,'[1]Equivalencia BH-BMPT'!$D$12,IF(J94=12,'[1]Equivalencia BH-BMPT'!$D$13,IF(J94=13,'[1]Equivalencia BH-BMPT'!$D$14,IF(J94=14,'[1]Equivalencia BH-BMPT'!$D$15,IF(J94=15,'[1]Equivalencia BH-BMPT'!$D$16,IF(J94=16,'[1]Equivalencia BH-BMPT'!$D$17,IF(J94=17,'[1]Equivalencia BH-BMPT'!$D$18,IF(J94=18,'[1]Equivalencia BH-BMPT'!$D$19,IF(J94=19,'[1]Equivalencia BH-BMPT'!$D$20,IF(J94=20,'[1]Equivalencia BH-BMPT'!$D$21,IF(J94=21,'[1]Equivalencia BH-BMPT'!$D$22,IF(J94=22,'[1]Equivalencia BH-BMPT'!$D$23,IF(J94=23,'[1]Equivalencia BH-BMPT'!#REF!,IF(J94=24,'[1]Equivalencia BH-BMPT'!$D$25,IF(J94=25,'[1]Equivalencia BH-BMPT'!$D$26,IF(J94=26,'[1]Equivalencia BH-BMPT'!$D$27,IF(J94=27,'[1]Equivalencia BH-BMPT'!$D$28,IF(J94=28,'[1]Equivalencia BH-BMPT'!$D$29,IF(J94=29,'[1]Equivalencia BH-BMPT'!$D$30,IF(J94=30,'[1]Equivalencia BH-BMPT'!$D$31,IF(J94=31,'[1]Equivalencia BH-BMPT'!$D$32,IF(J94=32,'[1]Equivalencia BH-BMPT'!$D$33,IF(J94=33,'[1]Equivalencia BH-BMPT'!$D$34,IF(J94=34,'[1]Equivalencia BH-BMPT'!$D$35,IF(J94=35,'[1]Equivalencia BH-BMPT'!$D$36,IF(J94=36,'[1]Equivalencia BH-BMPT'!$D$37,IF(J94=37,'[1]Equivalencia BH-BMPT'!$D$38,IF(J94=38,'[1]Equivalencia BH-BMPT'!#REF!,IF(J94=39,'[1]Equivalencia BH-BMPT'!$D$40,IF(J94=40,'[1]Equivalencia BH-BMPT'!$D$41,IF(J94=41,'[1]Equivalencia BH-BMPT'!$D$42,IF(J94=42,'[1]Equivalencia BH-BMPT'!$D$43,IF(J94=43,'[1]Equivalencia BH-BMPT'!$D$44,IF(J94=44,'[1]Equivalencia BH-BMPT'!$D$45,IF(J94=45,'[1]Equivalencia BH-BMPT'!$D$46,\"No ha seleccionado un número de programa\")))))))))))))))))))))))))))))))))))))))))))))","v":"Gobernanza e influencia local, regional e internacional"},"1395",80249660,"Jhonnatan Acosta Herrada",24344661,null,null,null,null,24344661,19549500,"2017-02-06","2017-02-13","2018-02-07",369,null,null,null,"X",null,null,0.80303028249191888,false]
[33,2017,"17-12-6331631",5,{"$f":"IF(D95=1,'[1]Tipo '!$B$2,IF(D95=2,'[1]Tipo '!$B$3,IF(D95=3,'[1]Tipo '!$B$4,IF(D95=4,'[1]Tipo '!$B$5,IF(D95=5,'[1]Tipo '!$B$6,IF(D95=6,'[1]Tipo '!$B$7,IF(D95=7,'[1]Tipo '!$B$8,IF(D95=8,'[1]Tipo '!$B$9,IF(D95=9,'[1]Tipo '!$B$10,IF(D95=10,'[1]Tipo '!$B$11,IF(D95=11,'[1]Tipo '!$B$12,IF(D95=12,'[1]Tipo '!$B$13,IF(D95=13,'[1]Tipo '!$B$14,IF(D95=14,'[1]Tipo '!$B$15,IF(D95=15,'[1]Tipo '!$B$16,IF(D95=16,'[1]Tipo '!$B$17,IF(D95=17,'[1]Tipo '!$B$18,IF(D95=18,'[1]Tipo '!$B$19,IF(D95=19,'[1]Tipo '!$B$20,\"No ha seleccionado un tipo de contrato válido\")))))))))))))))))))","v":"CONTRATOS DE PRESTACIÓN DE SERVICIOS PROFESIONALES Y DE APOYO A LA GESTIÓN"},"Contratación directa","Prestación de servicios profesionales y de apoyo a la gestión, o para la ejecución de trabajos artísticos que sólo puedan encomendarse a determinadas personas naturales;","“PRESTAR LOS SERVICIOS DE APOYO EN EL ÁREA DE GESTIÓN DE DESARROLLO LOCAL DE LA ALCALDÍA LOCAL DE LA CANDELARIA EN TEMAS DE GESTIÓN DOCUMENTAL, NOTIFICACIÓN O DEMÁS NECESIDADES QUE SE REQUIERAN","Inversión",45,{"$f":"IF(J95=1,'[1]Equivalencia BH-BMPT'!$D$2,IF(J95=2,'[1]Equivalencia BH-BMPT'!$D$3,IF(J95=3,'[1]Equivalencia BH-BMPT'!$D$4,IF(J95=4,'[1]Equivalencia BH-BMPT'!$D$5,IF(J95=5,'[1]Equivalencia BH-BMPT'!$D$6,IF(J95=6,'[1]Equivalencia BH-BMPT'!$D$7,IF(J95=7,'[1]Equivalencia BH-BMPT'!$D$8,IF(J95=8,'[1]Equivalencia BH-BMPT'!$D$9,IF(J95=9,'[1]Equivalencia BH-BMPT'!$D$10,IF(J95=10,'[1]Equivalencia BH-BMPT'!$D$11,IF(J95=11,'[1]Equivalencia BH-BMPT'!$D$12,IF(J95=12,'[1]Equivalencia BH-BMPT'!$D$13,IF(J95=13,'[1]Equivalencia BH-BMPT'!$D$14,IF(J95=14,'[1]Equivalencia BH-BMPT'!$D$15,IF(J95=15,'[1]Equivalencia BH-BMPT'!$D$16,IF(J95=16,'[1]Equivalencia BH-BMPT'!$D$17,IF(J95=17,'[1]Equivalencia BH-BMPT'!$D$18,IF(J95=18,'[1]Equivalencia BH-BMPT'!$D$19,IF(J95=19,'[1]Equivalencia BH-BMPT'!$D$20,IF(J95=20,'[1]Equivalencia BH-BMPT'!$D$21,IF(J95=21,'[1]Equivalencia BH-BMPT'!$D$22,IF(J95=22,'[1]Equivalencia BH-BMPT'!$D$23,IF(J95=23,'[1]Equivalencia BH-BMPT'!#REF!,IF(J95=24,'[1]Equivalencia BH-BMPT'!$D$25,IF(J95=25,'[1]Equivalencia BH-BMPT'!$D$26,IF(J95=26,'[1]Equivalencia BH-BMPT'!$D$27,IF(J95=27,'[1]Equivalencia BH-BMPT'!$D$28,IF(J95=28,'[1]Equivalencia BH-BMPT'!$D$29,IF(J95=29,'[1]Equivalencia BH-BMPT'!$D$30,IF(J95=30,'[1]Equivalencia BH-BMPT'!$D$31,IF(J95=31,'[1]Equivalencia BH-BMPT'!$D$32,IF(J95=32,'[1]Equivalencia BH-BMPT'!$D$33,IF(J95=33,'[1]Equivalencia BH-BMPT'!$D$34,IF(J95=34,'[1]Equivalencia BH-BMPT'!$D$35,IF(J95=35,'[1]Equivalencia BH-BMPT'!$D$36,IF(J95=36,'[1]Equivalencia BH-BMPT'!$D$37,IF(J95=37,'[1]Equivalencia BH-BMPT'!$D$38,IF(J95=38,'[1]Equivalencia BH-BMPT'!#REF!,IF(J95=39,'[1]Equivalencia BH-BMPT'!$D$40,IF(J95=40,'[1]Equivalencia BH-BMPT'!$D$41,IF(J95=41,'[1]Equivalencia BH-BMPT'!$D$42,IF(J95=42,'[1]Equivalencia BH-BMPT'!$D$43,IF(J95=43,'[1]Equivalencia BH-BMPT'!$D$44,IF(J95=44,'[1]Equivalencia BH-BMPT'!$D$45,IF(J95=45,'[1]Equivalencia BH-BMPT'!$D$46,\"No ha seleccionado un número de programa\")))))))))))))))))))))))))))))))))))))))))))))","v":"Gobernanza e influencia local, regional e internacional"},"1395",51620077,"María Victoria Torres Torres",23754487,null,null,null,1796525,25551012,22242837,"2017-02-06","2017-02-07","2018-01-24",350,null,null,null,"X",null,null,0.87052665467810042,false]
[36,2017,"17-12-6332275",5,{"$f":"IF(D96=1,'[1]Tipo '!$B$2,IF(D96=2,'[1]Tipo '!$B$3,IF(D96=3,'[1]Tipo '!$B$4,IF(D96=4,'[1]Tipo '!$B$5,IF(D96=5,'[1]Tipo '!$B$6,IF(D96=6,'[1]Tipo '!$B$7,IF(D96=7,'[1]Tipo '!$B$8,IF(D96=8,'[1]Tipo '!$B$9,IF(D96=9,'[1]Tipo '!$B$10,IF(D96=10,'[1]Tipo '!$B$11,IF(D96=11,'[1]Tipo '!$B$12,IF(D96=12,'[1]Tipo '!$B$13,IF(D96=13,'[1]Tipo '!$B$14,IF(D96=14,'[1]Tipo '!$B$15,IF(D96=15,'[1]Tipo '!$B$16,IF(D96=16,'[1]Tipo '!$B$17,IF(D96=17,'[1]Tipo '!$B$18,IF(D96=18,'[1]Tipo '!$B$19,IF(D96=19,'[1]Tipo '!$B$20,\"No ha seleccionado un tipo de contrato válido\")))))))))))))))))))","v":"CONTRATOS DE PRESTACIÓN DE SERVICIOS PROFESIONALES Y DE APOYO A LA GESTIÓN"},"Contratación directa","Prestación de servicios profesionales y de apoyo a la gestión, o para la ejecución de trabajos artísticos que sólo puedan encomendarse a determinadas personas naturales;","PRESTAR LOS SERVICIOS DE APOYO  AL DESPACHO DEL ALCALDE LOCAL  DE LA CANDELARIA EN TEMAS DE ARCHIVO DE DOCUMENTOS EN LOS EXPEDIENTES DE COMPETENCIA DEL ÁREA DE GESTIÓN POLICIVA Y ÁREA DE GESTIÓN DE DESARROLLO LOCAL","Inversión",45,{"$f":"IF(J96=1,'[1]Equivalencia BH-BMPT'!$D$2,IF(J96=2,'[1]Equivalencia BH-BMPT'!$D$3,IF(J96=3,'[1]Equivalencia BH-BMPT'!$D$4,IF(J96=4,'[1]Equivalencia BH-BMPT'!$D$5,IF(J96=5,'[1]Equivalencia BH-BMPT'!$D$6,IF(J96=6,'[1]Equivalencia BH-BMPT'!$D$7,IF(J96=7,'[1]Equivalencia BH-BMPT'!$D$8,IF(J96=8,'[1]Equivalencia BH-BMPT'!$D$9,IF(J96=9,'[1]Equivalencia BH-BMPT'!$D$10,IF(J96=10,'[1]Equivalencia BH-BMPT'!$D$11,IF(J96=11,'[1]Equivalencia BH-BMPT'!$D$12,IF(J96=12,'[1]Equivalencia BH-BMPT'!$D$13,IF(J96=13,'[1]Equivalencia BH-BMPT'!$D$14,IF(J96=14,'[1]Equivalencia BH-BMPT'!$D$15,IF(J96=15,'[1]Equivalencia BH-BMPT'!$D$16,IF(J96=16,'[1]Equivalencia BH-BMPT'!$D$17,IF(J96=17,'[1]Equivalencia BH-BMPT'!$D$18,IF(J96=18,'[1]Equivalencia BH-BMPT'!$D$19,IF(J96=19,'[1]Equivalencia BH-BMPT'!$D$20,IF(J96=20,'[1]Equivalencia BH-BMPT'!$D$21,IF(J96=21,'[1]Equivalencia BH-BMPT'!$D$22,IF(J96=22,'[1]Equivalencia BH-BMPT'!$D$23,IF(J96=23,'[1]Equivalencia BH-BMPT'!#REF!,IF(J96=24,'[1]Equivalencia BH-BMPT'!$D$25,IF(J96=25,'[1]Equivalencia BH-BMPT'!$D$26,IF(J96=26,'[1]Equivalencia BH-BMPT'!$D$27,IF(J96=27,'[1]Equivalencia BH-BMPT'!$D$28,IF(J96=28,'[1]Equivalencia BH-BMPT'!$D$29,IF(J96=29,'[1]Equivalencia BH-BMPT'!$D$30,IF(J96=30,'[1]Equivalencia BH-BMPT'!$D$31,IF(J96=31,'[1]Equivalencia BH-BMPT'!$D$32,IF(J96=32,'[1]Equivalencia BH-BMPT'!$D$33,IF(J96=33,'[1]Equivalencia BH-BMPT'!$D$34,IF(J96=34,'[1]Equivalencia BH-BMPT'!$D$35,IF(J96=35,'[1]Equivalencia BH-BMPT'!$D$36,IF(J96=36,'[1]Equivalencia BH-BMPT'!$D$37,IF(J96=37,'[1]Equivalencia BH-BMPT'!$D$38,IF(J96=38,'[1]Equivalencia BH-BMPT'!#REF!,IF(J96=39,'[1]Equivalencia BH-BMPT'!$D$40,IF(J96=40,'[1]Equivalencia BH-BMPT'!$D$41,IF(J96=41,'[1]Equivalencia BH-BMPT'!$D$42,IF(J96=42,'[1]Equivalencia BH-BMPT'!$D$43,IF(J96=43,'[1]Equivalencia BH-BMPT'!$D$44,IF(J96=44,'[1]Equivalencia BH-BMPT'!$D$45,IF(J96=45,'[1]Equivalencia BH-BMPT'!$D$46,\"No ha seleccionado un número de programa\")))))))))))))))))))))))))))))))))))))))))))))","v":"Gobernanza e influencia local, regional e internacional"},"1395",80188460,"JEFFERSON ORLANDO MARQUEZ SILVA",21301578,null,null,null,8114888,29416466,20828212,"2017-02-07","2017-02-08","2018-04-21",444,null,null,null,"X",null,null,0.70804603109020636,false]
[38,2017,"17-12-6332674",5,{"$f":"IF(D97=1,'[1]Tipo '!$B$2,IF(D97=2,'[1]Tipo '!$B$3,IF(D97=3,'[1]Tipo '!$B$4,IF(D97=4,'[1]Tipo '!$B$5,IF(D97=5,'[1]Tipo '!$B$6,IF(D97=6,'[1]Tipo '!$B$7,IF(D97=7,'[1]Tipo '!$B$8,IF(D97=8,'[1]Tipo '!$B$9,IF(D97=9,'[1]Tipo '!$B$10,IF(D97=10,'[1]Tipo '!$B$11,IF(D97=11,'[1]Tipo '!$B$12,IF(D97=12,'[1]Tipo '!$B$13,IF(D97=13,'[1]Tipo '!$B$14,IF(D97=14,'[1]Tipo '!$B$15,IF(D97=15,'[1]Tipo '!$B$16,IF(D97=16,'[1]Tipo '!$B$17,IF(D97=17,'[1]Tipo '!$B$18,IF(D97=18,'[1]Tipo '!$B$19,IF(D97=19,'[1]Tipo '!$B$20,\"No ha seleccionado un tipo de contrato válido\")))))))))))))))))))","v":"CONTRATOS DE PRESTACIÓN DE SERVICIOS PROFESIONALES Y DE APOYO A LA GESTIÓN"},"Contratación directa","Prestación de servicios profesionales y de apoyo a la gestión, o para la ejecución de trabajos artísticos que sólo puedan encomendarse a determinadas personas naturales;","PRESTAR SUS SERVICIOS PROFESIONALES DE APOYO JURIDÍCO DE LOS PROCESOS A CARGO DEL ÁREA DE GESTIÓN POLICIVA DE LA ALCALDÍA LOCAL DE LA CANDELARÍA PARA TEMAS DE ESTABLECIMIENTOS DE COMERCIO, PROPIEDAD HORIZONTAL, ACCIONES CONSTITUCIONALES, OBRAS Y DERECHO DE PETICIÓN SEGUN REPARTO","Inversión",45,{"$f":"IF(J97=1,'[1]Equivalencia BH-BMPT'!$D$2,IF(J97=2,'[1]Equivalencia BH-BMPT'!$D$3,IF(J97=3,'[1]Equivalencia BH-BMPT'!$D$4,IF(J97=4,'[1]Equivalencia BH-BMPT'!$D$5,IF(J97=5,'[1]Equivalencia BH-BMPT'!$D$6,IF(J97=6,'[1]Equivalencia BH-BMPT'!$D$7,IF(J97=7,'[1]Equivalencia BH-BMPT'!$D$8,IF(J97=8,'[1]Equivalencia BH-BMPT'!$D$9,IF(J97=9,'[1]Equivalencia BH-BMPT'!$D$10,IF(J97=10,'[1]Equivalencia BH-BMPT'!$D$11,IF(J97=11,'[1]Equivalencia BH-BMPT'!$D$12,IF(J97=12,'[1]Equivalencia BH-BMPT'!$D$13,IF(J97=13,'[1]Equivalencia BH-BMPT'!$D$14,IF(J97=14,'[1]Equivalencia BH-BMPT'!$D$15,IF(J97=15,'[1]Equivalencia BH-BMPT'!$D$16,IF(J97=16,'[1]Equivalencia BH-BMPT'!$D$17,IF(J97=17,'[1]Equivalencia BH-BMPT'!$D$18,IF(J97=18,'[1]Equivalencia BH-BMPT'!$D$19,IF(J97=19,'[1]Equivalencia BH-BMPT'!$D$20,IF(J97=20,'[1]Equivalencia BH-BMPT'!$D$21,IF(J97=21,'[1]Equivalencia BH-BMPT'!$D$22,IF(J97=22,'[1]Equivalencia BH-BMPT'!$D$23,IF(J97=23,'[1]Equivalencia BH-BMPT'!#REF!,IF(J97=24,'[1]Equivalencia BH-BMPT'!$D$25,IF(J97=25,'[1]Equivalencia BH-BMPT'!$D$26,IF(J97=26,'[1]Equivalencia BH-BMPT'!$D$27,IF(J97=27,'[1]Equivalencia BH-BMPT'!$D$28,IF(J97=28,'[1]Equivalencia BH-BMPT'!$D$29,IF(J97=29,'[1]Equivalencia BH-BMPT'!$D$30,IF(J97=30,'[1]Equivalencia BH-BMPT'!$D$31,IF(J97=31,'[1]Equivalencia BH-BMPT'!$D$32,IF(J97=32,'[1]Equivalencia BH-BMPT'!$D$33,IF(J97=33,'[1]Equivalencia BH-BMPT'!$D$34,IF(J97=34,'[1]Equivalencia BH-BMPT'!$D$35,IF(J97=35,'[1]Equivalencia BH-BMPT'!$D$36,IF(J97=36,'[1]Equivalencia BH-BMPT'!$D$37,IF(J97=37,'[1]Equivalencia BH-BMPT'!$D$38,IF(J97=38,'[1]Equivalencia BH-BMPT'!#REF!,IF(J97=39,'[1]Equivalencia BH-BMPT'!$D$40,IF(J97=40,'[1]Equivalencia BH-BMPT'!$D$41,IF(J97=41,'[1]Equivalencia BH-BMPT'!$D$42,IF(J97=42,'[1]Equivalencia BH-BMPT'!$D$43,IF(J97=43,'[1]Equivalencia BH-BMPT'!$D$44,IF(J97=44,'[1]Equivalencia BH-BMPT'!$D$45,IF(J97=45,'[1]Equivalencia BH-BMPT'!$D$46,\"No ha seleccionado un número de programa\")))))))))))))))))))))))))))))))))))))))))))))","v":"Gobernanza e influencia local, regional e internacional"},"1395",79690696,"CESAR JOSE SANINT GONZALEZ",49500811,null,null,null,2250037,51750848,46050757,"2017-02-07","2017-02-09","2018-01-14",338,null,null,null,null,"X",null,{"$f":"SUM(U97/T97)","v":0.88985511889582947},false]
[40,2017,"17-12-6332890",5,{"$f":"IF(D98=1,'[1]Tipo '!$B$2,IF(D98=2,'[1]Tipo '!$B$3,IF(D98=3,'[1]Tipo '!$B$4,IF(D98=4,'[1]Tipo '!$B$5,IF(D98=5,'[1]Tipo '!$B$6,IF(D98=6,'[1]Tipo '!$B$7,IF(D98=7,'[1]Tipo '!$B$8,IF(D98=8,'[1]Tipo '!$B$9,IF(D98=9,'[1]Tipo '!$B$10,IF(D98=10,'[1]Tipo '!$B$11,IF(D98=11,'[1]Tipo '!$B$12,IF(D98=12,'[1]Tipo '!$B$13,IF(D98=13,'[1]Tipo '!$B$14,IF(D98=14,'[1]Tipo '!$B$15,IF(D98=15,'[1]Tipo '!$B$16,IF(D98=16,'[1]Tipo '!$B$17,IF(D98=17,'[1]Tipo '!$B$18,IF(D98=18,'[1]Tipo '!$B$19,IF(D98=19,'[1]Tipo '!$B$20,\"No ha seleccionado un tipo de contrato válido\")))))))))))))))))))","v":"CONTRATOS DE PRESTACIÓN DE SERVICIOS PROFESIONALES Y DE APOYO A LA GESTIÓN"},"Contratación directa","Prestación de servicios profesionales y de apoyo a la gestión, o para la ejecución de trabajos artísticos que sólo puedan encomendarse a determinadas personas naturales;","PRESTAR SUS SERVICIOS PROFESIONALES DE APOYO JURIDÍCO DE LOS PROCESOS A CARGO DEL ÁREA DE GESTIÓN POLICIVA DE LA ALCALDÍA LOCAL DE LA CANDELARÍA PARA TEMAS DE ESTABLECIMIENTOS DE COMERCIO, PROPIEDAD HORIZONTAL, ACCIONES CONSTITUCIONALES, OBRAS Y DERECHO DE PETICIÓN SEGUN REPARTO","Inversión",45,{"$f":"IF(J98=1,'[1]Equivalencia BH-BMPT'!$D$2,IF(J98=2,'[1]Equivalencia BH-BMPT'!$D$3,IF(J98=3,'[1]Equivalencia BH-BMPT'!$D$4,IF(J98=4,'[1]Equivalencia BH-BMPT'!$D$5,IF(J98=5,'[1]Equivalencia BH-BMPT'!$D$6,IF(J98=6,'[1]Equivalencia BH-BMPT'!$D$7,IF(J98=7,'[1]Equivalencia BH-BMPT'!$D$8,IF(J98=8,'[1]Equivalencia BH-BMPT'!$D$9,IF(J98=9,'[1]Equivalencia BH-BMPT'!$D$10,IF(J98=10,'[1]Equivalencia BH-BMPT'!$D$11,IF(J98=11,'[1]Equivalencia BH-BMPT'!$D$12,IF(J98=12,'[1]Equivalencia BH-BMPT'!$D$13,IF(J98=13,'[1]Equivalencia BH-BMPT'!$D$14,IF(J98=14,'[1]Equivalencia BH-BMPT'!$D$15,IF(J98=15,'[1]Equivalencia BH-BMPT'!$D$16,IF(J98=16,'[1]Equivalencia BH-BMPT'!$D$17,IF(J98=17,'[1]Equivalencia BH-BMPT'!$D$18,IF(J98=18,'[1]Equivalencia BH-BMPT'!$D$19,IF(J98=19,'[1]Equivalencia BH-BMPT'!$D$20,IF(J98=20,'[1]Equivalencia BH-BMPT'!$D$21,IF(J98=21,'[1]Equivalencia BH-BMPT'!$D$22,IF(J98=22,'[1]Equivalencia BH-BMPT'!$D$23,IF(J98=23,'[1]Equivalencia BH-BMPT'!#REF!,IF(J98=24,'[1]Equivalencia BH-BMPT'!$D$25,IF(J98=25,'[1]Equivalencia BH-BMPT'!$D$26,IF(J98=26,'[1]Equivalencia BH-BMPT'!$D$27,IF(J98=27,'[1]Equivalencia BH-BMPT'!$D$28,IF(J98=28,'[1]Equivalencia BH-BMPT'!$D$29,IF(J98=29,'[1]Equivalencia BH-BMPT'!$D$30,IF(J98=30,'[1]Equivalencia BH-BMPT'!$D$31,IF(J98=31,'[1]Equivalencia BH-BMPT'!$D$32,IF(J98=32,'[1]Equivalencia BH-BMPT'!$D$33,IF(J98=33,'[1]Equivalencia BH-BMPT'!$D$34,IF(J98=34,'[1]Equivalencia BH-BMPT'!$D$35,IF(J98=35,'[1]Equivalencia BH-BMPT'!$D$36,IF(J98=36,'[1]Equivalencia BH-BMPT'!$D$37,IF(J98=37,'[1]Equivalencia BH-BMPT'!$D$38,IF(J98=38,'[1]Equivalencia BH-BMPT'!#REF!,IF(J98=39,'[1]Equivalencia BH-BMPT'!$D$40,IF(J98=40,'[1]Equivalencia BH-BMPT'!$D$41,IF(J98=41,'[1]Equivalencia BH-BMPT'!$D$42,IF(J98=42,'[1]Equivalencia BH-BMPT'!$D$43,IF(J98=43,'[1]Equivalencia BH-BMPT'!$D$44,IF(J98=44,'[1]Equivalencia BH-BMPT'!$D$45,IF(J98=45,'[1]Equivalencia BH-BMPT'!$D$46,\"No ha seleccionado un número de programa\")))))))))))))))))))))))))))))))))))))))))))))","v":"Gobernanza e influencia local, regional e internacional"},"1395",51875915,"Luz Sofia Amaya Castañeda ",49500811,null,null,null,2250037,51750848,46200749,"2017-02-07","2017-02-08","2018-01-14",339,null,null,null,"X",null,null,0.89275346753738216,false]
[41,2017,"17-12-6333074",5,{"$f":"IF(D99=1,'[1]Tipo '!$B$2,IF(D99=2,'[1]Tipo '!$B$3,IF(D99=3,'[1]Tipo '!$B$4,IF(D99=4,'[1]Tipo '!$B$5,IF(D99=5,'[1]Tipo '!$B$6,IF(D99=6,'[1]Tipo '!$B$7,IF(D99=7,'[1]Tipo '!$B$8,IF(D99=8,'[1]Tipo '!$B$9,IF(D99=9,'[1]Tipo '!$B$10,IF(D99=10,'[1]Tipo '!$B$11,IF(D99=11,'[1]Tipo '!$B$12,IF(D99=12,'[1]Tipo '!$B$13,IF(D99=13,'[1]Tipo '!$B$14,IF(D99=14,'[1]Tipo '!$B$15,IF(D99=15,'[1]Tipo '!$B$16,IF(D99=16,'[1]Tipo '!$B$17,IF(D99=17,'[1]Tipo '!$B$18,IF(D99=18,'[1]Tipo '!$B$19,IF(D99=19,'[1]Tipo '!$B$20,\"No ha seleccionado un tipo de contrato válido\")))))))))))))))))))","v":"CONTRATOS DE PRESTACIÓN DE SERVICIOS PROFESIONALES Y DE APOYO A LA GESTIÓN"},"Contratación directa","Prestación de servicios profesionales y de apoyo a la gestión, o para la ejecución de trabajos artísticos que sólo puedan encomendarse a determinadas personas naturales;","PRESTAR LOS SERVICIOS DE APOYO AL ÁREA DE GESTIÓN DE DESARROLLO LOCAL, PARA EL FORTALECIMIENTO INSTITUCIONAL EN TEMAS DE CONTABILIDAD Y PRESUPUESTO EN LA ALCALDÍA LOCAL DE LA CANDELARIA","Inversión",45,{"$f":"IF(J99=1,'[1]Equivalencia BH-BMPT'!$D$2,IF(J99=2,'[1]Equivalencia BH-BMPT'!$D$3,IF(J99=3,'[1]Equivalencia BH-BMPT'!$D$4,IF(J99=4,'[1]Equivalencia BH-BMPT'!$D$5,IF(J99=5,'[1]Equivalencia BH-BMPT'!$D$6,IF(J99=6,'[1]Equivalencia BH-BMPT'!$D$7,IF(J99=7,'[1]Equivalencia BH-BMPT'!$D$8,IF(J99=8,'[1]Equivalencia BH-BMPT'!$D$9,IF(J99=9,'[1]Equivalencia BH-BMPT'!$D$10,IF(J99=10,'[1]Equivalencia BH-BMPT'!$D$11,IF(J99=11,'[1]Equivalencia BH-BMPT'!$D$12,IF(J99=12,'[1]Equivalencia BH-BMPT'!$D$13,IF(J99=13,'[1]Equivalencia BH-BMPT'!$D$14,IF(J99=14,'[1]Equivalencia BH-BMPT'!$D$15,IF(J99=15,'[1]Equivalencia BH-BMPT'!$D$16,IF(J99=16,'[1]Equivalencia BH-BMPT'!$D$17,IF(J99=17,'[1]Equivalencia BH-BMPT'!$D$18,IF(J99=18,'[1]Equivalencia BH-BMPT'!$D$19,IF(J99=19,'[1]Equivalencia BH-BMPT'!$D$20,IF(J99=20,'[1]Equivalencia BH-BMPT'!$D$21,IF(J99=21,'[1]Equivalencia BH-BMPT'!$D$22,IF(J99=22,'[1]Equivalencia BH-BMPT'!$D$23,IF(J99=23,'[1]Equivalencia BH-BMPT'!#REF!,IF(J99=24,'[1]Equivalencia BH-BMPT'!$D$25,IF(J99=25,'[1]Equivalencia BH-BMPT'!$D$26,IF(J99=26,'[1]Equivalencia BH-BMPT'!$D$27,IF(J99=27,'[1]Equivalencia BH-BMPT'!$D$28,IF(J99=28,'[1]Equivalencia BH-BMPT'!$D$29,IF(J99=29,'[1]Equivalencia BH-BMPT'!$D$30,IF(J99=30,'[1]Equivalencia BH-BMPT'!$D$31,IF(J99=31,'[1]Equivalencia BH-BMPT'!$D$32,IF(J99=32,'[1]Equivalencia BH-BMPT'!$D$33,IF(J99=33,'[1]Equivalencia BH-BMPT'!$D$34,IF(J99=34,'[1]Equivalencia BH-BMPT'!$D$35,IF(J99=35,'[1]Equivalencia BH-BMPT'!$D$36,IF(J99=36,'[1]Equivalencia BH-BMPT'!$D$37,IF(J99=37,'[1]Equivalencia BH-BMPT'!$D$38,IF(J99=38,'[1]Equivalencia BH-BMPT'!#REF!,IF(J99=39,'[1]Equivalencia BH-BMPT'!$D$40,IF(J99=40,'[1]Equivalencia BH-BMPT'!$D$41,IF(J99=41,'[1]Equivalencia BH-BMPT'!$D$42,IF(J99=42,'[1]Equivalencia BH-BMPT'!$D$43,IF(J99=43,'[1]Equivalencia BH-BMPT'!$D$44,IF(J99=44,'[1]Equivalencia BH-BMPT'!$D$45,IF(J99=45,'[1]Equivalencia BH-BMPT'!$D$46,\"No ha seleccionado un número de programa\")))))))))))))))))))))))))))))))))))))))))))))","v":"Gobernanza e influencia local, regional e internacional"},"1395",1013615359,"CAROL ANDREA LEIVA HERNÁNDEZ",33271037,null,null,null,12098560,45369597,30548864,"2017-02-08","2017-02-13","2018-04-29",450,null,null,null,"X",null,null,0.67333337785654124,false]
[43,2017,"17-13-6072314",5,{"$f":"IF(D100=1,'[1]Tipo '!$B$2,IF(D100=2,'[1]Tipo '!$B$3,IF(D100=3,'[1]Tipo '!$B$4,IF(D100=4,'[1]Tipo '!$B$5,IF(D100=5,'[1]Tipo '!$B$6,IF(D100=6,'[1]Tipo '!$B$7,IF(D100=7,'[1]Tipo '!$B$8,IF(D100=8,'[1]Tipo '!$B$9,IF(D100=9,'[1]Tipo '!$B$10,IF(D100=10,'[1]Tipo '!$B$11,IF(D100=11,'[1]Tipo '!$B$12,IF(D100=12,'[1]Tipo '!$B$13,IF(D100=13,'[1]Tipo '!$B$14,IF(D100=14,'[1]Tipo '!$B$15,IF(D100=15,'[1]Tipo '!$B$16,IF(D100=16,'[1]Tipo '!$B$17,IF(D100=17,'[1]Tipo '!$B$18,IF(D100=18,'[1]Tipo '!$B$19,IF(D100=19,'[1]Tipo '!$B$20,\"No ha seleccionado un tipo de contrato válido\")))))))))))))))))))","v":"CONTRATOS DE PRESTACIÓN DE SERVICIOS PROFESIONALES Y DE APOYO A LA GESTIÓN"},"Contratación directa","Prestación de servicios profesionales y de apoyo a la gestión, o para la ejecución de trabajos artísticos que sólo puedan encomendarse a determinadas personas naturales;","Prestar los servicios de apoyo a la administración local en la gestión de las casas comunitarias de la localidad de la candelaria de conformidad con el Acuerdo local 006 de 2013","Inversión",45,{"$f":"IF(J100=1,'[1]Equivalencia BH-BMPT'!$D$2,IF(J100=2,'[1]Equivalencia BH-BMPT'!$D$3,IF(J100=3,'[1]Equivalencia BH-BMPT'!$D$4,IF(J100=4,'[1]Equivalencia BH-BMPT'!$D$5,IF(J100=5,'[1]Equivalencia BH-BMPT'!$D$6,IF(J100=6,'[1]Equivalencia BH-BMPT'!$D$7,IF(J100=7,'[1]Equivalencia BH-BMPT'!$D$8,IF(J100=8,'[1]Equivalencia BH-BMPT'!$D$9,IF(J100=9,'[1]Equivalencia BH-BMPT'!$D$10,IF(J100=10,'[1]Equivalencia BH-BMPT'!$D$11,IF(J100=11,'[1]Equivalencia BH-BMPT'!$D$12,IF(J100=12,'[1]Equivalencia BH-BMPT'!$D$13,IF(J100=13,'[1]Equivalencia BH-BMPT'!$D$14,IF(J100=14,'[1]Equivalencia BH-BMPT'!$D$15,IF(J100=15,'[1]Equivalencia BH-BMPT'!$D$16,IF(J100=16,'[1]Equivalencia BH-BMPT'!$D$17,IF(J100=17,'[1]Equivalencia BH-BMPT'!$D$18,IF(J100=18,'[1]Equivalencia BH-BMPT'!$D$19,IF(J100=19,'[1]Equivalencia BH-BMPT'!$D$20,IF(J100=20,'[1]Equivalencia BH-BMPT'!$D$21,IF(J100=21,'[1]Equivalencia BH-BMPT'!$D$22,IF(J100=22,'[1]Equivalencia BH-BMPT'!$D$23,IF(J100=23,'[1]Equivalencia BH-BMPT'!#REF!,IF(J100=24,'[1]Equivalencia BH-BMPT'!$D$25,IF(J100=25,'[1]Equivalencia BH-BMPT'!$D$26,IF(J100=26,'[1]Equivalencia BH-BMPT'!$D$27,IF(J100=27,'[1]Equivalencia BH-BMPT'!$D$28,IF(J100=28,'[1]Equivalencia BH-BMPT'!$D$29,IF(J100=29,'[1]Equivalencia BH-BMPT'!$D$30,IF(J100=30,'[1]Equivalencia BH-BMPT'!$D$31,IF(J100=31,'[1]Equivalencia BH-BMPT'!$D$32,IF(J100=32,'[1]Equivalencia BH-BMPT'!$D$33,IF(J100=33,'[1]Equivalencia BH-BMPT'!$D$34,IF(J100=34,'[1]Equivalencia BH-BMPT'!$D$35,IF(J100=35,'[1]Equivalencia BH-BMPT'!$D$36,IF(J100=36,'[1]Equivalencia BH-BMPT'!$D$37,IF(J100=37,'[1]Equivalencia BH-BMPT'!$D$38,IF(J100=38,'[1]Equivalencia BH-BMPT'!#REF!,IF(J100=39,'[1]Equivalencia BH-BMPT'!$D$40,IF(J100=40,'[1]Equivalencia BH-BMPT'!$D$41,IF(J100=41,'[1]Equivalencia BH-BMPT'!$D$42,IF(J100=42,'[1]Equivalencia BH-BMPT'!$D$43,IF(J100=43,'[1]Equivalencia BH-BMPT'!$D$44,IF(J100=44,'[1]Equivalencia BH-BMPT'!$D$45,IF(J100=45,'[1]Equivalencia BH-BMPT'!$D$46,\"No ha seleccionado un número de programa\")))))))))))))))))))))))))))))))))))))))))))))","v":"Gobernanza e influencia local, regional e internacional"},"1395",41560087,"Marta María Castro Ferreira",27590616,null,null,null,1254119,28844735,25667636,"2017-02-08","2017-02-09","2018-01-14",338,null,null,null,null,"X",null,0.8898551503419948,false]
[45,2017,"17-12-6333958",5,{"$f":"IF(D101=1,'[1]Tipo '!$B$2,IF(D101=2,'[1]Tipo '!$B$3,IF(D101=3,'[1]Tipo '!$B$4,IF(D101=4,'[1]Tipo '!$B$5,IF(D101=5,'[1]Tipo '!$B$6,IF(D101=6,'[1]Tipo '!$B$7,IF(D101=7,'[1]Tipo '!$B$8,IF(D101=8,'[1]Tipo '!$B$9,IF(D101=9,'[1]Tipo '!$B$10,IF(D101=10,'[1]Tipo '!$B$11,IF(D101=11,'[1]Tipo '!$B$12,IF(D101=12,'[1]Tipo '!$B$13,IF(D101=13,'[1]Tipo '!$B$14,IF(D101=14,'[1]Tipo '!$B$15,IF(D101=15,'[1]Tipo '!$B$16,IF(D101=16,'[1]Tipo '!$B$17,IF(D101=17,'[1]Tipo '!$B$18,IF(D101=18,'[1]Tipo '!$B$19,IF(D101=19,'[1]Tipo '!$B$20,\"No ha seleccionado un tipo de contrato válido\")))))))))))))))))))","v":"CONTRATOS DE PRESTACIÓN DE SERVICIOS PROFESIONALES Y DE APOYO A LA GESTIÓN"},"Contratación directa","Prestación de servicios profesionales y de apoyo a la gestión, o para la ejecución de trabajos artísticos que sólo puedan encomendarse a determinadas personas naturales;","PRESTAR LOS SERVICIOS COMO CONDUCTOR DE APOYO DE LOS VEHICULOS DE PROPIEDAD DEL FONDO DE DESARROLLO LOCAL DE LA CANDELARIA","Inversión",45,{"$f":"IF(J101=1,'[1]Equivalencia BH-BMPT'!$D$2,IF(J101=2,'[1]Equivalencia BH-BMPT'!$D$3,IF(J101=3,'[1]Equivalencia BH-BMPT'!$D$4,IF(J101=4,'[1]Equivalencia BH-BMPT'!$D$5,IF(J101=5,'[1]Equivalencia BH-BMPT'!$D$6,IF(J101=6,'[1]Equivalencia BH-BMPT'!$D$7,IF(J101=7,'[1]Equivalencia BH-BMPT'!$D$8,IF(J101=8,'[1]Equivalencia BH-BMPT'!$D$9,IF(J101=9,'[1]Equivalencia BH-BMPT'!$D$10,IF(J101=10,'[1]Equivalencia BH-BMPT'!$D$11,IF(J101=11,'[1]Equivalencia BH-BMPT'!$D$12,IF(J101=12,'[1]Equivalencia BH-BMPT'!$D$13,IF(J101=13,'[1]Equivalencia BH-BMPT'!$D$14,IF(J101=14,'[1]Equivalencia BH-BMPT'!$D$15,IF(J101=15,'[1]Equivalencia BH-BMPT'!$D$16,IF(J101=16,'[1]Equivalencia BH-BMPT'!$D$17,IF(J101=17,'[1]Equivalencia BH-BMPT'!$D$18,IF(J101=18,'[1]Equivalencia BH-BMPT'!$D$19,IF(J101=19,'[1]Equivalencia BH-BMPT'!$D$20,IF(J101=20,'[1]Equivalencia BH-BMPT'!$D$21,IF(J101=21,'[1]Equivalencia BH-BMPT'!$D$22,IF(J101=22,'[1]Equivalencia BH-BMPT'!$D$23,IF(J101=23,'[1]Equivalencia BH-BMPT'!#REF!,IF(J101=24,'[1]Equivalencia BH-BMPT'!$D$25,IF(J101=25,'[1]Equivalencia BH-BMPT'!$D$26,IF(J101=26,'[1]Equivalencia BH-BMPT'!$D$27,IF(J101=27,'[1]Equivalencia BH-BMPT'!$D$28,IF(J101=28,'[1]Equivalencia BH-BMPT'!$D$29,IF(J101=29,'[1]Equivalencia BH-BMPT'!$D$30,IF(J101=30,'[1]Equivalencia BH-BMPT'!$D$31,IF(J101=31,'[1]Equivalencia BH-BMPT'!$D$32,IF(J101=32,'[1]Equivalencia BH-BMPT'!$D$33,IF(J101=33,'[1]Equivalencia BH-BMPT'!$D$34,IF(J101=34,'[1]Equivalencia BH-BMPT'!$D$35,IF(J101=35,'[1]Equivalencia BH-BMPT'!$D$36,IF(J101=36,'[1]Equivalencia BH-BMPT'!$D$37,IF(J101=37,'[1]Equivalencia BH-BMPT'!$D$38,IF(J101=38,'[1]Equivalencia BH-BMPT'!#REF!,IF(J101=39,'[1]Equivalencia BH-BMPT'!$D$40,IF(J101=40,'[1]Equivalencia BH-BMPT'!$D$41,IF(J101=41,'[1]Equivalencia BH-BMPT'!$D$42,IF(J101=42,'[1]Equivalencia BH-BMPT'!$D$43,IF(J101=43,'[1]Equivalencia BH-BMPT'!$D$44,IF(J101=44,'[1]Equivalencia BH-BMPT'!$D$45,IF(J101=45,'[1]Equivalencia BH-BMPT'!$D$46,\"No ha seleccionado un número de programa\")))))))))))))))))))))))))))))))))))))))))))))","v":"Gobernanza e influencia local, regional e internacional"},"1395",80280056,"Ricardo Ardila Acosta",22721684,22721684,null,null,null,{"$f":"O101+Q101+S101-P101","v":0},null,"2017-02-09","2017-02-09","2017-12-30",323,null,"x",null,null,null,null,{"$error":"#DIV/0!"},false]
[46,2017,"17-12-6334038",5,{"$f":"IF(D102=1,'[1]Tipo '!$B$2,IF(D102=2,'[1]Tipo '!$B$3,IF(D102=3,'[1]Tipo '!$B$4,IF(D102=4,'[1]Tipo '!$B$5,IF(D102=5,'[1]Tipo '!$B$6,IF(D102=6,'[1]Tipo '!$B$7,IF(D102=7,'[1]Tipo '!$B$8,IF(D102=8,'[1]Tipo '!$B$9,IF(D102=9,'[1]Tipo '!$B$10,IF(D102=10,'[1]Tipo '!$B$11,IF(D102=11,'[1]Tipo '!$B$12,IF(D102=12,'[1]Tipo '!$B$13,IF(D102=13,'[1]Tipo '!$B$14,IF(D102=14,'[1]Tipo '!$B$15,IF(D102=15,'[1]Tipo '!$B$16,IF(D102=16,'[1]Tipo '!$B$17,IF(D102=17,'[1]Tipo '!$B$18,IF(D102=18,'[1]Tipo '!$B$19,IF(D102=19,'[1]Tipo '!$B$20,\"No ha seleccionado un tipo de contrato válido\")))))))))))))))))))","v":"CONTRATOS DE PRESTACIÓN DE SERVICIOS PROFESIONALES Y DE APOYO A LA GESTIÓN"},"Contratación directa","Prestación de servicios profesionales y de apoyo a la gestión, o para la ejecución de trabajos artísticos que sólo puedan encomendarse a determinadas personas naturales;","Servicios profesionales como arquitecto en los procesos a cargo del Área dse Gestión Policiva de la Alcaldia Local de La Candelaria para temas de establecimientos de comercio, propiedad horizontal, acciones constitucionales, obras y derecho de petición","Inversión",45,{"$f":"IF(J102=1,'[1]Equivalencia BH-BMPT'!$D$2,IF(J102=2,'[1]Equivalencia BH-BMPT'!$D$3,IF(J102=3,'[1]Equivalencia BH-BMPT'!$D$4,IF(J102=4,'[1]Equivalencia BH-BMPT'!$D$5,IF(J102=5,'[1]Equivalencia BH-BMPT'!$D$6,IF(J102=6,'[1]Equivalencia BH-BMPT'!$D$7,IF(J102=7,'[1]Equivalencia BH-BMPT'!$D$8,IF(J102=8,'[1]Equivalencia BH-BMPT'!$D$9,IF(J102=9,'[1]Equivalencia BH-BMPT'!$D$10,IF(J102=10,'[1]Equivalencia BH-BMPT'!$D$11,IF(J102=11,'[1]Equivalencia BH-BMPT'!$D$12,IF(J102=12,'[1]Equivalencia BH-BMPT'!$D$13,IF(J102=13,'[1]Equivalencia BH-BMPT'!$D$14,IF(J102=14,'[1]Equivalencia BH-BMPT'!$D$15,IF(J102=15,'[1]Equivalencia BH-BMPT'!$D$16,IF(J102=16,'[1]Equivalencia BH-BMPT'!$D$17,IF(J102=17,'[1]Equivalencia BH-BMPT'!$D$18,IF(J102=18,'[1]Equivalencia BH-BMPT'!$D$19,IF(J102=19,'[1]Equivalencia BH-BMPT'!$D$20,IF(J102=20,'[1]Equivalencia BH-BMPT'!$D$21,IF(J102=21,'[1]Equivalencia BH-BMPT'!$D$22,IF(J102=22,'[1]Equivalencia BH-BMPT'!$D$23,IF(J102=23,'[1]Equivalencia BH-BMPT'!#REF!,IF(J102=24,'[1]Equivalencia BH-BMPT'!$D$25,IF(J102=25,'[1]Equivalencia BH-BMPT'!$D$26,IF(J102=26,'[1]Equivalencia BH-BMPT'!$D$27,IF(J102=27,'[1]Equivalencia BH-BMPT'!$D$28,IF(J102=28,'[1]Equivalencia BH-BMPT'!$D$29,IF(J102=29,'[1]Equivalencia BH-BMPT'!$D$30,IF(J102=30,'[1]Equivalencia BH-BMPT'!$D$31,IF(J102=31,'[1]Equivalencia BH-BMPT'!$D$32,IF(J102=32,'[1]Equivalencia BH-BMPT'!$D$33,IF(J102=33,'[1]Equivalencia BH-BMPT'!$D$34,IF(J102=34,'[1]Equivalencia BH-BMPT'!$D$35,IF(J102=35,'[1]Equivalencia BH-BMPT'!$D$36,IF(J102=36,'[1]Equivalencia BH-BMPT'!$D$37,IF(J102=37,'[1]Equivalencia BH-BMPT'!$D$38,IF(J102=38,'[1]Equivalencia BH-BMPT'!#REF!,IF(J102=39,'[1]Equivalencia BH-BMPT'!$D$40,IF(J102=40,'[1]Equivalencia BH-BMPT'!$D$41,IF(J102=41,'[1]Equivalencia BH-BMPT'!$D$42,IF(J102=42,'[1]Equivalencia BH-BMPT'!$D$43,IF(J102=43,'[1]Equivalencia BH-BMPT'!$D$44,IF(J102=44,'[1]Equivalencia BH-BMPT'!$D$45,IF(J102=45,'[1]Equivalencia BH-BMPT'!$D$46,\"No ha seleccionado un número de programa\")))))))))))))))))))))))))))))))))))))))))))))","v":"Gobernanza e influencia local, regional e internacional"},"1395",19487206,"DARIO PLAZAS MONTAÑEZ",44631879,null,null,null,2028722,{"$f":"O102+Q102+S102","v":46660601},41382929,"2017-02-10","2017-02-10","2018-01-14",337,null,null,null,"X",null,null,0.88689232699767417,false]
[47,2017,"17-12-6334271",5,{"$f":"IF(D103=1,'[1]Tipo '!$B$2,IF(D103=2,'[1]Tipo '!$B$3,IF(D103=3,'[1]Tipo '!$B$4,IF(D103=4,'[1]Tipo '!$B$5,IF(D103=5,'[1]Tipo '!$B$6,IF(D103=6,'[1]Tipo '!$B$7,IF(D103=7,'[1]Tipo '!$B$8,IF(D103=8,'[1]Tipo '!$B$9,IF(D103=9,'[1]Tipo '!$B$10,IF(D103=10,'[1]Tipo '!$B$11,IF(D103=11,'[1]Tipo '!$B$12,IF(D103=12,'[1]Tipo '!$B$13,IF(D103=13,'[1]Tipo '!$B$14,IF(D103=14,'[1]Tipo '!$B$15,IF(D103=15,'[1]Tipo '!$B$16,IF(D103=16,'[1]Tipo '!$B$17,IF(D103=17,'[1]Tipo '!$B$18,IF(D103=18,'[1]Tipo '!$B$19,IF(D103=19,'[1]Tipo '!$B$20,\"No ha seleccionado un tipo de contrato válido\")))))))))))))))))))","v":"CONTRATOS DE PRESTACIÓN DE SERVICIOS PROFESIONALES Y DE APOYO A LA GESTIÓN"},"Contratación directa","Prestación de servicios profesionales y de apoyo a la gestión, o para la ejecución de trabajos artísticos que sólo puedan encomendarse a determinadas personas naturales;","PRESTAR SUS SERVICIOS PROFESIONALES COMO ARQUITECTO EN LOS PROCESOS A CARGO DEL ÁREA DE GESTIÓN POLICIVA DE LA ALCALDÍA LOCAL LA CANDELARIA PARA TEMAS DE ESTABLECIMIENTOS DE COMERCIO, PROPIEDAD HORIZONTAL, ACCIONES CONSTITUCIONALES, OBRAS Y DERECHOS DE PETICIÓN","Inversión",45,{"$f":"IF(J103=1,'[1]Equivalencia BH-BMPT'!$D$2,IF(J103=2,'[1]Equivalencia BH-BMPT'!$D$3,IF(J103=3,'[1]Equivalencia BH-BMPT'!$D$4,IF(J103=4,'[1]Equivalencia BH-BMPT'!$D$5,IF(J103=5,'[1]Equivalencia BH-BMPT'!$D$6,IF(J103=6,'[1]Equivalencia BH-BMPT'!$D$7,IF(J103=7,'[1]Equivalencia BH-BMPT'!$D$8,IF(J103=8,'[1]Equivalencia BH-BMPT'!$D$9,IF(J103=9,'[1]Equivalencia BH-BMPT'!$D$10,IF(J103=10,'[1]Equivalencia BH-BMPT'!$D$11,IF(J103=11,'[1]Equivalencia BH-BMPT'!$D$12,IF(J103=12,'[1]Equivalencia BH-BMPT'!$D$13,IF(J103=13,'[1]Equivalencia BH-BMPT'!$D$14,IF(J103=14,'[1]Equivalencia BH-BMPT'!$D$15,IF(J103=15,'[1]Equivalencia BH-BMPT'!$D$16,IF(J103=16,'[1]Equivalencia BH-BMPT'!$D$17,IF(J103=17,'[1]Equivalencia BH-BMPT'!$D$18,IF(J103=18,'[1]Equivalencia BH-BMPT'!$D$19,IF(J103=19,'[1]Equivalencia BH-BMPT'!$D$20,IF(J103=20,'[1]Equivalencia BH-BMPT'!$D$21,IF(J103=21,'[1]Equivalencia BH-BMPT'!$D$22,IF(J103=22,'[1]Equivalencia BH-BMPT'!$D$23,IF(J103=23,'[1]Equivalencia BH-BMPT'!#REF!,IF(J103=24,'[1]Equivalencia BH-BMPT'!$D$25,IF(J103=25,'[1]Equivalencia BH-BMPT'!$D$26,IF(J103=26,'[1]Equivalencia BH-BMPT'!$D$27,IF(J103=27,'[1]Equivalencia BH-BMPT'!$D$28,IF(J103=28,'[1]Equivalencia BH-BMPT'!$D$29,IF(J103=29,'[1]Equivalencia BH-BMPT'!$D$30,IF(J103=30,'[1]Equivalencia BH-BMPT'!$D$31,IF(J103=31,'[1]Equivalencia BH-BMPT'!$D$32,IF(J103=32,'[1]Equivalencia BH-BMPT'!$D$33,IF(J103=33,'[1]Equivalencia BH-BMPT'!$D$34,IF(J103=34,'[1]Equivalencia BH-BMPT'!$D$35,IF(J103=35,'[1]Equivalencia BH-BMPT'!$D$36,IF(J103=36,'[1]Equivalencia BH-BMPT'!$D$37,IF(J103=37,'[1]Equivalencia BH-BMPT'!$D$38,IF(J103=38,'[1]Equivalencia BH-BMPT'!#REF!,IF(J103=39,'[1]Equivalencia BH-BMPT'!$D$40,IF(J103=40,'[1]Equivalencia BH-BMPT'!$D$41,IF(J103=41,'[1]Equivalencia BH-BMPT'!$D$42,IF(J103=42,'[1]Equivalencia BH-BMPT'!$D$43,IF(J103=43,'[1]Equivalencia BH-BMPT'!$D$44,IF(J103=44,'[1]Equivalencia BH-BMPT'!$D$45,IF(J103=45,'[1]Equivalencia BH-BMPT'!$D$46,\"No ha seleccionado un número de programa\")))))))))))))))))))))))))))))))))))))))))))))","v":"Gobernanza e influencia local, regional e internacional"},"1395",79692123,"CAMPO ELIAS GUTIERREZ GARCIA",44631879,null,null,null,null,44631879,39762949,"2017-02-10","2017-02-10","2017-12-30",322,null,null,null,null,"X",null,0.89090914142333111,false]
[48,2017,"17-12-6334830",5,{"$f":"IF(D104=1,'[1]Tipo '!$B$2,IF(D104=2,'[1]Tipo '!$B$3,IF(D104=3,'[1]Tipo '!$B$4,IF(D104=4,'[1]Tipo '!$B$5,IF(D104=5,'[1]Tipo '!$B$6,IF(D104=6,'[1]Tipo '!$B$7,IF(D104=7,'[1]Tipo '!$B$8,IF(D104=8,'[1]Tipo '!$B$9,IF(D104=9,'[1]Tipo '!$B$10,IF(D104=10,'[1]Tipo '!$B$11,IF(D104=11,'[1]Tipo '!$B$12,IF(D104=12,'[1]Tipo '!$B$13,IF(D104=13,'[1]Tipo '!$B$14,IF(D104=14,'[1]Tipo '!$B$15,IF(D104=15,'[1]Tipo '!$B$16,IF(D104=16,'[1]Tipo '!$B$17,IF(D104=17,'[1]Tipo '!$B$18,IF(D104=18,'[1]Tipo '!$B$19,IF(D104=19,'[1]Tipo '!$B$20,\"No ha seleccionado un tipo de contrato válido\")))))))))))))))))))","v":"CONTRATOS DE PRESTACIÓN DE SERVICIOS PROFESIONALES Y DE APOYO A LA GESTIÓN"},"Contratación directa","Prestación de servicios profesionales y de apoyo a la gestión, o para la ejecución de trabajos artísticos que sólo puedan encomendarse a determinadas personas naturales;","PRESTAR SERVICIOS PROFESIONALES PARA LA ESTRUCTURACIÓN DE LOS PROCESOS PRE-CONTRACTUALES, CONTRACTUALES, POS- CONTRACTUALES Y DEMÁS PROCEDIMIENTOS JURÍDICOS RELACIONADOS DEL FONDO DE DESARROLLO LOCAL DE LA CANDELARIA","Inversión",45,{"$f":"IF(J104=1,'[1]Equivalencia BH-BMPT'!$D$2,IF(J104=2,'[1]Equivalencia BH-BMPT'!$D$3,IF(J104=3,'[1]Equivalencia BH-BMPT'!$D$4,IF(J104=4,'[1]Equivalencia BH-BMPT'!$D$5,IF(J104=5,'[1]Equivalencia BH-BMPT'!$D$6,IF(J104=6,'[1]Equivalencia BH-BMPT'!$D$7,IF(J104=7,'[1]Equivalencia BH-BMPT'!$D$8,IF(J104=8,'[1]Equivalencia BH-BMPT'!$D$9,IF(J104=9,'[1]Equivalencia BH-BMPT'!$D$10,IF(J104=10,'[1]Equivalencia BH-BMPT'!$D$11,IF(J104=11,'[1]Equivalencia BH-BMPT'!$D$12,IF(J104=12,'[1]Equivalencia BH-BMPT'!$D$13,IF(J104=13,'[1]Equivalencia BH-BMPT'!$D$14,IF(J104=14,'[1]Equivalencia BH-BMPT'!$D$15,IF(J104=15,'[1]Equivalencia BH-BMPT'!$D$16,IF(J104=16,'[1]Equivalencia BH-BMPT'!$D$17,IF(J104=17,'[1]Equivalencia BH-BMPT'!$D$18,IF(J104=18,'[1]Equivalencia BH-BMPT'!$D$19,IF(J104=19,'[1]Equivalencia BH-BMPT'!$D$20,IF(J104=20,'[1]Equivalencia BH-BMPT'!$D$21,IF(J104=21,'[1]Equivalencia BH-BMPT'!$D$22,IF(J104=22,'[1]Equivalencia BH-BMPT'!$D$23,IF(J104=23,'[1]Equivalencia BH-BMPT'!#REF!,IF(J104=24,'[1]Equivalencia BH-BMPT'!$D$25,IF(J104=25,'[1]Equivalencia BH-BMPT'!$D$26,IF(J104=26,'[1]Equivalencia BH-BMPT'!$D$27,IF(J104=27,'[1]Equivalencia BH-BMPT'!$D$28,IF(J104=28,'[1]Equivalencia BH-BMPT'!$D$29,IF(J104=29,'[1]Equivalencia BH-BMPT'!$D$30,IF(J104=30,'[1]Equivalencia BH-BMPT'!$D$31,IF(J104=31,'[1]Equivalencia BH-BMPT'!$D$32,IF(J104=32,'[1]Equivalencia BH-BMPT'!$D$33,IF(J104=33,'[1]Equivalencia BH-BMPT'!$D$34,IF(J104=34,'[1]Equivalencia BH-BMPT'!$D$35,IF(J104=35,'[1]Equivalencia BH-BMPT'!$D$36,IF(J104=36,'[1]Equivalencia BH-BMPT'!$D$37,IF(J104=37,'[1]Equivalencia BH-BMPT'!$D$38,IF(J104=38,'[1]Equivalencia BH-BMPT'!#REF!,IF(J104=39,'[1]Equivalencia BH-BMPT'!$D$40,IF(J104=40,'[1]Equivalencia BH-BMPT'!$D$41,IF(J104=41,'[1]Equivalencia BH-BMPT'!$D$42,IF(J104=42,'[1]Equivalencia BH-BMPT'!$D$43,IF(J104=43,'[1]Equivalencia BH-BMPT'!$D$44,IF(J104=44,'[1]Equivalencia BH-BMPT'!$D$45,IF(J104=45,'[1]Equivalencia BH-BMPT'!$D$46,\"No ha seleccionado un número de programa\")))))))))))))))))))))))))))))))))))))))))))))","v":"Gobernanza e influencia local, regional e internacional"},"1395",1015437538,"WENDY LORENA RAMIREZ ESPITIA ",42197412,null,null,null,3324645,45522057,38744892,"2017-02-13","2017-02-13","2018-01-25",339,null,null,null,"X",null,null,0.8511234894328259,false]
[49,2017,"17-12-6335179",5,{"$f":"IF(D105=1,'[1]Tipo '!$B$2,IF(D105=2,'[1]Tipo '!$B$3,IF(D105=3,'[1]Tipo '!$B$4,IF(D105=4,'[1]Tipo '!$B$5,IF(D105=5,'[1]Tipo '!$B$6,IF(D105=6,'[1]Tipo '!$B$7,IF(D105=7,'[1]Tipo '!$B$8,IF(D105=8,'[1]Tipo '!$B$9,IF(D105=9,'[1]Tipo '!$B$10,IF(D105=10,'[1]Tipo '!$B$11,IF(D105=11,'[1]Tipo '!$B$12,IF(D105=12,'[1]Tipo '!$B$13,IF(D105=13,'[1]Tipo '!$B$14,IF(D105=14,'[1]Tipo '!$B$15,IF(D105=15,'[1]Tipo '!$B$16,IF(D105=16,'[1]Tipo '!$B$17,IF(D105=17,'[1]Tipo '!$B$18,IF(D105=18,'[1]Tipo '!$B$19,IF(D105=19,'[1]Tipo '!$B$20,\"No ha seleccionado un tipo de contrato válido\")))))))))))))))))))","v":"CONTRATOS DE PRESTACIÓN DE SERVICIOS PROFESIONALES Y DE APOYO A LA GESTIÓN"},"Contratación directa","Prestación de servicios profesionales y de apoyo a la gestión, o para la ejecución de trabajos artísticos que sólo puedan encomendarse a determinadas personas naturales;","PRESTAR SUS SERVICIOS PROFESIONALES PARA APOYAR AL DESPACHO DEL ALCALDE LOCAL, EN LA DEFINICION E IMPLEMENTACION DE LAS ESTRATEGIAS INTEGRALES DE COMUNICACIÓN EN LA LOCALIDAD DE LA CANDELARIA ","Inversión",45,{"$f":"IF(J105=1,'[1]Equivalencia BH-BMPT'!$D$2,IF(J105=2,'[1]Equivalencia BH-BMPT'!$D$3,IF(J105=3,'[1]Equivalencia BH-BMPT'!$D$4,IF(J105=4,'[1]Equivalencia BH-BMPT'!$D$5,IF(J105=5,'[1]Equivalencia BH-BMPT'!$D$6,IF(J105=6,'[1]Equivalencia BH-BMPT'!$D$7,IF(J105=7,'[1]Equivalencia BH-BMPT'!$D$8,IF(J105=8,'[1]Equivalencia BH-BMPT'!$D$9,IF(J105=9,'[1]Equivalencia BH-BMPT'!$D$10,IF(J105=10,'[1]Equivalencia BH-BMPT'!$D$11,IF(J105=11,'[1]Equivalencia BH-BMPT'!$D$12,IF(J105=12,'[1]Equivalencia BH-BMPT'!$D$13,IF(J105=13,'[1]Equivalencia BH-BMPT'!$D$14,IF(J105=14,'[1]Equivalencia BH-BMPT'!$D$15,IF(J105=15,'[1]Equivalencia BH-BMPT'!$D$16,IF(J105=16,'[1]Equivalencia BH-BMPT'!$D$17,IF(J105=17,'[1]Equivalencia BH-BMPT'!$D$18,IF(J105=18,'[1]Equivalencia BH-BMPT'!$D$19,IF(J105=19,'[1]Equivalencia BH-BMPT'!$D$20,IF(J105=20,'[1]Equivalencia BH-BMPT'!$D$21,IF(J105=21,'[1]Equivalencia BH-BMPT'!$D$22,IF(J105=22,'[1]Equivalencia BH-BMPT'!$D$23,IF(J105=23,'[1]Equivalencia BH-BMPT'!#REF!,IF(J105=24,'[1]Equivalencia BH-BMPT'!$D$25,IF(J105=25,'[1]Equivalencia BH-BMPT'!$D$26,IF(J105=26,'[1]Equivalencia BH-BMPT'!$D$27,IF(J105=27,'[1]Equivalencia BH-BMPT'!$D$28,IF(J105=28,'[1]Equivalencia BH-BMPT'!$D$29,IF(J105=29,'[1]Equivalencia BH-BMPT'!$D$30,IF(J105=30,'[1]Equivalencia BH-BMPT'!$D$31,IF(J105=31,'[1]Equivalencia BH-BMPT'!$D$32,IF(J105=32,'[1]Equivalencia BH-BMPT'!$D$33,IF(J105=33,'[1]Equivalencia BH-BMPT'!$D$34,IF(J105=34,'[1]Equivalencia BH-BMPT'!$D$35,IF(J105=35,'[1]Equivalencia BH-BMPT'!$D$36,IF(J105=36,'[1]Equivalencia BH-BMPT'!$D$37,IF(J105=37,'[1]Equivalencia BH-BMPT'!$D$38,IF(J105=38,'[1]Equivalencia BH-BMPT'!#REF!,IF(J105=39,'[1]Equivalencia BH-BMPT'!$D$40,IF(J105=40,'[1]Equivalencia BH-BMPT'!$D$41,IF(J105=41,'[1]Equivalencia BH-BMPT'!$D$42,IF(J105=42,'[1]Equivalencia BH-BMPT'!$D$43,IF(J105=43,'[1]Equivalencia BH-BMPT'!$D$44,IF(J105=44,'[1]Equivalencia BH-BMPT'!$D$45,IF(J105=45,'[1]Equivalencia BH-BMPT'!$D$46,\"No ha seleccionado un número de programa\")))))))))))))))))))))))))))))))))))))))))))))","v":"Gobernanza e influencia local, regional e internacional"},"1395",36306305,"PILIA ALEJANDRA SOLANO POLANIA",64240398,null,null,null,3098411,67338809,61141987,"2017-02-20","2017-02-20","2018-01-14",327,null,null,null,"X",null,null,0.90797547369749287,false]
[50,2017,"17-12-6336157",5,{"$f":"IF(D106=1,'[1]Tipo '!$B$2,IF(D106=2,'[1]Tipo '!$B$3,IF(D106=3,'[1]Tipo '!$B$4,IF(D106=4,'[1]Tipo '!$B$5,IF(D106=5,'[1]Tipo '!$B$6,IF(D106=6,'[1]Tipo '!$B$7,IF(D106=7,'[1]Tipo '!$B$8,IF(D106=8,'[1]Tipo '!$B$9,IF(D106=9,'[1]Tipo '!$B$10,IF(D106=10,'[1]Tipo '!$B$11,IF(D106=11,'[1]Tipo '!$B$12,IF(D106=12,'[1]Tipo '!$B$13,IF(D106=13,'[1]Tipo '!$B$14,IF(D106=14,'[1]Tipo '!$B$15,IF(D106=15,'[1]Tipo '!$B$16,IF(D106=16,'[1]Tipo '!$B$17,IF(D106=17,'[1]Tipo '!$B$18,IF(D106=18,'[1]Tipo '!$B$19,IF(D106=19,'[1]Tipo '!$B$20,\"No ha seleccionado un tipo de contrato válido\")))))))))))))))))))","v":"CONTRATOS DE PRESTACIÓN DE SERVICIOS PROFESIONALES Y DE APOYO A LA GESTIÓN"},"Contratación directa","Prestación de servicios profesionales y de apoyo a la gestión, o para la ejecución de trabajos artísticos que sólo puedan encomendarse a determinadas personas naturales;","PRESTAR LOS SERVICIOS DE APOYO A LA ADMINISTRACION LOCAL EN LA GESTION DE LAS CASAS COMUNITARIAS DE LA LOCLAIDAD DE LA CANDELARIA DE CONFORMIDAD CON EL ACUREDO LOCAL 006 DE 2013 ","Inversión",45,{"$f":"IF(J106=1,'[1]Equivalencia BH-BMPT'!$D$2,IF(J106=2,'[1]Equivalencia BH-BMPT'!$D$3,IF(J106=3,'[1]Equivalencia BH-BMPT'!$D$4,IF(J106=4,'[1]Equivalencia BH-BMPT'!$D$5,IF(J106=5,'[1]Equivalencia BH-BMPT'!$D$6,IF(J106=6,'[1]Equivalencia BH-BMPT'!$D$7,IF(J106=7,'[1]Equivalencia BH-BMPT'!$D$8,IF(J106=8,'[1]Equivalencia BH-BMPT'!$D$9,IF(J106=9,'[1]Equivalencia BH-BMPT'!$D$10,IF(J106=10,'[1]Equivalencia BH-BMPT'!$D$11,IF(J106=11,'[1]Equivalencia BH-BMPT'!$D$12,IF(J106=12,'[1]Equivalencia BH-BMPT'!$D$13,IF(J106=13,'[1]Equivalencia BH-BMPT'!$D$14,IF(J106=14,'[1]Equivalencia BH-BMPT'!$D$15,IF(J106=15,'[1]Equivalencia BH-BMPT'!$D$16,IF(J106=16,'[1]Equivalencia BH-BMPT'!$D$17,IF(J106=17,'[1]Equivalencia BH-BMPT'!$D$18,IF(J106=18,'[1]Equivalencia BH-BMPT'!$D$19,IF(J106=19,'[1]Equivalencia BH-BMPT'!$D$20,IF(J106=20,'[1]Equivalencia BH-BMPT'!$D$21,IF(J106=21,'[1]Equivalencia BH-BMPT'!$D$22,IF(J106=22,'[1]Equivalencia BH-BMPT'!$D$23,IF(J106=23,'[1]Equivalencia BH-BMPT'!#REF!,IF(J106=24,'[1]Equivalencia BH-BMPT'!$D$25,IF(J106=25,'[1]Equivalencia BH-BMPT'!$D$26,IF(J106=26,'[1]Equivalencia BH-BMPT'!$D$27,IF(J106=27,'[1]Equivalencia BH-BMPT'!$D$28,IF(J106=28,'[1]Equivalencia BH-BMPT'!$D$29,IF(J106=29,'[1]Equivalencia BH-BMPT'!$D$30,IF(J106=30,'[1]Equivalencia BH-BMPT'!$D$31,IF(J106=31,'[1]Equivalencia BH-BMPT'!$D$32,IF(J106=32,'[1]Equivalencia BH-BMPT'!$D$33,IF(J106=33,'[1]Equivalencia BH-BMPT'!$D$34,IF(J106=34,'[1]Equivalencia BH-BMPT'!$D$35,IF(J106=35,'[1]Equivalencia BH-BMPT'!$D$36,IF(J106=36,'[1]Equivalencia BH-BMPT'!$D$37,IF(J106=37,'[1]Equivalencia BH-BMPT'!$D$38,IF(J106=38,'[1]Equivalencia BH-BMPT'!#REF!,IF(J106=39,'[1]Equivalencia BH-BMPT'!$D$40,IF(J106=40,'[1]Equivalencia BH-BMPT'!$D$41,IF(J106=41,'[1]Equivalencia BH-BMPT'!$D$42,IF(J106=42,'[1]Equivalencia BH-BMPT'!$D$43,IF(J106=43,'[1]Equivalencia BH-BMPT'!$D$44,IF(J106=44,'[1]Equivalencia BH-BMPT'!$D$45,IF(J106=45,'[1]Equivalencia BH-BMPT'!$D$46,\"No ha seleccionado un número de programa\")))))))))))))))))))))))))))))))))))))))))))))","v":"Gobernanza e influencia local, regional e internacional"},"1395",21070860,"DORIS ELENA GUEVARA PALACIOS ",25751243,null,null,null,1254119,27005362,24497124,"2017-02-23","2017-02-23","2018-01-14",324,null,null,null,"X",null,null,0.90712074142905397,false]
[51,2017,"17-12-6336352",5,{"$f":"IF(D107=1,'[1]Tipo '!$B$2,IF(D107=2,'[1]Tipo '!$B$3,IF(D107=3,'[1]Tipo '!$B$4,IF(D107=4,'[1]Tipo '!$B$5,IF(D107=5,'[1]Tipo '!$B$6,IF(D107=6,'[1]Tipo '!$B$7,IF(D107=7,'[1]Tipo '!$B$8,IF(D107=8,'[1]Tipo '!$B$9,IF(D107=9,'[1]Tipo '!$B$10,IF(D107=10,'[1]Tipo '!$B$11,IF(D107=11,'[1]Tipo '!$B$12,IF(D107=12,'[1]Tipo '!$B$13,IF(D107=13,'[1]Tipo '!$B$14,IF(D107=14,'[1]Tipo '!$B$15,IF(D107=15,'[1]Tipo '!$B$16,IF(D107=16,'[1]Tipo '!$B$17,IF(D107=17,'[1]Tipo '!$B$18,IF(D107=18,'[1]Tipo '!$B$19,IF(D107=19,'[1]Tipo '!$B$20,\"No ha seleccionado un tipo de contrato válido\")))))))))))))))))))","v":"CONTRATOS DE PRESTACIÓN DE SERVICIOS PROFESIONALES Y DE APOYO A LA GESTIÓN"},"Contratación directa","Prestación de servicios profesionales y de apoyo a la gestión, o para la ejecución de trabajos artísticos que sólo puedan encomendarse a determinadas personas naturales;","PRESTAR LOS SERVICIOS DE APOYO ADMINISTRATIVO Y ASISTENCIAL AL AREA DE GESTION DE DESARROLLO LOCAL DE LA ALCALDIA LOCAL LA CANDELARIA  ","Inversión",45,{"$f":"IF(J107=1,'[1]Equivalencia BH-BMPT'!$D$2,IF(J107=2,'[1]Equivalencia BH-BMPT'!$D$3,IF(J107=3,'[1]Equivalencia BH-BMPT'!$D$4,IF(J107=4,'[1]Equivalencia BH-BMPT'!$D$5,IF(J107=5,'[1]Equivalencia BH-BMPT'!$D$6,IF(J107=6,'[1]Equivalencia BH-BMPT'!$D$7,IF(J107=7,'[1]Equivalencia BH-BMPT'!$D$8,IF(J107=8,'[1]Equivalencia BH-BMPT'!$D$9,IF(J107=9,'[1]Equivalencia BH-BMPT'!$D$10,IF(J107=10,'[1]Equivalencia BH-BMPT'!$D$11,IF(J107=11,'[1]Equivalencia BH-BMPT'!$D$12,IF(J107=12,'[1]Equivalencia BH-BMPT'!$D$13,IF(J107=13,'[1]Equivalencia BH-BMPT'!$D$14,IF(J107=14,'[1]Equivalencia BH-BMPT'!$D$15,IF(J107=15,'[1]Equivalencia BH-BMPT'!$D$16,IF(J107=16,'[1]Equivalencia BH-BMPT'!$D$17,IF(J107=17,'[1]Equivalencia BH-BMPT'!$D$18,IF(J107=18,'[1]Equivalencia BH-BMPT'!$D$19,IF(J107=19,'[1]Equivalencia BH-BMPT'!$D$20,IF(J107=20,'[1]Equivalencia BH-BMPT'!$D$21,IF(J107=21,'[1]Equivalencia BH-BMPT'!$D$22,IF(J107=22,'[1]Equivalencia BH-BMPT'!$D$23,IF(J107=23,'[1]Equivalencia BH-BMPT'!#REF!,IF(J107=24,'[1]Equivalencia BH-BMPT'!$D$25,IF(J107=25,'[1]Equivalencia BH-BMPT'!$D$26,IF(J107=26,'[1]Equivalencia BH-BMPT'!$D$27,IF(J107=27,'[1]Equivalencia BH-BMPT'!$D$28,IF(J107=28,'[1]Equivalencia BH-BMPT'!$D$29,IF(J107=29,'[1]Equivalencia BH-BMPT'!$D$30,IF(J107=30,'[1]Equivalencia BH-BMPT'!$D$31,IF(J107=31,'[1]Equivalencia BH-BMPT'!$D$32,IF(J107=32,'[1]Equivalencia BH-BMPT'!$D$33,IF(J107=33,'[1]Equivalencia BH-BMPT'!$D$34,IF(J107=34,'[1]Equivalencia BH-BMPT'!$D$35,IF(J107=35,'[1]Equivalencia BH-BMPT'!$D$36,IF(J107=36,'[1]Equivalencia BH-BMPT'!$D$37,IF(J107=37,'[1]Equivalencia BH-BMPT'!$D$38,IF(J107=38,'[1]Equivalencia BH-BMPT'!#REF!,IF(J107=39,'[1]Equivalencia BH-BMPT'!$D$40,IF(J107=40,'[1]Equivalencia BH-BMPT'!$D$41,IF(J107=41,'[1]Equivalencia BH-BMPT'!$D$42,IF(J107=42,'[1]Equivalencia BH-BMPT'!$D$43,IF(J107=43,'[1]Equivalencia BH-BMPT'!$D$44,IF(J107=44,'[1]Equivalencia BH-BMPT'!$D$45,IF(J107=45,'[1]Equivalencia BH-BMPT'!$D$46,\"No ha seleccionado un número de programa\")))))))))))))))))))))))))))))))))))))))))))))","v":"Gobernanza e influencia local, regional e internacional"},"1395",52305372,"Elcy Jeaneth Pulido Amórtegui",20287218,null,null,null,null,20287218,19475731,"2017-02-28","2017-02-28","2017-12-30",303,null,null,null,"X",null,null,0.96000008478244769,false]
[52,2017,"17-12-6336402",5,{"$f":"IF(D108=1,'[1]Tipo '!$B$2,IF(D108=2,'[1]Tipo '!$B$3,IF(D108=3,'[1]Tipo '!$B$4,IF(D108=4,'[1]Tipo '!$B$5,IF(D108=5,'[1]Tipo '!$B$6,IF(D108=6,'[1]Tipo '!$B$7,IF(D108=7,'[1]Tipo '!$B$8,IF(D108=8,'[1]Tipo '!$B$9,IF(D108=9,'[1]Tipo '!$B$10,IF(D108=10,'[1]Tipo '!$B$11,IF(D108=11,'[1]Tipo '!$B$12,IF(D108=12,'[1]Tipo '!$B$13,IF(D108=13,'[1]Tipo '!$B$14,IF(D108=14,'[1]Tipo '!$B$15,IF(D108=15,'[1]Tipo '!$B$16,IF(D108=16,'[1]Tipo '!$B$17,IF(D108=17,'[1]Tipo '!$B$18,IF(D108=18,'[1]Tipo '!$B$19,IF(D108=19,'[1]Tipo '!$B$20,\"No ha seleccionado un tipo de contrato válido\")))))))))))))))))))","v":"CONTRATOS DE PRESTACIÓN DE SERVICIOS PROFESIONALES Y DE APOYO A LA GESTIÓN"},"Contratación directa","Prestación de servicios profesionales y de apoyo a la gestión, o para la ejecución de trabajos artísticos que sólo puedan encomendarse a determinadas personas naturales;","PRESTAR LOS SERVICIOS DE APOYO A LA JUNTA ADMINISTRADORA LOCAL DE LA CANDELARIA DE CONFORMIDAD CON EL TRÁMITE DE LOS ASUNTOS DE SU COMPETENCIA","Inversión",45,{"$f":"IF(J108=1,'[1]Equivalencia BH-BMPT'!$D$2,IF(J108=2,'[1]Equivalencia BH-BMPT'!$D$3,IF(J108=3,'[1]Equivalencia BH-BMPT'!$D$4,IF(J108=4,'[1]Equivalencia BH-BMPT'!$D$5,IF(J108=5,'[1]Equivalencia BH-BMPT'!$D$6,IF(J108=6,'[1]Equivalencia BH-BMPT'!$D$7,IF(J108=7,'[1]Equivalencia BH-BMPT'!$D$8,IF(J108=8,'[1]Equivalencia BH-BMPT'!$D$9,IF(J108=9,'[1]Equivalencia BH-BMPT'!$D$10,IF(J108=10,'[1]Equivalencia BH-BMPT'!$D$11,IF(J108=11,'[1]Equivalencia BH-BMPT'!$D$12,IF(J108=12,'[1]Equivalencia BH-BMPT'!$D$13,IF(J108=13,'[1]Equivalencia BH-BMPT'!$D$14,IF(J108=14,'[1]Equivalencia BH-BMPT'!$D$15,IF(J108=15,'[1]Equivalencia BH-BMPT'!$D$16,IF(J108=16,'[1]Equivalencia BH-BMPT'!$D$17,IF(J108=17,'[1]Equivalencia BH-BMPT'!$D$18,IF(J108=18,'[1]Equivalencia BH-BMPT'!$D$19,IF(J108=19,'[1]Equivalencia BH-BMPT'!$D$20,IF(J108=20,'[1]Equivalencia BH-BMPT'!$D$21,IF(J108=21,'[1]Equivalencia BH-BMPT'!$D$22,IF(J108=22,'[1]Equivalencia BH-BMPT'!$D$23,IF(J108=23,'[1]Equivalencia BH-BMPT'!#REF!,IF(J108=24,'[1]Equivalencia BH-BMPT'!$D$25,IF(J108=25,'[1]Equivalencia BH-BMPT'!$D$26,IF(J108=26,'[1]Equivalencia BH-BMPT'!$D$27,IF(J108=27,'[1]Equivalencia BH-BMPT'!$D$28,IF(J108=28,'[1]Equivalencia BH-BMPT'!$D$29,IF(J108=29,'[1]Equivalencia BH-BMPT'!$D$30,IF(J108=30,'[1]Equivalencia BH-BMPT'!$D$31,IF(J108=31,'[1]Equivalencia BH-BMPT'!$D$32,IF(J108=32,'[1]Equivalencia BH-BMPT'!$D$33,IF(J108=33,'[1]Equivalencia BH-BMPT'!$D$34,IF(J108=34,'[1]Equivalencia BH-BMPT'!$D$35,IF(J108=35,'[1]Equivalencia BH-BMPT'!$D$36,IF(J108=36,'[1]Equivalencia BH-BMPT'!$D$37,IF(J108=37,'[1]Equivalencia BH-BMPT'!$D$38,IF(J108=38,'[1]Equivalencia BH-BMPT'!#REF!,IF(J108=39,'[1]Equivalencia BH-BMPT'!$D$40,IF(J108=40,'[1]Equivalencia BH-BMPT'!$D$41,IF(J108=41,'[1]Equivalencia BH-BMPT'!$D$42,IF(J108=42,'[1]Equivalencia BH-BMPT'!$D$43,IF(J108=43,'[1]Equivalencia BH-BMPT'!$D$44,IF(J108=44,'[1]Equivalencia BH-BMPT'!$D$45,IF(J108=45,'[1]Equivalencia BH-BMPT'!$D$46,\"No ha seleccionado un número de programa\")))))))))))))))))))))))))))))))))))))))))))))","v":"Gobernanza e influencia local, regional e internacional"},"1395",51879946,"Isabel Cristina Bulla Rodríguez",21393793,null,null,null,1069690,22463483,20324101,"2017-02-28","2017-02-28","2018-01-14",321,null,null,null,"X",null,null,0.90476178605072066,false]
[53,2017,"17-12-6336463",5,{"$f":"IF(D109=1,'[1]Tipo '!$B$2,IF(D109=2,'[1]Tipo '!$B$3,IF(D109=3,'[1]Tipo '!$B$4,IF(D109=4,'[1]Tipo '!$B$5,IF(D109=5,'[1]Tipo '!$B$6,IF(D109=6,'[1]Tipo '!$B$7,IF(D109=7,'[1]Tipo '!$B$8,IF(D109=8,'[1]Tipo '!$B$9,IF(D109=9,'[1]Tipo '!$B$10,IF(D109=10,'[1]Tipo '!$B$11,IF(D109=11,'[1]Tipo '!$B$12,IF(D109=12,'[1]Tipo '!$B$13,IF(D109=13,'[1]Tipo '!$B$14,IF(D109=14,'[1]Tipo '!$B$15,IF(D109=15,'[1]Tipo '!$B$16,IF(D109=16,'[1]Tipo '!$B$17,IF(D109=17,'[1]Tipo '!$B$18,IF(D109=18,'[1]Tipo '!$B$19,IF(D109=19,'[1]Tipo '!$B$20,\"No ha seleccionado un tipo de contrato válido\")))))))))))))))))))","v":"CONTRATOS DE PRESTACIÓN DE SERVICIOS PROFESIONALES Y DE APOYO A LA GESTIÓN"},"Contratación directa","Prestación de servicios profesionales y de apoyo a la gestión, o para la ejecución de trabajos artísticos que sólo puedan encomendarse a determinadas personas naturales;","PRESTAR LOS SERVICIOS TECNICOS DE APOYO A LA GESTION EN LA PRESENTACION Y SEGUIMIENTO DE LOS PROYECTOS DE MEDIO AMBIENTE Y FORTALECIMIENTO AL PLAN INSTITUCIONAL DE GESTION AMBIENTAL (PIGA) DE LA ALCALDIA LOCAL LA CANDELARIA","Inversión",39,{"$f":"IF(J109=1,'[1]Equivalencia BH-BMPT'!$D$2,IF(J109=2,'[1]Equivalencia BH-BMPT'!$D$3,IF(J109=3,'[1]Equivalencia BH-BMPT'!$D$4,IF(J109=4,'[1]Equivalencia BH-BMPT'!$D$5,IF(J109=5,'[1]Equivalencia BH-BMPT'!$D$6,IF(J109=6,'[1]Equivalencia BH-BMPT'!$D$7,IF(J109=7,'[1]Equivalencia BH-BMPT'!$D$8,IF(J109=8,'[1]Equivalencia BH-BMPT'!$D$9,IF(J109=9,'[1]Equivalencia BH-BMPT'!$D$10,IF(J109=10,'[1]Equivalencia BH-BMPT'!$D$11,IF(J109=11,'[1]Equivalencia BH-BMPT'!$D$12,IF(J109=12,'[1]Equivalencia BH-BMPT'!$D$13,IF(J109=13,'[1]Equivalencia BH-BMPT'!$D$14,IF(J109=14,'[1]Equivalencia BH-BMPT'!$D$15,IF(J109=15,'[1]Equivalencia BH-BMPT'!$D$16,IF(J109=16,'[1]Equivalencia BH-BMPT'!$D$17,IF(J109=17,'[1]Equivalencia BH-BMPT'!$D$18,IF(J109=18,'[1]Equivalencia BH-BMPT'!$D$19,IF(J109=19,'[1]Equivalencia BH-BMPT'!$D$20,IF(J109=20,'[1]Equivalencia BH-BMPT'!$D$21,IF(J109=21,'[1]Equivalencia BH-BMPT'!$D$22,IF(J109=22,'[1]Equivalencia BH-BMPT'!$D$23,IF(J109=23,'[1]Equivalencia BH-BMPT'!#REF!,IF(J109=24,'[1]Equivalencia BH-BMPT'!$D$25,IF(J109=25,'[1]Equivalencia BH-BMPT'!$D$26,IF(J109=26,'[1]Equivalencia BH-BMPT'!$D$27,IF(J109=27,'[1]Equivalencia BH-BMPT'!$D$28,IF(J109=28,'[1]Equivalencia BH-BMPT'!$D$29,IF(J109=29,'[1]Equivalencia BH-BMPT'!$D$30,IF(J109=30,'[1]Equivalencia BH-BMPT'!$D$31,IF(J109=31,'[1]Equivalencia BH-BMPT'!$D$32,IF(J109=32,'[1]Equivalencia BH-BMPT'!$D$33,IF(J109=33,'[1]Equivalencia BH-BMPT'!$D$34,IF(J109=34,'[1]Equivalencia BH-BMPT'!$D$35,IF(J109=35,'[1]Equivalencia BH-BMPT'!$D$36,IF(J109=36,'[1]Equivalencia BH-BMPT'!$D$37,IF(J109=37,'[1]Equivalencia BH-BMPT'!$D$38,IF(J109=38,'[1]Equivalencia BH-BMPT'!#REF!,IF(J109=39,'[1]Equivalencia BH-BMPT'!$D$40,IF(J109=40,'[1]Equivalencia BH-BMPT'!$D$41,IF(J109=41,'[1]Equivalencia BH-BMPT'!$D$42,IF(J109=42,'[1]Equivalencia BH-BMPT'!$D$43,IF(J109=43,'[1]Equivalencia BH-BMPT'!$D$44,IF(J109=44,'[1]Equivalencia BH-BMPT'!$D$45,IF(J109=45,'[1]Equivalencia BH-BMPT'!$D$46,\"No ha seleccionado un número de programa\")))))))))))))))))))))))))))))))))))))))))))))","v":"Ambiente sano para la equidad y disfrute del ciudadano"},"1395",1074129278,"EDWIN FERNANDO VANEGAS GALARZA",25082378,null,null,null,7524714,32607092,23828261,"2017-02-28","2017-02-28","2018-03-30",393,null,null,null,"X",null,null,0.73076927559194793,false]
[54,2017,"17-12-6336519  ",5,{"$f":"IF(D110=1,'[1]Tipo '!$B$2,IF(D110=2,'[1]Tipo '!$B$3,IF(D110=3,'[1]Tipo '!$B$4,IF(D110=4,'[1]Tipo '!$B$5,IF(D110=5,'[1]Tipo '!$B$6,IF(D110=6,'[1]Tipo '!$B$7,IF(D110=7,'[1]Tipo '!$B$8,IF(D110=8,'[1]Tipo '!$B$9,IF(D110=9,'[1]Tipo '!$B$10,IF(D110=10,'[1]Tipo '!$B$11,IF(D110=11,'[1]Tipo '!$B$12,IF(D110=12,'[1]Tipo '!$B$13,IF(D110=13,'[1]Tipo '!$B$14,IF(D110=14,'[1]Tipo '!$B$15,IF(D110=15,'[1]Tipo '!$B$16,IF(D110=16,'[1]Tipo '!$B$17,IF(D110=17,'[1]Tipo '!$B$18,IF(D110=18,'[1]Tipo '!$B$19,IF(D110=19,'[1]Tipo '!$B$20,\"No ha seleccionado un tipo de contrato válido\")))))))))))))))))))","v":"CONTRATOS DE PRESTACIÓN DE SERVICIOS PROFESIONALES Y DE APOYO A LA GESTIÓN"},"Contratación directa","Prestación de servicios profesionales y de apoyo a la gestión, o para la ejecución de trabajos artísticos que sólo puedan encomendarse a determinadas personas naturales;","PRESTAR SERVICIOS PROFESIONALES PARA APOYAR AL GRUPO DE GESTION DEL DESARROLLO LOCAL DEL FONDO DE DESARROLLO LOCAL DE LA CANDELARIA, EN LOS PROCESOS DE FORMULACION Y SEGUIMIENTO DE LOS PROGRAMAS Y PROYECTOS DEL PLAN DE DESARROLLO LOCAL CON ENFASIS EN EL BANCO DE AYUDAS TECNICAS Y APOYO A LA FORMACION DE LOS PROCESOS CULTURALES PROYECTO 1387 Y 1389 DEL PLAN DE DESARROLLO","Inversión",45,{"$f":"IF(J110=1,'[1]Equivalencia BH-BMPT'!$D$2,IF(J110=2,'[1]Equivalencia BH-BMPT'!$D$3,IF(J110=3,'[1]Equivalencia BH-BMPT'!$D$4,IF(J110=4,'[1]Equivalencia BH-BMPT'!$D$5,IF(J110=5,'[1]Equivalencia BH-BMPT'!$D$6,IF(J110=6,'[1]Equivalencia BH-BMPT'!$D$7,IF(J110=7,'[1]Equivalencia BH-BMPT'!$D$8,IF(J110=8,'[1]Equivalencia BH-BMPT'!$D$9,IF(J110=9,'[1]Equivalencia BH-BMPT'!$D$10,IF(J110=10,'[1]Equivalencia BH-BMPT'!$D$11,IF(J110=11,'[1]Equivalencia BH-BMPT'!$D$12,IF(J110=12,'[1]Equivalencia BH-BMPT'!$D$13,IF(J110=13,'[1]Equivalencia BH-BMPT'!$D$14,IF(J110=14,'[1]Equivalencia BH-BMPT'!$D$15,IF(J110=15,'[1]Equivalencia BH-BMPT'!$D$16,IF(J110=16,'[1]Equivalencia BH-BMPT'!$D$17,IF(J110=17,'[1]Equivalencia BH-BMPT'!$D$18,IF(J110=18,'[1]Equivalencia BH-BMPT'!$D$19,IF(J110=19,'[1]Equivalencia BH-BMPT'!$D$20,IF(J110=20,'[1]Equivalencia BH-BMPT'!$D$21,IF(J110=21,'[1]Equivalencia BH-BMPT'!$D$22,IF(J110=22,'[1]Equivalencia BH-BMPT'!$D$23,IF(J110=23,'[1]Equivalencia BH-BMPT'!#REF!,IF(J110=24,'[1]Equivalencia BH-BMPT'!$D$25,IF(J110=25,'[1]Equivalencia BH-BMPT'!$D$26,IF(J110=26,'[1]Equivalencia BH-BMPT'!$D$27,IF(J110=27,'[1]Equivalencia BH-BMPT'!$D$28,IF(J110=28,'[1]Equivalencia BH-BMPT'!$D$29,IF(J110=29,'[1]Equivalencia BH-BMPT'!$D$30,IF(J110=30,'[1]Equivalencia BH-BMPT'!$D$31,IF(J110=31,'[1]Equivalencia BH-BMPT'!$D$32,IF(J110=32,'[1]Equivalencia BH-BMPT'!$D$33,IF(J110=33,'[1]Equivalencia BH-BMPT'!$D$34,IF(J110=34,'[1]Equivalencia BH-BMPT'!$D$35,IF(J110=35,'[1]Equivalencia BH-BMPT'!$D$36,IF(J110=36,'[1]Equivalencia BH-BMPT'!$D$37,IF(J110=37,'[1]Equivalencia BH-BMPT'!$D$38,IF(J110=38,'[1]Equivalencia BH-BMPT'!#REF!,IF(J110=39,'[1]Equivalencia BH-BMPT'!$D$40,IF(J110=40,'[1]Equivalencia BH-BMPT'!$D$41,IF(J110=41,'[1]Equivalencia BH-BMPT'!$D$42,IF(J110=42,'[1]Equivalencia BH-BMPT'!$D$43,IF(J110=43,'[1]Equivalencia BH-BMPT'!$D$44,IF(J110=44,'[1]Equivalencia BH-BMPT'!$D$45,IF(J110=45,'[1]Equivalencia BH-BMPT'!$D$46,\"No ha seleccionado un número de programa\")))))))))))))))))))))))))))))))))))))))))))))","v":"Gobernanza e influencia local, regional e internacional"},"1395",52472048,"LISSETE MARITZA RAMIREZ JARAMILLO",50164756,null,null,null,null,50164756,44981060,"2017-03-01","2017-03-01","2017-12-30",303,null,null,null,null,"X",null,0.89666657603198552,{"$f":"IF(I110=\"Funcionamiento\",J110=0,J110=\"\")","v":false}]
[55,2017,"17-12-6337168",5,{"$f":"IF(D111=1,'[1]Tipo '!$B$2,IF(D111=2,'[1]Tipo '!$B$3,IF(D111=3,'[1]Tipo '!$B$4,IF(D111=4,'[1]Tipo '!$B$5,IF(D111=5,'[1]Tipo '!$B$6,IF(D111=6,'[1]Tipo '!$B$7,IF(D111=7,'[1]Tipo '!$B$8,IF(D111=8,'[1]Tipo '!$B$9,IF(D111=9,'[1]Tipo '!$B$10,IF(D111=10,'[1]Tipo '!$B$11,IF(D111=11,'[1]Tipo '!$B$12,IF(D111=12,'[1]Tipo '!$B$13,IF(D111=13,'[1]Tipo '!$B$14,IF(D111=14,'[1]Tipo '!$B$15,IF(D111=15,'[1]Tipo '!$B$16,IF(D111=16,'[1]Tipo '!$B$17,IF(D111=17,'[1]Tipo '!$B$18,IF(D111=18,'[1]Tipo '!$B$19,IF(D111=19,'[1]Tipo '!$B$20,\"No ha seleccionado un tipo de contrato válido\")))))))))))))))))))","v":"CONTRATOS DE PRESTACIÓN DE SERVICIOS PROFESIONALES Y DE APOYO A LA GESTIÓN"},"Contratación directa","Prestación de servicios profesionales y de apoyo a la gestión, o para la ejecución de trabajos artísticos que sólo puedan encomendarse a determinadas personas naturales;","PRESTACION DE SERVICIOS PROFESIONALES PARA APOYAR DESDE EL DESPACHO DEL ALCALDE LOCAL EN TEMAS DE INTERLOCUCIÓN Y GENERACIÓN DE ALIANZAS ESTRATEGICAS CON CIUDADANIA Y ENTIDADES PUBLICAS Y PRIVADAS, QUE CONTRIBUYAN AL LOGRO DE OBJETIVOS MISIONALES DE LA ENTIDAD","Inversión",45,{"$f":"IF(J111=1,'[1]Equivalencia BH-BMPT'!$D$2,IF(J111=2,'[1]Equivalencia BH-BMPT'!$D$3,IF(J111=3,'[1]Equivalencia BH-BMPT'!$D$4,IF(J111=4,'[1]Equivalencia BH-BMPT'!$D$5,IF(J111=5,'[1]Equivalencia BH-BMPT'!$D$6,IF(J111=6,'[1]Equivalencia BH-BMPT'!$D$7,IF(J111=7,'[1]Equivalencia BH-BMPT'!$D$8,IF(J111=8,'[1]Equivalencia BH-BMPT'!$D$9,IF(J111=9,'[1]Equivalencia BH-BMPT'!$D$10,IF(J111=10,'[1]Equivalencia BH-BMPT'!$D$11,IF(J111=11,'[1]Equivalencia BH-BMPT'!$D$12,IF(J111=12,'[1]Equivalencia BH-BMPT'!$D$13,IF(J111=13,'[1]Equivalencia BH-BMPT'!$D$14,IF(J111=14,'[1]Equivalencia BH-BMPT'!$D$15,IF(J111=15,'[1]Equivalencia BH-BMPT'!$D$16,IF(J111=16,'[1]Equivalencia BH-BMPT'!$D$17,IF(J111=17,'[1]Equivalencia BH-BMPT'!$D$18,IF(J111=18,'[1]Equivalencia BH-BMPT'!$D$19,IF(J111=19,'[1]Equivalencia BH-BMPT'!$D$20,IF(J111=20,'[1]Equivalencia BH-BMPT'!$D$21,IF(J111=21,'[1]Equivalencia BH-BMPT'!$D$22,IF(J111=22,'[1]Equivalencia BH-BMPT'!$D$23,IF(J111=23,'[1]Equivalencia BH-BMPT'!#REF!,IF(J111=24,'[1]Equivalencia BH-BMPT'!$D$25,IF(J111=25,'[1]Equivalencia BH-BMPT'!$D$26,IF(J111=26,'[1]Equivalencia BH-BMPT'!$D$27,IF(J111=27,'[1]Equivalencia BH-BMPT'!$D$28,IF(J111=28,'[1]Equivalencia BH-BMPT'!$D$29,IF(J111=29,'[1]Equivalencia BH-BMPT'!$D$30,IF(J111=30,'[1]Equivalencia BH-BMPT'!$D$31,IF(J111=31,'[1]Equivalencia BH-BMPT'!$D$32,IF(J111=32,'[1]Equivalencia BH-BMPT'!$D$33,IF(J111=33,'[1]Equivalencia BH-BMPT'!$D$34,IF(J111=34,'[1]Equivalencia BH-BMPT'!$D$35,IF(J111=35,'[1]Equivalencia BH-BMPT'!$D$36,IF(J111=36,'[1]Equivalencia BH-BMPT'!$D$37,IF(J111=37,'[1]Equivalencia BH-BMPT'!$D$38,IF(J111=38,'[1]Equivalencia BH-BMPT'!#REF!,IF(J111=39,'[1]Equivalencia BH-BMPT'!$D$40,IF(J111=40,'[1]Equivalencia BH-BMPT'!$D$41,IF(J111=41,'[1]Equivalencia BH-BMPT'!$D$42,IF(J111=42,'[1]Equivalencia BH-BMPT'!$D$43,IF(J111=43,'[1]Equivalencia BH-BMPT'!$D$44,IF(J111=44,'[1]Equivalencia BH-BMPT'!$D$45,IF(J111=45,'[1]Equivalencia BH-BMPT'!$D$46,\"No ha seleccionado un número de programa\")))))))))))))))))))))))))))))))))))))))))))))","v":"Gobernanza e influencia local, regional e internacional"},"1395",1033731738,"NATALIA ANDREA RUBIANO FORERO",18442925,null,null,null,null,18442925,18442925,"2017-03-02","2017-03-02","2017-08-03",150,null,null,null,"X",null,null,1,false]
[58,2017,"17-12-6388637",5,{"$f":"IF(D112=1,'[1]Tipo '!$B$2,IF(D112=2,'[1]Tipo '!$B$3,IF(D112=3,'[1]Tipo '!$B$4,IF(D112=4,'[1]Tipo '!$B$5,IF(D112=5,'[1]Tipo '!$B$6,IF(D112=6,'[1]Tipo '!$B$7,IF(D112=7,'[1]Tipo '!$B$8,IF(D112=8,'[1]Tipo '!$B$9,IF(D112=9,'[1]Tipo '!$B$10,IF(D112=10,'[1]Tipo '!$B$11,IF(D112=11,'[1]Tipo '!$B$12,IF(D112=12,'[1]Tipo '!$B$13,IF(D112=13,'[1]Tipo '!$B$14,IF(D112=14,'[1]Tipo '!$B$15,IF(D112=15,'[1]Tipo '!$B$16,IF(D112=16,'[1]Tipo '!$B$17,IF(D112=17,'[1]Tipo '!$B$18,IF(D112=18,'[1]Tipo '!$B$19,IF(D112=19,'[1]Tipo '!$B$20,\"No ha seleccionado un tipo de contrato válido\")))))))))))))))))))","v":"CONTRATOS DE PRESTACIÓN DE SERVICIOS PROFESIONALES Y DE APOYO A LA GESTIÓN"},"Contratación directa","Prestación de servicios profesionales y de apoyo a la gestión, o para la ejecución de trabajos artísticos que sólo puedan encomendarse a determinadas personas naturales;","PRESTAR LOS SEERVICIOS DE APOYO A LA ALCALDIA LOCAL LA CANDELARIA EN TEMAS DE GESTION DOCUMENTAL, NOTIFICACION O DEMAS NECESIDADES QUE SE REQUIERAN ","Inversión",45,{"$f":"IF(J112=1,'[1]Equivalencia BH-BMPT'!$D$2,IF(J112=2,'[1]Equivalencia BH-BMPT'!$D$3,IF(J112=3,'[1]Equivalencia BH-BMPT'!$D$4,IF(J112=4,'[1]Equivalencia BH-BMPT'!$D$5,IF(J112=5,'[1]Equivalencia BH-BMPT'!$D$6,IF(J112=6,'[1]Equivalencia BH-BMPT'!$D$7,IF(J112=7,'[1]Equivalencia BH-BMPT'!$D$8,IF(J112=8,'[1]Equivalencia BH-BMPT'!$D$9,IF(J112=9,'[1]Equivalencia BH-BMPT'!$D$10,IF(J112=10,'[1]Equivalencia BH-BMPT'!$D$11,IF(J112=11,'[1]Equivalencia BH-BMPT'!$D$12,IF(J112=12,'[1]Equivalencia BH-BMPT'!$D$13,IF(J112=13,'[1]Equivalencia BH-BMPT'!$D$14,IF(J112=14,'[1]Equivalencia BH-BMPT'!$D$15,IF(J112=15,'[1]Equivalencia BH-BMPT'!$D$16,IF(J112=16,'[1]Equivalencia BH-BMPT'!$D$17,IF(J112=17,'[1]Equivalencia BH-BMPT'!$D$18,IF(J112=18,'[1]Equivalencia BH-BMPT'!$D$19,IF(J112=19,'[1]Equivalencia BH-BMPT'!$D$20,IF(J112=20,'[1]Equivalencia BH-BMPT'!$D$21,IF(J112=21,'[1]Equivalencia BH-BMPT'!$D$22,IF(J112=22,'[1]Equivalencia BH-BMPT'!$D$23,IF(J112=23,'[1]Equivalencia BH-BMPT'!#REF!,IF(J112=24,'[1]Equivalencia BH-BMPT'!$D$25,IF(J112=25,'[1]Equivalencia BH-BMPT'!$D$26,IF(J112=26,'[1]Equivalencia BH-BMPT'!$D$27,IF(J112=27,'[1]Equivalencia BH-BMPT'!$D$28,IF(J112=28,'[1]Equivalencia BH-BMPT'!$D$29,IF(J112=29,'[1]Equivalencia BH-BMPT'!$D$30,IF(J112=30,'[1]Equivalencia BH-BMPT'!$D$31,IF(J112=31,'[1]Equivalencia BH-BMPT'!$D$32,IF(J112=32,'[1]Equivalencia BH-BMPT'!$D$33,IF(J112=33,'[1]Equivalencia BH-BMPT'!$D$34,IF(J112=34,'[1]Equivalencia BH-BMPT'!$D$35,IF(J112=35,'[1]Equivalencia BH-BMPT'!$D$36,IF(J112=36,'[1]Equivalencia BH-BMPT'!$D$37,IF(J112=37,'[1]Equivalencia BH-BMPT'!$D$38,IF(J112=38,'[1]Equivalencia BH-BMPT'!#REF!,IF(J112=39,'[1]Equivalencia BH-BMPT'!$D$40,IF(J112=40,'[1]Equivalencia BH-BMPT'!$D$41,IF(J112=41,'[1]Equivalencia BH-BMPT'!$D$42,IF(J112=42,'[1]Equivalencia BH-BMPT'!$D$43,IF(J112=43,'[1]Equivalencia BH-BMPT'!$D$44,IF(J112=44,'[1]Equivalencia BH-BMPT'!$D$45,IF(J112=45,'[1]Equivalencia BH-BMPT'!$D$46,\"No ha seleccionado un número de programa\")))))))))))))))))))))))))))))))))))))))))))))","v":"Gobernanza e influencia local, regional e internacional"},"1395",1122727530,"JESSE JOSE VILLEGAS CACRERA ",19554422,null,null,null,null,19554422,18521618,"2017-03-17","2017-03-17","2017-12-30",256,null,null,null,null,"X",null,0.94718309751114094,false]
[61,2017,"17-12-6424138",5,{"$f":"IF(D113=1,'[1]Tipo '!$B$2,IF(D113=2,'[1]Tipo '!$B$3,IF(D113=3,'[1]Tipo '!$B$4,IF(D113=4,'[1]Tipo '!$B$5,IF(D113=5,'[1]Tipo '!$B$6,IF(D113=6,'[1]Tipo '!$B$7,IF(D113=7,'[1]Tipo '!$B$8,IF(D113=8,'[1]Tipo '!$B$9,IF(D113=9,'[1]Tipo '!$B$10,IF(D113=10,'[1]Tipo '!$B$11,IF(D113=11,'[1]Tipo '!$B$12,IF(D113=12,'[1]Tipo '!$B$13,IF(D113=13,'[1]Tipo '!$B$14,IF(D113=14,'[1]Tipo '!$B$15,IF(D113=15,'[1]Tipo '!$B$16,IF(D113=16,'[1]Tipo '!$B$17,IF(D113=17,'[1]Tipo '!$B$18,IF(D113=18,'[1]Tipo '!$B$19,IF(D113=19,'[1]Tipo '!$B$20,\"No ha seleccionado un tipo de contrato válido\")))))))))))))))))))","v":"CONTRATOS DE PRESTACIÓN DE SERVICIOS PROFESIONALES Y DE APOYO A LA GESTIÓN"},"Contratación directa","Prestación de servicios profesionales y de apoyo a la gestión, o para la ejecución de trabajos artísticos que sólo puedan encomendarse a determinadas personas naturales;","PRESTAR LOS SERVICIOS DE APOYO A LA ALCALDÍA LOCAL DE LA CANDELARIA EN TEMAS DE GESTIÓN DOCUMENTAL, NOTIFICACIÓN O DEMÁS NECESIDADES QUE SE REQUIERAN","Inversión",45,{"$f":"IF(J113=1,'[1]Equivalencia BH-BMPT'!$D$2,IF(J113=2,'[1]Equivalencia BH-BMPT'!$D$3,IF(J113=3,'[1]Equivalencia BH-BMPT'!$D$4,IF(J113=4,'[1]Equivalencia BH-BMPT'!$D$5,IF(J113=5,'[1]Equivalencia BH-BMPT'!$D$6,IF(J113=6,'[1]Equivalencia BH-BMPT'!$D$7,IF(J113=7,'[1]Equivalencia BH-BMPT'!$D$8,IF(J113=8,'[1]Equivalencia BH-BMPT'!$D$9,IF(J113=9,'[1]Equivalencia BH-BMPT'!$D$10,IF(J113=10,'[1]Equivalencia BH-BMPT'!$D$11,IF(J113=11,'[1]Equivalencia BH-BMPT'!$D$12,IF(J113=12,'[1]Equivalencia BH-BMPT'!$D$13,IF(J113=13,'[1]Equivalencia BH-BMPT'!$D$14,IF(J113=14,'[1]Equivalencia BH-BMPT'!$D$15,IF(J113=15,'[1]Equivalencia BH-BMPT'!$D$16,IF(J113=16,'[1]Equivalencia BH-BMPT'!$D$17,IF(J113=17,'[1]Equivalencia BH-BMPT'!$D$18,IF(J113=18,'[1]Equivalencia BH-BMPT'!$D$19,IF(J113=19,'[1]Equivalencia BH-BMPT'!$D$20,IF(J113=20,'[1]Equivalencia BH-BMPT'!$D$21,IF(J113=21,'[1]Equivalencia BH-BMPT'!$D$22,IF(J113=22,'[1]Equivalencia BH-BMPT'!$D$23,IF(J113=23,'[1]Equivalencia BH-BMPT'!#REF!,IF(J113=24,'[1]Equivalencia BH-BMPT'!$D$25,IF(J113=25,'[1]Equivalencia BH-BMPT'!$D$26,IF(J113=26,'[1]Equivalencia BH-BMPT'!$D$27,IF(J113=27,'[1]Equivalencia BH-BMPT'!$D$28,IF(J113=28,'[1]Equivalencia BH-BMPT'!$D$29,IF(J113=29,'[1]Equivalencia BH-BMPT'!$D$30,IF(J113=30,'[1]Equivalencia BH-BMPT'!$D$31,IF(J113=31,'[1]Equivalencia BH-BMPT'!$D$32,IF(J113=32,'[1]Equivalencia BH-BMPT'!$D$33,IF(J113=33,'[1]Equivalencia BH-BMPT'!$D$34,IF(J113=34,'[1]Equivalencia BH-BMPT'!$D$35,IF(J113=35,'[1]Equivalencia BH-BMPT'!$D$36,IF(J113=36,'[1]Equivalencia BH-BMPT'!$D$37,IF(J113=37,'[1]Equivalencia BH-BMPT'!$D$38,IF(J113=38,'[1]Equivalencia BH-BMPT'!#REF!,IF(J113=39,'[1]Equivalencia BH-BMPT'!$D$40,IF(J113=40,'[1]Equivalencia BH-BMPT'!$D$41,IF(J113=41,'[1]Equivalencia BH-BMPT'!$D$42,IF(J113=42,'[1]Equivalencia BH-BMPT'!$D$43,IF(J113=43,'[1]Equivalencia BH-BMPT'!$D$44,IF(J113=44,'[1]Equivalencia BH-BMPT'!$D$45,IF(J113=45,'[1]Equivalencia BH-BMPT'!$D$46,\"No ha seleccionado un número de programa\")))))))))))))))))))))))))))))))))))))))))))))","v":"Gobernanza e influencia local, regional e internacional"},"1395",52160400,"ALBALINNE RAMIREZ RAMIREZ",8262432,null,null,null,4131216,12393648,{"$f":"P113+R113+T113","v":12393648},"2017-03-28","2017-03-28","2017-09-27",180,null,null,null,"X",null,null,1,false]
[65,2017,"17-12-6484885",5,{"$f":"IF(D114=1,'[1]Tipo '!$B$2,IF(D114=2,'[1]Tipo '!$B$3,IF(D114=3,'[1]Tipo '!$B$4,IF(D114=4,'[1]Tipo '!$B$5,IF(D114=5,'[1]Tipo '!$B$6,IF(D114=6,'[1]Tipo '!$B$7,IF(D114=7,'[1]Tipo '!$B$8,IF(D114=8,'[1]Tipo '!$B$9,IF(D114=9,'[1]Tipo '!$B$10,IF(D114=10,'[1]Tipo '!$B$11,IF(D114=11,'[1]Tipo '!$B$12,IF(D114=12,'[1]Tipo '!$B$13,IF(D114=13,'[1]Tipo '!$B$14,IF(D114=14,'[1]Tipo '!$B$15,IF(D114=15,'[1]Tipo '!$B$16,IF(D114=16,'[1]Tipo '!$B$17,IF(D114=17,'[1]Tipo '!$B$18,IF(D114=18,'[1]Tipo '!$B$19,IF(D114=19,'[1]Tipo '!$B$20,\"No ha seleccionado un tipo de contrato válido\")))))))))))))))))))","v":"CONTRATOS DE PRESTACIÓN DE SERVICIOS PROFESIONALES Y DE APOYO A LA GESTIÓN"},"Contratación directa","Prestación de servicios profesionales y de apoyo a la gestión, o para la ejecución de trabajos artísticos que sólo puedan encomendarse a determinadas personas naturales;","PRESTAR LOS SERVICIOS COMO CONDUCTOR DE APOYO DE LOS VEHÍCULOS DE PROPIEDAD DEL FONDO DE DESARROLLO LOCAL DE LA CANDELARIA","Inversión",45,{"$f":"IF(J114=1,'[1]Equivalencia BH-BMPT'!$D$2,IF(J114=2,'[1]Equivalencia BH-BMPT'!$D$3,IF(J114=3,'[1]Equivalencia BH-BMPT'!$D$4,IF(J114=4,'[1]Equivalencia BH-BMPT'!$D$5,IF(J114=5,'[1]Equivalencia BH-BMPT'!$D$6,IF(J114=6,'[1]Equivalencia BH-BMPT'!$D$7,IF(J114=7,'[1]Equivalencia BH-BMPT'!$D$8,IF(J114=8,'[1]Equivalencia BH-BMPT'!$D$9,IF(J114=9,'[1]Equivalencia BH-BMPT'!$D$10,IF(J114=10,'[1]Equivalencia BH-BMPT'!$D$11,IF(J114=11,'[1]Equivalencia BH-BMPT'!$D$12,IF(J114=12,'[1]Equivalencia BH-BMPT'!$D$13,IF(J114=13,'[1]Equivalencia BH-BMPT'!$D$14,IF(J114=14,'[1]Equivalencia BH-BMPT'!$D$15,IF(J114=15,'[1]Equivalencia BH-BMPT'!$D$16,IF(J114=16,'[1]Equivalencia BH-BMPT'!$D$17,IF(J114=17,'[1]Equivalencia BH-BMPT'!$D$18,IF(J114=18,'[1]Equivalencia BH-BMPT'!$D$19,IF(J114=19,'[1]Equivalencia BH-BMPT'!$D$20,IF(J114=20,'[1]Equivalencia BH-BMPT'!$D$21,IF(J114=21,'[1]Equivalencia BH-BMPT'!$D$22,IF(J114=22,'[1]Equivalencia BH-BMPT'!$D$23,IF(J114=23,'[1]Equivalencia BH-BMPT'!#REF!,IF(J114=24,'[1]Equivalencia BH-BMPT'!$D$25,IF(J114=25,'[1]Equivalencia BH-BMPT'!$D$26,IF(J114=26,'[1]Equivalencia BH-BMPT'!$D$27,IF(J114=27,'[1]Equivalencia BH-BMPT'!$D$28,IF(J114=28,'[1]Equivalencia BH-BMPT'!$D$29,IF(J114=29,'[1]Equivalencia BH-BMPT'!$D$30,IF(J114=30,'[1]Equivalencia BH-BMPT'!$D$31,IF(J114=31,'[1]Equivalencia BH-BMPT'!$D$32,IF(J114=32,'[1]Equivalencia BH-BMPT'!$D$33,IF(J114=33,'[1]Equivalencia BH-BMPT'!$D$34,IF(J114=34,'[1]Equivalencia BH-BMPT'!$D$35,IF(J114=35,'[1]Equivalencia BH-BMPT'!$D$36,IF(J114=36,'[1]Equivalencia BH-BMPT'!$D$37,IF(J114=37,'[1]Equivalencia BH-BMPT'!$D$38,IF(J114=38,'[1]Equivalencia BH-BMPT'!#REF!,IF(J114=39,'[1]Equivalencia BH-BMPT'!$D$40,IF(J114=40,'[1]Equivalencia BH-BMPT'!$D$41,IF(J114=41,'[1]Equivalencia BH-BMPT'!$D$42,IF(J114=42,'[1]Equivalencia BH-BMPT'!$D$43,IF(J114=43,'[1]Equivalencia BH-BMPT'!$D$44,IF(J114=44,'[1]Equivalencia BH-BMPT'!$D$45,IF(J114=45,'[1]Equivalencia BH-BMPT'!$D$46,\"No ha seleccionado un número de programa\")))))))))))))))))))))))))))))))))))))))))))))","v":"Gobernanza e influencia local, regional e internacional"},"1395",1010187694,"CHRISTIAN CAMILO ROMERO WALTEROS",17833082,null,null,null,1032804,18865886,16800278,"2017-04-12","2017-04-12","2018-01-14",274,null,null,null,"X",null,null,0.89051094658369079,false]
[66,2017,"17-12-6549639",5,{"$f":"IF(D115=1,'[1]Tipo '!$B$2,IF(D115=2,'[1]Tipo '!$B$3,IF(D115=3,'[1]Tipo '!$B$4,IF(D115=4,'[1]Tipo '!$B$5,IF(D115=5,'[1]Tipo '!$B$6,IF(D115=6,'[1]Tipo '!$B$7,IF(D115=7,'[1]Tipo '!$B$8,IF(D115=8,'[1]Tipo '!$B$9,IF(D115=9,'[1]Tipo '!$B$10,IF(D115=10,'[1]Tipo '!$B$11,IF(D115=11,'[1]Tipo '!$B$12,IF(D115=12,'[1]Tipo '!$B$13,IF(D115=13,'[1]Tipo '!$B$14,IF(D115=14,'[1]Tipo '!$B$15,IF(D115=15,'[1]Tipo '!$B$16,IF(D115=16,'[1]Tipo '!$B$17,IF(D115=17,'[1]Tipo '!$B$18,IF(D115=18,'[1]Tipo '!$B$19,IF(D115=19,'[1]Tipo '!$B$20,\"No ha seleccionado un tipo de contrato válido\")))))))))))))))))))","v":"CONTRATOS DE PRESTACIÓN DE SERVICIOS PROFESIONALES Y DE APOYO A LA GESTIÓN"},"Contratación directa","Prestación de servicios profesionales y de apoyo a la gestión, o para la ejecución de trabajos artísticos que sólo puedan encomendarse a determinadas personas naturales;","APOYO PROFESIONAL EN EL ÁREA DE GESTIÓN DE DESARROLLO LOCAL DEL LA ALCALDÍA LOCAL DE LA CANDELARIA EN TEMAS DE PRESUPUESTO","Inversión",45,{"$f":"IF(J115=1,'[1]Equivalencia BH-BMPT'!$D$2,IF(J115=2,'[1]Equivalencia BH-BMPT'!$D$3,IF(J115=3,'[1]Equivalencia BH-BMPT'!$D$4,IF(J115=4,'[1]Equivalencia BH-BMPT'!$D$5,IF(J115=5,'[1]Equivalencia BH-BMPT'!$D$6,IF(J115=6,'[1]Equivalencia BH-BMPT'!$D$7,IF(J115=7,'[1]Equivalencia BH-BMPT'!$D$8,IF(J115=8,'[1]Equivalencia BH-BMPT'!$D$9,IF(J115=9,'[1]Equivalencia BH-BMPT'!$D$10,IF(J115=10,'[1]Equivalencia BH-BMPT'!$D$11,IF(J115=11,'[1]Equivalencia BH-BMPT'!$D$12,IF(J115=12,'[1]Equivalencia BH-BMPT'!$D$13,IF(J115=13,'[1]Equivalencia BH-BMPT'!$D$14,IF(J115=14,'[1]Equivalencia BH-BMPT'!$D$15,IF(J115=15,'[1]Equivalencia BH-BMPT'!$D$16,IF(J115=16,'[1]Equivalencia BH-BMPT'!$D$17,IF(J115=17,'[1]Equivalencia BH-BMPT'!$D$18,IF(J115=18,'[1]Equivalencia BH-BMPT'!$D$19,IF(J115=19,'[1]Equivalencia BH-BMPT'!$D$20,IF(J115=20,'[1]Equivalencia BH-BMPT'!$D$21,IF(J115=21,'[1]Equivalencia BH-BMPT'!$D$22,IF(J115=22,'[1]Equivalencia BH-BMPT'!$D$23,IF(J115=23,'[1]Equivalencia BH-BMPT'!#REF!,IF(J115=24,'[1]Equivalencia BH-BMPT'!$D$25,IF(J115=25,'[1]Equivalencia BH-BMPT'!$D$26,IF(J115=26,'[1]Equivalencia BH-BMPT'!$D$27,IF(J115=27,'[1]Equivalencia BH-BMPT'!$D$28,IF(J115=28,'[1]Equivalencia BH-BMPT'!$D$29,IF(J115=29,'[1]Equivalencia BH-BMPT'!$D$30,IF(J115=30,'[1]Equivalencia BH-BMPT'!$D$31,IF(J115=31,'[1]Equivalencia BH-BMPT'!$D$32,IF(J115=32,'[1]Equivalencia BH-BMPT'!$D$33,IF(J115=33,'[1]Equivalencia BH-BMPT'!$D$34,IF(J115=34,'[1]Equivalencia BH-BMPT'!$D$35,IF(J115=35,'[1]Equivalencia BH-BMPT'!$D$36,IF(J115=36,'[1]Equivalencia BH-BMPT'!$D$37,IF(J115=37,'[1]Equivalencia BH-BMPT'!$D$38,IF(J115=38,'[1]Equivalencia BH-BMPT'!#REF!,IF(J115=39,'[1]Equivalencia BH-BMPT'!$D$40,IF(J115=40,'[1]Equivalencia BH-BMPT'!$D$41,IF(J115=41,'[1]Equivalencia BH-BMPT'!$D$42,IF(J115=42,'[1]Equivalencia BH-BMPT'!$D$43,IF(J115=43,'[1]Equivalencia BH-BMPT'!$D$44,IF(J115=44,'[1]Equivalencia BH-BMPT'!$D$45,IF(J115=45,'[1]Equivalencia BH-BMPT'!$D$46,\"No ha seleccionado un número de programa\")))))))))))))))))))))))))))))))))))))))))))))","v":"Gobernanza e influencia local, regional e internacional"},"1395",52691628,"MARGARITA MARIA LOZANO AMAYA",32324304,null,null,null,4057444,36381748,30971822,"2017-04-26","2017-04-27","2018-01-24",269,null,null,null,"X",null,null,0.85130109746238691,false]
[71,2017,"17-12-6814166",5,{"$f":"IF(D116=1,'[1]Tipo '!$B$2,IF(D116=2,'[1]Tipo '!$B$3,IF(D116=3,'[1]Tipo '!$B$4,IF(D116=4,'[1]Tipo '!$B$5,IF(D116=5,'[1]Tipo '!$B$6,IF(D116=6,'[1]Tipo '!$B$7,IF(D116=7,'[1]Tipo '!$B$8,IF(D116=8,'[1]Tipo '!$B$9,IF(D116=9,'[1]Tipo '!$B$10,IF(D116=10,'[1]Tipo '!$B$11,IF(D116=11,'[1]Tipo '!$B$12,IF(D116=12,'[1]Tipo '!$B$13,IF(D116=13,'[1]Tipo '!$B$14,IF(D116=14,'[1]Tipo '!$B$15,IF(D116=15,'[1]Tipo '!$B$16,IF(D116=16,'[1]Tipo '!$B$17,IF(D116=17,'[1]Tipo '!$B$18,IF(D116=18,'[1]Tipo '!$B$19,IF(D116=19,'[1]Tipo '!$B$20,\"No ha seleccionado un tipo de contrato válido\")))))))))))))))))))","v":"CONTRATOS DE PRESTACIÓN DE SERVICIOS PROFESIONALES Y DE APOYO A LA GESTIÓN"},"Contratación directa","Prestación de servicios profesionales y de apoyo a la gestión, o para la ejecución de trabajos artísticos que sólo puedan encomendarse a determinadas personas naturales;","PRESTAR SUS SERVICIOS PROFESIONALES EN LA IMPLEMENTACIÓN Y SEGUIMIENTO DE LA POLÍTICA PÚBLICA DE COMUNICACIÓN COMUNITARIA Y ALTERNATIVA EN LA LOCALIDAD 17 DE LA CANDELARIA","Inversión",45,{"$f":"IF(J116=1,'[1]Equivalencia BH-BMPT'!$D$2,IF(J116=2,'[1]Equivalencia BH-BMPT'!$D$3,IF(J116=3,'[1]Equivalencia BH-BMPT'!$D$4,IF(J116=4,'[1]Equivalencia BH-BMPT'!$D$5,IF(J116=5,'[1]Equivalencia BH-BMPT'!$D$6,IF(J116=6,'[1]Equivalencia BH-BMPT'!$D$7,IF(J116=7,'[1]Equivalencia BH-BMPT'!$D$8,IF(J116=8,'[1]Equivalencia BH-BMPT'!$D$9,IF(J116=9,'[1]Equivalencia BH-BMPT'!$D$10,IF(J116=10,'[1]Equivalencia BH-BMPT'!$D$11,IF(J116=11,'[1]Equivalencia BH-BMPT'!$D$12,IF(J116=12,'[1]Equivalencia BH-BMPT'!$D$13,IF(J116=13,'[1]Equivalencia BH-BMPT'!$D$14,IF(J116=14,'[1]Equivalencia BH-BMPT'!$D$15,IF(J116=15,'[1]Equivalencia BH-BMPT'!$D$16,IF(J116=16,'[1]Equivalencia BH-BMPT'!$D$17,IF(J116=17,'[1]Equivalencia BH-BMPT'!$D$18,IF(J116=18,'[1]Equivalencia BH-BMPT'!$D$19,IF(J116=19,'[1]Equivalencia BH-BMPT'!$D$20,IF(J116=20,'[1]Equivalencia BH-BMPT'!$D$21,IF(J116=21,'[1]Equivalencia BH-BMPT'!$D$22,IF(J116=22,'[1]Equivalencia BH-BMPT'!$D$23,IF(J116=23,'[1]Equivalencia BH-BMPT'!#REF!,IF(J116=24,'[1]Equivalencia BH-BMPT'!$D$25,IF(J116=25,'[1]Equivalencia BH-BMPT'!$D$26,IF(J116=26,'[1]Equivalencia BH-BMPT'!$D$27,IF(J116=27,'[1]Equivalencia BH-BMPT'!$D$28,IF(J116=28,'[1]Equivalencia BH-BMPT'!$D$29,IF(J116=29,'[1]Equivalencia BH-BMPT'!$D$30,IF(J116=30,'[1]Equivalencia BH-BMPT'!$D$31,IF(J116=31,'[1]Equivalencia BH-BMPT'!$D$32,IF(J116=32,'[1]Equivalencia BH-BMPT'!$D$33,IF(J116=33,'[1]Equivalencia BH-BMPT'!$D$34,IF(J116=34,'[1]Equivalencia BH-BMPT'!$D$35,IF(J116=35,'[1]Equivalencia BH-BMPT'!$D$36,IF(J116=36,'[1]Equivalencia BH-BMPT'!$D$37,IF(J116=37,'[1]Equivalencia BH-BMPT'!$D$38,IF(J116=38,'[1]Equivalencia BH-BMPT'!#REF!,IF(J116=39,'[1]Equivalencia BH-BMPT'!$D$40,IF(J116=40,'[1]Equivalencia BH-BMPT'!$D$41,IF(J116=41,'[1]Equivalencia BH-BMPT'!$D$42,IF(J116=42,'[1]Equivalencia BH-BMPT'!$D$43,IF(J116=43,'[1]Equivalencia BH-BMPT'!$D$44,IF(J116=44,'[1]Equivalencia BH-BMPT'!$D$45,IF(J116=45,'[1]Equivalencia BH-BMPT'!$D$46,\"No ha seleccionado un número de programa\")))))))))))))))))))))))))))))))))))))))))))))","v":"Gobernanza e influencia local, regional e internacional"},"1395",79151298,"GUSTAVO CASASBUENAS VIVAS",24750407,null,null,null,4500074,29250481,23400384,"2017-07-07","2017-07-10","2018-01-23",195,null,null,null,"X",null,null,0.79999997265002243,false]
[72,2017,"17-12-6814350",5,{"$f":"IF(D117=1,'[2]Tipo '!$B$2,IF(D117=2,'[2]Tipo '!$B$3,IF(D117=3,'[2]Tipo '!$B$4,IF(D117=4,'[2]Tipo '!$B$5,IF(D117=5,'[2]Tipo '!$B$6,IF(D117=6,'[2]Tipo '!$B$7,IF(D117=7,'[2]Tipo '!$B$8,IF(D117=8,'[2]Tipo '!$B$9,IF(D117=9,'[2]Tipo '!$B$10,IF(D117=10,'[2]Tipo '!$B$11,IF(D117=11,'[2]Tipo '!$B$12,IF(D117=12,'[2]Tipo '!$B$13,IF(D117=13,'[2]Tipo '!$B$14,IF(D117=14,'[2]Tipo '!$B$15,IF(D117=15,'[2]Tipo '!$B$16,IF(D117=16,'[2]Tipo '!$B$17,IF(D117=17,'[2]Tipo '!$B$18,IF(D117=18,'[2]Tipo '!$B$19,IF(D117=19,'[2]Tipo '!$B$20,\"No ha seleccionado un tipo de contrato válido\")))))))))))))))))))","v":"CONTRATOS DE PRESTACIÓN DE SERVICIOS PROFESIONALES Y DE APOYO A LA GESTIÓN"},"Contratación directa","Prestación de servicios profesionales y de apoyo a la gestión, o para la ejecución de trabajos artísticos que sólo puedan encomendarse a determinadas personas naturales;","PRESTAR LOS SERVICIOS DE APOYO AL ÁREA DE GESTIÓN DE DESARROLLO LOCAL DE LA ALCALDÍA LOCAL DE LA CANDELARIA EN TEMAS CULTURALES LOCALES CONTENIDOS EN EL PROYECTO 1389 “CANDELARIA CULTURAL Y DEPORTIVA MEJOR PARA TODOS","Inversión",45,{"$f":"IF(J117=1,'[2]Equivalencia BH-BMPT'!$D$2,IF(J117=2,'[2]Equivalencia BH-BMPT'!$D$3,IF(J117=3,'[2]Equivalencia BH-BMPT'!$D$4,IF(J117=4,'[2]Equivalencia BH-BMPT'!$D$5,IF(J117=5,'[2]Equivalencia BH-BMPT'!$D$6,IF(J117=6,'[2]Equivalencia BH-BMPT'!$D$7,IF(J117=7,'[2]Equivalencia BH-BMPT'!$D$8,IF(J117=8,'[2]Equivalencia BH-BMPT'!$D$9,IF(J117=9,'[2]Equivalencia BH-BMPT'!$D$10,IF(J117=10,'[2]Equivalencia BH-BMPT'!$D$11,IF(J117=11,'[2]Equivalencia BH-BMPT'!$D$12,IF(J117=12,'[2]Equivalencia BH-BMPT'!$D$13,IF(J117=13,'[2]Equivalencia BH-BMPT'!$D$14,IF(J117=14,'[2]Equivalencia BH-BMPT'!$D$15,IF(J117=15,'[2]Equivalencia BH-BMPT'!$D$16,IF(J117=16,'[2]Equivalencia BH-BMPT'!$D$17,IF(J117=17,'[2]Equivalencia BH-BMPT'!$D$18,IF(J117=18,'[2]Equivalencia BH-BMPT'!$D$19,IF(J117=19,'[2]Equivalencia BH-BMPT'!$D$20,IF(J117=20,'[2]Equivalencia BH-BMPT'!$D$21,IF(J117=21,'[2]Equivalencia BH-BMPT'!$D$22,IF(J117=22,'[2]Equivalencia BH-BMPT'!$D$23,IF(J117=23,'[2]Equivalencia BH-BMPT'!#REF!,IF(J117=24,'[2]Equivalencia BH-BMPT'!$D$25,IF(J117=25,'[2]Equivalencia BH-BMPT'!$D$26,IF(J117=26,'[2]Equivalencia BH-BMPT'!$D$27,IF(J117=27,'[2]Equivalencia BH-BMPT'!$D$28,IF(J117=28,'[2]Equivalencia BH-BMPT'!$D$29,IF(J117=29,'[2]Equivalencia BH-BMPT'!$D$30,IF(J117=30,'[2]Equivalencia BH-BMPT'!$D$31,IF(J117=31,'[2]Equivalencia BH-BMPT'!$D$32,IF(J117=32,'[2]Equivalencia BH-BMPT'!$D$33,IF(J117=33,'[2]Equivalencia BH-BMPT'!$D$34,IF(J117=34,'[2]Equivalencia BH-BMPT'!$D$35,IF(J117=35,'[2]Equivalencia BH-BMPT'!$D$36,IF(J117=36,'[2]Equivalencia BH-BMPT'!$D$37,IF(J117=37,'[2]Equivalencia BH-BMPT'!$D$38,IF(J117=38,'[2]Equivalencia BH-BMPT'!#REF!,IF(J117=39,'[2]Equivalencia BH-BMPT'!$D$40,IF(J117=40,'[2]Equivalencia BH-BMPT'!$D$41,IF(J117=41,'[2]Equivalencia BH-BMPT'!$D$42,IF(J117=42,'[2]Equivalencia BH-BMPT'!$D$43,IF(J117=43,'[2]Equivalencia BH-BMPT'!$D$44,IF(J117=44,'[2]Equivalencia BH-BMPT'!$D$45,IF(J117=45,'[2]Equivalencia BH-BMPT'!$D$46,\"No ha seleccionado un número de programa\")))))))))))))))))))))))))))))))))))))))))))))","v":"Gobernanza e influencia local, regional e internacional"},"1395",52880234,"JUDITH PALACIOS MENA",11766585,null,null,null,4278758,16045343,11124770,"2017-07-10","2017-07-10","2018-02-22",225,null,null,null,"X",null,null,0.69333326186919153,false]
[73,2017,"17-12-6814426",5,{"$f":"IF(D118=1,'[2]Tipo '!$B$2,IF(D118=2,'[2]Tipo '!$B$3,IF(D118=3,'[2]Tipo '!$B$4,IF(D118=4,'[2]Tipo '!$B$5,IF(D118=5,'[2]Tipo '!$B$6,IF(D118=6,'[2]Tipo '!$B$7,IF(D118=7,'[2]Tipo '!$B$8,IF(D118=8,'[2]Tipo '!$B$9,IF(D118=9,'[2]Tipo '!$B$10,IF(D118=10,'[2]Tipo '!$B$11,IF(D118=11,'[2]Tipo '!$B$12,IF(D118=12,'[2]Tipo '!$B$13,IF(D118=13,'[2]Tipo '!$B$14,IF(D118=14,'[2]Tipo '!$B$15,IF(D118=15,'[2]Tipo '!$B$16,IF(D118=16,'[2]Tipo '!$B$17,IF(D118=17,'[2]Tipo '!$B$18,IF(D118=18,'[2]Tipo '!$B$19,IF(D118=19,'[2]Tipo '!$B$20,\"No ha seleccionado un tipo de contrato válido\")))))))))))))))))))","v":"CONTRATOS DE PRESTACIÓN DE SERVICIOS PROFESIONALES Y DE APOYO A LA GESTIÓN"},"Contratación directa","Prestación de servicios profesionales y de apoyo a la gestión, o para la ejecución de trabajos artísticos que sólo puedan encomendarse a determinadas personas naturales;","PRESTAR LOS SERVICIOS DE APOYO LOGÍSTICO EN TODOS LOS EVENTOS Y ACTIVIDADES DE LA ADMINISTRACIÓN LOCAL DE LA LOCALIDAD 17 DE LA CANDELARIA","Inversión",45,{"$f":"IF(J118=1,'[2]Equivalencia BH-BMPT'!$D$2,IF(J118=2,'[2]Equivalencia BH-BMPT'!$D$3,IF(J118=3,'[2]Equivalencia BH-BMPT'!$D$4,IF(J118=4,'[2]Equivalencia BH-BMPT'!$D$5,IF(J118=5,'[2]Equivalencia BH-BMPT'!$D$6,IF(J118=6,'[2]Equivalencia BH-BMPT'!$D$7,IF(J118=7,'[2]Equivalencia BH-BMPT'!$D$8,IF(J118=8,'[2]Equivalencia BH-BMPT'!$D$9,IF(J118=9,'[2]Equivalencia BH-BMPT'!$D$10,IF(J118=10,'[2]Equivalencia BH-BMPT'!$D$11,IF(J118=11,'[2]Equivalencia BH-BMPT'!$D$12,IF(J118=12,'[2]Equivalencia BH-BMPT'!$D$13,IF(J118=13,'[2]Equivalencia BH-BMPT'!$D$14,IF(J118=14,'[2]Equivalencia BH-BMPT'!$D$15,IF(J118=15,'[2]Equivalencia BH-BMPT'!$D$16,IF(J118=16,'[2]Equivalencia BH-BMPT'!$D$17,IF(J118=17,'[2]Equivalencia BH-BMPT'!$D$18,IF(J118=18,'[2]Equivalencia BH-BMPT'!$D$19,IF(J118=19,'[2]Equivalencia BH-BMPT'!$D$20,IF(J118=20,'[2]Equivalencia BH-BMPT'!$D$21,IF(J118=21,'[2]Equivalencia BH-BMPT'!$D$22,IF(J118=22,'[2]Equivalencia BH-BMPT'!$D$23,IF(J118=23,'[2]Equivalencia BH-BMPT'!#REF!,IF(J118=24,'[2]Equivalencia BH-BMPT'!$D$25,IF(J118=25,'[2]Equivalencia BH-BMPT'!$D$26,IF(J118=26,'[2]Equivalencia BH-BMPT'!$D$27,IF(J118=27,'[2]Equivalencia BH-BMPT'!$D$28,IF(J118=28,'[2]Equivalencia BH-BMPT'!$D$29,IF(J118=29,'[2]Equivalencia BH-BMPT'!$D$30,IF(J118=30,'[2]Equivalencia BH-BMPT'!$D$31,IF(J118=31,'[2]Equivalencia BH-BMPT'!$D$32,IF(J118=32,'[2]Equivalencia BH-BMPT'!$D$33,IF(J118=33,'[2]Equivalencia BH-BMPT'!$D$34,IF(J118=34,'[2]Equivalencia BH-BMPT'!$D$35,IF(J118=35,'[2]Equivalencia BH-BMPT'!$D$36,IF(J118=36,'[2]Equivalencia BH-BMPT'!$D$37,IF(J118=37,'[2]Equivalencia BH-BMPT'!$D$38,IF(J118=38,'[2]Equivalencia BH-BMPT'!#REF!,IF(J118=39,'[2]Equivalencia BH-BMPT'!$D$40,IF(J118=40,'[2]Equivalencia BH-BMPT'!$D$41,IF(J118=41,'[2]Equivalencia BH-BMPT'!$D$42,IF(J118=42,'[2]Equivalencia BH-BMPT'!$D$43,IF(J118=43,'[2]Equivalencia BH-BMPT'!$D$44,IF(J118=44,'[2]Equivalencia BH-BMPT'!$D$45,IF(J118=45,'[2]Equivalencia BH-BMPT'!$D$46,\"No ha seleccionado un número de programa\")))))))))))))))))))))))))))))))))))))))))))))","v":"Gobernanza e influencia local, regional e internacional"},"1395",1023018345,"JEFRY SMITH OTTAVO MARIN",11076819,null,null,null,4027934,15104753,10405496,"2017-07-10","2017-07-11","2018-02-23",224,null,null,null,"X",null,null,0.68888885505112196,false]
[74,2017,"17-12-6814512",5,{"$f":"IF(D119=1,'[2]Tipo '!$B$2,IF(D119=2,'[2]Tipo '!$B$3,IF(D119=3,'[2]Tipo '!$B$4,IF(D119=4,'[2]Tipo '!$B$5,IF(D119=5,'[2]Tipo '!$B$6,IF(D119=6,'[2]Tipo '!$B$7,IF(D119=7,'[2]Tipo '!$B$8,IF(D119=8,'[2]Tipo '!$B$9,IF(D119=9,'[2]Tipo '!$B$10,IF(D119=10,'[2]Tipo '!$B$11,IF(D119=11,'[2]Tipo '!$B$12,IF(D119=12,'[2]Tipo '!$B$13,IF(D119=13,'[2]Tipo '!$B$14,IF(D119=14,'[2]Tipo '!$B$15,IF(D119=15,'[2]Tipo '!$B$16,IF(D119=16,'[2]Tipo '!$B$17,IF(D119=17,'[2]Tipo '!$B$18,IF(D119=18,'[2]Tipo '!$B$19,IF(D119=19,'[2]Tipo '!$B$20,\"No ha seleccionado un tipo de contrato válido\")))))))))))))))))))","v":"CONTRATOS DE PRESTACIÓN DE SERVICIOS PROFESIONALES Y DE APOYO A LA GESTIÓN"},"Contratación directa","Prestación de servicios profesionales y de apoyo a la gestión, o para la ejecución de trabajos artísticos que sólo puedan encomendarse a determinadas personas naturales;","PRESTAR SUS SERVICIOS PROFESIONALES PARA APOYAR AL ÁREA DE GESTIÓN DE DESARROLLO LOCAL, EN TEMAS DE FORMULACIÓN Y SEGUIMIENTO DE LOS PROGRAMAS Y PROYECTOS DEL PLAN DE DESARROLLO LOCAL, ASÍ COMO DE LOS PROCESOS DE OBLIGACIONES POR PAGAR DEL FDLC","Inversión",45,{"$f":"IF(J119=1,'[2]Equivalencia BH-BMPT'!$D$2,IF(J119=2,'[2]Equivalencia BH-BMPT'!$D$3,IF(J119=3,'[2]Equivalencia BH-BMPT'!$D$4,IF(J119=4,'[2]Equivalencia BH-BMPT'!$D$5,IF(J119=5,'[2]Equivalencia BH-BMPT'!$D$6,IF(J119=6,'[2]Equivalencia BH-BMPT'!$D$7,IF(J119=7,'[2]Equivalencia BH-BMPT'!$D$8,IF(J119=8,'[2]Equivalencia BH-BMPT'!$D$9,IF(J119=9,'[2]Equivalencia BH-BMPT'!$D$10,IF(J119=10,'[2]Equivalencia BH-BMPT'!$D$11,IF(J119=11,'[2]Equivalencia BH-BMPT'!$D$12,IF(J119=12,'[2]Equivalencia BH-BMPT'!$D$13,IF(J119=13,'[2]Equivalencia BH-BMPT'!$D$14,IF(J119=14,'[2]Equivalencia BH-BMPT'!$D$15,IF(J119=15,'[2]Equivalencia BH-BMPT'!$D$16,IF(J119=16,'[2]Equivalencia BH-BMPT'!$D$17,IF(J119=17,'[2]Equivalencia BH-BMPT'!$D$18,IF(J119=18,'[2]Equivalencia BH-BMPT'!$D$19,IF(J119=19,'[2]Equivalencia BH-BMPT'!$D$20,IF(J119=20,'[2]Equivalencia BH-BMPT'!$D$21,IF(J119=21,'[2]Equivalencia BH-BMPT'!$D$22,IF(J119=22,'[2]Equivalencia BH-BMPT'!$D$23,IF(J119=23,'[2]Equivalencia BH-BMPT'!#REF!,IF(J119=24,'[2]Equivalencia BH-BMPT'!$D$25,IF(J119=25,'[2]Equivalencia BH-BMPT'!$D$26,IF(J119=26,'[2]Equivalencia BH-BMPT'!$D$27,IF(J119=27,'[2]Equivalencia BH-BMPT'!$D$28,IF(J119=28,'[2]Equivalencia BH-BMPT'!$D$29,IF(J119=29,'[2]Equivalencia BH-BMPT'!$D$30,IF(J119=30,'[2]Equivalencia BH-BMPT'!$D$31,IF(J119=31,'[2]Equivalencia BH-BMPT'!$D$32,IF(J119=32,'[2]Equivalencia BH-BMPT'!$D$33,IF(J119=33,'[2]Equivalencia BH-BMPT'!$D$34,IF(J119=34,'[2]Equivalencia BH-BMPT'!$D$35,IF(J119=35,'[2]Equivalencia BH-BMPT'!$D$36,IF(J119=36,'[2]Equivalencia BH-BMPT'!$D$37,IF(J119=37,'[2]Equivalencia BH-BMPT'!$D$38,IF(J119=38,'[2]Equivalencia BH-BMPT'!#REF!,IF(J119=39,'[2]Equivalencia BH-BMPT'!$D$40,IF(J119=40,'[2]Equivalencia BH-BMPT'!$D$41,IF(J119=41,'[2]Equivalencia BH-BMPT'!$D$42,IF(J119=42,'[2]Equivalencia BH-BMPT'!$D$43,IF(J119=43,'[2]Equivalencia BH-BMPT'!$D$44,IF(J119=44,'[2]Equivalencia BH-BMPT'!$D$45,IF(J119=45,'[2]Equivalencia BH-BMPT'!$D$46,\"No ha seleccionado un número de programa\")))))))))))))))))))))))))))))))))))))))))))))","v":"Gobernanza e influencia local, regional e internacional"},"1395",1018431069,"LAURA ESTEFANIA RESTREPO GONZALEZ",22315942,null,null,null,2028722,24344664,20692964,"2017-07-11","2017-07-13","2018-01-11",177,null,null,null,null,"X",null,0.84999998356929474,false]
[75,2017,"17-12-6814556",5,{"$f":"IF(D120=1,'[2]Tipo '!$B$2,IF(D120=2,'[2]Tipo '!$B$3,IF(D120=3,'[2]Tipo '!$B$4,IF(D120=4,'[2]Tipo '!$B$5,IF(D120=5,'[2]Tipo '!$B$6,IF(D120=6,'[2]Tipo '!$B$7,IF(D120=7,'[2]Tipo '!$B$8,IF(D120=8,'[2]Tipo '!$B$9,IF(D120=9,'[2]Tipo '!$B$10,IF(D120=10,'[2]Tipo '!$B$11,IF(D120=11,'[2]Tipo '!$B$12,IF(D120=12,'[2]Tipo '!$B$13,IF(D120=13,'[2]Tipo '!$B$14,IF(D120=14,'[2]Tipo '!$B$15,IF(D120=15,'[2]Tipo '!$B$16,IF(D120=16,'[2]Tipo '!$B$17,IF(D120=17,'[2]Tipo '!$B$18,IF(D120=18,'[2]Tipo '!$B$19,IF(D120=19,'[2]Tipo '!$B$20,\"No ha seleccionado un tipo de contrato válido\")))))))))))))))))))","v":"CONTRATOS DE PRESTACIÓN DE SERVICIOS PROFESIONALES Y DE APOYO A LA GESTIÓN"},"Contratación directa","Prestación de servicios profesionales y de apoyo a la gestión, o para la ejecución de trabajos artísticos que sólo puedan encomendarse a determinadas personas naturales;","PRESTAR LOS SERVICIOS PROFESIONALES, PARA FORTALECER LA GESTIÓN ADMINISTRATIVA EN TEMAS DE PROPIEDAD HORIZONTAL EN LA LOCALIDAD DE LA CANDELARIA","Inversión",45,{"$f":"IF(J120=1,'[2]Equivalencia BH-BMPT'!$D$2,IF(J120=2,'[2]Equivalencia BH-BMPT'!$D$3,IF(J120=3,'[2]Equivalencia BH-BMPT'!$D$4,IF(J120=4,'[2]Equivalencia BH-BMPT'!$D$5,IF(J120=5,'[2]Equivalencia BH-BMPT'!$D$6,IF(J120=6,'[2]Equivalencia BH-BMPT'!$D$7,IF(J120=7,'[2]Equivalencia BH-BMPT'!$D$8,IF(J120=8,'[2]Equivalencia BH-BMPT'!$D$9,IF(J120=9,'[2]Equivalencia BH-BMPT'!$D$10,IF(J120=10,'[2]Equivalencia BH-BMPT'!$D$11,IF(J120=11,'[2]Equivalencia BH-BMPT'!$D$12,IF(J120=12,'[2]Equivalencia BH-BMPT'!$D$13,IF(J120=13,'[2]Equivalencia BH-BMPT'!$D$14,IF(J120=14,'[2]Equivalencia BH-BMPT'!$D$15,IF(J120=15,'[2]Equivalencia BH-BMPT'!$D$16,IF(J120=16,'[2]Equivalencia BH-BMPT'!$D$17,IF(J120=17,'[2]Equivalencia BH-BMPT'!$D$18,IF(J120=18,'[2]Equivalencia BH-BMPT'!$D$19,IF(J120=19,'[2]Equivalencia BH-BMPT'!$D$20,IF(J120=20,'[2]Equivalencia BH-BMPT'!$D$21,IF(J120=21,'[2]Equivalencia BH-BMPT'!$D$22,IF(J120=22,'[2]Equivalencia BH-BMPT'!$D$23,IF(J120=23,'[2]Equivalencia BH-BMPT'!#REF!,IF(J120=24,'[2]Equivalencia BH-BMPT'!$D$25,IF(J120=25,'[2]Equivalencia BH-BMPT'!$D$26,IF(J120=26,'[2]Equivalencia BH-BMPT'!$D$27,IF(J120=27,'[2]Equivalencia BH-BMPT'!$D$28,IF(J120=28,'[2]Equivalencia BH-BMPT'!$D$29,IF(J120=29,'[2]Equivalencia BH-BMPT'!$D$30,IF(J120=30,'[2]Equivalencia BH-BMPT'!$D$31,IF(J120=31,'[2]Equivalencia BH-BMPT'!$D$32,IF(J120=32,'[2]Equivalencia BH-BMPT'!$D$33,IF(J120=33,'[2]Equivalencia BH-BMPT'!$D$34,IF(J120=34,'[2]Equivalencia BH-BMPT'!$D$35,IF(J120=35,'[2]Equivalencia BH-BMPT'!$D$36,IF(J120=36,'[2]Equivalencia BH-BMPT'!$D$37,IF(J120=37,'[2]Equivalencia BH-BMPT'!$D$38,IF(J120=38,'[2]Equivalencia BH-BMPT'!#REF!,IF(J120=39,'[2]Equivalencia BH-BMPT'!$D$40,IF(J120=40,'[2]Equivalencia BH-BMPT'!$D$41,IF(J120=41,'[2]Equivalencia BH-BMPT'!$D$42,IF(J120=42,'[2]Equivalencia BH-BMPT'!$D$43,IF(J120=43,'[2]Equivalencia BH-BMPT'!$D$44,IF(J120=44,'[2]Equivalencia BH-BMPT'!$D$45,IF(J120=45,'[2]Equivalencia BH-BMPT'!$D$46,\"No ha seleccionado un número de programa\")))))))))))))))))))))))))))))))))))))))))))))","v":"Gobernanza e influencia local, regional e internacional"},"1395",80761043,"CARLOS ANDRES MERIZALDE RUSINQUE",22315942,null,null,null,2569715,24885657,20828212,"2017-07-12","2017-07-12","2018-01-14",178,null,null,null,"X",null,null,0.83695648461280325,false]
[76,2017,"17-12-6814590",5,{"$f":"IF(D121=1,'[2]Tipo '!$B$2,IF(D121=2,'[2]Tipo '!$B$3,IF(D121=3,'[2]Tipo '!$B$4,IF(D121=4,'[2]Tipo '!$B$5,IF(D121=5,'[2]Tipo '!$B$6,IF(D121=6,'[2]Tipo '!$B$7,IF(D121=7,'[2]Tipo '!$B$8,IF(D121=8,'[2]Tipo '!$B$9,IF(D121=9,'[2]Tipo '!$B$10,IF(D121=10,'[2]Tipo '!$B$11,IF(D121=11,'[2]Tipo '!$B$12,IF(D121=12,'[2]Tipo '!$B$13,IF(D121=13,'[2]Tipo '!$B$14,IF(D121=14,'[2]Tipo '!$B$15,IF(D121=15,'[2]Tipo '!$B$16,IF(D121=16,'[2]Tipo '!$B$17,IF(D121=17,'[2]Tipo '!$B$18,IF(D121=18,'[2]Tipo '!$B$19,IF(D121=19,'[2]Tipo '!$B$20,\"No ha seleccionado un tipo de contrato válido\")))))))))))))))))))","v":"CONTRATOS DE PRESTACIÓN DE SERVICIOS PROFESIONALES Y DE APOYO A LA GESTIÓN"},"Contratación directa","Prestación de servicios profesionales y de apoyo a la gestión, o para la ejecución de trabajos artísticos que sólo puedan encomendarse a determinadas personas naturales;","PRESTAR SERVICIOS DE APOYO PARA LA ADMINISTRACIÓN DE LA LAVANDERÍA DE LA CASA COMUNITARIA DE EGIPTO DE LA LOCALIDAD DE LA CANDELARIA","Inversión",45,{"$f":"IF(J121=1,'[2]Equivalencia BH-BMPT'!$D$2,IF(J121=2,'[2]Equivalencia BH-BMPT'!$D$3,IF(J121=3,'[2]Equivalencia BH-BMPT'!$D$4,IF(J121=4,'[2]Equivalencia BH-BMPT'!$D$5,IF(J121=5,'[2]Equivalencia BH-BMPT'!$D$6,IF(J121=6,'[2]Equivalencia BH-BMPT'!$D$7,IF(J121=7,'[2]Equivalencia BH-BMPT'!$D$8,IF(J121=8,'[2]Equivalencia BH-BMPT'!$D$9,IF(J121=9,'[2]Equivalencia BH-BMPT'!$D$10,IF(J121=10,'[2]Equivalencia BH-BMPT'!$D$11,IF(J121=11,'[2]Equivalencia BH-BMPT'!$D$12,IF(J121=12,'[2]Equivalencia BH-BMPT'!$D$13,IF(J121=13,'[2]Equivalencia BH-BMPT'!$D$14,IF(J121=14,'[2]Equivalencia BH-BMPT'!$D$15,IF(J121=15,'[2]Equivalencia BH-BMPT'!$D$16,IF(J121=16,'[2]Equivalencia BH-BMPT'!$D$17,IF(J121=17,'[2]Equivalencia BH-BMPT'!$D$18,IF(J121=18,'[2]Equivalencia BH-BMPT'!$D$19,IF(J121=19,'[2]Equivalencia BH-BMPT'!$D$20,IF(J121=20,'[2]Equivalencia BH-BMPT'!$D$21,IF(J121=21,'[2]Equivalencia BH-BMPT'!$D$22,IF(J121=22,'[2]Equivalencia BH-BMPT'!$D$23,IF(J121=23,'[2]Equivalencia BH-BMPT'!#REF!,IF(J121=24,'[2]Equivalencia BH-BMPT'!$D$25,IF(J121=25,'[2]Equivalencia BH-BMPT'!$D$26,IF(J121=26,'[2]Equivalencia BH-BMPT'!$D$27,IF(J121=27,'[2]Equivalencia BH-BMPT'!$D$28,IF(J121=28,'[2]Equivalencia BH-BMPT'!$D$29,IF(J121=29,'[2]Equivalencia BH-BMPT'!$D$30,IF(J121=30,'[2]Equivalencia BH-BMPT'!$D$31,IF(J121=31,'[2]Equivalencia BH-BMPT'!$D$32,IF(J121=32,'[2]Equivalencia BH-BMPT'!$D$33,IF(J121=33,'[2]Equivalencia BH-BMPT'!$D$34,IF(J121=34,'[2]Equivalencia BH-BMPT'!$D$35,IF(J121=35,'[2]Equivalencia BH-BMPT'!$D$36,IF(J121=36,'[2]Equivalencia BH-BMPT'!$D$37,IF(J121=37,'[2]Equivalencia BH-BMPT'!$D$38,IF(J121=38,'[2]Equivalencia BH-BMPT'!#REF!,IF(J121=39,'[2]Equivalencia BH-BMPT'!$D$40,IF(J121=40,'[2]Equivalencia BH-BMPT'!$D$41,IF(J121=41,'[2]Equivalencia BH-BMPT'!$D$42,IF(J121=42,'[2]Equivalencia BH-BMPT'!$D$43,IF(J121=43,'[2]Equivalencia BH-BMPT'!$D$44,IF(J121=44,'[2]Equivalencia BH-BMPT'!$D$45,IF(J121=45,'[2]Equivalencia BH-BMPT'!$D$46,\"No ha seleccionado un número de programa\")))))))))))))))))))))))))))))))))))))))))))))","v":"Gobernanza e influencia local, regional e internacional"},"1395",41621560,"NELLY PARRA TOCORA",11360844,null,null,null,4131216,15492060,10603454,"2017-07-12","2017-07-12","2018-02-24",223,null,null,null,"X",null,null,0.68444441862476646,false]
[77,2017,"17-12-6814628",5,{"$f":"IF(D122=1,'[2]Tipo '!$B$2,IF(D122=2,'[2]Tipo '!$B$3,IF(D122=3,'[2]Tipo '!$B$4,IF(D122=4,'[2]Tipo '!$B$5,IF(D122=5,'[2]Tipo '!$B$6,IF(D122=6,'[2]Tipo '!$B$7,IF(D122=7,'[2]Tipo '!$B$8,IF(D122=8,'[2]Tipo '!$B$9,IF(D122=9,'[2]Tipo '!$B$10,IF(D122=10,'[2]Tipo '!$B$11,IF(D122=11,'[2]Tipo '!$B$12,IF(D122=12,'[2]Tipo '!$B$13,IF(D122=13,'[2]Tipo '!$B$14,IF(D122=14,'[2]Tipo '!$B$15,IF(D122=15,'[2]Tipo '!$B$16,IF(D122=16,'[2]Tipo '!$B$17,IF(D122=17,'[2]Tipo '!$B$18,IF(D122=18,'[2]Tipo '!$B$19,IF(D122=19,'[2]Tipo '!$B$20,\"No ha seleccionado un tipo de contrato válido\")))))))))))))))))))","v":"CONTRATOS DE PRESTACIÓN DE SERVICIOS PROFESIONALES Y DE APOYO A LA GESTIÓN"},"Contratación directa","Prestación de servicios profesionales y de apoyo a la gestión, o para la ejecución de trabajos artísticos que sólo puedan encomendarse a determinadas personas naturales;","PRESTAR LOS SERVICIOS DE APOYO A LA GESTIÓN EN LA JUNTA ADMINISTRADORA LOCAL DE LA CANDELARIA, EN TEMAS DE GESTIÓN DOCUMENTAL, NOTIFICACIÓN O DEMÁS NECESIDADES ADMINISTRATIVAS QUE SE REQUIERAN, DE CONFORMIDAD CON EL TRÁMITE DE LOS ASUNTOS DE SU COMPETENCIA","Inversión",45,{"$f":"IF(J122=1,'[2]Equivalencia BH-BMPT'!$D$2,IF(J122=2,'[2]Equivalencia BH-BMPT'!$D$3,IF(J122=3,'[2]Equivalencia BH-BMPT'!$D$4,IF(J122=4,'[2]Equivalencia BH-BMPT'!$D$5,IF(J122=5,'[2]Equivalencia BH-BMPT'!$D$6,IF(J122=6,'[2]Equivalencia BH-BMPT'!$D$7,IF(J122=7,'[2]Equivalencia BH-BMPT'!$D$8,IF(J122=8,'[2]Equivalencia BH-BMPT'!$D$9,IF(J122=9,'[2]Equivalencia BH-BMPT'!$D$10,IF(J122=10,'[2]Equivalencia BH-BMPT'!$D$11,IF(J122=11,'[2]Equivalencia BH-BMPT'!$D$12,IF(J122=12,'[2]Equivalencia BH-BMPT'!$D$13,IF(J122=13,'[2]Equivalencia BH-BMPT'!$D$14,IF(J122=14,'[2]Equivalencia BH-BMPT'!$D$15,IF(J122=15,'[2]Equivalencia BH-BMPT'!$D$16,IF(J122=16,'[2]Equivalencia BH-BMPT'!$D$17,IF(J122=17,'[2]Equivalencia BH-BMPT'!$D$18,IF(J122=18,'[2]Equivalencia BH-BMPT'!$D$19,IF(J122=19,'[2]Equivalencia BH-BMPT'!$D$20,IF(J122=20,'[2]Equivalencia BH-BMPT'!$D$21,IF(J122=21,'[2]Equivalencia BH-BMPT'!$D$22,IF(J122=22,'[2]Equivalencia BH-BMPT'!$D$23,IF(J122=23,'[2]Equivalencia BH-BMPT'!#REF!,IF(J122=24,'[2]Equivalencia BH-BMPT'!$D$25,IF(J122=25,'[2]Equivalencia BH-BMPT'!$D$26,IF(J122=26,'[2]Equivalencia BH-BMPT'!$D$27,IF(J122=27,'[2]Equivalencia BH-BMPT'!$D$28,IF(J122=28,'[2]Equivalencia BH-BMPT'!$D$29,IF(J122=29,'[2]Equivalencia BH-BMPT'!$D$30,IF(J122=30,'[2]Equivalencia BH-BMPT'!$D$31,IF(J122=31,'[2]Equivalencia BH-BMPT'!$D$32,IF(J122=32,'[2]Equivalencia BH-BMPT'!$D$33,IF(J122=33,'[2]Equivalencia BH-BMPT'!$D$34,IF(J122=34,'[2]Equivalencia BH-BMPT'!$D$35,IF(J122=35,'[2]Equivalencia BH-BMPT'!$D$36,IF(J122=36,'[2]Equivalencia BH-BMPT'!$D$37,IF(J122=37,I122 BH-[5]K89!$D$38,IF(J122=38,'[2]Equivalencia BH-BMPT'!#REF!,IF(J122=39,'[2]Equivalencia BH-BMPT'!$D$40,IF(J122=40,'[2]Equivalencia BH-BMPT'!$D$41,IF(J122=41,'[2]Equivalencia BH-BMPT'!$D$42,IF(J122=42,'[2]Equivalencia BH-BMPT'!$D$43,IF(J122=43,'[2]Equivalencia BH-BMPT'!$D$44,IF(J122=44,'[2]Equivalencia BH-BMPT'!$D$45,IF(J122=45,'[2]Equivalencia BH-BMPT'!$D$46,\"No ha seleccionado un número de programa\")))))))))))))))))))))))))))))))))))))))))))))","v":"Gobernanza e influencia local, regional e internacional"},"1395",79651770,"MARBYN ALFONSO SABOGAL",11360844,null,null,null,null,11360844,10603454,"2017-07-12","2017-07-12","2017-12-26",165,null,null,null,"X",null,null,0.93333329812468158,false]
[78,2017,"17-13-6760886",11,{"$f":"IF(D123=1,'[2]Tipo '!$B$2,IF(D123=2,'[2]Tipo '!$B$3,IF(D123=3,'[2]Tipo '!$B$4,IF(D123=4,'[2]Tipo '!$B$5,IF(D123=5,'[2]Tipo '!$B$6,IF(D123=6,'[2]Tipo '!$B$7,IF(D123=7,'[2]Tipo '!$B$8,IF(D123=8,'[2]Tipo '!$B$9,IF(D123=9,'[2]Tipo '!$B$10,IF(D123=10,'[2]Tipo '!$B$11,IF(D123=11,'[2]Tipo '!$B$12,IF(D123=12,'[2]Tipo '!$B$13,IF(D123=13,'[2]Tipo '!$B$14,IF(D123=14,'[2]Tipo '!$B$15,IF(D123=15,'[2]Tipo '!$B$16,IF(D123=16,'[2]Tipo '!$B$17,IF(D123=17,'[2]Tipo '!$B$18,IF(D123=18,'[2]Tipo '!$B$19,IF(D123=19,'[2]Tipo '!$B$20,\"No ha seleccionado un tipo de contrato válido\")))))))))))))))))))","v":"SUMINISTRO"},"Contratación mínima cuantia ","No aplica","MANTENIMIENTO PREVENTIVO Y CORRECTIVO (CON SUMINISTRO DE REPUESTOS) PARA LAS BICICLETAS CONVENCIONALES Y TÁNDEM DE LA ALCALDÍA LOCAL DE CANDELARIA","Inversión",45,{"$f":"IF(J123=1,'[2]Equivalencia BH-BMPT'!$D$2,IF(J123=2,'[2]Equivalencia BH-BMPT'!$D$3,IF(J123=3,'[2]Equivalencia BH-BMPT'!$D$4,IF(J123=4,'[2]Equivalencia BH-BMPT'!$D$5,IF(J123=5,'[2]Equivalencia BH-BMPT'!$D$6,IF(J123=6,'[2]Equivalencia BH-BMPT'!$D$7,IF(J123=7,'[2]Equivalencia BH-BMPT'!$D$8,IF(J123=8,'[2]Equivalencia BH-BMPT'!$D$9,IF(J123=9,'[2]Equivalencia BH-BMPT'!$D$10,IF(J123=10,'[2]Equivalencia BH-BMPT'!$D$11,IF(J123=11,'[2]Equivalencia BH-BMPT'!$D$12,IF(J123=12,'[2]Equivalencia BH-BMPT'!$D$13,IF(J123=13,'[2]Equivalencia BH-BMPT'!$D$14,IF(J123=14,'[2]Equivalencia BH-BMPT'!$D$15,IF(J123=15,'[2]Equivalencia BH-BMPT'!$D$16,IF(J123=16,'[2]Equivalencia BH-BMPT'!$D$17,IF(J123=17,'[2]Equivalencia BH-BMPT'!$D$18,IF(J123=18,'[2]Equivalencia BH-BMPT'!$D$19,IF(J123=19,'[2]Equivalencia BH-BMPT'!$D$20,IF(J123=20,'[2]Equivalencia BH-BMPT'!$D$21,IF(J123=21,'[2]Equivalencia BH-BMPT'!$D$22,IF(J123=22,'[2]Equivalencia BH-BMPT'!$D$23,IF(J123=23,'[2]Equivalencia BH-BMPT'!#REF!,IF(J123=24,'[2]Equivalencia BH-BMPT'!$D$25,IF(J123=25,'[2]Equivalencia BH-BMPT'!$D$26,IF(J123=26,'[2]Equivalencia BH-BMPT'!$D$27,IF(J123=27,'[2]Equivalencia BH-BMPT'!$D$28,IF(J123=28,'[2]Equivalencia BH-BMPT'!$D$29,IF(J123=29,'[2]Equivalencia BH-BMPT'!$D$30,IF(J123=30,'[2]Equivalencia BH-BMPT'!$D$31,IF(J123=31,'[2]Equivalencia BH-BMPT'!$D$32,IF(J123=32,'[2]Equivalencia BH-BMPT'!$D$33,IF(J123=33,'[2]Equivalencia BH-BMPT'!$D$34,IF(J123=34,'[2]Equivalencia BH-BMPT'!$D$35,IF(J123=35,'[2]Equivalencia BH-BMPT'!$D$36,IF(J123=36,'[2]Equivalencia BH-BMPT'!$D$37,IF(J123=37,'[2]Equivalencia BH-BMPT'!$D$38,IF(J123=38,'[2]Equivalencia BH-BMPT'!#REF!,IF(J123=39,'[2]Equivalencia BH-BMPT'!$D$40,IF(J123=40,'[2]Equivalencia BH-BMPT'!$D$41,IF(J123=41,'[2]Equivalencia BH-BMPT'!$D$42,IF(J123=42,'[2]Equivalencia BH-BMPT'!$D$43,IF(J123=43,'[2]Equivalencia BH-BMPT'!$D$44,IF(J123=44,'[2]Equivalencia BH-BMPT'!$D$45,IF(J123=45,'[2]Equivalencia BH-BMPT'!$D$46,\"No ha seleccionado un número de programa\")))))))))))))))))))))))))))))))))))))))))))))","v":"Gobernanza e influencia local, regional e internacional"},"1395",9007531050,"SERVICIO TECNICO MECANICO MOVIL COLOMBIA SAS",8422400,null,null,null,null,8422400,8422400,"2017-07-12","2017-07-24","2017-10-23",90,null,null,null,null,"X",null,1,false]
[79,2017,"17-12-6857372",5,{"$f":"IF(D124=1,'[2]Tipo '!$B$2,IF(D124=2,'[2]Tipo '!$B$3,IF(D124=3,'[2]Tipo '!$B$4,IF(D124=4,'[2]Tipo '!$B$5,IF(D124=5,'[2]Tipo '!$B$6,IF(D124=6,'[2]Tipo '!$B$7,IF(D124=7,'[2]Tipo '!$B$8,IF(D124=8,'[2]Tipo '!$B$9,IF(D124=9,'[2]Tipo '!$B$10,IF(D124=10,'[2]Tipo '!$B$11,IF(D124=11,'[2]Tipo '!$B$12,IF(D124=12,'[2]Tipo '!$B$13,IF(D124=13,'[2]Tipo '!$B$14,IF(D124=14,'[2]Tipo '!$B$15,IF(D124=15,'[2]Tipo '!$B$16,IF(D124=16,'[2]Tipo '!$B$17,IF(D124=17,'[2]Tipo '!$B$18,IF(D124=18,'[2]Tipo '!$B$19,IF(D124=19,'[2]Tipo '!$B$20,\"No ha seleccionado un tipo de contrato válido\")))))))))))))))))))","v":"CONTRATOS DE PRESTACIÓN DE SERVICIOS PROFESIONALES Y DE APOYO A LA GESTIÓN"},"Contratación directa","Prestación de servicios profesionales y de apoyo a la gestión, o para la ejecución de trabajos artísticos que sólo puedan encomendarse a determinadas personas naturales;","PRESTAR SUS SERVICIOS PROFESIONALES DE APOYO JURIDÍCO FRENTE A DILIGENCIAS JUDICIALES POR COMISIÓN DE LOS JUECES A LOS ALCALDES LOCALES ASI COMO EN LOS PROCESOS A CARGO DEL AREA DE GESTIÓN POLICIVA DE LA ALCALDÍA LOCAL DE LA CANDELARIA SEGUN REPARTO","Inversión",45,{"$f":"IF(J124=1,'[2]Equivalencia BH-BMPT'!$D$2,IF(J124=2,'[2]Equivalencia BH-BMPT'!$D$3,IF(J124=3,'[2]Equivalencia BH-BMPT'!$D$4,IF(J124=4,'[2]Equivalencia BH-BMPT'!$D$5,IF(J124=5,'[2]Equivalencia BH-BMPT'!$D$6,IF(J124=6,'[2]Equivalencia BH-BMPT'!$D$7,IF(J124=7,'[2]Equivalencia BH-BMPT'!$D$8,IF(J124=8,'[2]Equivalencia BH-BMPT'!$D$9,IF(J124=9,'[2]Equivalencia BH-BMPT'!$D$10,IF(J124=10,'[2]Equivalencia BH-BMPT'!$D$11,IF(J124=11,'[2]Equivalencia BH-BMPT'!$D$12,IF(J124=12,'[2]Equivalencia BH-BMPT'!$D$13,IF(J124=13,'[2]Equivalencia BH-BMPT'!$D$14,IF(J124=14,'[2]Equivalencia BH-BMPT'!$D$15,IF(J124=15,'[2]Equivalencia BH-BMPT'!$D$16,IF(J124=16,'[2]Equivalencia BH-BMPT'!$D$17,IF(J124=17,'[2]Equivalencia BH-BMPT'!$D$18,IF(J124=18,'[2]Equivalencia BH-BMPT'!$D$19,IF(J124=19,'[2]Equivalencia BH-BMPT'!$D$20,IF(J124=20,'[2]Equivalencia BH-BMPT'!$D$21,IF(J124=21,'[2]Equivalencia BH-BMPT'!$D$22,IF(J124=22,'[2]Equivalencia BH-BMPT'!$D$23,IF(J124=23,'[2]Equivalencia BH-BMPT'!#REF!,IF(J124=24,'[2]Equivalencia BH-BMPT'!$D$25,IF(J124=25,'[2]Equivalencia BH-BMPT'!$D$26,IF(J124=26,'[2]Equivalencia BH-BMPT'!$D$27,IF(J124=27,'[2]Equivalencia BH-BMPT'!$D$28,IF(J124=28,'[2]Equivalencia BH-BMPT'!$D$29,IF(J124=29,'[2]Equivalencia BH-BMPT'!$D$30,IF(J124=30,'[2]Equivalencia BH-BMPT'!$D$31,IF(J124=31,'[2]Equivalencia BH-BMPT'!$D$32,IF(J124=32,'[2]Equivalencia BH-BMPT'!$D$33,IF(J124=33,'[2]Equivalencia BH-BMPT'!$D$34,IF(J124=34,'[2]Equivalencia BH-BMPT'!$D$35,IF(J124=35,'[2]Equivalencia BH-BMPT'!$D$36,IF(J124=36,'[2]Equivalencia BH-BMPT'!$D$37,IF(J124=37,'[2]Equivalencia BH-BMPT'!$D$38,IF(J124=38,'[2]Equivalencia BH-BMPT'!#REF!,IF(J124=39,'[2]Equivalencia BH-BMPT'!$D$40,IF(J124=40,'[2]Equivalencia BH-BMPT'!$D$41,IF(J124=41,'[2]Equivalencia BH-BMPT'!$D$42,IF(J124=42,'[2]Equivalencia BH-BMPT'!$D$43,IF(J124=43,'[2]Equivalencia BH-BMPT'!$D$44,IF(J124=44,'[2]Equivalencia BH-BMPT'!$D$45,IF(J124=45,'[2]Equivalencia BH-BMPT'!$D$46,\"No ha seleccionado un número de programa\")))))))))))))))))))))))))))))))))))))))))))))","v":"Gobernanza e influencia local, regional e internacional"},"1395",80084321,"ANDRES BERNANDO BARRETO GONZALEZ",24000395,null,null,null,null,24000395,17250283,"2017-07-21","2017-07-21","2017-12-30",160,null,null,null,"X",null,null,0.71874996224020482,false]
[80,2017,"17-12-6906317",5,{"$f":"IF(D125=1,'[2]Tipo '!$B$2,IF(D125=2,'[2]Tipo '!$B$3,IF(D125=3,'[2]Tipo '!$B$4,IF(D125=4,'[2]Tipo '!$B$5,IF(D125=5,'[2]Tipo '!$B$6,IF(D125=6,'[2]Tipo '!$B$7,IF(D125=7,'[2]Tipo '!$B$8,IF(D125=8,'[2]Tipo '!$B$9,IF(D125=9,'[2]Tipo '!$B$10,IF(D125=10,'[2]Tipo '!$B$11,IF(D125=11,'[2]Tipo '!$B$12,IF(D125=12,'[2]Tipo '!$B$13,IF(D125=13,'[2]Tipo '!$B$14,IF(D125=14,'[2]Tipo '!$B$15,IF(D125=15,'[2]Tipo '!$B$16,IF(D125=16,'[2]Tipo '!$B$17,IF(D125=17,'[2]Tipo '!$B$18,IF(D125=18,'[2]Tipo '!$B$19,IF(D125=19,'[2]Tipo '!$B$20,\"No ha seleccionado un tipo de contrato válido\")))))))))))))))))))","v":"CONTRATOS DE PRESTACIÓN DE SERVICIOS PROFESIONALES Y DE APOYO A LA GESTIÓN"},"Contratación directa","Prestación de servicios profesionales y de apoyo a la gestión, o para la ejecución de trabajos artísticos que sólo puedan encomendarse a determinadas personas naturales;","PRESTACIÓN DE SERVICIOS PROFESIONALES PARA APOYAR DESDE EL DESPACHO DEL ALCALDE LOCAL EN TEMAS DE PARTICIPACIÓN, PRENSA Y COMUNICACIONES DE LA ENTIDAD FORTALECIENDO LA COMUNICACIÓN INTERNA Y EXTERNA Y LAS RELACIONES CON LA COMUNIDAD”","Inversión",45,{"$f":"IF(J125=1,'[2]Equivalencia BH-BMPT'!$D$2,IF(J125=2,'[2]Equivalencia BH-BMPT'!$D$3,IF(J125=3,'[2]Equivalencia BH-BMPT'!$D$4,IF(J125=4,'[2]Equivalencia BH-BMPT'!$D$5,IF(J125=5,'[2]Equivalencia BH-BMPT'!$D$6,IF(J125=6,'[2]Equivalencia BH-BMPT'!$D$7,IF(J125=7,'[2]Equivalencia BH-BMPT'!$D$8,IF(J125=8,'[2]Equivalencia BH-BMPT'!$D$9,IF(J125=9,'[2]Equivalencia BH-BMPT'!$D$10,IF(J125=10,'[2]Equivalencia BH-BMPT'!$D$11,IF(J125=11,'[2]Equivalencia BH-BMPT'!$D$12,IF(J125=12,'[2]Equivalencia BH-BMPT'!$D$13,IF(J125=13,'[2]Equivalencia BH-BMPT'!$D$14,IF(J125=14,'[2]Equivalencia BH-BMPT'!$D$15,IF(J125=15,'[2]Equivalencia BH-BMPT'!$D$16,IF(J125=16,'[2]Equivalencia BH-BMPT'!$D$17,IF(J125=17,'[2]Equivalencia BH-BMPT'!$D$18,IF(J125=18,'[2]Equivalencia BH-BMPT'!$D$19,IF(J125=19,'[2]Equivalencia BH-BMPT'!$D$20,IF(J125=20,'[2]Equivalencia BH-BMPT'!$D$21,IF(J125=21,'[2]Equivalencia BH-BMPT'!$D$22,IF(J125=22,'[2]Equivalencia BH-BMPT'!$D$23,IF(J125=23,'[2]Equivalencia BH-BMPT'!#REF!,IF(J125=24,'[2]Equivalencia BH-BMPT'!$D$25,IF(J125=25,'[2]Equivalencia BH-BMPT'!$D$26,IF(J125=26,'[2]Equivalencia BH-BMPT'!$D$27,IF(J125=27,'[2]Equivalencia BH-BMPT'!$D$28,IF(J125=28,'[2]Equivalencia BH-BMPT'!$D$29,IF(J125=29,'[2]Equivalencia BH-BMPT'!$D$30,IF(J125=30,'[2]Equivalencia BH-BMPT'!$D$31,IF(J125=31,'[2]Equivalencia BH-BMPT'!$D$32,IF(J125=32,'[2]Equivalencia BH-BMPT'!$D$33,IF(J125=33,'[2]Equivalencia BH-BMPT'!$D$34,IF(J125=34,'[2]Equivalencia BH-BMPT'!$D$35,IF(J125=35,'[2]Equivalencia BH-BMPT'!$D$36,IF(J125=36,'[2]Equivalencia BH-BMPT'!$D$37,IF(J125=37,'[2]Equivalencia BH-BMPT'!$D$38,IF(J125=38,'[2]Equivalencia BH-BMPT'!#REF!,IF(J125=39,'[2]Equivalencia BH-BMPT'!$D$40,IF(J125=40,'[2]Equivalencia BH-BMPT'!$D$41,IF(J125=41,'[2]Equivalencia BH-BMPT'!$D$42,IF(J125=42,'[2]Equivalencia BH-BMPT'!$D$43,IF(J125=43,'[2]Equivalencia BH-BMPT'!$D$44,IF(J125=44,'[2]Equivalencia BH-BMPT'!$D$45,IF(J125=45,'[2]Equivalencia BH-BMPT'!$D$46,\"No ha seleccionado un número de programa\")))))))))))))))))))))))))))))))))))))))))))))","v":"Gobernanza e influencia local, regional e internacional"},"1395",1033731738,"NATALIA ANDREA RUBIANO FORERO",18442925,null,null,null,7377170,25820095,16208174,"2017-08-04","2017-08-04","2018-02-28",210,null,null,null,"X",null,null,0.62773487084381374,false]
[81,2017,"17-12-6970338",5,{"$f":"IF(D126=1,'[2]Tipo '!$B$2,IF(D126=2,'[2]Tipo '!$B$3,IF(D126=3,'[2]Tipo '!$B$4,IF(D126=4,'[2]Tipo '!$B$5,IF(D126=5,'[2]Tipo '!$B$6,IF(D126=6,'[2]Tipo '!$B$7,IF(D126=7,'[2]Tipo '!$B$8,IF(D126=8,'[2]Tipo '!$B$9,IF(D126=9,'[2]Tipo '!$B$10,IF(D126=10,'[2]Tipo '!$B$11,IF(D126=11,'[2]Tipo '!$B$12,IF(D126=12,'[2]Tipo '!$B$13,IF(D126=13,'[2]Tipo '!$B$14,IF(D126=14,'[2]Tipo '!$B$15,IF(D126=15,'[2]Tipo '!$B$16,IF(D126=16,'[2]Tipo '!$B$17,IF(D126=17,'[2]Tipo '!$B$18,IF(D126=18,'[2]Tipo '!$B$19,IF(D126=19,'[2]Tipo '!$B$20,\"No ha seleccionado un tipo de contrato válido\")))))))))))))))))))","v":"CONTRATOS DE PRESTACIÓN DE SERVICIOS PROFESIONALES Y DE APOYO A LA GESTIÓN"},"Contratación directa","Prestación de servicios profesionales y de apoyo a la gestión, o para la ejecución de trabajos artísticos que sólo puedan encomendarse a determinadas personas naturales;","PRESTAR LOS SERVICIOS PROFESIONALES EN LA GESTIÓN DE COBRO PERSUASIVO Y COACTIVO DEL FDLC, DE CONFORMIDAD CON LOS LINEAMIENTOS ESTABLECIDOS PARA LA MATERIA”","Inversión",45,{"$f":"IF(J126=1,'[2]Equivalencia BH-BMPT'!$D$2,IF(J126=2,'[2]Equivalencia BH-BMPT'!$D$3,IF(J126=3,'[2]Equivalencia BH-BMPT'!$D$4,IF(J126=4,'[2]Equivalencia BH-BMPT'!$D$5,IF(J126=5,'[2]Equivalencia BH-BMPT'!$D$6,IF(J126=6,'[2]Equivalencia BH-BMPT'!$D$7,IF(J126=7,'[2]Equivalencia BH-BMPT'!$D$8,IF(J126=8,'[2]Equivalencia BH-BMPT'!$D$9,IF(J126=9,'[2]Equivalencia BH-BMPT'!$D$10,IF(J126=10,'[2]Equivalencia BH-BMPT'!$D$11,IF(J126=11,'[2]Equivalencia BH-BMPT'!$D$12,IF(J126=12,'[2]Equivalencia BH-BMPT'!$D$13,IF(J126=13,'[2]Equivalencia BH-BMPT'!$D$14,IF(J126=14,'[2]Equivalencia BH-BMPT'!$D$15,IF(J126=15,'[2]Equivalencia BH-BMPT'!$D$16,IF(J126=16,'[2]Equivalencia BH-BMPT'!$D$17,IF(J126=17,'[2]Equivalencia BH-BMPT'!$D$18,IF(J126=18,'[2]Equivalencia BH-BMPT'!$D$19,IF(J126=19,'[2]Equivalencia BH-BMPT'!$D$20,IF(J126=20,'[2]Equivalencia BH-BMPT'!$D$21,IF(J126=21,'[2]Equivalencia BH-BMPT'!$D$22,IF(J126=22,'[2]Equivalencia BH-BMPT'!$D$23,IF(J126=23,'[2]Equivalencia BH-BMPT'!#REF!,IF(J126=24,'[2]Equivalencia BH-BMPT'!$D$25,IF(J126=25,'[2]Equivalencia BH-BMPT'!$D$26,IF(J126=26,'[2]Equivalencia BH-BMPT'!$D$27,IF(J126=27,'[2]Equivalencia BH-BMPT'!$D$28,IF(J126=28,'[2]Equivalencia BH-BMPT'!$D$29,IF(J126=29,'[2]Equivalencia BH-BMPT'!$D$30,IF(J126=30,'[2]Equivalencia BH-BMPT'!$D$31,IF(J126=31,'[2]Equivalencia BH-BMPT'!$D$32,IF(J126=32,'[2]Equivalencia BH-BMPT'!$D$33,IF(J126=33,'[2]Equivalencia BH-BMPT'!$D$34,IF(J126=34,'[2]Equivalencia BH-BMPT'!$D$35,IF(J126=35,'[2]Equivalencia BH-BMPT'!$D$36,IF(J126=36,'[2]Equivalencia BH-BMPT'!$D$37,IF(J126=37,'[2]Equivalencia BH-BMPT'!$D$38,IF(J126=38,'[2]Equivalencia BH-BMPT'!#REF!,IF(J126=39,'[2]Equivalencia BH-BMPT'!$D$40,IF(J126=40,'[2]Equivalencia BH-BMPT'!$D$41,IF(J126=41,'[2]Equivalencia BH-BMPT'!$D$42,IF(J126=42,'[2]Equivalencia BH-BMPT'!$D$43,IF(J126=43,'[2]Equivalencia BH-BMPT'!$D$44,IF(J126=44,'[2]Equivalencia BH-BMPT'!$D$45,IF(J126=45,'[2]Equivalencia BH-BMPT'!$D$46,\"No ha seleccionado un número de programa\")))))))))))))))))))))))))))))))))))))))))))))","v":"Gobernanza e influencia local, regional e internacional"},"1395",94481394,"ALEJANDRO JARAMILLO CABRERA",17594550,null,null,null,null,17594550,15639600,"2017-08-16","2017-08-16","2017-12-30",135,null,null,null,null,"X",null,0.88888888888888884,false]
[83,2017,"17-12-6978274",5,{"$f":"IF(D127=1,'[2]Tipo '!$B$2,IF(D127=2,'[2]Tipo '!$B$3,IF(D127=3,'[2]Tipo '!$B$4,IF(D127=4,'[2]Tipo '!$B$5,IF(D127=5,'[2]Tipo '!$B$6,IF(D127=6,'[2]Tipo '!$B$7,IF(D127=7,'[2]Tipo '!$B$8,IF(D127=8,'[2]Tipo '!$B$9,IF(D127=9,'[2]Tipo '!$B$10,IF(D127=10,'[2]Tipo '!$B$11,IF(D127=11,'[2]Tipo '!$B$12,IF(D127=12,'[2]Tipo '!$B$13,IF(D127=13,'[2]Tipo '!$B$14,IF(D127=14,'[2]Tipo '!$B$15,IF(D127=15,'[2]Tipo '!$B$16,IF(D127=16,'[2]Tipo '!$B$17,IF(D127=17,'[2]Tipo '!$B$18,IF(D127=18,'[2]Tipo '!$B$19,IF(D127=19,'[2]Tipo '!$B$20,\"No ha seleccionado un tipo de contrato válido\")))))))))))))))))))","v":"CONTRATOS DE PRESTACIÓN DE SERVICIOS PROFESIONALES Y DE APOYO A LA GESTIÓN"},"Contratación directa","Prestación de servicios profesionales y de apoyo a la gestión, o para la ejecución de trabajos artísticos que sólo puedan encomendarse a determinadas personas naturales;","PRESTAR SUS SERVICIOS PROFESIONALES PARA APOYAR A LA ALCALDIA LOCAL DE LA CANDELARIA EN TEMAS DE PROTECCIÓN Y DEFENSA AL CONSUMIDOR","Inversión",45,{"$f":"IF(J127=1,'[2]Equivalencia BH-BMPT'!$D$2,IF(J127=2,'[2]Equivalencia BH-BMPT'!$D$3,IF(J127=3,'[2]Equivalencia BH-BMPT'!$D$4,IF(J127=4,'[2]Equivalencia BH-BMPT'!$D$5,IF(J127=5,'[2]Equivalencia BH-BMPT'!$D$6,IF(J127=6,'[2]Equivalencia BH-BMPT'!$D$7,IF(J127=7,'[2]Equivalencia BH-BMPT'!$D$8,IF(J127=8,'[2]Equivalencia BH-BMPT'!$D$9,IF(J127=9,'[2]Equivalencia BH-BMPT'!$D$10,IF(J127=10,'[2]Equivalencia BH-BMPT'!$D$11,IF(J127=11,'[2]Equivalencia BH-BMPT'!$D$12,IF(J127=12,'[2]Equivalencia BH-BMPT'!$D$13,IF(J127=13,'[2]Equivalencia BH-BMPT'!$D$14,IF(J127=14,'[2]Equivalencia BH-BMPT'!$D$15,IF(J127=15,'[2]Equivalencia BH-BMPT'!$D$16,IF(J127=16,'[2]Equivalencia BH-BMPT'!$D$17,IF(J127=17,'[2]Equivalencia BH-BMPT'!$D$18,IF(J127=18,'[2]Equivalencia BH-BMPT'!$D$19,IF(J127=19,'[2]Equivalencia BH-BMPT'!$D$20,IF(J127=20,'[2]Equivalencia BH-BMPT'!$D$21,IF(J127=21,'[2]Equivalencia BH-BMPT'!$D$22,IF(J127=22,'[2]Equivalencia BH-BMPT'!$D$23,IF(J127=23,'[2]Equivalencia BH-BMPT'!#REF!,IF(J127=24,'[2]Equivalencia BH-BMPT'!$D$25,IF(J127=25,'[2]Equivalencia BH-BMPT'!$D$26,IF(J127=26,'[2]Equivalencia BH-BMPT'!$D$27,IF(J127=27,'[2]Equivalencia BH-BMPT'!$D$28,IF(J127=28,'[2]Equivalencia BH-BMPT'!$D$29,IF(J127=29,'[2]Equivalencia BH-BMPT'!$D$30,IF(J127=30,'[2]Equivalencia BH-BMPT'!$D$31,IF(J127=31,'[2]Equivalencia BH-BMPT'!$D$32,IF(J127=32,'[2]Equivalencia BH-BMPT'!$D$33,IF(J127=33,'[2]Equivalencia BH-BMPT'!$D$34,IF(J127=34,'[2]Equivalencia BH-BMPT'!$D$35,IF(J127=35,'[2]Equivalencia BH-BMPT'!$D$36,IF(J127=36,'[2]Equivalencia BH-BMPT'!$D$37,IF(J127=37,'[2]Equivalencia BH-BMPT'!$D$38,IF(J127=38,'[2]Equivalencia BH-BMPT'!#REF!,IF(J127=39,'[2]Equivalencia BH-BMPT'!$D$40,IF(J127=40,'[2]Equivalencia BH-BMPT'!$D$41,IF(J127=41,'[2]Equivalencia BH-BMPT'!$D$42,IF(J127=42,'[2]Equivalencia BH-BMPT'!$D$43,IF(J127=43,'[2]Equivalencia BH-BMPT'!$D$44,IF(J127=44,'[2]Equivalencia BH-BMPT'!$D$45,IF(J127=45,'[2]Equivalencia BH-BMPT'!$D$46,\"No ha seleccionado un número de programa\")))))))))))))))))))))))))))))))))))))))))))))","v":"Gobernanza e influencia local, regional e internacional"},"1395",19322109,"FABIO OSORIO RIVERA",20250333,null,null,null,null,20250333,null,"2017-08-17","2017-08-24","2017-12-30",126,null,"x",null,null,null,null,0,false]
[86,2017,"17-12-6989965",5,{"$f":"IF(D128=1,'[2]Tipo '!$B$2,IF(D128=2,'[2]Tipo '!$B$3,IF(D128=3,'[2]Tipo '!$B$4,IF(D128=4,'[2]Tipo '!$B$5,IF(D128=5,'[2]Tipo '!$B$6,IF(D128=6,'[2]Tipo '!$B$7,IF(D128=7,'[2]Tipo '!$B$8,IF(D128=8,'[2]Tipo '!$B$9,IF(D128=9,'[2]Tipo '!$B$10,IF(D128=10,'[2]Tipo '!$B$11,IF(D128=11,'[2]Tipo '!$B$12,IF(D128=12,'[2]Tipo '!$B$13,IF(D128=13,'[2]Tipo '!$B$14,IF(D128=14,'[2]Tipo '!$B$15,IF(D128=15,'[2]Tipo '!$B$16,IF(D128=16,'[2]Tipo '!$B$17,IF(D128=17,'[2]Tipo '!$B$18,IF(D128=18,'[2]Tipo '!$B$19,IF(D128=19,'[2]Tipo '!$B$20,\"No ha seleccionado un tipo de contrato válido\")))))))))))))))))))","v":"CONTRATOS DE PRESTACIÓN DE SERVICIOS PROFESIONALES Y DE APOYO A LA GESTIÓN"},"Contratación directa","Prestación de servicios profesionales y de apoyo a la gestión, o para la ejecución de trabajos artísticos que sólo puedan encomendarse a determinadas personas naturales;","“PRESTAR SUS SERVICIOS PROFESIONALES EN LA GESTIÓN DE PROYECTOS EN MATERIA DE PROMOCION DE LA CONVIVENCIA CIUDADANA EN LA LOCALIDAD DE LA CANDELARIA”","Inversión",45,{"$f":"IF(J128=1,'[2]Equivalencia BH-BMPT'!$D$2,IF(J128=2,'[2]Equivalencia BH-BMPT'!$D$3,IF(J128=3,'[2]Equivalencia BH-BMPT'!$D$4,IF(J128=4,'[2]Equivalencia BH-BMPT'!$D$5,IF(J128=5,'[2]Equivalencia BH-BMPT'!$D$6,IF(J128=6,'[2]Equivalencia BH-BMPT'!$D$7,IF(J128=7,'[2]Equivalencia BH-BMPT'!$D$8,IF(J128=8,'[2]Equivalencia BH-BMPT'!$D$9,IF(J128=9,'[2]Equivalencia BH-BMPT'!$D$10,IF(J128=10,'[2]Equivalencia BH-BMPT'!$D$11,IF(J128=11,'[2]Equivalencia BH-BMPT'!$D$12,IF(J128=12,'[2]Equivalencia BH-BMPT'!$D$13,IF(J128=13,'[2]Equivalencia BH-BMPT'!$D$14,IF(J128=14,'[2]Equivalencia BH-BMPT'!$D$15,IF(J128=15,'[2]Equivalencia BH-BMPT'!$D$16,IF(J128=16,'[2]Equivalencia BH-BMPT'!$D$17,IF(J128=17,'[2]Equivalencia BH-BMPT'!$D$18,IF(J128=18,'[2]Equivalencia BH-BMPT'!$D$19,IF(J128=19,'[2]Equivalencia BH-BMPT'!$D$20,IF(J128=20,'[2]Equivalencia BH-BMPT'!$D$21,IF(J128=21,'[2]Equivalencia BH-BMPT'!$D$22,IF(J128=22,'[2]Equivalencia BH-BMPT'!$D$23,IF(J128=23,'[2]Equivalencia BH-BMPT'!#REF!,IF(J128=24,'[2]Equivalencia BH-BMPT'!$D$25,IF(J128=25,'[2]Equivalencia BH-BMPT'!$D$26,IF(J128=26,'[2]Equivalencia BH-BMPT'!$D$27,IF(J128=27,'[2]Equivalencia BH-BMPT'!$D$28,IF(J128=28,'[2]Equivalencia BH-BMPT'!$D$29,IF(J128=29,'[2]Equivalencia BH-BMPT'!$D$30,IF(J128=30,'[2]Equivalencia BH-BMPT'!$D$31,IF(J128=31,'[2]Equivalencia BH-BMPT'!$D$32,IF(J128=32,'[2]Equivalencia BH-BMPT'!$D$33,IF(J128=33,'[2]Equivalencia BH-BMPT'!$D$34,IF(J128=34,'[2]Equivalencia BH-BMPT'!$D$35,IF(J128=35,'[2]Equivalencia BH-BMPT'!$D$36,IF(J128=36,'[2]Equivalencia BH-BMPT'!$D$37,IF(J128=37,'[2]Equivalencia BH-BMPT'!$D$38,IF(J128=38,'[2]Equivalencia BH-BMPT'!#REF!,IF(J128=39,'[2]Equivalencia BH-BMPT'!$D$40,IF(J128=40,'[2]Equivalencia BH-BMPT'!$D$41,IF(J128=41,'[2]Equivalencia BH-BMPT'!$D$42,IF(J128=42,'[2]Equivalencia BH-BMPT'!$D$43,IF(J128=43,'[2]Equivalencia BH-BMPT'!$D$44,IF(J128=44,'[2]Equivalencia BH-BMPT'!$D$45,IF(J128=45,'[2]Equivalencia BH-BMPT'!$D$46,\"No ha seleccionado un número de programa\")))))))))))))))))))))))))))))))))))))))))))))","v":"Gobernanza e influencia local, regional e internacional"},"1395",17096516,"JAIME UMAÑA DÍAZ ",19050313,null,null,null,9000148,28050461,16800276,"2017-08-24","2017-08-25","2018-02-28",187,null,null,null,"X",null,null,0.59893047747058414,false]
[88,2017,"17-12-6990150",5,{"$f":"IF(D129=1,'[2]Tipo '!$B$2,IF(D129=2,'[2]Tipo '!$B$3,IF(D129=3,'[2]Tipo '!$B$4,IF(D129=4,'[2]Tipo '!$B$5,IF(D129=5,'[2]Tipo '!$B$6,IF(D129=6,'[2]Tipo '!$B$7,IF(D129=7,'[2]Tipo '!$B$8,IF(D129=8,'[2]Tipo '!$B$9,IF(D129=9,'[2]Tipo '!$B$10,IF(D129=10,'[2]Tipo '!$B$11,IF(D129=11,'[2]Tipo '!$B$12,IF(D129=12,'[2]Tipo '!$B$13,IF(D129=13,'[2]Tipo '!$B$14,IF(D129=14,'[2]Tipo '!$B$15,IF(D129=15,'[2]Tipo '!$B$16,IF(D129=16,'[2]Tipo '!$B$17,IF(D129=17,'[2]Tipo '!$B$18,IF(D129=18,'[2]Tipo '!$B$19,IF(D129=19,'[2]Tipo '!$B$20,\"No ha seleccionado un tipo de contrato válido\")))))))))))))))))))","v":"CONTRATOS DE PRESTACIÓN DE SERVICIOS PROFESIONALES Y DE APOYO A LA GESTIÓN"},"Contratación directa","Prestación de servicios profesionales y de apoyo a la gestión, o para la ejecución de trabajos artísticos que sólo puedan encomendarse a determinadas personas naturales;","PRESTAR LOS SERVICIOS TECNICOS DE APOYO AL AREA DE GESTION DEL DESARROLLO LOCAL EN TEMAS ADMINISTRATIVOS DE SEGUIMIENTO Y TRAZABILIDAD DEL PAGO OPORTUNO DE OBLIGACIONES","Inversión",45,{"$f":"IF(J129=1,'[2]Equivalencia BH-BMPT'!$D$2,IF(J129=2,'[2]Equivalencia BH-BMPT'!$D$3,IF(J129=3,'[2]Equivalencia BH-BMPT'!$D$4,IF(J129=4,'[2]Equivalencia BH-BMPT'!$D$5,IF(J129=5,'[2]Equivalencia BH-BMPT'!$D$6,IF(J129=6,'[2]Equivalencia BH-BMPT'!$D$7,IF(J129=7,'[2]Equivalencia BH-BMPT'!$D$8,IF(J129=8,'[2]Equivalencia BH-BMPT'!$D$9,IF(J129=9,'[2]Equivalencia BH-BMPT'!$D$10,IF(J129=10,'[2]Equivalencia BH-BMPT'!$D$11,IF(J129=11,'[2]Equivalencia BH-BMPT'!$D$12,IF(J129=12,'[2]Equivalencia BH-BMPT'!$D$13,IF(J129=13,'[2]Equivalencia BH-BMPT'!$D$14,IF(J129=14,'[2]Equivalencia BH-BMPT'!$D$15,IF(J129=15,'[2]Equivalencia BH-BMPT'!$D$16,IF(J129=16,'[2]Equivalencia BH-BMPT'!$D$17,IF(J129=17,'[2]Equivalencia BH-BMPT'!$D$18,IF(J129=18,'[2]Equivalencia BH-BMPT'!$D$19,IF(J129=19,'[2]Equivalencia BH-BMPT'!$D$20,IF(J129=20,'[2]Equivalencia BH-BMPT'!$D$21,IF(J129=21,'[2]Equivalencia BH-BMPT'!$D$22,IF(J129=22,'[2]Equivalencia BH-BMPT'!$D$23,IF(J129=23,'[2]Equivalencia BH-BMPT'!#REF!,IF(J129=24,'[2]Equivalencia BH-BMPT'!$D$25,IF(J129=25,'[2]Equivalencia BH-BMPT'!$D$26,IF(J129=26,'[2]Equivalencia BH-BMPT'!$D$27,IF(J129=27,'[2]Equivalencia BH-BMPT'!$D$28,IF(J129=28,'[2]Equivalencia BH-BMPT'!$D$29,IF(J129=29,'[2]Equivalencia BH-BMPT'!$D$30,IF(J129=30,'[2]Equivalencia BH-BMPT'!$D$31,IF(J129=31,'[2]Equivalencia BH-BMPT'!$D$32,IF(J129=32,'[2]Equivalencia BH-BMPT'!$D$33,IF(J129=33,'[2]Equivalencia BH-BMPT'!$D$34,IF(J129=34,'[2]Equivalencia BH-BMPT'!$D$35,IF(J129=35,'[2]Equivalencia BH-BMPT'!$D$36,IF(J129=36,'[2]Equivalencia BH-BMPT'!$D$37,IF(J129=37,'[2]Equivalencia BH-BMPT'!$D$38,IF(J129=38,'[2]Equivalencia BH-BMPT'!#REF!,IF(J129=39,'[2]Equivalencia BH-BMPT'!$D$40,IF(J129=40,'[2]Equivalencia BH-BMPT'!$D$41,IF(J129=41,'[2]Equivalencia BH-BMPT'!$D$42,IF(J129=42,'[2]Equivalencia BH-BMPT'!$D$43,IF(J129=43,'[2]Equivalencia BH-BMPT'!$D$44,IF(J129=44,'[2]Equivalencia BH-BMPT'!$D$45,IF(J129=45,'[2]Equivalencia BH-BMPT'!$D$46,\"No ha seleccionado un número de programa\")))))))))))))))))))))))))))))))))))))))))))))","v":"Gobernanza e influencia local, regional e internacional"},"1395",1069078871,"DIANA KATHERINE MORA SANCHEZ ",10283538,250004,null,null,2500001,{"$f":"O129+Q129+S129-P129","v":12533535},8771193,"2017-08-28","2017-08-28","2017-12-30",123,null,null,null,null,"x",null,{"$f":"SUM(U129/T129)","v":0.6998179683544985},false]
[90,2017,"17-12-7044044",5,{"$f":"IF(D130=1,'[3]Tipo '!$B$2,IF(D130=2,'[3]Tipo '!$B$3,IF(D130=3,'[3]Tipo '!$B$4,IF(D130=4,'[3]Tipo '!$B$5,IF(D130=5,'[3]Tipo '!$B$6,IF(D130=6,'[3]Tipo '!$B$7,IF(D130=7,'[3]Tipo '!$B$8,IF(D130=8,'[3]Tipo '!$B$9,IF(D130=9,'[3]Tipo '!$B$10,IF(D130=10,'[3]Tipo '!$B$11,IF(D130=11,'[3]Tipo '!$B$12,IF(D130=12,'[3]Tipo '!$B$13,IF(D130=13,'[3]Tipo '!$B$14,IF(D130=14,'[3]Tipo '!$B$15,IF(D130=15,'[3]Tipo '!$B$16,IF(D130=16,'[3]Tipo '!$B$17,IF(D130=17,'[3]Tipo '!$B$18,IF(D130=18,'[3]Tipo '!$B$19,IF(D130=19,'[3]Tipo '!$B$20,\"No ha seleccionado un tipo de contrato válido\")))))))))))))))))))","v":"CONTRATOS DE PRESTACIÓN DE SERVICIOS PROFESIONALES Y DE APOYO A LA GESTIÓN"},"Contratación directa","Prestación de servicios profesionales y de apoyo a la gestión, o para la ejecución de trabajos artísticos que sólo puedan encomendarse a determinadas personas naturales;","PRESTAR LOS SERVICIOS PROFESIONALES PARA FORTALECER Y PROMOVER ESTRATEGIAS DE IMPLEMENTACIÓN, APLICACIÓN Y CAPACITACIÓN A LAS COMUNIDADES SOBRE LA NORMATIVIDAD REFERENTE AL CÓDIGO DE POLICÍA, ACTUACIONES ADMINISTRATIVAS DE LEY 232 EN LA LOCALIDAD DE LA CANDELARIA, USO DEL SUELO Y ESPACIOS PRIVADO ABIERTOS AL PÚBLICO EN LA CANDELARIA","Inversión",45,{"$f":"IF(J130=1,'[3]Equivalencia BH-BMPT'!$D$2,IF(J130=2,'[3]Equivalencia BH-BMPT'!$D$3,IF(J130=3,'[3]Equivalencia BH-BMPT'!$D$4,IF(J130=4,'[3]Equivalencia BH-BMPT'!$D$5,IF(J130=5,'[3]Equivalencia BH-BMPT'!$D$6,IF(J130=6,'[3]Equivalencia BH-BMPT'!$D$7,IF(J130=7,'[3]Equivalencia BH-BMPT'!$D$8,IF(J130=8,'[3]Equivalencia BH-BMPT'!$D$9,IF(J130=9,'[3]Equivalencia BH-BMPT'!$D$10,IF(J130=10,'[3]Equivalencia BH-BMPT'!$D$11,IF(J130=11,'[3]Equivalencia BH-BMPT'!$D$12,IF(J130=12,'[3]Equivalencia BH-BMPT'!$D$13,IF(J130=13,'[3]Equivalencia BH-BMPT'!$D$14,IF(J130=14,'[3]Equivalencia BH-BMPT'!$D$15,IF(J130=15,'[3]Equivalencia BH-BMPT'!$D$16,IF(J130=16,'[3]Equivalencia BH-BMPT'!$D$17,IF(J130=17,'[3]Equivalencia BH-BMPT'!$D$18,IF(J130=18,'[3]Equivalencia BH-BMPT'!$D$19,IF(J130=19,'[3]Equivalencia BH-BMPT'!$D$20,IF(J130=20,'[3]Equivalencia BH-BMPT'!$D$21,IF(J130=21,'[3]Equivalencia BH-BMPT'!$D$22,IF(J130=22,'[3]Equivalencia BH-BMPT'!$D$23,IF(J130=23,'[3]Equivalencia BH-BMPT'!#REF!,IF(J130=24,'[3]Equivalencia BH-BMPT'!$D$25,IF(J130=25,'[3]Equivalencia BH-BMPT'!$D$26,IF(J130=26,'[3]Equivalencia BH-BMPT'!$D$27,IF(J130=27,'[3]Equivalencia BH-BMPT'!$D$28,IF(J130=28,'[3]Equivalencia BH-BMPT'!$D$29,IF(J130=29,'[3]Equivalencia BH-BMPT'!$D$30,IF(J130=30,'[3]Equivalencia BH-BMPT'!$D$31,IF(J130=31,'[3]Equivalencia BH-BMPT'!$D$32,IF(J130=32,'[3]Equivalencia BH-BMPT'!$D$33,IF(J130=33,'[3]Equivalencia BH-BMPT'!$D$34,IF(J130=34,'[3]Equivalencia BH-BMPT'!$D$35,IF(J130=35,'[3]Equivalencia BH-BMPT'!$D$36,IF(J130=36,'[3]Equivalencia BH-BMPT'!$D$37,IF(J130=37,'[3]Equivalencia BH-BMPT'!$D$38,IF(J130=38,'[3]Equivalencia BH-BMPT'!#REF!,IF(J130=39,'[3]Equivalencia BH-BMPT'!$D$40,IF(J130=40,'[3]Equivalencia BH-BMPT'!$D$41,IF(J130=41,'[3]Equivalencia BH-BMPT'!$D$42,IF(J130=42,'[3]Equivalencia BH-BMPT'!$D$43,IF(J130=43,'[3]Equivalencia BH-BMPT'!$D$44,IF(J130=44,'[3]Equivalencia BH-BMPT'!$D$45,IF(J130=45,'[3]Equivalencia BH-BMPT'!$D$46,\"No ha seleccionado un número de programa\")))))))))))))))))))))))))))))))))))))))))))))","v":"Gobernanza e influencia local, regional e internacional"},"1395",5220781,"ALBA CONSTANZA CASTELLANOS INFANTE",16950279,null,null,null,null,{"$f":"O130+Q130+S130","v":16950279},14700238,"2017-09-08","2017-09-08","2017-12-30",113,null,null,null,"X",null,null,0.86725640327218212,false]
[92,2017,"17-12-7121110",5,{"$f":"IF(D131=1,'[3]Tipo '!$B$2,IF(D131=2,'[3]Tipo '!$B$3,IF(D131=3,'[3]Tipo '!$B$4,IF(D131=4,'[3]Tipo '!$B$5,IF(D131=5,'[3]Tipo '!$B$6,IF(D131=6,'[3]Tipo '!$B$7,IF(D131=7,'[3]Tipo '!$B$8,IF(D131=8,'[3]Tipo '!$B$9,IF(D131=9,'[3]Tipo '!$B$10,IF(D131=10,'[3]Tipo '!$B$11,IF(D131=11,'[3]Tipo '!$B$12,IF(D131=12,'[3]Tipo '!$B$13,IF(D131=13,'[3]Tipo '!$B$14,IF(D131=14,'[3]Tipo '!$B$15,IF(D131=15,'[3]Tipo '!$B$16,IF(D131=16,'[3]Tipo '!$B$17,IF(D131=17,'[3]Tipo '!$B$18,IF(D131=18,'[3]Tipo '!$B$19,IF(D131=19,'[3]Tipo '!$B$20,\"No ha seleccionado un tipo de contrato válido\")))))))))))))))))))","v":"CONTRATOS DE PRESTACIÓN DE SERVICIOS PROFESIONALES Y DE APOYO A LA GESTIÓN"},"Contratación directa","Prestación de servicios profesionales y de apoyo a la gestión, o para la ejecución de trabajos artísticos que sólo puedan encomendarse a determinadas personas naturales;","PRESTAR LOS SERVICIOS DE APOYO EN TEMAS DE GESTIÓN DOCUMENTAL Y NOTIFICACIÓN DE CORRESPONDENCIA, DE CONFORMIDAD CON EL TRÁMITE DE LOS ASUNTOS DE SU COMPETENCIA","Inversión",45,{"$f":"IF(J131=1,'[3]Equivalencia BH-BMPT'!$D$2,IF(J131=2,'[3]Equivalencia BH-BMPT'!$D$3,IF(J131=3,'[3]Equivalencia BH-BMPT'!$D$4,IF(J131=4,'[3]Equivalencia BH-BMPT'!$D$5,IF(J131=5,'[3]Equivalencia BH-BMPT'!$D$6,IF(J131=6,'[3]Equivalencia BH-BMPT'!$D$7,IF(J131=7,'[3]Equivalencia BH-BMPT'!$D$8,IF(J131=8,'[3]Equivalencia BH-BMPT'!$D$9,IF(J131=9,'[3]Equivalencia BH-BMPT'!$D$10,IF(J131=10,'[3]Equivalencia BH-BMPT'!$D$11,IF(J131=11,'[3]Equivalencia BH-BMPT'!$D$12,IF(J131=12,'[3]Equivalencia BH-BMPT'!$D$13,IF(J131=13,'[3]Equivalencia BH-BMPT'!$D$14,IF(J131=14,'[3]Equivalencia BH-BMPT'!$D$15,IF(J131=15,'[3]Equivalencia BH-BMPT'!$D$16,IF(J131=16,'[3]Equivalencia BH-BMPT'!$D$17,IF(J131=17,'[3]Equivalencia BH-BMPT'!$D$18,IF(J131=18,'[3]Equivalencia BH-BMPT'!$D$19,IF(J131=19,'[3]Equivalencia BH-BMPT'!$D$20,IF(J131=20,'[3]Equivalencia BH-BMPT'!$D$21,IF(J131=21,'[3]Equivalencia BH-BMPT'!$D$22,IF(J131=22,'[3]Equivalencia BH-BMPT'!$D$23,IF(J131=23,'[3]Equivalencia BH-BMPT'!#REF!,IF(J131=24,'[3]Equivalencia BH-BMPT'!$D$25,IF(J131=25,'[3]Equivalencia BH-BMPT'!$D$26,IF(J131=26,'[3]Equivalencia BH-BMPT'!$D$27,IF(J131=27,'[3]Equivalencia BH-BMPT'!$D$28,IF(J131=28,'[3]Equivalencia BH-BMPT'!$D$29,IF(J131=29,'[3]Equivalencia BH-BMPT'!$D$30,IF(J131=30,'[3]Equivalencia BH-BMPT'!$D$31,IF(J131=31,'[3]Equivalencia BH-BMPT'!$D$32,IF(J131=32,'[3]Equivalencia BH-BMPT'!$D$33,IF(J131=33,'[3]Equivalencia BH-BMPT'!$D$34,IF(J131=34,'[3]Equivalencia BH-BMPT'!$D$35,IF(J131=35,'[3]Equivalencia BH-BMPT'!$D$36,IF(J131=36,'[3]Equivalencia BH-BMPT'!$D$37,IF(J131=37,'[3]Equivalencia BH-BMPT'!$D$38,IF(J131=38,'[3]Equivalencia BH-BMPT'!#REF!,IF(J131=39,'[3]Equivalencia BH-BMPT'!$D$40,IF(J131=40,'[3]Equivalencia BH-BMPT'!$D$41,IF(J131=41,'[3]Equivalencia BH-BMPT'!$D$42,IF(J131=42,'[3]Equivalencia BH-BMPT'!$D$43,IF(J131=43,'[3]Equivalencia BH-BMPT'!$D$44,IF(J131=44,'[3]Equivalencia BH-BMPT'!$D$45,IF(J131=45,'[3]Equivalencia BH-BMPT'!$D$46,\"No ha seleccionado un número de programa\")))))))))))))))))))))))))))))))))))))))))))))","v":"Gobernanza e influencia local, regional e internacional"},"1395",52160400,"ALBALINNE  RAMIREZ RAMIREZ",6196824,null,null,null,null,6196824,5095166,"2017-09-28","2017-10-02","2017-12-30",90,null,null,null,"X",null,null,0.82222215767302731,false]
[94,2017,"17-12-7143810",5,{"$f":"IF(D132=1,'[3]Tipo '!$B$2,IF(D132=2,'[3]Tipo '!$B$3,IF(D132=3,'[3]Tipo '!$B$4,IF(D132=4,'[3]Tipo '!$B$5,IF(D132=5,'[3]Tipo '!$B$6,IF(D132=6,'[3]Tipo '!$B$7,IF(D132=7,'[3]Tipo '!$B$8,IF(D132=8,'[3]Tipo '!$B$9,IF(D132=9,'[3]Tipo '!$B$10,IF(D132=10,'[3]Tipo '!$B$11,IF(D132=11,'[3]Tipo '!$B$12,IF(D132=12,'[3]Tipo '!$B$13,IF(D132=13,'[3]Tipo '!$B$14,IF(D132=14,'[3]Tipo '!$B$15,IF(D132=15,'[3]Tipo '!$B$16,IF(D132=16,'[3]Tipo '!$B$17,IF(D132=17,'[3]Tipo '!$B$18,IF(D132=18,'[3]Tipo '!$B$19,IF(D132=19,'[3]Tipo '!$B$20,\"No ha seleccionado un tipo de contrato válido\")))))))))))))))))))","v":"CONTRATOS DE PRESTACIÓN DE SERVICIOS PROFESIONALES Y DE APOYO A LA GESTIÓN"},"Contratación directa","Prestación de servicios profesionales y de apoyo a la gestión, o para la ejecución de trabajos artísticos que sólo puedan encomendarse a determinadas personas naturales;","PRESTAR SUS SERVICIOS DE APOYO ADMINISTRATIVO EN LA PUBLICACIÓN DE PROCESOS CONTRACTUALES DEL FONDO DE DESARROLLO LOCAL DE LA CANDELARIA A TRAVÉS DE LAS PLATAFORMAS ELECTRÓNICAS SECOP","Inversión",45,{"$f":"IF(J132=1,'[3]Equivalencia BH-BMPT'!$D$2,IF(J132=2,'[3]Equivalencia BH-BMPT'!$D$3,IF(J132=3,'[3]Equivalencia BH-BMPT'!$D$4,IF(J132=4,'[3]Equivalencia BH-BMPT'!$D$5,IF(J132=5,'[3]Equivalencia BH-BMPT'!$D$6,IF(J132=6,'[3]Equivalencia BH-BMPT'!$D$7,IF(J132=7,'[3]Equivalencia BH-BMPT'!$D$8,IF(J132=8,'[3]Equivalencia BH-BMPT'!$D$9,IF(J132=9,'[3]Equivalencia BH-BMPT'!$D$10,IF(J132=10,'[3]Equivalencia BH-BMPT'!$D$11,IF(J132=11,'[3]Equivalencia BH-BMPT'!$D$12,IF(J132=12,'[3]Equivalencia BH-BMPT'!$D$13,IF(J132=13,'[3]Equivalencia BH-BMPT'!$D$14,IF(J132=14,'[3]Equivalencia BH-BMPT'!$D$15,IF(J132=15,'[3]Equivalencia BH-BMPT'!$D$16,IF(J132=16,'[3]Equivalencia BH-BMPT'!$D$17,IF(J132=17,'[3]Equivalencia BH-BMPT'!$D$18,IF(J132=18,'[3]Equivalencia BH-BMPT'!$D$19,IF(J132=19,'[3]Equivalencia BH-BMPT'!$D$20,IF(J132=20,'[3]Equivalencia BH-BMPT'!$D$21,IF(J132=21,'[3]Equivalencia BH-BMPT'!$D$22,IF(J132=22,'[3]Equivalencia BH-BMPT'!$D$23,IF(J132=23,'[3]Equivalencia BH-BMPT'!#REF!,IF(J132=24,'[3]Equivalencia BH-BMPT'!$D$25,IF(J132=25,'[3]Equivalencia BH-BMPT'!$D$26,IF(J132=26,'[3]Equivalencia BH-BMPT'!$D$27,IF(J132=27,'[3]Equivalencia BH-BMPT'!$D$28,IF(J132=28,'[3]Equivalencia BH-BMPT'!$D$29,IF(J132=29,'[3]Equivalencia BH-BMPT'!$D$30,IF(J132=30,'[3]Equivalencia BH-BMPT'!$D$31,IF(J132=31,'[3]Equivalencia BH-BMPT'!$D$32,IF(J132=32,'[3]Equivalencia BH-BMPT'!$D$33,IF(J132=33,'[3]Equivalencia BH-BMPT'!$D$34,IF(J132=34,'[3]Equivalencia BH-BMPT'!$D$35,IF(J132=35,'[3]Equivalencia BH-BMPT'!$D$36,IF(J132=36,'[3]Equivalencia BH-BMPT'!$D$37,IF(J132=37,'[3]Equivalencia BH-BMPT'!$D$38,IF(J132=38,'[3]Equivalencia BH-BMPT'!#REF!,IF(J132=39,'[3]Equivalencia BH-BMPT'!$D$40,IF(J132=40,'[3]Equivalencia BH-BMPT'!$D$41,IF(J132=41,'[3]Equivalencia BH-BMPT'!$D$42,IF(J132=42,'[3]Equivalencia BH-BMPT'!$D$43,IF(J132=43,'[3]Equivalencia BH-BMPT'!$D$44,IF(J132=44,'[3]Equivalencia BH-BMPT'!$D$45,IF(J132=45,'[3]Equivalencia BH-BMPT'!$D$46,\"No ha seleccionado un número de programa\")))))))))))))))))))))))))))))))))))))))))))))","v":"Gobernanza e influencia local, regional e internacional"},"1395",1010216582,"WILSON ENRIQUE GARCIA VALDERRAMA",6204199,null,null,null,2139379,8343578,5063196,"2017-10-04","2017-10-04","2018-01-29",117,null,null,null,"X",null,null,0.60683749825314748,false]
[97,2015,null,null,"CONTRATO DE OBRA PUBLICA","Licitación pública","No aplica","Seleccionar al proponente que ofrezca las mejores condiciones para contratar la consultoria para las fases I Y II Para el Proyecto CENTRO ADMINISTRATIVO LOCAL DE LA CANDELARIA FASE I  : formulacion del Plan y manejo , elaboracion del anteproyecto, realizacion de todos los tramites para su aprobacion , estudios topograficos y levantamiento arquitectonico , realizacion de titulos de titularidady tramites complementarios, FASE II : Diseño arqutectonico, estudios de suelos geotecnico , diseño estructural, diseño hidrosanitario, diseño de red de gas, diseño electrico, programacion de obra y elaboracion de presupuesto , sistema de alarmas contra hurtos , diseño de sistema de ventilacion mecanica, diseño de circuito cerrado de television , expedicion de la licencia de construccion,y demas permisos , de acuerdo con las caracteristicas que para tal fin se establecen para el presente pliego de condiciones","Inversión",45,{"$f":"IF(J133=1,'Equivalencia BH-BMPT'!$D$2,IF(J133=2,'Equivalencia BH-BMPT'!$D$3,IF(J133=3,'Equivalencia BH-BMPT'!$D$4,IF(J133=4,'Equivalencia BH-BMPT'!$D$5,IF(J133=5,'Equivalencia BH-BMPT'!$D$6,IF(J133=6,'Equivalencia BH-BMPT'!$D$7,IF(J133=7,'Equivalencia BH-BMPT'!$D$8,IF(J133=8,'Equivalencia BH-BMPT'!$D$9,IF(J133=9,'Equivalencia BH-BMPT'!$D$10,IF(J133=10,'Equivalencia BH-BMPT'!$D$11,IF(J133=11,'Equivalencia BH-BMPT'!$D$12,IF(J133=12,'Equivalencia BH-BMPT'!$D$13,IF(J133=13,'Equivalencia BH-BMPT'!$D$14,IF(J133=14,'Equivalencia BH-BMPT'!$D$15,IF(J133=15,'Equivalencia BH-BMPT'!$D$16,IF(J133=16,'Equivalencia BH-BMPT'!$D$17,IF(J133=17,'Equivalencia BH-BMPT'!$D$18,IF(J133=18,'Equivalencia BH-BMPT'!$D$19,IF(J133=19,'Equivalencia BH-BMPT'!$D$20,IF(J133=20,'Equivalencia BH-BMPT'!$D$21,IF(J133=21,'Equivalencia BH-BMPT'!$D$22,IF(J133=22,'Equivalencia BH-BMPT'!$D$23,IF(J133=23,'Equivalencia BH-BMPT'!#REF!,IF(J133=24,'Equivalencia BH-BMPT'!$D$25,IF(J133=25,'Equivalencia BH-BMPT'!$D$26,IF(J133=26,'Equivalencia BH-BMPT'!$D$27,IF(J133=27,'Equivalencia BH-BMPT'!$D$28,IF(J133=28,'Equivalencia BH-BMPT'!$D$29,IF(J133=29,'Equivalencia BH-BMPT'!$D$30,IF(J133=30,'Equivalencia BH-BMPT'!$D$31,IF(J133=31,'Equivalencia BH-BMPT'!$D$32,IF(J133=32,'Equivalencia BH-BMPT'!$D$33,IF(J133=33,'Equivalencia BH-BMPT'!$D$34,IF(J133=34,'Equivalencia BH-BMPT'!$D$35,IF(J133=35,'Equivalencia BH-BMPT'!$D$36,IF(J133=36,'Equivalencia BH-BMPT'!$D$37,IF(J133=37,'Equivalencia BH-BMPT'!$D$38,IF(J133=38,'Equivalencia BH-BMPT'!#REF!,IF(J133=39,'Equivalencia BH-BMPT'!$D$40,IF(J133=40,'Equivalencia BH-BMPT'!$D$41,IF(J133=41,'Equivalencia BH-BMPT'!$D$42,IF(J133=42,'Equivalencia BH-BMPT'!$D$43,IF(J133=43,'Equivalencia BH-BMPT'!$D$44,IF(J133=44,'Equivalencia BH-BMPT'!$D$45,IF(J133=45,'Equivalencia BH-BMPT'!$D$46,\"No ha seleccionado un número de programa\")))))))))))))))))))))))))))))))))))))))))))))","v":"Gobernanza e influencia local, regional e internacional"},"1395",null,"CONSORCIO ALEXSA",null,null,null,null,135231938,135231938,null,null,null,null,null,null,null,null,null,null,null,0,false]
[97,2017,"17-12-7298265",5,{"$f":"IF(D134=1,'[3]Tipo '!$B$2,IF(D134=2,'[3]Tipo '!$B$3,IF(D134=3,'[3]Tipo '!$B$4,IF(D134=4,'[3]Tipo '!$B$5,IF(D134=5,'[3]Tipo '!$B$6,IF(D134=6,'[3]Tipo '!$B$7,IF(D134=7,'[3]Tipo '!$B$8,IF(D134=8,'[3]Tipo '!$B$9,IF(D134=9,'[3]Tipo '!$B$10,IF(D134=10,'[3]Tipo '!$B$11,IF(D134=11,'[3]Tipo '!$B$12,IF(D134=12,'[3]Tipo '!$B$13,IF(D134=13,'[3]Tipo '!$B$14,IF(D134=14,'[3]Tipo '!$B$15,IF(D134=15,'[3]Tipo '!$B$16,IF(D134=16,'[3]Tipo '!$B$17,IF(D134=17,'[3]Tipo '!$B$18,IF(D134=18,'[3]Tipo '!$B$19,IF(D134=19,'[3]Tipo '!$B$20,\"No ha seleccionado un tipo de contrato válido\")))))))))))))))))))","v":"CONTRATOS DE PRESTACIÓN DE SERVICIOS PROFESIONALES Y DE APOYO A LA GESTIÓN"},"Contratación directa","Prestación de servicios profesionales y de apoyo a la gestión, o para la ejecución de trabajos artísticos que sólo puedan encomendarse a determinadas personas naturales;","PRESTAR SUS SERVICIOS PROFESIONALES DE APOYO EN LOS PROCESOS A CARGO DEL ÁREA DE GESTIÓN POLICIVA DE LA ALCALDÍA LOCAL DE LA CANDELARÍA PARA TEMAS DE ESTABLECIMIENTOS DE COMERCIO, CONTROL URBANÍSTICO, PROPIEDAD HORIZONTAL, ACCIONES CONSTITUCIONALES, OBRAS Y DERECHO DE PETICIÓN","Inversión",45,{"$f":"IF(J134=1,'[3]Equivalencia BH-BMPT'!$D$2,IF(J134=2,'[3]Equivalencia BH-BMPT'!$D$3,IF(J134=3,'[3]Equivalencia BH-BMPT'!$D$4,IF(J134=4,'[3]Equivalencia BH-BMPT'!$D$5,IF(J134=5,'[3]Equivalencia BH-BMPT'!$D$6,IF(J134=6,'[3]Equivalencia BH-BMPT'!$D$7,IF(J134=7,'[3]Equivalencia BH-BMPT'!$D$8,IF(J134=8,'[3]Equivalencia BH-BMPT'!$D$9,IF(J134=9,'[3]Equivalencia BH-BMPT'!$D$10,IF(J134=10,'[3]Equivalencia BH-BMPT'!$D$11,IF(J134=11,'[3]Equivalencia BH-BMPT'!$D$12,IF(J134=12,'[3]Equivalencia BH-BMPT'!$D$13,IF(J134=13,'[3]Equivalencia BH-BMPT'!$D$14,IF(J134=14,'[3]Equivalencia BH-BMPT'!$D$15,IF(J134=15,'[3]Equivalencia BH-BMPT'!$D$16,IF(J134=16,'[3]Equivalencia BH-BMPT'!$D$17,IF(J134=17,'[3]Equivalencia BH-BMPT'!$D$18,IF(J134=18,'[3]Equivalencia BH-BMPT'!$D$19,IF(J134=19,'[3]Equivalencia BH-BMPT'!$D$20,IF(J134=20,'[3]Equivalencia BH-BMPT'!$D$21,IF(J134=21,'[3]Equivalencia BH-BMPT'!$D$22,IF(J134=22,'[3]Equivalencia BH-BMPT'!$D$23,IF(J134=23,'[3]Equivalencia BH-BMPT'!#REF!,IF(J134=24,'[3]Equivalencia BH-BMPT'!$D$25,IF(J134=25,'[3]Equivalencia BH-BMPT'!$D$26,IF(J134=26,'[3]Equivalencia BH-BMPT'!$D$27,IF(J134=27,'[3]Equivalencia BH-BMPT'!$D$28,IF(J134=28,'[3]Equivalencia BH-BMPT'!$D$29,IF(J134=29,'[3]Equivalencia BH-BMPT'!$D$30,IF(J134=30,'[3]Equivalencia BH-BMPT'!$D$31,IF(J134=31,'[3]Equivalencia BH-BMPT'!$D$32,IF(J134=32,'[3]Equivalencia BH-BMPT'!$D$33,IF(J134=33,'[3]Equivalencia BH-BMPT'!$D$34,IF(J134=34,'[3]Equivalencia BH-BMPT'!$D$35,IF(J134=35,'[3]Equivalencia BH-BMPT'!$D$36,IF(J134=36,'[3]Equivalencia BH-BMPT'!$D$37,IF(J134=37,'[3]Equivalencia BH-BMPT'!$D$38,IF(J134=38,'[3]Equivalencia BH-BMPT'!#REF!,IF(J134=39,'[3]Equivalencia BH-BMPT'!$D$40,IF(J134=40,'[3]Equivalencia BH-BMPT'!$D$41,IF(J134=41,'[3]Equivalencia BH-BMPT'!$D$42,IF(J134=42,'[3]Equivalencia BH-BMPT'!$D$43,IF(J134=43,'[3]Equivalencia BH-BMPT'!$D$44,IF(J134=44,'[3]Equivalencia BH-BMPT'!$D$45,IF(J134=45,'[3]Equivalencia BH-BMPT'!$D$46,\"No ha seleccionado un número de programa\")))))))))))))))))))))))))))))))))))))))))))))","v":"Gobernanza e influencia local, regional e internacional"},"1395",11333166,"JULIO ALBERTO CENDALES BELLO",7844392,null,null,null,null,7844392,5815670,"2017-11-03","2017-11-03","2017-12-30",58,null,null,null,null,"X",null,0.74137931913652455,false]
[99,2017,"17-12-7298569",5,{"$f":"IF(D135=1,'[4]Tipo '!$B$2,IF(D135=2,'[4]Tipo '!$B$3,IF(D135=3,'[4]Tipo '!$B$4,IF(D135=4,'[4]Tipo '!$B$5,IF(D135=5,'[4]Tipo '!$B$6,IF(D135=6,'[4]Tipo '!$B$7,IF(D135=7,'[4]Tipo '!$B$8,IF(D135=8,'[4]Tipo '!$B$9,IF(D135=9,'[4]Tipo '!$B$10,IF(D135=10,'[4]Tipo '!$B$11,IF(D135=11,'[4]Tipo '!$B$12,IF(D135=12,'[4]Tipo '!$B$13,IF(D135=13,'[4]Tipo '!$B$14,IF(D135=14,'[4]Tipo '!$B$15,IF(D135=15,'[4]Tipo '!$B$16,IF(D135=16,'[4]Tipo '!$B$17,IF(D135=17,'[4]Tipo '!$B$18,IF(D135=18,'[4]Tipo '!$B$19,IF(D135=19,'[4]Tipo '!$B$20,\"No ha seleccionado un tipo de contrato válido\")))))))))))))))))))","v":"CONTRATOS DE PRESTACIÓN DE SERVICIOS PROFESIONALES Y DE APOYO A LA GESTIÓN"},"Contratación directa","Prestación de servicios profesionales y de apoyo a la gestión, o para la ejecución de trabajos artísticos que sólo puedan encomendarse a determinadas personas naturales;","PRESTAR LOS SERVICIOS DE APOYO AL DESPACHO DEL ALCALDE LOCAL DE LA CANDELARIA EN TEMAS ASISTENCIALES Y DE GESTIÓN DOCUMENTAL","Inversión",45,{"$f":"IF(J135=1,'[4]Equivalencia BH-BMPT'!$D$2,IF(J135=2,'[4]Equivalencia BH-BMPT'!$D$3,IF(J135=3,'[4]Equivalencia BH-BMPT'!$D$4,IF(J135=4,'[4]Equivalencia BH-BMPT'!$D$5,IF(J135=5,'[4]Equivalencia BH-BMPT'!$D$6,IF(J135=6,'[4]Equivalencia BH-BMPT'!$D$7,IF(J135=7,'[4]Equivalencia BH-BMPT'!$D$8,IF(J135=8,'[4]Equivalencia BH-BMPT'!$D$9,IF(J135=9,'[4]Equivalencia BH-BMPT'!$D$10,IF(J135=10,'[4]Equivalencia BH-BMPT'!$D$11,IF(J135=11,'[4]Equivalencia BH-BMPT'!$D$12,IF(J135=12,'[4]Equivalencia BH-BMPT'!$D$13,IF(J135=13,'[4]Equivalencia BH-BMPT'!$D$14,IF(J135=14,'[4]Equivalencia BH-BMPT'!$D$15,IF(J135=15,'[4]Equivalencia BH-BMPT'!$D$16,IF(J135=16,'[4]Equivalencia BH-BMPT'!$D$17,IF(J135=17,'[4]Equivalencia BH-BMPT'!$D$18,IF(J135=18,'[4]Equivalencia BH-BMPT'!$D$19,IF(J135=19,'[4]Equivalencia BH-BMPT'!$D$20,IF(J135=20,'[4]Equivalencia BH-BMPT'!$D$21,IF(J135=21,'[4]Equivalencia BH-BMPT'!$D$22,IF(J135=22,'[4]Equivalencia BH-BMPT'!$D$23,IF(J135=23,'[4]Equivalencia BH-BMPT'!#REF!,IF(J135=24,'[4]Equivalencia BH-BMPT'!$D$25,IF(J135=25,'[4]Equivalencia BH-BMPT'!$D$26,IF(J135=26,'[4]Equivalencia BH-BMPT'!$D$27,IF(J135=27,'[4]Equivalencia BH-BMPT'!$D$28,IF(J135=28,'[4]Equivalencia BH-BMPT'!$D$29,IF(J135=29,'[4]Equivalencia BH-BMPT'!$D$30,IF(J135=30,'[4]Equivalencia BH-BMPT'!$D$31,IF(J135=31,'[4]Equivalencia BH-BMPT'!$D$32,IF(J135=32,'[4]Equivalencia BH-BMPT'!$D$33,IF(J135=33,'[4]Equivalencia BH-BMPT'!$D$34,IF(J135=34,'[4]Equivalencia BH-BMPT'!$D$35,IF(J135=35,'[4]Equivalencia BH-BMPT'!$D$36,IF(J135=36,'[4]Equivalencia BH-BMPT'!$D$37,IF(J135=37,'[4]Equivalencia BH-BMPT'!$D$38,IF(J135=38,'[4]Equivalencia BH-BMPT'!#REF!,IF(J135=39,'[4]Equivalencia BH-BMPT'!$D$40,IF(J135=40,'[4]Equivalencia BH-BMPT'!$D$41,IF(J135=41,'[4]Equivalencia BH-BMPT'!$D$42,IF(J135=42,'[4]Equivalencia BH-BMPT'!$D$43,IF(J135=43,'[4]Equivalencia BH-BMPT'!$D$44,IF(J135=44,'[4]Equivalencia BH-BMPT'!$D$45,IF(J135=45,'[4]Equivalencia BH-BMPT'!$D$46,\"No ha seleccionado un número de programa\")))))))))))))))))))))))))))))))))))))))))))))","v":"Gobernanza e influencia local, regional e internacional"},"1395",79798858,"WALTON VELASQUEZ SANABRIA",3558008,null,null,null,1006984,4564992,2438891,"2017-11-08","2017-11-09","2017-12-30",53,null,null,null,"X",null,null,0.53425964382851054,false]
[101,2017,"17-12-7395767",16,{"$f":"IF(D136=1,'[4]Tipo '!$B$2,IF(D136=2,'[4]Tipo '!$B$3,IF(D136=3,'[4]Tipo '!$B$4,IF(D136=4,'[4]Tipo '!$B$5,IF(D136=5,'[4]Tipo '!$B$6,IF(D136=6,'[4]Tipo '!$B$7,IF(D136=7,'[4]Tipo '!$B$8,IF(D136=8,'[4]Tipo '!$B$9,IF(D136=9,'[4]Tipo '!$B$10,IF(D136=10,'[4]Tipo '!$B$11,IF(D136=11,'[4]Tipo '!$B$12,IF(D136=12,'[4]Tipo '!$B$13,IF(D136=13,'[4]Tipo '!$B$14,IF(D136=14,'[4]Tipo '!$B$15,IF(D136=15,'[4]Tipo '!$B$16,IF(D136=16,'[4]Tipo '!$B$17,IF(D136=17,'[4]Tipo '!$B$18,IF(D136=18,'[4]Tipo '!$B$19,IF(D136=19,'[4]Tipo '!$B$20,\"No ha seleccionado un tipo de contrato válido\")))))))))))))))))))","v":"CONTRATOS INTERADMINISTRATIVOS"},"Contratación directa","Contratos interadministrativos","AUNAR ESFUERZOS TÉCNICOS, ADMINISTRATIVOS Y FINANCIEROS PARA REALIZAR ACTIVIDADES DE INTERVENCION FISICA, SOCIAL Y MANTENIMIENTO DE UN PUNTO CRITICO CORRESPONDIENTE AL SEPARADOR DE LA CARRERA TERCERA (3) ESTES, ENTRE CALLE Y 10 DE LA LOCALIDAD DE LA CANDELARIA","Inversión",45,{"$f":"IF(J136=1,'[4]Equivalencia BH-BMPT'!$D$2,IF(J136=2,'[4]Equivalencia BH-BMPT'!$D$3,IF(J136=3,'[4]Equivalencia BH-BMPT'!$D$4,IF(J136=4,'[4]Equivalencia BH-BMPT'!$D$5,IF(J136=5,'[4]Equivalencia BH-BMPT'!$D$6,IF(J136=6,'[4]Equivalencia BH-BMPT'!$D$7,IF(J136=7,'[4]Equivalencia BH-BMPT'!$D$8,IF(J136=8,'[4]Equivalencia BH-BMPT'!$D$9,IF(J136=9,'[4]Equivalencia BH-BMPT'!$D$10,IF(J136=10,'[4]Equivalencia BH-BMPT'!$D$11,IF(J136=11,'[4]Equivalencia BH-BMPT'!$D$12,IF(J136=12,'[4]Equivalencia BH-BMPT'!$D$13,IF(J136=13,'[4]Equivalencia BH-BMPT'!$D$14,IF(J136=14,'[4]Equivalencia BH-BMPT'!$D$15,IF(J136=15,'[4]Equivalencia BH-BMPT'!$D$16,IF(J136=16,'[4]Equivalencia BH-BMPT'!$D$17,IF(J136=17,'[4]Equivalencia BH-BMPT'!$D$18,IF(J136=18,'[4]Equivalencia BH-BMPT'!$D$19,IF(J136=19,'[4]Equivalencia BH-BMPT'!$D$20,IF(J136=20,'[4]Equivalencia BH-BMPT'!$D$21,IF(J136=21,'[4]Equivalencia BH-BMPT'!$D$22,IF(J136=22,'[4]Equivalencia BH-BMPT'!$D$23,IF(J136=23,'[4]Equivalencia BH-BMPT'!#REF!,IF(J136=24,'[4]Equivalencia BH-BMPT'!$D$25,IF(J136=25,'[4]Equivalencia BH-BMPT'!$D$26,IF(J136=26,'[4]Equivalencia BH-BMPT'!$D$27,IF(J136=27,'[4]Equivalencia BH-BMPT'!$D$28,IF(J136=28,'[4]Equivalencia BH-BMPT'!$D$29,IF(J136=29,'[4]Equivalencia BH-BMPT'!$D$30,IF(J136=30,'[4]Equivalencia BH-BMPT'!$D$31,IF(J136=31,'[4]Equivalencia BH-BMPT'!$D$32,IF(J136=32,'[4]Equivalencia BH-BMPT'!$D$33,IF(J136=33,'[4]Equivalencia BH-BMPT'!$D$34,IF(J136=34,'[4]Equivalencia BH-BMPT'!$D$35,IF(J136=35,'[4]Equivalencia BH-BMPT'!$D$36,IF(J136=36,'[4]Equivalencia BH-BMPT'!$D$37,IF(J136=37,'[4]Equivalencia BH-BMPT'!$D$38,IF(J136=38,'[4]Equivalencia BH-BMPT'!#REF!,IF(J136=39,'[4]Equivalencia BH-BMPT'!$D$40,IF(J136=40,'[4]Equivalencia BH-BMPT'!$D$41,IF(J136=41,'[4]Equivalencia BH-BMPT'!$D$42,IF(J136=42,'[4]Equivalencia BH-BMPT'!$D$43,IF(J136=43,'[4]Equivalencia BH-BMPT'!$D$44,IF(J136=44,'[4]Equivalencia BH-BMPT'!$D$45,IF(J136=45,'[4]Equivalencia BH-BMPT'!$D$46,\"No ha seleccionado un número de programa\")))))))))))))))))))))))))))))))))))))))))))))","v":"Gobernanza e influencia local, regional e internacional"},"1395",830128286,"AGUAS BOGOTA SA ESP",15862662,null,null,null,null,15862662,null,"2017-11-10","2017-01-15","2018-08-16",210,null,null,"X",null,null,null,0,false]
[104,2017,"17-12-7473152",5,{"$f":"IF(D137=1,'[4]Tipo '!$B$2,IF(D137=2,'[4]Tipo '!$B$3,IF(D137=3,'[4]Tipo '!$B$4,IF(D137=4,'[4]Tipo '!$B$5,IF(D137=5,'[4]Tipo '!$B$6,IF(D137=6,'[4]Tipo '!$B$7,IF(D137=7,'[4]Tipo '!$B$8,IF(D137=8,'[4]Tipo '!$B$9,IF(D137=9,'[4]Tipo '!$B$10,IF(D137=10,'[4]Tipo '!$B$11,IF(D137=11,'[4]Tipo '!$B$12,IF(D137=12,'[4]Tipo '!$B$13,IF(D137=13,'[4]Tipo '!$B$14,IF(D137=14,'[4]Tipo '!$B$15,IF(D137=15,'[4]Tipo '!$B$16,IF(D137=16,'[4]Tipo '!$B$17,IF(D137=17,'[4]Tipo '!$B$18,IF(D137=18,'[4]Tipo '!$B$19,IF(D137=19,'[4]Tipo '!$B$20,\"No ha seleccionado un tipo de contrato válido\")))))))))))))))))))","v":"CONTRATOS DE PRESTACIÓN DE SERVICIOS PROFESIONALES Y DE APOYO A LA GESTIÓN"},"Contratación directa","Prestación de servicios profesionales y de apoyo a la gestión, o para la ejecución de trabajos artísticos que sólo puedan encomendarse a determinadas personas naturales;","PRESTAR LOS SERVICIOS PROFESIONALES PARA APOYAR EN LA ADMINISTRACION DE CASAS COMUNITARIAS DE LA LOCALIDAD DE CONFORMIDAD CON EL ACUERDO LOCAL 006 DE 2013","Inversión",45,{"$f":"IF(J137=1,'[4]Equivalencia BH-BMPT'!$D$2,IF(J137=2,'[4]Equivalencia BH-BMPT'!$D$3,IF(J137=3,'[4]Equivalencia BH-BMPT'!$D$4,IF(J137=4,'[4]Equivalencia BH-BMPT'!$D$5,IF(J137=5,'[4]Equivalencia BH-BMPT'!$D$6,IF(J137=6,'[4]Equivalencia BH-BMPT'!$D$7,IF(J137=7,'[4]Equivalencia BH-BMPT'!$D$8,IF(J137=8,'[4]Equivalencia BH-BMPT'!$D$9,IF(J137=9,'[4]Equivalencia BH-BMPT'!$D$10,IF(J137=10,'[4]Equivalencia BH-BMPT'!$D$11,IF(J137=11,'[4]Equivalencia BH-BMPT'!$D$12,IF(J137=12,'[4]Equivalencia BH-BMPT'!$D$13,IF(J137=13,'[4]Equivalencia BH-BMPT'!$D$14,IF(J137=14,'[4]Equivalencia BH-BMPT'!$D$15,IF(J137=15,'[4]Equivalencia BH-BMPT'!$D$16,IF(J137=16,'[4]Equivalencia BH-BMPT'!$D$17,IF(J137=17,'[4]Equivalencia BH-BMPT'!$D$18,IF(J137=18,'[4]Equivalencia BH-BMPT'!$D$19,IF(J137=19,'[4]Equivalencia BH-BMPT'!$D$20,IF(J137=20,'[4]Equivalencia BH-BMPT'!$D$21,IF(J137=21,'[4]Equivalencia BH-BMPT'!$D$22,IF(J137=22,'[4]Equivalencia BH-BMPT'!$D$23,IF(J137=23,'[4]Equivalencia BH-BMPT'!#REF!,IF(J137=24,'[4]Equivalencia BH-BMPT'!$D$25,IF(J137=25,'[4]Equivalencia BH-BMPT'!$D$26,IF(J137=26,'[4]Equivalencia BH-BMPT'!$D$27,IF(J137=27,'[4]Equivalencia BH-BMPT'!$D$28,IF(J137=28,'[4]Equivalencia BH-BMPT'!$D$29,IF(J137=29,'[4]Equivalencia BH-BMPT'!$D$30,IF(J137=30,'[4]Equivalencia BH-BMPT'!$D$31,IF(J137=31,'[4]Equivalencia BH-BMPT'!$D$32,IF(J137=32,'[4]Equivalencia BH-BMPT'!$D$33,IF(J137=33,'[4]Equivalencia BH-BMPT'!$D$34,IF(J137=34,'[4]Equivalencia BH-BMPT'!$D$35,IF(J137=35,'[4]Equivalencia BH-BMPT'!$D$36,IF(J137=36,'[4]Equivalencia BH-BMPT'!$D$37,IF(J137=37,'[4]Equivalencia BH-BMPT'!$D$38,IF(J137=38,'[4]Equivalencia BH-BMPT'!#REF!,IF(J137=39,'[4]Equivalencia BH-BMPT'!$D$40,IF(J137=40,'[4]Equivalencia BH-BMPT'!$D$41,IF(J137=41,'[4]Equivalencia BH-BMPT'!$D$42,IF(J137=42,'[4]Equivalencia BH-BMPT'!$D$43,IF(J137=43,'[4]Equivalencia BH-BMPT'!$D$44,IF(J137=44,'[4]Equivalencia BH-BMPT'!$D$45,IF(J137=45,'[4]Equivalencia BH-BMPT'!$D$46,\"No ha seleccionado un número de programa\")))))))))))))))))))))))))))))))))))))))))))))","v":"Gobernanza e influencia local, regional e internacional"},"1395",94541052,"KEWIN CAMILO GONZALEZ LARGO",3628387,null,null,null,null,3628387,null,"2017-12-07","2017-12-11","2017-12-30",24,null,null,null,null,"X",null,0,false]
[118,2016,null,null,"INTERVENTORIA","CONCURSO DE MÉRITOS","No aplica"," EJECUTAR A PRECIOS UNITARIOS FIJOS, SIN FORMULA DE REAJUSTE, LAS OBRAS PARA REPARACIONES LOCATIVAS, MANTENIMIENTO PREVENTIVO Y CORRECTIVO DE LOS BIENES INMUEBLES DEL FONDO DE DESARROLLO LOCAL DE LA CANDELARIA","Inversión",45,{"$f":"IF(J138=1,'Equivalencia BH-BMPT'!$D$2,IF(J138=2,'Equivalencia BH-BMPT'!$D$3,IF(J138=3,'Equivalencia BH-BMPT'!$D$4,IF(J138=4,'Equivalencia BH-BMPT'!$D$5,IF(J138=5,'Equivalencia BH-BMPT'!$D$6,IF(J138=6,'Equivalencia BH-BMPT'!$D$7,IF(J138=7,'Equivalencia BH-BMPT'!$D$8,IF(J138=8,'Equivalencia BH-BMPT'!$D$9,IF(J138=9,'Equivalencia BH-BMPT'!$D$10,IF(J138=10,'Equivalencia BH-BMPT'!$D$11,IF(J138=11,'Equivalencia BH-BMPT'!$D$12,IF(J138=12,'Equivalencia BH-BMPT'!$D$13,IF(J138=13,'Equivalencia BH-BMPT'!$D$14,IF(J138=14,'Equivalencia BH-BMPT'!$D$15,IF(J138=15,'Equivalencia BH-BMPT'!$D$16,IF(J138=16,'Equivalencia BH-BMPT'!$D$17,IF(J138=17,'Equivalencia BH-BMPT'!$D$18,IF(J138=18,'Equivalencia BH-BMPT'!$D$19,IF(J138=19,'Equivalencia BH-BMPT'!$D$20,IF(J138=20,'Equivalencia BH-BMPT'!$D$21,IF(J138=21,'Equivalencia BH-BMPT'!$D$22,IF(J138=22,'Equivalencia BH-BMPT'!$D$23,IF(J138=23,'Equivalencia BH-BMPT'!#REF!,IF(J138=24,'Equivalencia BH-BMPT'!$D$25,IF(J138=25,'Equivalencia BH-BMPT'!$D$26,IF(J138=26,'Equivalencia BH-BMPT'!$D$27,IF(J138=27,'Equivalencia BH-BMPT'!$D$28,IF(J138=28,'Equivalencia BH-BMPT'!$D$29,IF(J138=29,'Equivalencia BH-BMPT'!$D$30,IF(J138=30,'Equivalencia BH-BMPT'!$D$31,IF(J138=31,'Equivalencia BH-BMPT'!$D$32,IF(J138=32,'Equivalencia BH-BMPT'!$D$33,IF(J138=33,'Equivalencia BH-BMPT'!$D$34,IF(J138=34,'Equivalencia BH-BMPT'!$D$35,IF(J138=35,'Equivalencia BH-BMPT'!$D$36,IF(J138=36,'Equivalencia BH-BMPT'!$D$37,IF(J138=37,'Equivalencia BH-BMPT'!$D$38,IF(J138=38,'Equivalencia BH-BMPT'!#REF!,IF(J138=39,'Equivalencia BH-BMPT'!$D$40,IF(J138=40,'Equivalencia BH-BMPT'!$D$41,IF(J138=41,'Equivalencia BH-BMPT'!$D$42,IF(J138=42,'Equivalencia BH-BMPT'!$D$43,IF(J138=43,'Equivalencia BH-BMPT'!$D$44,IF(J138=44,'Equivalencia BH-BMPT'!$D$45,IF(J138=45,'Equivalencia BH-BMPT'!$D$46,\"No ha seleccionado un número de programa\")))))))))))))))))))))))))))))))))))))))))))))","v":"Gobernanza e influencia local, regional e internacional"},"1395",null,"CONSORCIO MANTENIMIENTO CNR",null,757228,null,null,44957554,{"$f":"O138+Q138+S138-P138","v":44200326},44200326,null,null,null,null,null,null,null,null,null,null,1,false]
[120,2016,null,null,"INTERVENTORIA","CONCURSO DE MÉRITOS","No aplica","INTERVENTORIA TÉCNICA, ADMINISTRATIVA, FINANCIERA, SOCIAL, AMBIENTAL Y SISO DEL CONTRATO DE OBRA QUE SE DERIVE DE LAS SELECCIONES ABREVIADAS DE MENOR CUANTÍA FDLC SAMC 038 Y FDLC 039 DE 2016 O LA QUE HAGA SUS VECES, QUE REFIERE A ¿EJECUTAR A PRECIOS UNITARIOS FIJOS, SIN FORMULA DE REAJUSTE, LAS OBRAS PARA DOTAR DE UN TANQUE DE ALMACENAMIENTO DE AGUA POTABLE, ADECUAR LAS INSTALACIONES HIDRÁULICAS SANITARIAS Y ELÉCTRICAS, REPARACIONES LOCATIVAS, MANTENIMIENTO PREVENTIVO Y CORRECTIVO DE LA UNIDAD BÁSICA DE ATENCIÓN EN SALUD- UBA DE LA  LOCALIDAD DE LA CANDELARIA¿ Y ¿EJECUTAR A PRECIOS UNITARIOS FIJOS, SIN FÓRMULA DE REAJUSTE, LAS OBRAS PARA REPARACIONES LOCATIVAS, MANTENIMIENTO PREVENTIVO Y CORRECTIVO DE LOS BIENES INMUEBLES DEL FONDO DE DESARROLLO LOCAL DE LA CANDELARIA","Inversión",45,{"$f":"IF(J139=1,'Equivalencia BH-BMPT'!$D$2,IF(J139=2,'Equivalencia BH-BMPT'!$D$3,IF(J139=3,'Equivalencia BH-BMPT'!$D$4,IF(J139=4,'Equivalencia BH-BMPT'!$D$5,IF(J139=5,'Equivalencia BH-BMPT'!$D$6,IF(J139=6,'Equivalencia BH-BMPT'!$D$7,IF(J139=7,'Equivalencia BH-BMPT'!$D$8,IF(J139=8,'Equivalencia BH-BMPT'!$D$9,IF(J139=9,'Equivalencia BH-BMPT'!$D$10,IF(J139=10,'Equivalencia BH-BMPT'!$D$11,IF(J139=11,'Equivalencia BH-BMPT'!$D$12,IF(J139=12,'Equivalencia BH-BMPT'!$D$13,IF(J139=13,'Equivalencia BH-BMPT'!$D$14,IF(J139=14,'Equivalencia BH-BMPT'!$D$15,IF(J139=15,'Equivalencia BH-BMPT'!$D$16,IF(J139=16,'Equivalencia BH-BMPT'!$D$17,IF(J139=17,'Equivalencia BH-BMPT'!$D$18,IF(J139=18,'Equivalencia BH-BMPT'!$D$19,IF(J139=19,'Equivalencia BH-BMPT'!$D$20,IF(J139=20,'Equivalencia BH-BMPT'!$D$21,IF(J139=21,'Equivalencia BH-BMPT'!$D$22,IF(J139=22,'Equivalencia BH-BMPT'!$D$23,IF(J139=23,'Equivalencia BH-BMPT'!#REF!,IF(J139=24,'Equivalencia BH-BMPT'!$D$25,IF(J139=25,'Equivalencia BH-BMPT'!$D$26,IF(J139=26,'Equivalencia BH-BMPT'!$D$27,IF(J139=27,'Equivalencia BH-BMPT'!$D$28,IF(J139=28,'Equivalencia BH-BMPT'!$D$29,IF(J139=29,'Equivalencia BH-BMPT'!$D$30,IF(J139=30,'Equivalencia BH-BMPT'!$D$31,IF(J139=31,'Equivalencia BH-BMPT'!$D$32,IF(J139=32,'Equivalencia BH-BMPT'!$D$33,IF(J139=33,'Equivalencia BH-BMPT'!$D$34,IF(J139=34,'Equivalencia BH-BMPT'!$D$35,IF(J139=35,'Equivalencia BH-BMPT'!$D$36,IF(J139=36,'Equivalencia BH-BMPT'!$D$37,IF(J139=37,'Equivalencia BH-BMPT'!$D$38,IF(J139=38,'Equivalencia BH-BMPT'!#REF!,IF(J139=39,'Equivalencia BH-BMPT'!$D$40,IF(J139=40,'Equivalencia BH-BMPT'!$D$41,IF(J139=41,'Equivalencia BH-BMPT'!$D$42,IF(J139=42,'Equivalencia BH-BMPT'!$D$43,IF(J139=43,'Equivalencia BH-BMPT'!$D$44,IF(J139=44,'Equivalencia BH-BMPT'!$D$45,IF(J139=45,'Equivalencia BH-BMPT'!$D$46,\"No ha seleccionado un número de programa\")))))))))))))))))))))))))))))))))))))))))))))","v":"Gobernanza e influencia local, regional e internacional"},"1395",null,"CONSORCIO I CANDELARIA",null,null,null,null,11995194,{"$f":"O139+Q139+S139","v":11995194},11995194,"2017-09-08",null,null,null,null,null,null,null,null,null,1,false]
[null,2016,"CUENTA DE COBRO",null,null,null,"No aplica","PAGO HONORARIOS EDILES","Inversión",45,{"$f":"IF(J140=1,'Equivalencia BH-BMPT'!$D$2,IF(J140=2,'Equivalencia BH-BMPT'!$D$3,IF(J140=3,'Equivalencia BH-BMPT'!$D$4,IF(J140=4,'Equivalencia BH-BMPT'!$D$5,IF(J140=5,'Equivalencia BH-BMPT'!$D$6,IF(J140=6,'Equivalencia BH-BMPT'!$D$7,IF(J140=7,'Equivalencia BH-BMPT'!$D$8,IF(J140=8,'Equivalencia BH-BMPT'!$D$9,IF(J140=9,'Equivalencia BH-BMPT'!$D$10,IF(J140=10,'Equivalencia BH-BMPT'!$D$11,IF(J140=11,'Equivalencia BH-BMPT'!$D$12,IF(J140=12,'Equivalencia BH-BMPT'!$D$13,IF(J140=13,'Equivalencia BH-BMPT'!$D$14,IF(J140=14,'Equivalencia BH-BMPT'!$D$15,IF(J140=15,'Equivalencia BH-BMPT'!$D$16,IF(J140=16,'Equivalencia BH-BMPT'!$D$17,IF(J140=17,'Equivalencia BH-BMPT'!$D$18,IF(J140=18,'Equivalencia BH-BMPT'!$D$19,IF(J140=19,'Equivalencia BH-BMPT'!$D$20,IF(J140=20,'Equivalencia BH-BMPT'!$D$21,IF(J140=21,'Equivalencia BH-BMPT'!$D$22,IF(J140=22,'Equivalencia BH-BMPT'!$D$23,IF(J140=23,'Equivalencia BH-BMPT'!#REF!,IF(J140=24,'Equivalencia BH-BMPT'!$D$25,IF(J140=25,'Equivalencia BH-BMPT'!$D$26,IF(J140=26,'Equivalencia BH-BMPT'!$D$27,IF(J140=27,'Equivalencia BH-BMPT'!$D$28,IF(J140=28,'Equivalencia BH-BMPT'!$D$29,IF(J140=29,'Equivalencia BH-BMPT'!$D$30,IF(J140=30,'Equivalencia BH-BMPT'!$D$31,IF(J140=31,'Equivalencia BH-BMPT'!$D$32,IF(J140=32,'Equivalencia BH-BMPT'!$D$33,IF(J140=33,'Equivalencia BH-BMPT'!$D$34,IF(J140=34,'Equivalencia BH-BMPT'!$D$35,IF(J140=35,'Equivalencia BH-BMPT'!$D$36,IF(J140=36,'Equivalencia BH-BMPT'!$D$37,IF(J140=37,'Equivalencia BH-BMPT'!$D$38,IF(J140=38,'Equivalencia BH-BMPT'!#REF!,IF(J140=39,'Equivalencia BH-BMPT'!$D$40,IF(J140=40,'Equivalencia BH-BMPT'!$D$41,IF(J140=41,'Equivalencia BH-BMPT'!$D$42,IF(J140=42,'Equivalencia BH-BMPT'!$D$43,IF(J140=43,'Equivalencia BH-BMPT'!$D$44,IF(J140=44,'Equivalencia BH-BMPT'!$D$45,IF(J140=45,'Equivalencia BH-BMPT'!$D$46,\"No ha seleccionado un número de programa\")))))))))))))))))))))))))))))))))))))))))))))","v":"Gobernanza e influencia local, regional e internacional"},"1395",null,"PAGO HONORARIOS EDILES",null,null,null,null,543880356,543880356,{"$f":"P140+R140+T140","v":543880356},"2017-01-31","2017-01-31","2017-12-30",363,null,null,null,null,"X",null,1,false]
[67,2017,"17-12-6691221",5,{"$f":"IF(D141=1,'[1]Tipo '!$B$2,IF(D141=2,'[1]Tipo '!$B$3,IF(D141=3,'[1]Tipo '!$B$4,IF(D141=4,'[1]Tipo '!$B$5,IF(D141=5,'[1]Tipo '!$B$6,IF(D141=6,'[1]Tipo '!$B$7,IF(D141=7,'[1]Tipo '!$B$8,IF(D141=8,'[1]Tipo '!$B$9,IF(D141=9,'[1]Tipo '!$B$10,IF(D141=10,'[1]Tipo '!$B$11,IF(D141=11,'[1]Tipo '!$B$12,IF(D141=12,'[1]Tipo '!$B$13,IF(D141=13,'[1]Tipo '!$B$14,IF(D141=14,'[1]Tipo '!$B$15,IF(D141=15,'[1]Tipo '!$B$16,IF(D141=16,'[1]Tipo '!$B$17,IF(D141=17,'[1]Tipo '!$B$18,IF(D141=18,'[1]Tipo '!$B$19,IF(D141=19,'[1]Tipo '!$B$20,\"No ha seleccionado un tipo de contrato válido\")))))))))))))))))))","v":"CONTRATOS DE PRESTACIÓN DE SERVICIOS PROFESIONALES Y DE APOYO A LA GESTIÓN"},"Contratación directa","Prestación de servicios profesionales y de apoyo a la gestión, o para la ejecución de trabajos artísticos que sólo puedan encomendarse a determinadas personas naturales;","PRESTACIÓN DE SERVICIOS PROFESIONALES EN LA IMPLEMENTACIÓN DE ACCIONES Y ESTRATEGIAS CULTURALES, MUSICALES Y ARTÍSTICAS ENFOCADAS A LAS INSTANCIAS DE PARTICIPACIÓN DE LA LOCALIDAD LA CANDELARIA  DE ACUERDO CON EL PROGRAMA \"GOBERNANZA E INFLUENCIA LOCAL, REGIONAL E INTERNACIONAL - PROYECTO 1396 CANDELARIA MAS PARTICIPATIVA","Inversión",45,{"$f":"IF(J141=1,'[1]Equivalencia BH-BMPT'!$D$2,IF(J141=2,'[1]Equivalencia BH-BMPT'!$D$3,IF(J141=3,'[1]Equivalencia BH-BMPT'!$D$4,IF(J141=4,'[1]Equivalencia BH-BMPT'!$D$5,IF(J141=5,'[1]Equivalencia BH-BMPT'!$D$6,IF(J141=6,'[1]Equivalencia BH-BMPT'!$D$7,IF(J141=7,'[1]Equivalencia BH-BMPT'!$D$8,IF(J141=8,'[1]Equivalencia BH-BMPT'!$D$9,IF(J141=9,'[1]Equivalencia BH-BMPT'!$D$10,IF(J141=10,'[1]Equivalencia BH-BMPT'!$D$11,IF(J141=11,'[1]Equivalencia BH-BMPT'!$D$12,IF(J141=12,'[1]Equivalencia BH-BMPT'!$D$13,IF(J141=13,'[1]Equivalencia BH-BMPT'!$D$14,IF(J141=14,'[1]Equivalencia BH-BMPT'!$D$15,IF(J141=15,'[1]Equivalencia BH-BMPT'!$D$16,IF(J141=16,'[1]Equivalencia BH-BMPT'!$D$17,IF(J141=17,'[1]Equivalencia BH-BMPT'!$D$18,IF(J141=18,'[1]Equivalencia BH-BMPT'!$D$19,IF(J141=19,'[1]Equivalencia BH-BMPT'!$D$20,IF(J141=20,'[1]Equivalencia BH-BMPT'!$D$21,IF(J141=21,'[1]Equivalencia BH-BMPT'!$D$22,IF(J141=22,'[1]Equivalencia BH-BMPT'!$D$23,IF(J141=23,'[1]Equivalencia BH-BMPT'!#REF!,IF(J141=24,'[1]Equivalencia BH-BMPT'!$D$25,IF(J141=25,'[1]Equivalencia BH-BMPT'!$D$26,IF(J141=26,'[1]Equivalencia BH-BMPT'!$D$27,IF(J141=27,'[1]Equivalencia BH-BMPT'!$D$28,IF(J141=28,'[1]Equivalencia BH-BMPT'!$D$29,IF(J141=29,'[1]Equivalencia BH-BMPT'!$D$30,IF(J141=30,'[1]Equivalencia BH-BMPT'!$D$31,IF(J141=31,'[1]Equivalencia BH-BMPT'!$D$32,IF(J141=32,'[1]Equivalencia BH-BMPT'!$D$33,IF(J141=33,'[1]Equivalencia BH-BMPT'!$D$34,IF(J141=34,'[1]Equivalencia BH-BMPT'!$D$35,IF(J141=35,'[1]Equivalencia BH-BMPT'!$D$36,IF(J141=36,'[1]Equivalencia BH-BMPT'!$D$37,IF(J141=37,'[1]Equivalencia BH-BMPT'!$D$38,IF(J141=38,'[1]Equivalencia BH-BMPT'!#REF!,IF(J141=39,'[1]Equivalencia BH-BMPT'!$D$40,IF(J141=40,'[1]Equivalencia BH-BMPT'!$D$41,IF(J141=41,'[1]Equivalencia BH-BMPT'!$D$42,IF(J141=42,'[1]Equivalencia BH-BMPT'!$D$43,IF(J141=43,'[1]Equivalencia BH-BMPT'!$D$44,IF(J141=44,'[1]Equivalencia BH-BMPT'!$D$45,IF(J141=45,'[1]Equivalencia BH-BMPT'!$D$46,\"No ha seleccionado un número de programa\")))))))))))))))))))))))))))))))))))))))))))))","v":"Gobernanza e influencia local, regional e internacional"},"1396",1026557848,"LAURA ANDREA DAZA OCAMPO",26213541,null,null,null,1918064,28131605,24295477,"2017-06-06","2017-06-06","2018-01-24",235,null,null,null,"X",null,null,0.86363636202058147,false]
[68,2017,"17-12-6691484",5,{"$f":"IF(D142=1,'[1]Tipo '!$B$2,IF(D142=2,'[1]Tipo '!$B$3,IF(D142=3,'[1]Tipo '!$B$4,IF(D142=4,'[1]Tipo '!$B$5,IF(D142=5,'[1]Tipo '!$B$6,IF(D142=6,'[1]Tipo '!$B$7,IF(D142=7,'[1]Tipo '!$B$8,IF(D142=8,'[1]Tipo '!$B$9,IF(D142=9,'[1]Tipo '!$B$10,IF(D142=10,'[1]Tipo '!$B$11,IF(D142=11,'[1]Tipo '!$B$12,IF(D142=12,'[1]Tipo '!$B$13,IF(D142=13,'[1]Tipo '!$B$14,IF(D142=14,'[1]Tipo '!$B$15,IF(D142=15,'[1]Tipo '!$B$16,IF(D142=16,'[1]Tipo '!$B$17,IF(D142=17,'[1]Tipo '!$B$18,IF(D142=18,'[1]Tipo '!$B$19,IF(D142=19,'[1]Tipo '!$B$20,\"No ha seleccionado un tipo de contrato válido\")))))))))))))))))))","v":"CONTRATOS DE PRESTACIÓN DE SERVICIOS PROFESIONALES Y DE APOYO A LA GESTIÓN"},"Contratación directa","Prestación de servicios profesionales y de apoyo a la gestión, o para la ejecución de trabajos artísticos que sólo puedan encomendarse a determinadas personas naturales;","PRESTAR SUS SERVICIOS DE APOYO TÉCNICO EN LA ADMINISTRACIÓN, MANTENIMIENTO Y FUNCIONAMIENTO DEL SISTEMA RADIO CANDELARIA ON LINE”. “GOBERNANZA E INFLUENCIA LOCAL, REGIONAL E INTERNACIONAL – PROYECTO 1396 CANDELARIA MAS PARTICIPATIVA","Inversión",45,{"$f":"IF(J142=1,'[1]Equivalencia BH-BMPT'!$D$2,IF(J142=2,'[1]Equivalencia BH-BMPT'!$D$3,IF(J142=3,'[1]Equivalencia BH-BMPT'!$D$4,IF(J142=4,'[1]Equivalencia BH-BMPT'!$D$5,IF(J142=5,'[1]Equivalencia BH-BMPT'!$D$6,IF(J142=6,'[1]Equivalencia BH-BMPT'!$D$7,IF(J142=7,'[1]Equivalencia BH-BMPT'!$D$8,IF(J142=8,'[1]Equivalencia BH-BMPT'!$D$9,IF(J142=9,'[1]Equivalencia BH-BMPT'!$D$10,IF(J142=10,'[1]Equivalencia BH-BMPT'!$D$11,IF(J142=11,'[1]Equivalencia BH-BMPT'!$D$12,IF(J142=12,'[1]Equivalencia BH-BMPT'!$D$13,IF(J142=13,'[1]Equivalencia BH-BMPT'!$D$14,IF(J142=14,'[1]Equivalencia BH-BMPT'!$D$15,IF(J142=15,'[1]Equivalencia BH-BMPT'!$D$16,IF(J142=16,'[1]Equivalencia BH-BMPT'!$D$17,IF(J142=17,'[1]Equivalencia BH-BMPT'!$D$18,IF(J142=18,'[1]Equivalencia BH-BMPT'!$D$19,IF(J142=19,'[1]Equivalencia BH-BMPT'!$D$20,IF(J142=20,'[1]Equivalencia BH-BMPT'!$D$21,IF(J142=21,'[1]Equivalencia BH-BMPT'!$D$22,IF(J142=22,'[1]Equivalencia BH-BMPT'!$D$23,IF(J142=23,'[1]Equivalencia BH-BMPT'!#REF!,IF(J142=24,'[1]Equivalencia BH-BMPT'!$D$25,IF(J142=25,'[1]Equivalencia BH-BMPT'!$D$26,IF(J142=26,'[1]Equivalencia BH-BMPT'!$D$27,IF(J142=27,'[1]Equivalencia BH-BMPT'!$D$28,IF(J142=28,'[1]Equivalencia BH-BMPT'!$D$29,IF(J142=29,'[1]Equivalencia BH-BMPT'!$D$30,IF(J142=30,'[1]Equivalencia BH-BMPT'!$D$31,IF(J142=31,'[1]Equivalencia BH-BMPT'!$D$32,IF(J142=32,'[1]Equivalencia BH-BMPT'!$D$33,IF(J142=33,'[1]Equivalencia BH-BMPT'!$D$34,IF(J142=34,'[1]Equivalencia BH-BMPT'!$D$35,IF(J142=35,'[1]Equivalencia BH-BMPT'!$D$36,IF(J142=36,'[1]Equivalencia BH-BMPT'!$D$37,IF(J142=37,'[1]Equivalencia BH-BMPT'!$D$38,IF(J142=38,'[1]Equivalencia BH-BMPT'!#REF!,IF(J142=39,'[1]Equivalencia BH-BMPT'!$D$40,IF(J142=40,'[1]Equivalencia BH-BMPT'!$D$41,IF(J142=41,'[1]Equivalencia BH-BMPT'!$D$42,IF(J142=42,'[1]Equivalencia BH-BMPT'!$D$43,IF(J142=43,'[1]Equivalencia BH-BMPT'!$D$44,IF(J142=44,'[1]Equivalencia BH-BMPT'!$D$45,IF(J142=45,'[1]Equivalencia BH-BMPT'!$D$46,\"No ha seleccionado un número de programa\")))))))))))))))))))))))))))))))))))))))))))))","v":"Gobernanza e influencia local, regional e internacional"},"1396",80810407,"ANDRES CAMILO REDONDO RENGIFO",17139626,null,null,null,null,17139626,15383859,"2017-06-06","2017-06-07","2017-12-30",205,null,null,null,null,"X",null,0.89756095027977856,false]
[69,2017,"17-13-6719047",11,{"$f":"IF(D143=1,'[1]Tipo '!$B$2,IF(D143=2,'[1]Tipo '!$B$3,IF(D143=3,'[1]Tipo '!$B$4,IF(D143=4,'[1]Tipo '!$B$5,IF(D143=5,'[1]Tipo '!$B$6,IF(D143=6,'[1]Tipo '!$B$7,IF(D143=7,'[1]Tipo '!$B$8,IF(D143=8,'[1]Tipo '!$B$9,IF(D143=9,'[1]Tipo '!$B$10,IF(D143=10,'[1]Tipo '!$B$11,IF(D143=11,'[1]Tipo '!$B$12,IF(D143=12,'[1]Tipo '!$B$13,IF(D143=13,'[1]Tipo '!$B$14,IF(D143=14,'[1]Tipo '!$B$15,IF(D143=15,'[1]Tipo '!$B$16,IF(D143=16,'[1]Tipo '!$B$17,IF(D143=17,'[1]Tipo '!$B$18,IF(D143=18,'[1]Tipo '!$B$19,IF(D143=19,'[1]Tipo '!$B$20,\"No ha seleccionado un tipo de contrato válido\")))))))))))))))))))","v":"SUMINISTRO"},"Contratación mínima cuantia ","No aplica","SUMINISTRO DE BIENES Y SERVICIOS NECESARIOS PARA LA REALIZACIÓN DEL EVENTO CULTURAL DESTINADO AL FORTALECIMIENTO DE LAS COSTUMBRES DE LAS POBLACIONES INDÍGENAS DE LA LOCALIDAD DE LA CANDELARIA","Inversión",25,{"$f":"IF(J143=1,'[1]Equivalencia BH-BMPT'!$D$2,IF(J143=2,'[1]Equivalencia BH-BMPT'!$D$3,IF(J143=3,'[1]Equivalencia BH-BMPT'!$D$4,IF(J143=4,'[1]Equivalencia BH-BMPT'!$D$5,IF(J143=5,'[1]Equivalencia BH-BMPT'!$D$6,IF(J143=6,'[1]Equivalencia BH-BMPT'!$D$7,IF(J143=7,'[1]Equivalencia BH-BMPT'!$D$8,IF(J143=8,'[1]Equivalencia BH-BMPT'!$D$9,IF(J143=9,'[1]Equivalencia BH-BMPT'!$D$10,IF(J143=10,'[1]Equivalencia BH-BMPT'!$D$11,IF(J143=11,'[1]Equivalencia BH-BMPT'!$D$12,IF(J143=12,'[1]Equivalencia BH-BMPT'!$D$13,IF(J143=13,'[1]Equivalencia BH-BMPT'!$D$14,IF(J143=14,'[1]Equivalencia BH-BMPT'!$D$15,IF(J143=15,'[1]Equivalencia BH-BMPT'!$D$16,IF(J143=16,'[1]Equivalencia BH-BMPT'!$D$17,IF(J143=17,'[1]Equivalencia BH-BMPT'!$D$18,IF(J143=18,'[1]Equivalencia BH-BMPT'!$D$19,IF(J143=19,'[1]Equivalencia BH-BMPT'!$D$20,IF(J143=20,'[1]Equivalencia BH-BMPT'!$D$21,IF(J143=21,'[1]Equivalencia BH-BMPT'!$D$22,IF(J143=22,'[1]Equivalencia BH-BMPT'!$D$23,IF(J143=23,'[1]Equivalencia BH-BMPT'!#REF!,IF(J143=24,'[1]Equivalencia BH-BMPT'!$D$25,IF(J143=25,'[1]Equivalencia BH-BMPT'!$D$26,IF(J143=26,'[1]Equivalencia BH-BMPT'!$D$27,IF(J143=27,'[1]Equivalencia BH-BMPT'!$D$28,IF(J143=28,'[1]Equivalencia BH-BMPT'!$D$29,IF(J143=29,'[1]Equivalencia BH-BMPT'!$D$30,IF(J143=30,'[1]Equivalencia BH-BMPT'!$D$31,IF(J143=31,'[1]Equivalencia BH-BMPT'!$D$32,IF(J143=32,'[1]Equivalencia BH-BMPT'!$D$33,IF(J143=33,'[1]Equivalencia BH-BMPT'!$D$34,IF(J143=34,'[1]Equivalencia BH-BMPT'!$D$35,IF(J143=35,'[1]Equivalencia BH-BMPT'!$D$36,IF(J143=36,'[1]Equivalencia BH-BMPT'!$D$37,IF(J143=37,'[1]Equivalencia BH-BMPT'!$D$38,IF(J143=38,'[1]Equivalencia BH-BMPT'!#REF!,IF(J143=39,'[1]Equivalencia BH-BMPT'!$D$40,IF(J143=40,'[1]Equivalencia BH-BMPT'!$D$41,IF(J143=41,'[1]Equivalencia BH-BMPT'!$D$42,IF(J143=42,'[1]Equivalencia BH-BMPT'!$D$43,IF(J143=43,'[1]Equivalencia BH-BMPT'!$D$44,IF(J143=44,'[1]Equivalencia BH-BMPT'!$D$45,IF(J143=45,'[1]Equivalencia BH-BMPT'!$D$46,\"No ha seleccionado un número de programa\")))))))))))))))))))))))))))))))))))))))))))))","v":"Cambio cultural y construcción del tejido social para la vida"},"1396",8300324294,"CABILDO INDIGENA INGA DE BOGOTA",11795000,null,null,null,null,11795000,11795000,"2017-06-28","2017-07-12","2017-08-11",30,null,null,null,"X",null,null,1,false]
[89,2017,"17-13-7014516",11,{"$f":"IF(D144=1,'[3]Tipo '!$B$2,IF(D144=2,'[3]Tipo '!$B$3,IF(D144=3,'[3]Tipo '!$B$4,IF(D144=4,'[3]Tipo '!$B$5,IF(D144=5,'[3]Tipo '!$B$6,IF(D144=6,'[3]Tipo '!$B$7,IF(D144=7,'[3]Tipo '!$B$8,IF(D144=8,'[3]Tipo '!$B$9,IF(D144=9,'[3]Tipo '!$B$10,IF(D144=10,'[3]Tipo '!$B$11,IF(D144=11,'[3]Tipo '!$B$12,IF(D144=12,'[3]Tipo '!$B$13,IF(D144=13,'[3]Tipo '!$B$14,IF(D144=14,'[3]Tipo '!$B$15,IF(D144=15,'[3]Tipo '!$B$16,IF(D144=16,'[3]Tipo '!$B$17,IF(D144=17,'[3]Tipo '!$B$18,IF(D144=18,'[3]Tipo '!$B$19,IF(D144=19,'[3]Tipo '!$B$20,\"No ha seleccionado un tipo de contrato válido\")))))))))))))))))))","v":"SUMINISTRO"},"Contratación mínima cuantia ","No aplica","SUMINISTRO DE BIENES Y SERVICIOS NECESARIOS PARA EL DESARROLLO DEL FORO EDUCATIVO A REALIZAR DE MANERA CONJUNTA ENTRE LA LOCALIDAD DE SANTA FE Y LA LOCALIDAD DE CANDELARIA 2017","Inversión",42,{"$f":"IF(J144=1,'[3]Equivalencia BH-BMPT'!$D$2,IF(J144=2,'[3]Equivalencia BH-BMPT'!$D$3,IF(J144=3,'[3]Equivalencia BH-BMPT'!$D$4,IF(J144=4,'[3]Equivalencia BH-BMPT'!$D$5,IF(J144=5,'[3]Equivalencia BH-BMPT'!$D$6,IF(J144=6,'[3]Equivalencia BH-BMPT'!$D$7,IF(J144=7,'[3]Equivalencia BH-BMPT'!$D$8,IF(J144=8,'[3]Equivalencia BH-BMPT'!$D$9,IF(J144=9,'[3]Equivalencia BH-BMPT'!$D$10,IF(J144=10,'[3]Equivalencia BH-BMPT'!$D$11,IF(J144=11,'[3]Equivalencia BH-BMPT'!$D$12,IF(J144=12,'[3]Equivalencia BH-BMPT'!$D$13,IF(J144=13,'[3]Equivalencia BH-BMPT'!$D$14,IF(J144=14,'[3]Equivalencia BH-BMPT'!$D$15,IF(J144=15,'[3]Equivalencia BH-BMPT'!$D$16,IF(J144=16,'[3]Equivalencia BH-BMPT'!$D$17,IF(J144=17,'[3]Equivalencia BH-BMPT'!$D$18,IF(J144=18,'[3]Equivalencia BH-BMPT'!$D$19,IF(J144=19,'[3]Equivalencia BH-BMPT'!$D$20,IF(J144=20,'[3]Equivalencia BH-BMPT'!$D$21,IF(J144=21,'[3]Equivalencia BH-BMPT'!$D$22,IF(J144=22,'[3]Equivalencia BH-BMPT'!$D$23,IF(J144=23,'[3]Equivalencia BH-BMPT'!#REF!,IF(J144=24,'[3]Equivalencia BH-BMPT'!$D$25,IF(J144=25,'[3]Equivalencia BH-BMPT'!$D$26,IF(J144=26,'[3]Equivalencia BH-BMPT'!$D$27,IF(J144=27,'[3]Equivalencia BH-BMPT'!$D$28,IF(J144=28,'[3]Equivalencia BH-BMPT'!$D$29,IF(J144=29,'[3]Equivalencia BH-BMPT'!$D$30,IF(J144=30,'[3]Equivalencia BH-BMPT'!$D$31,IF(J144=31,'[3]Equivalencia BH-BMPT'!$D$32,IF(J144=32,'[3]Equivalencia BH-BMPT'!$D$33,IF(J144=33,'[3]Equivalencia BH-BMPT'!$D$34,IF(J144=34,'[3]Equivalencia BH-BMPT'!$D$35,IF(J144=35,'[3]Equivalencia BH-BMPT'!$D$36,IF(J144=36,'[3]Equivalencia BH-BMPT'!$D$37,IF(J144=37,'[3]Equivalencia BH-BMPT'!$D$38,IF(J144=38,'[3]Equivalencia BH-BMPT'!#REF!,IF(J144=39,'[3]Equivalencia BH-BMPT'!$D$40,IF(J144=40,'[3]Equivalencia BH-BMPT'!$D$41,IF(J144=41,'[3]Equivalencia BH-BMPT'!$D$42,IF(J144=42,'[3]Equivalencia BH-BMPT'!$D$43,IF(J144=43,'[3]Equivalencia BH-BMPT'!$D$44,IF(J144=44,'[3]Equivalencia BH-BMPT'!$D$45,IF(J144=45,'[3]Equivalencia BH-BMPT'!$D$46,\"No ha seleccionado un número de programa\")))))))))))))))))))))))))))))))))))))))))))))","v":"Transparencia, gestión pública y servicio a la ciudadanía"},"1396",9008904361,"SINERGY N S.A.S",7797950,null,null,null,null,7797950,7797950,"2017-09-08","2017-09-11","2017-10-10",30,null,null,null,null,null,"X",1,false]
[105,2017,"SECOP II",11,{"$f":"IF(D145=1,'[4]Tipo '!$B$2,IF(D145=2,'[4]Tipo '!$B$3,IF(D145=3,'[4]Tipo '!$B$4,IF(D145=4,'[4]Tipo '!$B$5,IF(D145=5,'[4]Tipo '!$B$6,IF(D145=6,'[4]Tipo '!$B$7,IF(D145=7,'[4]Tipo '!$B$8,IF(D145=8,'[4]Tipo '!$B$9,IF(D145=9,'[4]Tipo '!$B$10,IF(D145=10,'[4]Tipo '!$B$11,IF(D145=11,'[4]Tipo '!$B$12,IF(D145=12,'[4]Tipo '!$B$13,IF(D145=13,'[4]Tipo '!$B$14,IF(D145=14,'[4]Tipo '!$B$15,IF(D145=15,'[4]Tipo '!$B$16,IF(D145=16,'[4]Tipo '!$B$17,IF(D145=17,'[4]Tipo '!$B$18,IF(D145=18,'[4]Tipo '!$B$19,IF(D145=19,'[4]Tipo '!$B$20,\"No ha seleccionado un tipo de contrato válido\")))))))))))))))))))","v":"SUMINISTRO"},"Contratación mínima cuantia ","No aplica","SUMINISTRO DE BIENES Y SERVICIOS NECESARIOS PARA EL DESARROLLO DEL DIA DEL COMUNAL ","Inversión",42,{"$f":"IF(J145=1,'[4]Equivalencia BH-BMPT'!$D$2,IF(J145=2,'[4]Equivalencia BH-BMPT'!$D$3,IF(J145=3,'[4]Equivalencia BH-BMPT'!$D$4,IF(J145=4,'[4]Equivalencia BH-BMPT'!$D$5,IF(J145=5,'[4]Equivalencia BH-BMPT'!$D$6,IF(J145=6,'[4]Equivalencia BH-BMPT'!$D$7,IF(J145=7,'[4]Equivalencia BH-BMPT'!$D$8,IF(J145=8,'[4]Equivalencia BH-BMPT'!$D$9,IF(J145=9,'[4]Equivalencia BH-BMPT'!$D$10,IF(J145=10,'[4]Equivalencia BH-BMPT'!$D$11,IF(J145=11,'[4]Equivalencia BH-BMPT'!$D$12,IF(J145=12,'[4]Equivalencia BH-BMPT'!$D$13,IF(J145=13,'[4]Equivalencia BH-BMPT'!$D$14,IF(J145=14,'[4]Equivalencia BH-BMPT'!$D$15,IF(J145=15,'[4]Equivalencia BH-BMPT'!$D$16,IF(J145=16,'[4]Equivalencia BH-BMPT'!$D$17,IF(J145=17,'[4]Equivalencia BH-BMPT'!$D$18,IF(J145=18,'[4]Equivalencia BH-BMPT'!$D$19,IF(J145=19,'[4]Equivalencia BH-BMPT'!$D$20,IF(J145=20,'[4]Equivalencia BH-BMPT'!$D$21,IF(J145=21,'[4]Equivalencia BH-BMPT'!$D$22,IF(J145=22,'[4]Equivalencia BH-BMPT'!$D$23,IF(J145=23,'[4]Equivalencia BH-BMPT'!#REF!,IF(J145=24,'[4]Equivalencia BH-BMPT'!$D$25,IF(J145=25,'[4]Equivalencia BH-BMPT'!$D$26,IF(J145=26,'[4]Equivalencia BH-BMPT'!$D$27,IF(J145=27,'[4]Equivalencia BH-BMPT'!$D$28,IF(J145=28,'[4]Equivalencia BH-BMPT'!$D$29,IF(J145=29,'[4]Equivalencia BH-BMPT'!$D$30,IF(J145=30,'[4]Equivalencia BH-BMPT'!$D$31,IF(J145=31,'[4]Equivalencia BH-BMPT'!$D$32,IF(J145=32,'[4]Equivalencia BH-BMPT'!$D$33,IF(J145=33,'[4]Equivalencia BH-BMPT'!$D$34,IF(J145=34,'[4]Equivalencia BH-BMPT'!$D$35,IF(J145=35,'[4]Equivalencia BH-BMPT'!$D$36,IF(J145=36,'[4]Equivalencia BH-BMPT'!$D$37,IF(J145=37,'[4]Equivalencia BH-BMPT'!$D$38,IF(J145=38,'[4]Equivalencia BH-BMPT'!#REF!,IF(J145=39,'[4]Equivalencia BH-BMPT'!$D$40,IF(J145=40,'[4]Equivalencia BH-BMPT'!$D$41,IF(J145=41,'[4]Equivalencia BH-BMPT'!$D$42,IF(J145=42,'[4]Equivalencia BH-BMPT'!$D$43,IF(J145=43,'[4]Equivalencia BH-BMPT'!$D$44,IF(J145=44,'[4]Equivalencia BH-BMPT'!$D$45,IF(J145=45,'[4]Equivalencia BH-BMPT'!$D$46,\"No ha seleccionado un número de programa\")))))))))))))))))))))))))))))))))))))))))))))","v":"Transparencia, gestión pública y servicio a la ciudadanía"},"1396",9007967860,"ATLAS GOURMET SAS",3740000,null,null,null,null,3740000,null,"2017-12-18","2018-12-10","2018-01-19",30,null,null,null,null,"X",null,0,false]
[60,2017,"17-12-6450985",17,{"$f":"IF(D146=1,'[1]Tipo '!$B$2,IF(D146=2,'[1]Tipo '!$B$3,IF(D146=3,'[1]Tipo '!$B$4,IF(D146=4,'[1]Tipo '!$B$5,IF(D146=5,'[1]Tipo '!$B$6,IF(D146=6,'[1]Tipo '!$B$7,IF(D146=7,'[1]Tipo '!$B$8,IF(D146=8,'[1]Tipo '!$B$9,IF(D146=9,'[1]Tipo '!$B$10,IF(D146=10,'[1]Tipo '!$B$11,IF(D146=11,'[1]Tipo '!$B$12,IF(D146=12,'[1]Tipo '!$B$13,IF(D146=13,'[1]Tipo '!$B$14,IF(D146=14,'[1]Tipo '!$B$15,IF(D146=15,'[1]Tipo '!$B$16,IF(D146=16,'[1]Tipo '!$B$17,IF(D146=17,'[1]Tipo '!$B$18,IF(D146=18,'[1]Tipo '!$B$19,IF(D146=19,'[1]Tipo '!$B$20,\"No ha seleccionado un tipo de contrato válido\")))))))))))))))))))","v":"CONVENIOS DE APOYO Y/O CONVENIOS DE ASOCIACIÓN "},"Contratación directa","Contratos interadministrativos","AUNAR ESFUERZOS TÉCNICOS, ADMINISTRATIVOS, LOGÍSTICOS PARA LA CONTINUIDAD DEL CENTRO ORQUESTAL LOCAL DE LA CANDELARIA",null,null,{"$f":"IF(J146=1,'[1]Equivalencia BH-BMPT'!$D$2,IF(J146=2,'[1]Equivalencia BH-BMPT'!$D$3,IF(J146=3,'[1]Equivalencia BH-BMPT'!$D$4,IF(J146=4,'[1]Equivalencia BH-BMPT'!$D$5,IF(J146=5,'[1]Equivalencia BH-BMPT'!$D$6,IF(J146=6,'[1]Equivalencia BH-BMPT'!$D$7,IF(J146=7,'[1]Equivalencia BH-BMPT'!$D$8,IF(J146=8,'[1]Equivalencia BH-BMPT'!$D$9,IF(J146=9,'[1]Equivalencia BH-BMPT'!$D$10,IF(J146=10,'[1]Equivalencia BH-BMPT'!$D$11,IF(J146=11,'[1]Equivalencia BH-BMPT'!$D$12,IF(J146=12,'[1]Equivalencia BH-BMPT'!$D$13,IF(J146=13,'[1]Equivalencia BH-BMPT'!$D$14,IF(J146=14,'[1]Equivalencia BH-BMPT'!$D$15,IF(J146=15,'[1]Equivalencia BH-BMPT'!$D$16,IF(J146=16,'[1]Equivalencia BH-BMPT'!$D$17,IF(J146=17,'[1]Equivalencia BH-BMPT'!$D$18,IF(J146=18,'[1]Equivalencia BH-BMPT'!$D$19,IF(J146=19,'[1]Equivalencia BH-BMPT'!$D$20,IF(J146=20,'[1]Equivalencia BH-BMPT'!$D$21,IF(J146=21,'[1]Equivalencia BH-BMPT'!$D$22,IF(J146=22,'[1]Equivalencia BH-BMPT'!$D$23,IF(J146=23,'[1]Equivalencia BH-BMPT'!#REF!,IF(J146=24,'[1]Equivalencia BH-BMPT'!$D$25,IF(J146=25,'[1]Equivalencia BH-BMPT'!$D$26,IF(J146=26,'[1]Equivalencia BH-BMPT'!$D$27,IF(J146=27,'[1]Equivalencia BH-BMPT'!$D$28,IF(J146=28,'[1]Equivalencia BH-BMPT'!$D$29,IF(J146=29,'[1]Equivalencia BH-BMPT'!$D$30,IF(J146=30,'[1]Equivalencia BH-BMPT'!$D$31,IF(J146=31,'[1]Equivalencia BH-BMPT'!$D$32,IF(J146=32,'[1]Equivalencia BH-BMPT'!$D$33,IF(J146=33,'[1]Equivalencia BH-BMPT'!$D$34,IF(J146=34,'[1]Equivalencia BH-BMPT'!$D$35,IF(J146=35,'[1]Equivalencia BH-BMPT'!$D$36,IF(J146=36,'[1]Equivalencia BH-BMPT'!$D$37,IF(J146=37,'[1]Equivalencia BH-BMPT'!$D$38,IF(J146=38,'[1]Equivalencia BH-BMPT'!#REF!,IF(J146=39,'[1]Equivalencia BH-BMPT'!$D$40,IF(J146=40,'[1]Equivalencia BH-BMPT'!$D$41,IF(J146=41,'[1]Equivalencia BH-BMPT'!$D$42,IF(J146=42,'[1]Equivalencia BH-BMPT'!$D$43,IF(J146=43,'[1]Equivalencia BH-BMPT'!$D$44,IF(J146=44,'[1]Equivalencia BH-BMPT'!$D$45,IF(J146=45,'[1]Equivalencia BH-BMPT'!$D$46,\"No ha seleccionado un número de programa\")))))))))))))))))))))))))))))))))))))))))))))","v":"No ha seleccionado un número de programa"},null,8999992821,"ORQUESTA FILARMONICA DE BOGOTA",null,null,null,null,null,0,null,"2017-03-22","2017-03-22","2018-08-30",519,null,null,null,"X",null,null,{"$error":"#DIV/0!"},true]
[null,null,null,null,"FACTURAS",null,null,"PAGO DE ARL CONTRATISTAS","Inversión",45,{"$f":"IF(J147=1,'Equivalencia BH-BMPT'!$D$2,IF(J147=2,'Equivalencia BH-BMPT'!$D$3,IF(J147=3,'Equivalencia BH-BMPT'!$D$4,IF(J147=4,'Equivalencia BH-BMPT'!$D$5,IF(J147=5,'Equivalencia BH-BMPT'!$D$6,IF(J147=6,'Equivalencia BH-BMPT'!$D$7,IF(J147=7,'Equivalencia BH-BMPT'!$D$8,IF(J147=8,'Equivalencia BH-BMPT'!$D$9,IF(J147=9,'Equivalencia BH-BMPT'!$D$10,IF(J147=10,'Equivalencia BH-BMPT'!$D$11,IF(J147=11,'Equivalencia BH-BMPT'!$D$12,IF(J147=12,'Equivalencia BH-BMPT'!$D$13,IF(J147=13,'Equivalencia BH-BMPT'!$D$14,IF(J147=14,'Equivalencia BH-BMPT'!$D$15,IF(J147=15,'Equivalencia BH-BMPT'!$D$16,IF(J147=16,'Equivalencia BH-BMPT'!$D$17,IF(J147=17,'Equivalencia BH-BMPT'!$D$18,IF(J147=18,'Equivalencia BH-BMPT'!$D$19,IF(J147=19,'Equivalencia BH-BMPT'!$D$20,IF(J147=20,'Equivalencia BH-BMPT'!$D$21,IF(J147=21,'Equivalencia BH-BMPT'!$D$22,IF(J147=22,'Equivalencia BH-BMPT'!$D$23,IF(J147=23,'Equivalencia BH-BMPT'!#REF!,IF(J147=24,'Equivalencia BH-BMPT'!$D$25,IF(J147=25,'Equivalencia BH-BMPT'!$D$26,IF(J147=26,'Equivalencia BH-BMPT'!$D$27,IF(J147=27,'Equivalencia BH-BMPT'!$D$28,IF(J147=28,'Equivalencia BH-BMPT'!$D$29,IF(J147=29,'Equivalencia BH-BMPT'!$D$30,IF(J147=30,'Equivalencia BH-BMPT'!$D$31,IF(J147=31,'Equivalencia BH-BMPT'!$D$32,IF(J147=32,'Equivalencia BH-BMPT'!$D$33,IF(J147=33,'Equivalencia BH-BMPT'!$D$34,IF(J147=34,'Equivalencia BH-BMPT'!$D$35,IF(J147=35,'Equivalencia BH-BMPT'!$D$36,IF(J147=36,'Equivalencia BH-BMPT'!$D$37,IF(J147=37,'Equivalencia BH-BMPT'!$D$38,IF(J147=38,'Equivalencia BH-BMPT'!#REF!,IF(J147=39,'Equivalencia BH-BMPT'!$D$40,IF(J147=40,'Equivalencia BH-BMPT'!$D$41,IF(J147=41,'Equivalencia BH-BMPT'!$D$42,IF(J147=42,'Equivalencia BH-BMPT'!$D$43,IF(J147=43,'Equivalencia BH-BMPT'!$D$44,IF(J147=44,'Equivalencia BH-BMPT'!$D$45,IF(J147=45,'Equivalencia BH-BMPT'!$D$46,\"No ha seleccionado un número de programa\")))))))))))))))))))))))))))))))))))))))))))))","v":"Gobernanza e influencia local, regional e internacional"},"1395",null,"POSITIVA COMPAÑÍA DE SEGUROS",1899900,null,null,null,null,{"$f":"O147+Q147+S147","v":1899900},null,null,null,null,null,null,null,null,null,null,null,0]
["TOTALES",null,null,null,null,null,null,null,null,null,null,null,null,null,null,null,null,null,null,{"$f":"SUM(T14:T147)","v":10787453167}]
[]
[]
[null,null,null,null,null,null,null,null,null,null,null,null,null,null,null,null,null,null,null,1289186851,"COMPROMISOS DE GASTOS GENERALES"]
[null,null,null,null,null,null,null,null,null,null,null,null,null,null,null,null,null,null,null,9565844316,"COMPROMISOS DE INVERSIÓN DIRECTA "]
[null,1289186851,null,null,null,null,null,null,null,null,null,null,null,null,null,null,null,null,null,{"$f":"SUBTOTAL(9,T151:T152)","v":10855031167},"VALOR TOTAL COMPROMISOS"]
[null,null,null,null,null,null,null,null,null,null,null,null,null,null,null,null,null,null,null,6757800,"SALUD DE EDILES"]
[null,null,null,null,null,null,null,null,null,null,null,null,null,null,null,null,null,null,null,1899900,"ARL POSITIVA"]
[null,null,null,null,null,null,null,null,null,null,null,null,null,null,null,null,null,null,null,null,"VALOR NETO DE COMPROMISOS"]

{"sheet":"Instructivo","index":1,"n_rows":85,"n_cols":3,"rows_kept":85,"cut":false,"hidden":false,"merged":[[0,0,0,2],[74,0,74,2],[75,0,76,0],[75,1,76,1],[82,0,82,2],[68,0,71,0],[68,1,71,1],[63,0,64,0],[63,1,64,1],[1,0,1,2],[3,0,3,2],[9,0,9,2],[8,0,8,2],[7,0,7,2],[6,0,6,2],[5,0,5,2],[2,0,2,2],[27,0,47,0],[60,0,62,0],[60,1,62,1],[22,0,22,2],[23,0,24,0],[23,1,24,1],[30,1,31,1],[48,0,49,0],[48,1,49,1],[4,0,4,2],[52,0,54,0],[53,1,54,1],[56,0,57,0],[59,0,59,2],[11,0,11,2]]}
["INSTRUCTIVO PARA DILIGENCIAMIENTO DEL FORMATO DE RENDICIÓN DE CUENTAS A 31 DE DICIEMBRE DE 2017"]
["OBSERVACIONES INICIALES"]
["Recomendamos leer cuidadosamente y poner en práctica las instrucciones que se explican en este instructivo. De la calidad de la información que se registre, depende en gran medida la calidad del informe de rendición de cuentas de la Gestión Contractual que presenta el Alcalde Mayor, consolidado por la Veeduría Distrital."]
["La base en Excel a diligenciar es inmodificable, debe utilizar versión Excel 2010 o posteriores, la versión 2007 no habilita los macros.  La base no permite que se incluyan columnas con otro tipo de información que la Veeduría Distrital no está solicitando o que se cambie el formato de celda establecido. Tenga en cuenta que muchas celdas están bloqueadas y/o solo permiten el registro de una información determinada."]
["La información que se registre en la base, debe coincidir con los reportes realizados en PREDIS y en el SECOP"]
["Diligencie la totalidad de celdas requeridas."]
["Para insertar una o varias filas,  seleccione una fila que no sea la primera fila del formato (shift+espacio), posteriormente copiar (Control +c), inmediatamente seleccione el numero de filas a insertar, desde 1 hasta las que usted requiera, por ultimo aplique Control+. Si usted no sigue este procedimiento las filas que copie no "]
["En primer lugar diligencie toda la información correspondiente a los contratos suscritos con cargo a la vigencia 2017."]
["Una vez incluidos todos los contratos de la vigencia 2017, a continuación diligencie el formato completo con la información correspondiente a las adiciones efectuadas con cargo a la vigencia 2017 de contratos suscritos en vigencias anteriores. La información general del contrato como: modalidad de selección, tipología contractual, objeto, entre otros, debe corresponder a la información del contrato adicionado o modificado."]
["En caso de haber realizado apropiaciones presupuestales en la vigencia a través de resoluciones, caja menor, honorarios ediles, servicios públicos, debe relacionar dicha información en una sola fila al final de la base, indicando de que se trata la apropiación."]
[]
["ENCABEZADO DEL FORMATO"]
[1,"Entidad","Indique el nombre completo de la Entidad."]
[2,"Sector","Relacione el sector al cual pertenece la Entidad."]
[3,"Presupuesto Disponible Inversión Directa","Indique el valor total del presupuesto disponible de inversión directa, de acuerdo con el PREDIS, a 31 de diciembre de 2017."]
[4,"Presupuesto comprometido de inversión ","Escriba el valor total del presupuesto comprometido de inversión directa, de acuerdo con el PREDIS a 31 de diciembre de 2017."]
[5,"Presupuesto Disponible Funcionamiento","Indique el valor total del presupuesto de funcionamiento disponible, de acuerdo con el PREDIS a 31 de diciembre de 2017."]
[6,"Presupuesto comprometido funcionamiento ","Escriba el monto del presupuesto de funcionamiento, comprometido mediante contratos, de acuerdo con el PREDIS a 31 de diciembre de 2017."]
[7,"Presupuesto Disponible Operación","Coloque el monto del presupuesto de operación disponible, de acuerdo con el PREDIS, a 31 de diciembre de 2017. Los gastos de operación corresponden solamente a aquellas entidades de régimen de contratación  privado."]
[8,"Presupuesto comprometido operación mediante contratos:","Escriba el monto del presupuesto de operación comprometido mediante contratos a  31 de diciembre de 2017."]
[9,"Nombre de quien diligencia el formato:","Indique el nombre completo, cargo, número de teléfono con extensión y correo electrónico del funcionario que diligencia el formato y que posteriormente realizará los ajustes y aclaraciones a que haya lugar por solicitud de la Veeduría Distrital."]
[]
["1- INFORMACIÓN GENERAL"]
[1,"Número de Contrato","En estricto orden consecutivo (1, 2, 3 y así sucesivamente, hasta llegar al último contrato suscrito durante la vigencia) registre el número del contrato, el orden consecutivo hace necesario registrar también, los contratos que fueron anulados, se debe indicar tal situación en la columna 19 (Estado)."]
[null,null,"Una vez terminado el registro de los contratos con cargo a la vigencia 2017, en las siguientes filas registre la información correspondiente a las adiciones efectuadas con cargo a la vigencia 2017 de contratos suscritos en vigencias anteriores, especificando el año de suscripción en la columna dos."]
[2,"Año","Registre el año de celebración del contrato."]
[3,"Número de proceso en el SECOP","Relacione el número de proceso con el cual se encuentra publicado el contrato en el SECOP. Ejemplo 005-FDLU-2017."]
[4,"Tipo de Contrato:","En esta columna solamente escriba el NUMERO de uno de los 19 tipos de contratos relacionados a continuación, al digitar el numero de tipo de contrato, en la columna equivalencia tipo de contrato, aparecerá automáticamente el tipo. Ejemplo si usted digita el numero 2, automáticamente en la siguiente columna aparecerá el tipo Consultoría:"]
[null,"1. Obra :","Son contratos de obra los que celebren las entidades estatales para la construcción, mantenimiento, instalación y, en general, para la realización de cualquier otro trabajo material sobre bienes inmuebles, cualquiera que sea la modalidad de ejecución y pago. Numeral 1 del Artículo 32 de la Ley 80 de 1993. "]
[null,"2. Consultoría:","Aquellos que celebran las entidades estatales, referidos a los estudios necesarios para la ejecución de proyectos de inversión, de diagnósticos, prefactibilidad o factibilidad para programas o proyectos específicos, así como a las asesorías técnicas de coordinación, control y supervisión. Numeral 2 del Artículo 32 de la Ley 80 de 1993. "]
[null,"3. Interventoría:","Son también  contratos de consultoría los que tienen por objeto la Interventoría, asesoría, gerencia de obras o de proyectos, dirección, programación y la ejecución de diseños, planos, anteproyectos y proyectos. Numeral 2 del Artículo 32 de la Ley 80 de 1993."]
[null,null,"El contrato de Interventoría tiene por objeto la  supervisión, seguimiento y vigilancia a la ejecución material de un contrato principal."]
[null,"4. Contrato de Prestación de servicios:","Son contratos de prestación de servicios los que celebren las entidades estatales para desarrollar actividades relacionadas con la administración o funcionamiento de la entidad. Numeral 3 del Artículo 32 de la Ley 80 de 1993."]
[null,"5. Contrato de Prestación de servicios profesionales y de apoyo a la gestión:","Corresponden a aquellos de naturaleza intelectual diferentes a los de consultoría que se derivan del cumplimiento de las funciones de la entidad estatal; así como los relacionados con actividades operativas, logísticas, o asistenciales. Art. 2.2.1.2.1.4.9, Decreto 1082 de 2015"]
[null,"6. Compraventa de bienes muebles:","Son aquellos contratos donde se transfiere el dominio de un bien mueble (aquellos susceptibles de ser trasladadas de un lugar a otro sin alterar ni su forma ni su esencia, tal es el caso del mobiliario y equipo de oficina, maquinaria, automóviles, etc.), cuya ejecución se agota de manera instantánea. Artículo 660, Código Civil."]
[null,"7. Compraventa de bienes inmuebles:","Son aquellos contratos donde se transfiere el dominio de un bien inmueble (todos aquellos bienes considerados bienes raíces, por tener de común la circunstancia de estar íntimamente ligados al suelo, unidos de modo inseparable, física o jurídicamente, al terreno). Artículo 656, Código Civil."]
[null,"8. Arrendamiento de bienes muebles","Es un contrato que tiene por objeto, conceder el uso y goce de un bien mueble a cambio de un precio determinado.  Artículo 1974 Código Civil."]
[null,"9. Arrendamiento de bienes inmuebles:","Es un contrato que tiene por objeto, conceder el uso y goce de un bien inmueble a cambio de un precio determinado.  Artículo 2.2.1.2.1.4.11 Decreto 1082 de 2015"]
[null,"10. Seguros:","El seguro es un contrato, en virtud del cual una persona jurídica llamada asegurador, asume, a cambio de una prima, un riesgo que le es trasladado por una persona natural o jurídica llamado tomador y en el cual éste tiene un interés asegurable, con el fin de indemnizarlo, en el evento de que ocurra la realización del riesgo amparado. de conformidad con el Título V, del Libro Cuarto del Código de Comercio "]
[null,"11. Suministro:","El suministro es el contrato por el cual una parte se obliga, a cambio de una contraprestación, a cumplir en favor de otra, en forma independiente, prestaciones periódicas o continuadas de cosas o servicios. Artículo 968, Código de Comercio"]
[null,"12. Empréstitos:","Son contratos de empréstito los que tienen por objeto proveer a la entidad estatal contratante de recursos en moneda nacional o extranjera con plazo para su pago. Artículo 7,  Decreto 2681 de 1996. "]
[null,"13. Fiducia mercantil o encargo fiduciario:","Son contratos que tienen por objeto la administración o el manejo de los recursos vinculados a los contratos que tales entidades celebren. Numeral 5 de Articulo 32 de la Ley 80 de 1993."]
[null,"14. Concesión:","Este contrato tiene por objeto otorgar a una persona llamada CONCESIONARIO  la prestación, operación, explotación, organización o gestión, total o parcial, de un servicio público, o la construcción, explotación o conservación total o parcial, de una obra o bien destinados al servicio o uso público, así como todas aquellas actividades necesarias para la adecuada prestación o funcionamiento de la obra o servicio por cuenta y riesgo del CONCESIONARIO, y bajo la vigilancia y control de la entidad concedente, a cambio de una remuneración que puede consistir en derechos, tarifas, tasas, valorización, o en la participación que se le otorgue en la explotación del bien, obra o servicio, o en una suma periódica, única o porcentual, y en general, en cualquier otra modalidad de contraprestación que las partes acuerden. Numeral 4 del Artículo 32 de la Ley 80 de 1993 "]
[null,"15. Convenios de cooperación:","Son aquellos mediante los cuales se formaliza la asistencia, ayuda, auxilio, soporte o colaboración entre entidades de una misma nación, de distintos países o por parte de organizaciones internacionales de naturaleza pública o privada a favor de entidades públicas. Artículo 20 de la ley 1150"]
[null,"16. Convenios/Contratos interadministrativos:","El convenio interadministrativo es el negocio jurídico en el cual están presentes dos entidades públicas en desarrollo de relaciones interadministrativas cuyo objeto es coordinar, cooperar, colaborar o distribuir competencias en la realización de funciones administrativas de interés común a los sujetos negóciales. Artículo 95 de la ley 489 de 1998."]
[null,"17. Convenios de Apoyo y/o Convenios de Asociación:","Los contratos que en desarrollo de lo dispuesto en el segundo inciso del artículo 355 de la Constitución Política celebren la Nación, los Departamentos, Distritos y Municipios con entidades privadas sin ánimo de lucro y de reconocida idoneidad, con el propósito de impulsar programas y actividades de interés público.  Reglamentado mediante Decreto 92 de 2017"]
[null,"18. Asociaciones Público Privadas:","Los contratos con personas naturales o jurídicas que se celebran en desarrollo de lo dispuesto en el Decreto 1508 de 2012."]
[null,"19. Otros:","Los demás tipos de contratos que no se encuentren definidos en las anteriores tipologías."]
[5,"Modalidad de Selección","Al ubicarse en la celda, se despliega una lista de modalidades de selección, de las cuales debe seleccionar la indicada. El formato no permite incluir modalidades diferentes a las señaladas en la lista desplegable.  "]
[null,null,"Para las adiciones a contratos de años anteriores se debe diligenciar la modalidad de selección del contrato adicionado o modificado"]
[6,"Procedimiento o causal","Esta columna solo se diligencia para las modalidades de selección abreviada y contratación directa. Al ubicarse en la celda, se despliega una lista de procedimientos o causales, de las cuales debe seleccionar la indicada. El formato no permite incluir procedimientos o causales diferentes a las señaladas en la lista desplegable.  "]
[7,"Objeto","Registre el objeto del contrato."]
[8,"Afectación ","Registre la afectación según la clasificación de cuentas del presupuesto de gastos. Funcionamiento, Inversión y Operación, esta última aplica únicamente para entidades de régimen privado. La celda solamente permite registrar estas tres opciones."]
[null,"Número Programa:","Si en la columna anterior “Afectación”,  indicó funcionamiento u operación deje en blanco el número de programa, es decir esta columna solamente aplica para Inversión."]
[null,null,"Identifíquelo de acuerdo con el código presupuestal del plan de desarrollo Bogotá Mejor Para Todos. Si un mismo contrato afecta más de un código presupuestal discrimine el contrato por cada código que afecte en filas separadas. Si se registra el número del programa (de 1 a 45), automáticamente en la columna siguiente aparece el nombre del mismo."]
[9,"Número Proyecto:","Indique el código presupuestal con el que se identifica el proyecto. Si un mismo contrato afecta más de un proyecto, discriminar el contrato por cada proyecto que afecte en filas separadas."]
[10,"Número de Identificación del contratista:","Indicar el número de identificación del contratista persona natural o jurídica con quien se suscribió el contrato, sin digito de verificación (DV), el formato de celda no permite guiones, puntos o comas, solo números. "]
[null,"Nombre del Contratista","Indicar el nombre del contratista, persona natural o jurídica."]
[]
["2- INFORMACIÓN FINANCIERA"]
[11,"Valor Inicial ","Registre el valor inicial del contrato con cargo a la vigencia 2017, el formato de celda no permite guiones, puntos, comas o texto escrito. Esta columna solo debe contener información numérica."]
[null,null,"En el caso de adiciones a contratos de años anteriores,  no diligencie esta columna, solamente la columna 15 \"Adiciones\" "]
[null,null,"Excluya las reservas de apropiación y cuentas por pagar."]
[12,"Número de reducciones ","Diligencie esta columna solo en el caso de reducciones, reintegros, liberaciones, saldos a favor o cualquier factor que disminuya el valor de los contratos con cargo a la vigencia."]
[null,null,"Registre en esta celda la cantidad de reducciones que se realizaron al contrato."]
[13,"Valor total reducciones (En valor negativo)","Registre el valor total de las reducciones que se realizaron al contrato, el formato de celda no permite guiones, puntos, comas o texto escrito. Esta columna solo debe contener información numérica."]
[14,"Número de adiciones ","Diligencie esta columna solo en el caso de adiciones al valor inicial que aumenten el valor del contrato con cargo a la vigencia."]
[15,"Valor total de adiciones","Registre el valor total de las adiciones que se realizaron al contrato,  el formato de celda no permite guiones, puntos, comas o texto escrito. Esta columna solo debe contener información numérica."]
[16,"Valor Final","Esta columna se encuentra formulada y bloqueada, sí el valor final no coincide, es porque están mal diligenciadas las columnas valor inicial, valor de reducciones y/o valor de adiciones. En tal caso se debe verificar dicha información."]
[null,null,"La sumatoria de la columna 16 (valor final) para los contratos de Inversión Directa, según el programa del Plan de Desarrollo, deberá coincidir con el rubro registrado en el encabezado 4, Presupuesto comprometido de inversión según PREDIS, este valor debe coincidir a la vez con los informes de ejecución presupuestal del PREDIS.  "]
[null,null,"Si los valores no coinciden debe especificarse al final del formato en qué está representada la diferencia (discriminando los conceptos por Programa y Proyecto de inversión), con sus respectivos valores. Recuerde que la justificación debe hacerse solo para los contratos de inversión."]
[null,null,"Las bases donde dichos valores no coincidan serán devueltas por la Veeduría Distrital a cada entidad para los respectivos ajustes."]
[17,"Giros","En esta columna se debe registrar el valor de los giros a la fecha de corte del presente informe, 31 de diciembre de 2017, el formato de celda no permite guiones, puntos, comas o texto escrito. Esta columna solo debe contener información numérica."]
[]
["3- PLAZOS"]
[18,"Fecha de Suscripción","Relacionar la fecha en que se suscribió el contrato original. La celda solo admite el formato Día/Mes/Año así  25/02/2017."]
[null,null,"Para las adiciones a contratos de años anteriores se debe registrar en esta columna la fecha de suscripción de la adición en la vigencia 2017."]
[19,"Fecha de inicio","Indicar la fecha de inicio del contrato. Para las adiciones a contratos de años anteriores se debe diligenciar la fecha de inicio de la adición en la vigencia 2017. La celda solo admite el formato Día/Mes/Año así  25/02/2017."]
[20,"Fecha de terminación","Indicar la fecha efectiva de terminación del contrato. La celda solo admite el formato Día/Mes/Año así  25/02/2017."]
[21,"Plazo en días","Esta columna contiene el plazo inicial del contrato con el número total de días a ejecutar (sólo número de días, no mes, no texto)."]
[22,"Prórroga en días","En caso de presentarse este evento, indicar en días, el tiempo por el cual se prorrogó el contrato a partir de la fecha inicial de terminación (sólo número de días, no mes, no texto)."]
[]
["4- ESTADO A 31 DE DICIEMBRE DE 2017"]
[23,"Estado","Marque con una X en la respectiva columna si el contrato se encuentra Anulado, Por Iniciar, En Ejecución, Terminado o Liquidado."]
[24,"% Avance y/o cumplimiento","Indica el porcentaje de avance o de cumplimiento del mismo en términos presupuestales, es decir lo efectivamente pagado al contratista. Si no se ha iniciado la ejecución, él % de avance es 0%. La celda se encuentra formulada y protegida. Es la relación entre el valor de los giros y el valor final del contrato. Si el porcentaje de avance no coincide, se debe revisar los valores que se registraron en estas columnas. "]

{"sheet":"Equivalencia BH-BMPT","index":2,"n_rows":46,"n_cols":4,"rows_kept":46,"cut":false,"hidden":false,"merged":[]}
[null,null,"Cod_BMT","Programa - Bogotá Mejor para Todos"]
[null,null,1,"Prevención y atención de la maternidad y la paternidad tempranas"]
[null,null,2,"Desarrollo integral desde la gestación hasta la adolescencia"]
[null,null,3,"Igualdad y autonomía para una Bogotá incluyente"]
[null,null,4,"Familias protegidas y adaptadas al cambio climático"]
[null,null,5,"Desarrollo integral para la felicidad y el ejercicio de la ciudadanía"]
[null,null,6,"Calidad educativa para todos"]
[null,null,7,"Inclusión educativa para la equidad"]
[null,null,8,"Acceso con calidad a la educación superior"]
[null,null,9,"Atención integral y eficiente en salud"]
[null,null,10,"Modernización de la infraestructura física y tecnológica en salud"]
[null,null,11,"Mejores oportunidades para el desarrollo a través de la cultura, la recreación y el deporte"]
[null,null,12,"Mujeres protagonistas, activas y empoderadas en el cierre de brechas de género"]
[null,null,13,"Infraestructura para el desarrollo del hábitat"]
[null,null,14,"Intervenciones integrales del hábitat"]
[null,null,15,"Recuperación, incorporación, vida urbana y control de la ilegalidad"]
[null,null,16,"Integración social para una ciudad de oportunidades"]
[null,null,17,"Espacio público, derecho de todos"]
[null,null,18,"Mejor movilidad para todos"]
[null,null,19,"Seguridad y convivencia para todos"]
[null,null,20,"Fortalecimiento del Sistema de Protección Integral a Mujeres Víctimas de Violencia - SOFIA"]
[null,null,21,"Justicia para todos: consolidación del Sistema Distrital de Justicia"]
[null,null,22,"Bogotá vive los derechos humanos"]
[null,null,23,"Bogotá mejor para las víctimas, la paz y la reconciliación"]
[null,null,24,"Equipo por la educación para el reencuentro, la reconciliación y la paz"]
[null,null,25,"Cambio cultural y construcción del tejido social para la vida"]
[null,null,26,"Información relevante e integral para la planeación territorial"]
[null,null,27,"Proyectos urbanos integrales con visión de ciudad"]
[null,null,28,"Suelo para reducir el déficit habitacional de suelo urbanizable, vivienda y soportes urbanos"]
[null,null,29,"Articulación regional y planeación integral del transporte"]
[null,null,30,"Financiación para el Desarrollo Territorial"]
[null,null,31,"Fundamentar el desarrollo económico en la generación y uso del conocimiento para mejorar la competitividad de la Ciudad Región"]
[null,null,32,"Generar alternativas de ingreso y empleo de mejor calidad"]
[null,null,33,"Elevar la eficiencia de los mercados de la ciudad"]
[null,null,34,"Mejorar y fortalecer el recaudo tributario de la ciudad e impulsar el uso de mecanismos de vinculación de capital privado"]
[null,null,35,"Bogotá, ciudad inteligente"]
[null,null,36,"Bogotá, una ciudad digital"]
[null,null,37,"Consolidar el turismo como factor de desarrollo, confianza y felicidad para Bogotá Región"]
[null,null,38,"Recuperación y manejo de la Estructura Ecológica Principal"]
[null,null,39,"Ambiente sano para la equidad y disfrute del ciudadano"]
[null,null,40,"Gestión de la huella ambiental urbana"]
[null,null,41,"Desarrollo rural sostenible"]
[null,null,42,"Transparencia, gestión pública y servicio a la ciudadanía"]
[null,null,43,"Modernización institucional"]
[null,null,44,"Gobierno y ciudadanía digital"]
[null,null,45,"Gobernanza e influencia local, regional e internacional"]

{"sheet":"Tipo ","index":3,"n_rows":30,"n_cols":5,"rows_kept":30,"cut":false,"hidden":false,"merged":[[0,2,1,2]]}
[null,null,"Modalidad de Selección","afectacion"]
[1,"OBRA PÚBLICA",null,"Funcionamiento"]
[2,"CONSULTORÍA","Contratación directa","Inversión"]
[3,"INTERVENTORÍA","Contratación mínima cuantia ","Operación"]
[4,"CONTRATOS DE PRESTACIÓN DE SERVICIOS","Selección abreviada "]
[5,"CONTRATOS DE PRESTACIÓN DE SERVICIOS PROFESIONALES Y DE APOYO A LA GESTIÓN","Licitación pública"]
[6,"COMPRAVENTA DE BIENES MUEBLES","Régimen privado "]
[7,"COMPRAVENTA DE BIENES INMUEBLES","Regimen especial"]
[8,"ARRENDAMIENTO DE BIENES MUEBLES"]
[9,"ARRENDAMIENTO DE BIENES INMUEBLES"]
[10,"SEGUROS","selección abreviada"]
[11,"SUMINISTRO","Subasta inversa "]
[12,"EMPRESTITOS","Bolsas de productos"]
[13,"FIDUCIA MERCANTIL O ENCARGO FIDUCIARIO","Acuerdo marco de precios "]
[14,"CONCESIÓN ","Selección abreviada por menor cuantía "]
[15,"CONVENIOS DE COOPERACION"]
[16,"CONTRATOS INTERADMINISTRATIVOS","contratacion directa"]
[17,"CONVENIOS DE APOYO Y/O CONVENIOS DE ASOCIACIÓN ","Urgencia manifiesta"]
[18,"ASOCIACIONES PÚBLICO PRIVADAS","Contratación de empréstitos",null,{"$f":"54/155","v":0.34838709677419355}]
[19,"OTROS","Contratos interadministrativos"]
[null,null,"Contratación de bienes y servicios en el sector Defensa y en el Departamento Administrativo de Seguridad, DAS",null,{"$f":"1.55*1.55","v":2.4025000000000003}]
[null,null,"Contratos para el desarrollo de actividades científicas y tecnológicas",null,{"$f":"53/E21","v":22.060353798126947}]
[null,null,"Contratos de encargo fiduciario que celebren las entidades territoriales cuando inician el Acuerdo de Reestructuración de Pasivos"]
[null,null,"Cuando no exista pluralidad de oferentes en el mercado"]
[null,null,"Prestación de servicios profesionales y de apoyo a la gestión, o para la ejecución de trabajos artísticos que sólo puedan encomendarse a determinadas personas naturales;"]
[null,null,"El arrendamiento o adquisición de inmuebles"]
[null,null,"Contratación de bienes y servicios de la Dirección Nacional de Inteligencia (DNI)"]
[null,null,"Decreto 777 de 1992"]
[null,null,"Decreto 92 de 2017"]
[null,null,"No aplica"]