{"text_format":"1","workbook":"xlsx","n_sheets":5,"sheets":["HOJA DE TRABAJO","Formato2020 ","Instructivo","Tipo","Eje_Pilar_Prop"],"not_rendered":{"charts":0,"images":1,"macros":1,"external_links":2,"defined_names":21,"comments":1,"pivot_tables":2},"unopened":[],"bounds":{"document_bytes":16777216,"sheet_cells":100000,"rows_first":2000,"rows_last":500,"rows_between":2000,"halvings":0,"cell_chars":16384,"cell_head_chars":4096},"cells_cut":0,"cells_raw":0,"read":"whole","date_system":"1900"}

{"sheet":"HOJA DE TRABAJO","index":0,"n_rows":82,"n_cols":8,"rows_kept":82,"cut":false,"hidden":false,"merged":[[2,7,3,7],[43,7,44,7],[41,4,41,7],[0,4,0,7]]}
[null,null,null,null,"REGISTROS"]
[]
["Etiquetas de fila","Suma de Valor Final ",null,null,"COMPROMISO","COMPROMISO ACUMULADO","SUMATORIA CONTRATOS FDLCH","DIFERENCIA"]
[1293,211330439,null,null,"RUBRO","PREDIS","FORMATO"]
[1294,2186614540,null,null,"FUNCIONAMIETO",2464019807,{"$f":"SUM(B17:B40)","v":2464019807},{"$f":"+F5-G5","v":0}]
[1295,181965000,null,null,"INVERSION DIRECTA",{"$f":"SUM(F7:F19)","v":18400660685},{"$f":"SUM(B4:B16)","v":18400660685},{"$f":"+F6-G6","v":0}]
[1296,482708685,null,null,"1293 - Contribuir en el desarrollo de la primera i  ",211330439,{"$f":"+GETPIVOTDATA(\"Valor Final \",$A$3,\"Número Proyecto\",1293)","v":211330439},0]
[1297,110000000,null,null,"1294 - Fortalecimiento a las personas mayores     ",2186614540,{"$f":"+GETPIVOTDATA(\"Valor Final \",$A$3,\"Número Proyecto\",1294)","v":2186614540},0]
[1298,652384456,null,null,"1295 - Brindar acciones integrales, para personas     ",181965000,{"$f":"+GETPIVOTDATA(\"Valor Final \",$A$3,\"Número Proyecto\",1295)","v":181965000},0]
[1299,70600000,null,null,"1296 - Reducción y mitigación del riesgo frente al   ",482708685,{"$f":"+GETPIVOTDATA(\"Valor Final \",$A$3,\"Número Proyecto\",1296)","v":482708685},0]
[1300,77145000,null,null,"1297 - Por un territorio educado, incluyente y div   ",110000000,{"$f":"+GETPIVOTDATA(\"Valor Final \",$A$3,\"Número Proyecto\",1297)","v":110000000},0]
[1301,3847273671,null,null,"1298 - Cultura y deporte: transformando vidas y ha   ",652384456,{"$f":"+GETPIVOTDATA(\"Valor Final \",$A$3,\"Número Proyecto\",1298)","v":652384456},0]
[1302,1058083851,null,null,"1299 - Asesoría para legalización de barrios y tit   ",70600000,{"$f":"+GETPIVOTDATA(\"Valor Final \",$A$3,\"Número Proyecto\",1299)","v":70600000},0]
[1303,381576497,null,null,"1300 - Adecuación y mantenimiento de parques     ",77145000,{"$f":"+GETPIVOTDATA(\"Valor Final \",$A$3,\"Número Proyecto\",1300)","v":77145000},0]
[1304,2498798384,null,null,"1301 - Mejorar la calidad de la movilidad    ",3847273671,{"$f":"+GETPIVOTDATA(\"Valor Final \",$A$3,\"Número Proyecto\",1301)","v":3847273671},0]
[1305,6642180162,null,null,"1302 - Entornos seguros para la ciudadanía     ",1058083851,{"$f":"+GETPIVOTDATA(\"Valor Final \",$A$3,\"Número Proyecto\",1302)","v":1058083851},0]
[131089001,386340565,null,null,"1303 - Apoyo y asesoría a la ruralidad    ",381576497,{"$f":"+GETPIVOTDATA(\"Valor Final \",$A$3,\"Número Proyecto\",1303)","v":381576497},0]
[13101040102,628959612,null,null,"1304 - Gobernanza y fortalecimiento del desarrollo     ",2498798384,{"$f":"+GETPIVOTDATA(\"Valor Final \",$A$3,\"Número Proyecto\",1304)","v":2498798384},0]
[1310201010102,31327192,null,null,"1305 - En Chapinero participamos todos      ",6642180162,{"$f":"+GETPIVOTDATA(\"Valor Final \",$A$3,\"Número Proyecto\",1305)","v":6642180162},0]
[1310202010202,19274922]
[1310202010203,42249921]
[1310202010302,148070729]
[13102020203050,626942185]
[13102020203060,36926000]
[131020202020105,4811238]
[131020202020106,78626800]
[131020202020107,77090558]
[131020202020110,4513950]
[131020202020201,47466667]
[131020202030301,22497500]
[131020202030401,18384140]
[131020202030603,60767810]
[131020202030608,5470050]
[131020202030611,13185031]
[131020202030612,125746639]
[131020202040101,52406900]
[131020202040102,5970110]
[131020202040103,7440840]
[1310202020101,17100000]
[131020202030304,2450448]
["Total general",20864680492]
[null,null,null,null,"GIROS"]
[]
["Etiquetas de fila","Suma de Giros\n(Valor en pesos)",null,null,"COMPROMISO","COMPROMISO ACUMULADO","SUMATORIA GIROS FDLCH","DIFERENCIA"]
[1293,54203333,null,null,"RUBRO","PREDIS","FORMATO"]
[1294,2117503216,null,null,"FUNCIONAMIETO",1784653988,{"$f":"SUM(B58:B79)","v":1784653988},{"$f":"+F46-G46","v":0}]
[1295,39870000,null,null,"INVERSION DIRECTA",{"$f":"SUM(F48:F60)","v":8606905121},{"$f":"SUM(B45:B57)","v":8606905121},{"$f":"+F47-G47","v":0}]
[1296,90255000,null,null,"1293 - Contribuir en el desarrollo de la primera i  ",54203333,{"$f":"+GETPIVOTDATA(\"Giros\n(Valor en pesos)\",$A$44,\"Número Proyecto\",1293)","v":54203333},0]
[1297,41040000,null,null,"1294 - Fortalecimiento a las personas mayores     ",2117503216,{"$f":"+GETPIVOTDATA(\"Giros\n(Valor en pesos)\",$A$44,\"Número Proyecto\",1294)","v":2117503216},0]
[1298,94826666,null,null,"1295 - Brindar acciones integrales, para personas     ",39870000,{"$f":"+GETPIVOTDATA(\"Giros\n(Valor en pesos)\",$A$44,\"Número Proyecto\",1295)","v":39870000},0]
[1299,62473334,null,null,"1296 - Reducción y mitigación del riesgo frente al   ",90255000,{"$f":"+GETPIVOTDATA(\"Giros\n(Valor en pesos)\",$A$44,\"Número Proyecto\",1296)","v":90255000},0]
[1300,72019667,null,null,"1297 - Por un territorio educado, incluyente y div   ",41040000,{"$f":"+GETPIVOTDATA(\"Giros\n(Valor en pesos)\",$A$44,\"Número Proyecto\",1297)","v":41040000},0]
[1301,522187281,null,null,"1298 - Cultura y deporte: transformando vidas y ha   ",94826666,{"$f":"+GETPIVOTDATA(\"Giros\n(Valor en pesos)\",$A$44,\"Número Proyecto\",1298)","v":94826666},0]
[1302,448457376,null,null,"1299 - Asesoría para legalización de barrios y tit   ",62473334,{"$f":"+GETPIVOTDATA(\"Giros\n(Valor en pesos)\",$A$44,\"Número Proyecto\",1299)","v":62473334},0]
[1303,114142109,null,null,"1300 - Adecuación y mantenimiento de parques     ",72019667,{"$f":"+GETPIVOTDATA(\"Giros\n(Valor en pesos)\",$A$44,\"Número Proyecto\",1300)","v":72019667},0]
[1304,2302017230,null,null,"1301 - Mejorar la calidad de la movilidad    ",522187281,{"$f":"+GETPIVOTDATA(\"Giros\n(Valor en pesos)\",$A$44,\"Número Proyecto\",1301)","v":522187281},0]
[1305,2647909909,null,null,"1302 - Entornos seguros para la ciudadanía     ",448457376,{"$f":"+GETPIVOTDATA(\"Giros\n(Valor en pesos)\",$A$44,\"Número Proyecto\",1302)","v":448457376},0]
[131089001,375654604,null,null,"1303 - Apoyo y asesoría a la ruralidad    ",114142109,{"$f":"+GETPIVOTDATA(\"Giros\n(Valor en pesos)\",$A$44,\"Número Proyecto\",1303)","v":114142109},0]
[13101040102,628959612,null,null,"1304 - Gobernanza y fortalecimiento del desarrollo     ",2302017230,{"$f":"+GETPIVOTDATA(\"Giros\n(Valor en pesos)\",$A$44,\"Número Proyecto\",1304)","v":2302017230},0]
[1310201010102,0,null,null,"1305 - En Chapinero participamos todos      ",2647909909,{"$f":"+GETPIVOTDATA(\"Giros\n(Valor en pesos)\",$A$44,\"Número Proyecto\",1305)","v":2647909909},0]
[1310202010202,0]
[1310202010203,14897350]
[1310202010302,975000]
[13102020203050,455698332]
[13102020203060,24491935]
[131020202020105,4811238]
[131020202020106,78626800]
[131020202020107,74994669]
[131020202020110,0]
[131020202020201,39466667]
[131020202030301,0]
[131020202030401,18384140]
[131020202030603,0]
[131020202030608,0]
[131020202030611,2045031]
[131020202030612,0]
[131020202040101,52406900]
[131020202040102,5970110]
[131020202040103,7271600]
[1310202020101,0]
[131020202030304,0]
["Total general",10391559109]

{"sheet":"Formato2020 ","index":1,"n_rows":309,"n_cols":49,"rows_kept":309,"cut":false,"hidden":false,"merged":[[7,29,7,30],[11,33,11,36],[10,29,10,32],[5,31,5,37],[6,31,6,37],[7,31,7,37],[8,31,8,37],[9,31,9,37],[9,29,9,30],[10,33,10,36],[8,10,9,15],[8,29,8,30],[9,0,9,3],[9,5,9,7],[11,14,11,15],[10,0,10,15],[10,16,10,22],[10,23,10,28],[11,2,11,3],[11,8,11,12],[8,0,8,3],[8,5,8,7],[1,0,1,37],[2,0,2,37],[4,0,4,3],[4,8,4,10],[4,14,4,15],[4,22,4,37],[5,0,5,3],[5,8,5,10],[5,29,5,30],[6,0,6,3],[6,8,6,10],[6,29,6,30]]}
[]
["VEEDURIA DISTRITAL - RENDICION DE CUENTAS DE LA GESTION CONTRACTUAL EN EL DISTRITO CAPITAL (Acuerdo 380 de 2009)"]
["INFORMACION GENERAL DE CONTRATACION ENTIDADES DISTRITALES  -  ENERO 1 A 31 DICIEMBRE DE 2020"]
[]
["1. Entidad",null,null,null,"FONDO DE DESARROLLO LOCAL DE CHAPINERO",null,null,"2. Sector","Gobierno"]
["3. Presupuesto Disponible Inversión Directa PREDIS",null,null,null,18785956671,null,null,"5. Presupuesto Disponible Funcionamiento PREDIS",2283000000,null,null,null,null,null,null,null,null,null,null,null,null,null,null,null,null,null,null,null,null,"9. Nombre de quien diligencia el formato",null,"MARYARY SUNED QUINCHE SÁNCHEZ"]
["4. Presupuesto Comprometido de Inversión Directa según PREDIS ",null,null,null,18400660685,null,null,"6. Presupuesto Comprometido Funcionamiento según PREDIS",2077679242,null,null,null,null,null,null,null,null,null,null,null,null,null,null,null,null,null,null,null,null,"Cargo",null,"APOYO TÉCNICO"]
[null,null,null,null,null,null,null,null,null,null,null,null,null,null,null,null,null,null,null,null,null,null,null,null,null,null,null,null,null,"Dependencia",null,"ÁREA GESTIÓN DEL DESARROLLO LOCAL"]
["7. Presupuesto Disponible Operación (Régimen Privado)",null,null,null,null,null,null,null,null,null,null,null,null,null,null,null,null,null,null,null,null,null,null,null,null,null,null,null,null,"Teléfono",null,"3820660 - 3387000"]
["8. Presupuesto Comprometido Operación mediante contratos",null,null,null,null,null,null,null,null,null,null,null,null,null,null,null,null,null,null,null,null,null,null,null,null,null,null,null,null,"Correo Electrónico",null,"maryary.quinche@gobiernobogota.gov.co"]
["1- INFORMACION GENERAL",null,null,null,null,null,null,null,null,null,null,null,null,null,null,null,"2- INFORMACION FINANCIERA",null,null,null,null,null,null,"3 - PLAZOS ",null,null,null,null,null,"4. CESION",null,null,null,null,null,null,null,"5. %  Avance y/o cumplimiento"]
[1,2,3,null,4,null,6,7,8,null,null,null,null,9,10,null,11,12,13,14,15,16,17,18,19,20,21,22,23,24,25,26,27,null,null,null,null,29]
["Número Contrato","Año","Proceso Publicado en","Número de proceso contractual \nSECOP","Tipo de contrato ","Modalidad de Selección","Procedimiento o causal","Objeto","Afectación","Plan de Desarrollo Distrital","Número Programa","Equivalencia número de programa","Eje / Pilar / Propósito","Número Proyecto","Número  de Identificación del contratista\n(NIT con digito de verificación)","Nombre del contratista","Valor Inicial del contrato","Número de reducciones","Valor total reducciones \n(En valor negativo)","Número de adiciones","Valor total de adiciones ","Valor Final ","Giros\n(Valor en pesos)","Fecha de suscripción (DD/MM/AAAA)","Fecha de inicio (DD/MM/AAAA)","Fecha de terminación (DD/MM/AAAA)","Plazo en días","Número de prórrogas","Prorroga en días","Número  de Identificación del cesionario\n(NIT con digito de verificación)","Nombre cesionario","Fecha cesión\n(DD/MM/AAAA)","Valor cesión","Celebrado o por iniciar","En Ejecución","Terminado","Liquidado","% Avance y/o Cumplimiento",null,null,"Total Contratos","Validación Tipo","Validación Modalidad","Validación procedimiento","Validación afectación","Validación programa","secop","Fecha suscripción","PDD"]
["FDLCH-CPS-001-2020",2020,"SECOP II","CPS-001-2020","Contratos de prestación de servicios profesionales y de apoyo a la gestión","Contratación directa","Prestación de servicios profesionales y de apoyo a la gestión, o para la ejecución de trabajos artísticos que sólo puedan encomendarse a determinadas personas naturales;","PRESTACIÓN DE SERVICIOS PROFESIONALES PARA APOYAR LA GESTIÓN CONTRACTUAL A CARGO DEL ÁREA DE GESTIÓN DEL DESARROLLO LOCAL DE LA ALCALDÍA LOCAL DE CHAPINERO","Inversión","Bogotá Mejor para Todos",45,{"$f":"IF(ISERROR(VLOOKUP(K14,Eje_Pilar_Prop!$C$2:$E$104,2,FALSE)),\" \",VLOOKUP(K14,Eje_Pilar_Prop!$C$2:$E$104,2,FALSE))","v":"Gobernanza e influencia local, regional e internacional"},{"$f":"IF(ISERROR(VLOOKUP(K14,Eje_Pilar_Prop!$C$2:$E$104,3,FALSE)),\" \",VLOOKUP(K14,Eje_Pilar_Prop!$C$2:$E$104,3,FALSE))","v":"Eje Transversal 4 Gobierno Legitimo, Fortalecimiento Local y Eficiencia"},1304,1078368894,"JENNYFER PAOLA GALVIS TORRES",22050000,1,-1102050,2,11025000,{"$f":"+Q14+S14+U14","v":31972950},31972500,"2020-01-21","2020-01-22","2020-07-15",120,2,60,null,null,null,null,null,null,"X",null,{"$f":"IF(ISERROR(W14/V14),\"-\",(W14/V14))","v":0.99998592560273603},null,null,{"$f":"IF(SUMPRODUCT((A$14:A14=A14)*(B$14:B14=B14)*(D$14:D14=D14))>1,0,1)","v":1},{"$f":"IF(ISBLANK(E14),1,IFERROR(VLOOKUP(E14,tipo,1,FALSE),\"NO\"))","v":"Contratos de prestación de servicios profesionales y de apoyo a la gestión"},{"$f":"IF(ISBLANK(F14),1,IFERROR(VLOOKUP(F14,modal,1,FALSE),\"NO\"))","v":"Contratación directa"},{"$f":"IF(ISBLANK(G14),1,IFERROR(VLOOKUP(G14,Tipo!$C$12:$C$27,1,FALSE),\"NO\"))","v":"Prestación de servicios profesionales y de apoyo a la gestión, o para la ejecución de trabajos artísticos que sólo puedan encomendarse a determinadas personas naturales;"},{"$f":"IF(ISBLANK(I14),1,IFERROR(VLOOKUP(I14,afectacion,1,FALSE),\"NO\"))","v":"Inversión"},{"$f":"IF(ISBLANK(K14),1,IFERROR(VLOOKUP(K14,Eje_Pilar_Prop!$C$3:$C$104,1,FALSE),\"NO\"))","v":45},{"$f":"IF(ISBLANK(C14),1,IFERROR(VLOOKUP(C14,SECOP,1,FALSE),\"NO\"))","v":"SECOP II"},{"$f":"IF(OR(YEAR(X14)=2020,ISBLANK(X14)),1,\"NO\")","v":1},{"$f":"IF(ISBLANK(J14),1,IFERROR(VLOOKUP(J14,pdd,1,FALSE),\"NO\"))","v":"Bogotá Mejor para Todos"}]
["FDLCH-CPS-002-2020",2020,"SECOP II","CPS-002-2020","Contratos de prestación de servicios profesionales y de apoyo a la gestión","Contratación directa","Prestación de servicios profesionales y de apoyo a la gestión, o para la ejecución de trabajos artísticos que sólo puedan encomendarse a determinadas personas naturales;","PRESTACIÓN DE SERVICIOS PROFESIONALES PARA APOYAR LA GESTIÓN CONTRACTUAL A CARGO DEL ÁREA DE GESTIÓN DEL DESARROLLO LOCAL DE LA ALCALDÍA LOCAL DE CHAPINERO","Inversión","Bogotá Mejor para Todos",45,{"$f":"IF(ISERROR(VLOOKUP(K15,Eje_Pilar_Prop!$C$2:$E$104,2,FALSE)),\" \",VLOOKUP(K15,Eje_Pilar_Prop!$C$2:$E$104,2,FALSE))","v":"Gobernanza e influencia local, regional e internacional"},{"$f":"IF(ISERROR(VLOOKUP(K15,Eje_Pilar_Prop!$C$2:$E$104,3,FALSE)),\" \",VLOOKUP(K15,Eje_Pilar_Prop!$C$2:$E$104,3,FALSE))","v":"Eje Transversal 4 Gobierno Legitimo, Fortalecimiento Local y Eficiencia"},1304,51854194,"BONNY BIANEY AGUIRRE BEDOYA",22050000,1,-1102050,2,11025000,31972950,31972500,"2020-01-21","2020-01-22","2020-07-15",120,2,60,null,null,null,null,null,null,"X",null,0.99998592560273603,null,null,{"$f":"IF(SUMPRODUCT((A$14:A15=A15)*(B$14:B15=B15)*(D$14:D15=D15))>1,0,1)","v":1},"Contratos de prestación de servicios profesionales y de apoyo a la gestión","Contratación directa",{"$f":"IF(ISBLANK(G15),1,IFERROR(VLOOKUP(G15,Tipo!$C$12:$C$27,1,FALSE),\"NO\"))","v":"Prestación de servicios profesionales y de apoyo a la gestión, o para la ejecución de trabajos artísticos que sólo puedan encomendarse a determinadas personas naturales;"},"Inversión",{"$f":"IF(ISBLANK(K15),1,IFERROR(VLOOKUP(K15,Eje_Pilar_Prop!$C$3:$C$104,1,FALSE),\"NO\"))","v":45},"SECOP II",1,"Bogotá Mejor para Todos"]
["FDLCH-CPS-003-2020",2020,"SECOP II","CPS-003-2020","Contratos de prestación de servicios profesionales y de apoyo a la gestión","Contratación directa","Prestación de servicios profesionales y de apoyo a la gestión, o para la ejecución de trabajos artísticos que sólo puedan encomendarse a determinadas personas naturales;","PRESTACIÓN DE SERVICIOS PROFESIONALES PARA APOYAR LA GESTIÓN JURÍDICA DEL DESPACHO DE LA ALCALDÍA LOCAL DE CHAPINERO Y LA DE LAS DEPENDENCIAS QUE LA CONFORMAN, EN CUMPLIMIENTO DE LAS FUNCIONES ESTABLECIDAS POR MANDATO CONSTITUCIONAL Y LEGAL","Inversión","Bogotá Mejor para Todos",45,{"$f":"IF(ISERROR(VLOOKUP(K16,Eje_Pilar_Prop!$C$2:$E$104,2,FALSE)),\" \",VLOOKUP(K16,Eje_Pilar_Prop!$C$2:$E$104,2,FALSE))","v":"Gobernanza e influencia local, regional e internacional"},{"$f":"IF(ISERROR(VLOOKUP(K16,Eje_Pilar_Prop!$C$2:$E$104,3,FALSE)),\" \",VLOOKUP(K16,Eje_Pilar_Prop!$C$2:$E$104,3,FALSE))","v":"Eje Transversal 4 Gobierno Legitimo, Fortalecimiento Local y Eficiencia"},1304,53159659,"ERIKA NATHALIA MUNERA LEMUS",36000000,0,0,0,0,{"$f":"+Q16+S16+U16","v":36000000},36000000,"2020-01-22","2020-01-22",{"$f":"+Y16","v":"2020-01-22"},120,0,0,null,null,null,null,null,null,"X",null,1,null,null,{"$f":"IF(SUMPRODUCT((A$14:A16=A16)*(B$14:B16=B16)*(D$14:D16=D16))>1,0,1)","v":1},{"$f":"IF(ISBLANK(E16),1,IFERROR(VLOOKUP(E16,tipo,1,FALSE),\"NO\"))","v":"Contratos de prestación de servicios profesionales y de apoyo a la gestión"},{"$f":"IF(ISBLANK(F16),1,IFERROR(VLOOKUP(F16,modal,1,FALSE),\"NO\"))","v":"Contratación directa"},{"$f":"IF(ISBLANK(G16),1,IFERROR(VLOOKUP(G16,Tipo!$C$12:$C$27,1,FALSE),\"NO\"))","v":"Prestación de servicios profesionales y de apoyo a la gestión, o para la ejecución de trabajos artísticos que sólo puedan encomendarse a determinadas personas naturales;"},{"$f":"IF(ISBLANK(I16),1,IFERROR(VLOOKUP(I16,afectacion,1,FALSE),\"NO\"))","v":"Inversión"},{"$f":"IF(ISBLANK(K16),1,IFERROR(VLOOKUP(K16,Eje_Pilar_Prop!$C$3:$C$104,1,FALSE),\"NO\"))","v":45},{"$f":"IF(ISBLANK(C16),1,IFERROR(VLOOKUP(C16,SECOP,1,FALSE),\"NO\"))","v":"SECOP II"},{"$f":"IF(OR(YEAR(X16)=2020,ISBLANK(X16)),1,\"NO\")","v":1},{"$f":"IF(ISBLANK(J16),1,IFERROR(VLOOKUP(J16,pdd,1,FALSE),\"NO\"))","v":"Bogotá Mejor para Todos"}]
["FDLCH-CPS-004-2020",2020,"SECOP II","CPS-004-2020","Contratos de prestación de servicios profesionales y de apoyo a la gestión","Contratación directa","Prestación de servicios profesionales y de apoyo a la gestión, o para la ejecución de trabajos artísticos que sólo puedan encomendarse a determinadas personas naturales;","PRESTACIÓN DE SERVICIOS PROFESIONALES PARA APOYAR LA GESTIÓN CONTRACTUAL A CARGO DEL ÁREA DE GESTIÓN DEL DESARROLLO LOCAL DE LA ALCALDÍA LOCAL DE CHAPINERO","Inversión","Bogotá Mejor para Todos",45,{"$f":"IF(ISERROR(VLOOKUP(K17,Eje_Pilar_Prop!$C$2:$E$104,2,FALSE)),\" \",VLOOKUP(K17,Eje_Pilar_Prop!$C$2:$E$104,2,FALSE))","v":"Gobernanza e influencia local, regional e internacional"},{"$f":"IF(ISERROR(VLOOKUP(K17,Eje_Pilar_Prop!$C$2:$E$104,3,FALSE)),\" \",VLOOKUP(K17,Eje_Pilar_Prop!$C$2:$E$104,3,FALSE))","v":"Eje Transversal 4 Gobierno Legitimo, Fortalecimiento Local y Eficiencia"},1304,49772886,"PAOLA KARINA ESCALONA PABON",22050000,0,0,1,5512500,27562500,27562500,"2020-01-23","2020-01-24","2020-07-11",120,1,30,39576142,"MARGARITA MARIA CASAS ALARCON\n","2020-02-19",17088750,null,null,"X",null,1,null,null,{"$f":"IF(SUMPRODUCT((A$14:A17=A17)*(B$14:B17=B17)*(D$14:D17=D17))>1,0,1)","v":1},"Contratos de prestación de servicios profesionales y de apoyo a la gestión","Contratación directa",{"$f":"IF(ISBLANK(G17),1,IFERROR(VLOOKUP(G17,Tipo!$C$12:$C$27,1,FALSE),\"NO\"))","v":"Prestación de servicios profesionales y de apoyo a la gestión, o para la ejecución de trabajos artísticos que sólo puedan encomendarse a determinadas personas naturales;"},"Inversión",{"$f":"IF(ISBLANK(K17),1,IFERROR(VLOOKUP(K17,Eje_Pilar_Prop!$C$3:$C$104,1,FALSE),\"NO\"))","v":45},"SECOP II",1,"Bogotá Mejor para Todos"]
["FDLCH-CPS-005-2020",2020,"SECOP II","CPS-005-2020","Contratos de prestación de servicios profesionales y de apoyo a la gestión","Contratación directa","Prestación de servicios profesionales y de apoyo a la gestión, o para la ejecución de trabajos artísticos que sólo puedan encomendarse a determinadas personas naturales;","PRESTACIÓN DE SERVICIOS PROFESIONALES PARA EL APOYO AL ÁREA DE GESTIÓN DEL DESARROLLO LOCAL DE LA ALCALDÍA LOCAL DE CHAPINERO EN LA FORMULACIÓN, GESTIÓN, EJECUCIÓN Y SEGUIMIENTO A LOS PROYECTOS ASIGNADOS POR EL ALCALDE LOCAL DE CHAPINERO DERIVADOS DE LOS GASTOS DE FUNCIONAMIENTOS Y LA SUPERVISIÓN DE CONTRATOS QUE LE SEAN ASIGNADOS  ","Inversión","Bogotá Mejor para Todos",45,{"$f":"IF(ISERROR(VLOOKUP(K18,Eje_Pilar_Prop!$C$2:$E$104,2,FALSE)),\" \",VLOOKUP(K18,Eje_Pilar_Prop!$C$2:$E$104,2,FALSE))","v":"Gobernanza e influencia local, regional e internacional"},{"$f":"IF(ISERROR(VLOOKUP(K18,Eje_Pilar_Prop!$C$2:$E$104,3,FALSE)),\" \",VLOOKUP(K18,Eje_Pilar_Prop!$C$2:$E$104,3,FALSE))","v":"Eje Transversal 4 Gobierno Legitimo, Fortalecimiento Local y Eficiencia"},1304,1020779113,"DANIEL FELIPE SANTIAGO COHEN ",23100000,0,0,0,0,23100000,23100000,"2020-01-23","2020-01-24",{"$f":"+Y18","v":"2020-01-24"},120,0,0,null,null,null,null,null,null,"X",null,1,null,null,{"$f":"IF(SUMPRODUCT((A$14:A18=A18)*(B$14:B18=B18)*(D$14:D18=D18))>1,0,1)","v":1},"Contratos de prestación de servicios profesionales y de apoyo a la gestión","Contratación directa",{"$f":"IF(ISBLANK(G18),1,IFERROR(VLOOKUP(G18,Tipo!$C$12:$C$27,1,FALSE),\"NO\"))","v":"Prestación de servicios profesionales y de apoyo a la gestión, o para la ejecución de trabajos artísticos que sólo puedan encomendarse a determinadas personas naturales;"},"Inversión",{"$f":"IF(ISBLANK(K18),1,IFERROR(VLOOKUP(K18,Eje_Pilar_Prop!$C$3:$C$104,1,FALSE),\"NO\"))","v":45},"SECOP II",1,"Bogotá Mejor para Todos"]
["FDLCH-CPS-006-2020",2020,"SECOP II","CPS-006-2020","Contratos de prestación de servicios profesionales y de apoyo a la gestión","Contratación directa","Prestación de servicios profesionales y de apoyo a la gestión, o para la ejecución de trabajos artísticos que sólo puedan encomendarse a determinadas personas naturales;","PRESTACIÓN DE SERVICIOS PERSONALES NECESARIOS PARA EL APOYO EN LA EJECUCIÓN DE ACTIVIDADES ADMINISTRATIVAS Y OPERATIVAS ADELANTADAS EN LA JUNTA ADMINISTRADORA LOCAL DE CHAPINERO","Inversión","Bogotá Mejor para Todos",45,{"$f":"IF(ISERROR(VLOOKUP(K19,Eje_Pilar_Prop!$C$2:$E$104,2,FALSE)),\" \",VLOOKUP(K19,Eje_Pilar_Prop!$C$2:$E$104,2,FALSE))","v":"Gobernanza e influencia local, regional e internacional"},{"$f":"IF(ISERROR(VLOOKUP(K19,Eje_Pilar_Prop!$C$2:$E$104,3,FALSE)),\" \",VLOOKUP(K19,Eje_Pilar_Prop!$C$2:$E$104,3,FALSE))","v":"Eje Transversal 4 Gobierno Legitimo, Fortalecimiento Local y Eficiencia"},1304,51968302,"DIANA SOFIA MELO CASTRO",9922500,0,0,1,4382438,14304938,14304938,"2020-01-21","2020-01-22","2020-07-14",120,1,30,null,null,null,null,null,null,"X",null,1,null,null,{"$f":"IF(SUMPRODUCT((A$14:A19=A19)*(B$14:B19=B19)*(D$14:D19=D19))>1,0,1)","v":1},"Contratos de prestación de servicios profesionales y de apoyo a la gestión","Contratación directa",{"$f":"IF(ISBLANK(G19),1,IFERROR(VLOOKUP(G19,Tipo!$C$12:$C$27,1,FALSE),\"NO\"))","v":"Prestación de servicios profesionales y de apoyo a la gestión, o para la ejecución de trabajos artísticos que sólo puedan encomendarse a determinadas personas naturales;"},"Inversión",{"$f":"IF(ISBLANK(K19),1,IFERROR(VLOOKUP(K19,Eje_Pilar_Prop!$C$3:$C$104,1,FALSE),\"NO\"))","v":45},"SECOP II",1,"Bogotá Mejor para Todos"]
["FDLCH-CPS-007-2020",2020,"SECOP II","CPS-007-2020","Contratos de prestación de servicios profesionales y de apoyo a la gestión","Contratación directa","Prestación de servicios profesionales y de apoyo a la gestión, o para la ejecución de trabajos artísticos que sólo puedan encomendarse a determinadas personas naturales;","PRESTACIÓN DE LOS SERVICIOS PERSONALES NECESARIOS PARA LA CONDUCCIÓN DE LOS VEHÍCULOS QUE CONFORMAN EL PARQUE AUTOMOTOR EN PROPIEDAD O CUSTODIA DEL FONDO DE DESARROLLO LOCAL DE CHAPINERO, Y EL TRANSPORTE DE SERVIDORES PÚBLICOS PARA LA REALIZACIÓN DE LAS ACTIVIDADES MISIONALES DE LA ALCALDÍA LOCAL DE CHAPINERO.","Inversión","Bogotá Mejor para Todos",45,{"$f":"IF(ISERROR(VLOOKUP(K20,Eje_Pilar_Prop!$C$2:$E$104,2,FALSE)),\" \",VLOOKUP(K20,Eje_Pilar_Prop!$C$2:$E$104,2,FALSE))","v":"Gobernanza e influencia local, regional e internacional"},{"$f":"IF(ISERROR(VLOOKUP(K20,Eje_Pilar_Prop!$C$2:$E$104,3,FALSE)),\" \",VLOOKUP(K20,Eje_Pilar_Prop!$C$2:$E$104,3,FALSE))","v":"Eje Transversal 4 Gobierno Legitimo, Fortalecimiento Local y Eficiencia"},1304,79518739,"GERARDO MORENO HERRERA",9360000,0,0,1,4056000,13416000,13416000,"2020-01-23","2020-01-24","2020-07-15",120,1,60,null,null,null,null,null,null,"X",null,1,null,null,{"$f":"IF(SUMPRODUCT((A$14:A20=A20)*(B$14:B20=B20)*(D$14:D20=D20))>1,0,1)","v":1},"Contratos de prestación de servicios profesionales y de apoyo a la gestión","Contratación directa",{"$f":"IF(ISBLANK(G20),1,IFERROR(VLOOKUP(G20,Tipo!$C$12:$C$27,1,FALSE),\"NO\"))","v":"Prestación de servicios profesionales y de apoyo a la gestión, o para la ejecución de trabajos artísticos que sólo puedan encomendarse a determinadas personas naturales;"},"Inversión",{"$f":"IF(ISBLANK(K20),1,IFERROR(VLOOKUP(K20,Eje_Pilar_Prop!$C$3:$C$104,1,FALSE),\"NO\"))","v":45},"SECOP II",1,"Bogotá Mejor para Todos"]
["FDLCH-CPS-008-2020",2020,"SECOP II","CPS-008-2020","Contratos de prestación de servicios profesionales y de apoyo a la gestión","Contratación directa","Prestación de servicios profesionales y de apoyo a la gestión, o para la ejecución de trabajos artísticos que sólo puedan encomendarse a determinadas personas naturales;","PRESTACIÓN DE SERVICIOS PARA EL APOYO EN LA EJECUCIÓN DE ACTIVIDADES ADMINISTRATIVAS Y OPERATIVAS TRANSVERSALES AL ÁREA DE GESTIÓN DEL DESARROLLO LOCAL RELACIONADAS CON LA GESTIÓN CONTRACTUAL DE LA ALCALDÍA LOCAL DE CHAPINERO","Inversión","Bogotá Mejor para Todos",45,{"$f":"IF(ISERROR(VLOOKUP(K21,Eje_Pilar_Prop!$C$2:$E$104,2,FALSE)),\" \",VLOOKUP(K21,Eje_Pilar_Prop!$C$2:$E$104,2,FALSE))","v":"Gobernanza e influencia local, regional e internacional"},{"$f":"IF(ISERROR(VLOOKUP(K21,Eje_Pilar_Prop!$C$2:$E$104,3,FALSE)),\" \",VLOOKUP(K21,Eje_Pilar_Prop!$C$2:$E$104,3,FALSE))","v":"Eje Transversal 4 Gobierno Legitimo, Fortalecimiento Local y Eficiencia"},1304,52119337,"MARTHA YANETH VASQUEZ FIGUEROA",9816660,0,0,0,0,9816660,9816660,"2020-01-20","2020-01-24",{"$f":"+Y21","v":"2020-01-24"},120,0,0,null,null,null,null,null,null,"X",null,1,null,null,{"$f":"IF(SUMPRODUCT((A$14:A21=A21)*(B$14:B21=B21)*(D$14:D21=D21))>1,0,1)","v":1},"Contratos de prestación de servicios profesionales y de apoyo a la gestión","Contratación directa",{"$f":"IF(ISBLANK(G21),1,IFERROR(VLOOKUP(G21,Tipo!$C$12:$C$27,1,FALSE),\"NO\"))","v":"Prestación de servicios profesionales y de apoyo a la gestión, o para la ejecución de trabajos artísticos que sólo puedan encomendarse a determinadas personas naturales;"},"Inversión",{"$f":"IF(ISBLANK(K21),1,IFERROR(VLOOKUP(K21,Eje_Pilar_Prop!$C$3:$C$104,1,FALSE),\"NO\"))","v":45},"SECOP II",1,"Bogotá Mejor para Todos"]
["FDLCH-CPS-009-2020",2020,"SECOP II","CPS-009-2020","Contratos de prestación de servicios profesionales y de apoyo a la gestión","Contratación directa","Prestación de servicios profesionales y de apoyo a la gestión, o para la ejecución de trabajos artísticos que sólo puedan encomendarse a determinadas personas naturales;"," PRESTACIÓN DE LOS SERVICIOS TÉCNICOS PARA APOYAR LA GESTIÓN Y EJECUCIÓN DE ACTIVIDADES ADMINISTRATIVAS Y OPERATIVAS QUE SE ADELANTAN EN EL DESPACHO DE LA ALCALDÍA LOCAL DE CHAPINERO.","Inversión","Bogotá Mejor para Todos",45,{"$f":"IF(ISERROR(VLOOKUP(K22,Eje_Pilar_Prop!$C$2:$E$104,2,FALSE)),\" \",VLOOKUP(K22,Eje_Pilar_Prop!$C$2:$E$104,2,FALSE))","v":"Gobernanza e influencia local, regional e internacional"},{"$f":"IF(ISERROR(VLOOKUP(K22,Eje_Pilar_Prop!$C$2:$E$104,3,FALSE)),\" \",VLOOKUP(K22,Eje_Pilar_Prop!$C$2:$E$104,3,FALSE))","v":"Eje Transversal 4 Gobierno Legitimo, Fortalecimiento Local y Eficiencia"},1304,22511864,"SONIA MILENA PORTILLO OSORIO",15400000,0,0,0,0,15400000,15400000,"2020-01-22","2020-01-24",{"$f":"+Y22","v":"2020-01-24"},120,0,0,null,null,null,null,null,null,"X",null,1,null,null,{"$f":"IF(SUMPRODUCT((A$14:A22=A22)*(B$14:B22=B22)*(D$14:D22=D22))>1,0,1)","v":1},"Contratos de prestación de servicios profesionales y de apoyo a la gestión","Contratación directa",{"$f":"IF(ISBLANK(G22),1,IFERROR(VLOOKUP(G22,Tipo!$C$12:$C$27,1,FALSE),\"NO\"))","v":"Prestación de servicios profesionales y de apoyo a la gestión, o para la ejecución de trabajos artísticos que sólo puedan encomendarse a determinadas personas naturales;"},"Inversión",{"$f":"IF(ISBLANK(K22),1,IFERROR(VLOOKUP(K22,Eje_Pilar_Prop!$C$3:$C$104,1,FALSE),\"NO\"))","v":45},"SECOP II",1,"Bogotá Mejor para Todos"]
["FDLCH-CPS-010-2020",2020,"SECOP II","CPS-010-2020","Contratos de prestación de servicios profesionales y de apoyo a la gestión","Contratación directa","Prestación de servicios profesionales y de apoyo a la gestión, o para la ejecución de trabajos artísticos que sólo puedan encomendarse a determinadas personas naturales;","PRESTACIÓN DE LOS SERVICIOS PERSONALES NECESARIOS PARA LA CONDUCCIÓN DE LOS VEHÍCULOS QUE CONFORMAN EL PARQUE AUTOMOTOR EN PROPIEDAD O CUSTODIA DEL FONDO DE DESARROLLO LOCAL DE CHAPINERO, Y EL TRANSPORTE DE SERVIDORES PÚBLICOS PARA LA REALIZACIÓN DE LAS ACTIVIDADES MISIONALES DE LA ALCALDÍA LOCAL DE CHAPINERO.","Inversión","Bogotá Mejor para Todos",45,{"$f":"IF(ISERROR(VLOOKUP(K23,Eje_Pilar_Prop!$C$2:$E$104,2,FALSE)),\" \",VLOOKUP(K23,Eje_Pilar_Prop!$C$2:$E$104,2,FALSE))","v":"Gobernanza e influencia local, regional e internacional"},{"$f":"IF(ISERROR(VLOOKUP(K23,Eje_Pilar_Prop!$C$2:$E$104,3,FALSE)),\" \",VLOOKUP(K23,Eje_Pilar_Prop!$C$2:$E$104,3,FALSE))","v":"Eje Transversal 4 Gobierno Legitimo, Fortalecimiento Local y Eficiencia"},1304,80157713,"FERNANDO MEDINA MONTERO",9360000,1,-546000,1,4680000,13494000,13494000,"2020-01-22","2020-01-23","2020-07-15",120,1,60,null,null,null,null,null,null,"X",null,1,null,null,{"$f":"IF(SUMPRODUCT((A$14:A23=A23)*(B$14:B23=B23)*(D$14:D23=D23))>1,0,1)","v":1},"Contratos de prestación de servicios profesionales y de apoyo a la gestión","Contratación directa",{"$f":"IF(ISBLANK(G23),1,IFERROR(VLOOKUP(G23,Tipo!$C$12:$C$27,1,FALSE),\"NO\"))","v":"Prestación de servicios profesionales y de apoyo a la gestión, o para la ejecución de trabajos artísticos que sólo puedan encomendarse a determinadas personas naturales;"},"Inversión",{"$f":"IF(ISBLANK(K23),1,IFERROR(VLOOKUP(K23,Eje_Pilar_Prop!$C$3:$C$104,1,FALSE),\"NO\"))","v":45},"SECOP II",1,"Bogotá Mejor para Todos"]
["FDLCH-CPS-011-2020",2020,"SECOP II","CPS-011-2020","Contratos de prestación de servicios profesionales y de apoyo a la gestión","Contratación directa","Prestación de servicios profesionales y de apoyo a la gestión, o para la ejecución de trabajos artísticos que sólo puedan encomendarse a determinadas personas naturales;","PRESTACIÓN DE LOS SERVICIOS PERSONALES NECESARIOS PARA LA CONDUCCIÓN DE LOS VEHÍCULOS QUE CONFORMAN EL PARQUE AUTOMOTOR EN PROPIEDAD O CUSTODIA DEL FONDO DE DESARROLLO LOCAL DE CHAPINERO, Y EL TRANSPORTE DE SERVIDORES PÚBLICOS PARA LA REALIZACIÓN DE LAS ACTIVIDADES MISIONALES DE LA ALCALDÍA LOCAL DE CHAPINERO.","Inversión","Bogotá Mejor para Todos",45,{"$f":"IF(ISERROR(VLOOKUP(K24,Eje_Pilar_Prop!$C$2:$E$104,2,FALSE)),\" \",VLOOKUP(K24,Eje_Pilar_Prop!$C$2:$E$104,2,FALSE))","v":"Gobernanza e influencia local, regional e internacional"},{"$f":"IF(ISERROR(VLOOKUP(K24,Eje_Pilar_Prop!$C$2:$E$104,3,FALSE)),\" \",VLOOKUP(K24,Eje_Pilar_Prop!$C$2:$E$104,3,FALSE))","v":"Eje Transversal 4 Gobierno Legitimo, Fortalecimiento Local y Eficiencia"},1304,3220879,"BENEDICTO VANEGAS CASTELLANOS",9360000,1,-1092000,1,4680000,12948000,12948000,"2020-01-22","2020-01-23","2020-07-15",120,1,60,null,null,null,null,null,null,"X",null,1,null,null,{"$f":"IF(SUMPRODUCT((A$14:A24=A24)*(B$14:B24=B24)*(D$14:D24=D24))>1,0,1)","v":1},"Contratos de prestación de servicios profesionales y de apoyo a la gestión","Contratación directa",{"$f":"IF(ISBLANK(G24),1,IFERROR(VLOOKUP(G24,Tipo!$C$12:$C$27,1,FALSE),\"NO\"))","v":"Prestación de servicios profesionales y de apoyo a la gestión, o para la ejecución de trabajos artísticos que sólo puedan encomendarse a determinadas personas naturales;"},"Inversión",{"$f":"IF(ISBLANK(K24),1,IFERROR(VLOOKUP(K24,Eje_Pilar_Prop!$C$3:$C$104,1,FALSE),\"NO\"))","v":45},"SECOP II",1,"Bogotá Mejor para Todos"]
["FDLCH-CPS-012-2020",2020,"SECOP II","CPS-012-2020","Contratos de prestación de servicios profesionales y de apoyo a la gestión","Contratación directa","Prestación de servicios profesionales y de apoyo a la gestión, o para la ejecución de trabajos artísticos que sólo puedan encomendarse a determinadas personas naturales;","“PRESTACIÓN DE SERVICIOS PERSONALES NECESARIOS PARA EL APOYO EN LA EJECUCIÓN DE ACTIVIDADES ADMINISTRATIVAS Y OPERATIVAS ADELANTADAS EN LA JUNTA ADMINISTRADORA LOCAL DE CHAPINERO”","Inversión","Bogotá Mejor para Todos",45,{"$f":"IF(ISERROR(VLOOKUP(K25,Eje_Pilar_Prop!$C$2:$E$104,2,FALSE)),\" \",VLOOKUP(K25,Eje_Pilar_Prop!$C$2:$E$104,2,FALSE))","v":"Gobernanza e influencia local, regional e internacional"},{"$f":"IF(ISERROR(VLOOKUP(K25,Eje_Pilar_Prop!$C$2:$E$104,3,FALSE)),\" \",VLOOKUP(K25,Eje_Pilar_Prop!$C$2:$E$104,3,FALSE))","v":"Eje Transversal 4 Gobierno Legitimo, Fortalecimiento Local y Eficiencia"},1304,52523548,"SANDRA MILENA GÓMEZ SALAZAR",9922500,1,-744187,1,4961250,14139563,14139563,"2020-01-22","2020-01-24","2020-07-14",120,1,60,null,null,null,null,null,null,"X",null,1,null,null,{"$f":"IF(SUMPRODUCT((A$14:A25=A25)*(B$14:B25=B25)*(D$14:D25=D25))>1,0,1)","v":1},"Contratos de prestación de servicios profesionales y de apoyo a la gestión","Contratación directa",{"$f":"IF(ISBLANK(G25),1,IFERROR(VLOOKUP(G25,Tipo!$C$12:$C$27,1,FALSE),\"NO\"))","v":"Prestación de servicios profesionales y de apoyo a la gestión, o para la ejecución de trabajos artísticos que sólo puedan encomendarse a determinadas personas naturales;"},"Inversión",{"$f":"IF(ISBLANK(K25),1,IFERROR(VLOOKUP(K25,Eje_Pilar_Prop!$C$3:$C$104,1,FALSE),\"NO\"))","v":45},"SECOP II",1,"Bogotá Mejor para Todos"]
["FDLCH-CPS-013-2020",2020,"SECOP II","CPS-013-2020","Contratos de prestación de servicios profesionales y de apoyo a la gestión","Contratación directa","Prestación de servicios profesionales y de apoyo a la gestión, o para la ejecución de trabajos artísticos que sólo puedan encomendarse a determinadas personas naturales;","PRESTACIÓN DE SERVICIOS PROFESIONALES PARA APOYAR AL ALCALDE LOCAL EN LA GESTIÓN DE LOS ASUNTOS RELACIONADOS CON SEGURIDAD CIUDADANA, CONVIVENCIA Y PREVENCIÓN DE CONFLICTIVIDADES, VIOLENCIAS Y DELITOS EN LA LOCALIDAD, DE CONFORMIDAD CON EL MARCO NORMATIVO APLICABLE EN LA MATERIA.","Inversión","Bogotá Mejor para Todos",19,{"$f":"IF(ISERROR(VLOOKUP(K26,Eje_Pilar_Prop!$C$2:$E$104,2,FALSE)),\" \",VLOOKUP(K26,Eje_Pilar_Prop!$C$2:$E$104,2,FALSE))","v":"Seguridad y convivencia para todos"},{"$f":"IF(ISERROR(VLOOKUP(K26,Eje_Pilar_Prop!$C$2:$E$104,3,FALSE)),\" \",VLOOKUP(K26,Eje_Pilar_Prop!$C$2:$E$104,3,FALSE))","v":"Pilar 3 Construcción de Comunidad y Cultura Ciudadana"},1302,79720862,"IVAN GUILLERMO RAMIREZ REYES",19600000,0,0,1,8330000,27930000,27930000,"2020-01-23","2020-01-24","2020-07-14",120,1,60,null,null,null,null,null,null,"X",null,1,null,null,{"$f":"IF(SUMPRODUCT((A$14:A26=A26)*(B$14:B26=B26)*(D$14:D26=D26))>1,0,1)","v":1},"Contratos de prestación de servicios profesionales y de apoyo a la gestión","Contratación directa",{"$f":"IF(ISBLANK(G26),1,IFERROR(VLOOKUP(G26,Tipo!$C$12:$C$27,1,FALSE),\"NO\"))","v":"Prestación de servicios profesionales y de apoyo a la gestión, o para la ejecución de trabajos artísticos que sólo puedan encomendarse a determinadas personas naturales;"},"Inversión",{"$f":"IF(ISBLANK(K26),1,IFERROR(VLOOKUP(K26,Eje_Pilar_Prop!$C$3:$C$104,1,FALSE),\"NO\"))","v":19},"SECOP II",1,"Bogotá Mejor para Todos"]
["FDLCH-CPS-014-2020",2020,"SECOP II","CPS-014-2020","Contratos de prestación de servicios profesionales y de apoyo a la gestión","Contratación directa","Prestación de servicios profesionales y de apoyo a la gestión, o para la ejecución de trabajos artísticos que sólo puedan encomendarse a determinadas personas naturales;","PRESTACIÓN DE SERVICIOS PERSONALES NECESARIOS PARA EL APOYO AL ÁREA DE GESTIÓN DEL DESARROLLO LOCAL DE LA ALCALDÍA LOCAL DE CHAPINERO EN LAS ACTIVIDADES DE RADIACIÓN Y CORRESPONDENCIA.","Inversión","Bogotá Mejor para Todos",45,{"$f":"IF(ISERROR(VLOOKUP(K27,Eje_Pilar_Prop!$C$2:$E$104,2,FALSE)),\" \",VLOOKUP(K27,Eje_Pilar_Prop!$C$2:$E$104,2,FALSE))","v":"Gobernanza e influencia local, regional e internacional"},{"$f":"IF(ISERROR(VLOOKUP(K27,Eje_Pilar_Prop!$C$2:$E$104,3,FALSE)),\" \",VLOOKUP(K27,Eje_Pilar_Prop!$C$2:$E$104,3,FALSE))","v":"Eje Transversal 4 Gobierno Legitimo, Fortalecimiento Local y Eficiencia"},1304,1032416216,"NADIA CAMILA ROA BERMÚDEZ",9349200,0,0,0,0,9349200,9349200,"2020-01-23","2020-01-28",{"$f":"+Y27+7+1","v":"2020-02-05"},120,0,0,null,null,null,null,null,null,"X",null,1,null,null,{"$f":"IF(SUMPRODUCT((A$14:A27=A27)*(B$14:B27=B27)*(D$14:D27=D27))>1,0,1)","v":1},null,"Contratación directa",{"$f":"IF(ISBLANK(G27),1,IFERROR(VLOOKUP(G27,Tipo!$C$12:$C$27,1,FALSE),\"NO\"))","v":"Prestación de servicios profesionales y de apoyo a la gestión, o para la ejecución de trabajos artísticos que sólo puedan encomendarse a determinadas personas naturales;"},"Inversión",{"$f":"IF(ISBLANK(K27),1,IFERROR(VLOOKUP(K27,Eje_Pilar_Prop!$C$3:$C$104,1,FALSE),\"NO\"))","v":45},"SECOP II",1,"Bogotá Mejor para Todos"]
["FDLCH-CPS-015-2020",2020,"SECOP II","CPS-015-2020","Contratos de prestación de servicios profesionales y de apoyo a la gestión","Contratación directa","Prestación de servicios profesionales y de apoyo a la gestión, o para la ejecución de trabajos artísticos que sólo puedan encomendarse a determinadas personas naturales;","PRESTACIÓN DE LOS SERVICIOS PERSONALES NECESARIOS PARA LA CONDUCCIÓN DE LOS VEHÍCULOS QUE CONFORMAN EL PARQUE AUTOMOTOR EN PROPIEDAD O CUSTODIA DEL FONDO DE DESARROLLO LOCAL DE CHAPINERO, Y EL TRANSPORTE DE SERVIDORES PÚBLICOS PARA LA REALIZACIÓN DE LAS ACTIVIDADES MISIONALES DE LA ALCALDÍA LOCAL DE CHAPINER","Inversión","Bogotá Mejor para Todos",45,{"$f":"IF(ISERROR(VLOOKUP(K28,Eje_Pilar_Prop!$C$2:$E$104,2,FALSE)),\" \",VLOOKUP(K28,Eje_Pilar_Prop!$C$2:$E$104,2,FALSE))","v":"Gobernanza e influencia local, regional e internacional"},{"$f":"IF(ISERROR(VLOOKUP(K28,Eje_Pilar_Prop!$C$2:$E$104,3,FALSE)),\" \",VLOOKUP(K28,Eje_Pilar_Prop!$C$2:$E$104,3,FALSE))","v":"Eje Transversal 4 Gobierno Legitimo, Fortalecimiento Local y Eficiencia"},1304,1018445848,"JUAN DAVID CHICACAUSA SALAS",9360000,1,-1092000,1,4680000,12948000,12948000,"2020-01-23","2020-01-27","2020-07-15",120,1,60,null,null,null,null,null,null,"X",null,1,null,null,{"$f":"IF(SUMPRODUCT((A$14:A28=A28)*(B$14:B28=B28)*(D$14:D28=D28))>1,0,1)","v":1},{"$f":"IF(ISBLANK(E28),1,IFERROR(VLOOKUP(E28,tipo,1,FALSE),\"NO\"))","v":"Contratos de prestación de servicios profesionales y de apoyo a la gestión"},"Contratación directa",{"$f":"IF(ISBLANK(G28),1,IFERROR(VLOOKUP(G28,Tipo!$C$12:$C$27,1,FALSE),\"NO\"))","v":"Prestación de servicios profesionales y de apoyo a la gestión, o para la ejecución de trabajos artísticos que sólo puedan encomendarse a determinadas personas naturales;"},"Inversión",{"$f":"IF(ISBLANK(K28),1,IFERROR(VLOOKUP(K28,Eje_Pilar_Prop!$C$3:$C$104,1,FALSE),\"NO\"))","v":45},"SECOP II",1,"Bogotá Mejor para Todos"]
["FDLCH-CPS-016-2020",2020,"SECOP II","CPS-016-2020","Contratos de prestación de servicios profesionales y de apoyo a la gestión","Contratación directa","Prestación de servicios profesionales y de apoyo a la gestión, o para la ejecución de trabajos artísticos que sólo puedan encomendarse a determinadas personas naturales;","PRESTACIÓN DE SERVICIOS PROFESIONALES PARA APOYAR AL ÁREA DE GESTIÓN DEL DESARROLLO LOCAL DE LA ALCALDÍA LOCAL DE CHAPINERO EN LA FORMULACIÓN, GESTIÓN, EJECUCIÓN Y SEGUIMIENTO DE LOS PROYECTOS ASIGNADOS Y LA SUPERVISIÓN DE CONTRATOS QUE LE SEAN ASIGNADOS.","Inversión","Bogotá Mejor para Todos",17,{"$f":"IF(ISERROR(VLOOKUP(K29,Eje_Pilar_Prop!$C$2:$E$104,2,FALSE)),\" \",VLOOKUP(K29,Eje_Pilar_Prop!$C$2:$E$104,2,FALSE))","v":"Espacio público, derecho de todos"},{"$f":"IF(ISERROR(VLOOKUP(K29,Eje_Pilar_Prop!$C$2:$E$104,3,FALSE)),\" \",VLOOKUP(K29,Eje_Pilar_Prop!$C$2:$E$104,3,FALSE))","v":"Pilar 2 Democracía Urbana"},1300,60293880,"MARIA CONSUELO MENDOZA VARELA",28000000,0,0,0,0,28000000,28000000,"2020-01-27","2020-01-29",{"$f":"+Y29","v":"2020-01-29"},120,0,0,null,null,null,null,null,null,"X",null,1,null,null,{"$f":"IF(SUMPRODUCT((A$14:A29=A29)*(B$14:B29=B29)*(D$14:D29=D29))>1,0,1)","v":1},"Contratos de prestación de servicios profesionales y de apoyo a la gestión","Contratación directa",{"$f":"IF(ISBLANK(G29),1,IFERROR(VLOOKUP(G29,Tipo!$C$12:$C$27,1,FALSE),\"NO\"))","v":"Prestación de servicios profesionales y de apoyo a la gestión, o para la ejecución de trabajos artísticos que sólo puedan encomendarse a determinadas personas naturales;"},"Inversión",{"$f":"IF(ISBLANK(K29),1,IFERROR(VLOOKUP(K29,Eje_Pilar_Prop!$C$3:$C$104,1,FALSE),\"NO\"))","v":17},"SECOP II",1,"Bogotá Mejor para Todos"]
["FDLCH-CPS-017-2020",2020,"SECOP II","CPS-017-2020","Contratos de prestación de servicios profesionales y de apoyo a la gestión","Contratación directa","Prestación de servicios profesionales y de apoyo a la gestión, o para la ejecución de trabajos artísticos que sólo puedan encomendarse a determinadas personas naturales;","PRESTACIÓN DE SERVICIOS PROFESIONALES EN DERECHO PARA APOYAR JURÍDICAMENTE LA EJECUCIÓN DE LAS ACCIONES REQUERIDAS PARA LA DEPURACIÓN DE LAS ACTUACIONES ADMINISTRATIVAS QUE CURSAN EN LA ALCALDÍA LOCAL","Inversión","Bogotá Mejor para Todos",45,{"$f":"IF(ISERROR(VLOOKUP(K30,Eje_Pilar_Prop!$C$2:$E$104,2,FALSE)),\" \",VLOOKUP(K30,Eje_Pilar_Prop!$C$2:$E$104,2,FALSE))","v":"Gobernanza e influencia local, regional e internacional"},{"$f":"IF(ISERROR(VLOOKUP(K30,Eje_Pilar_Prop!$C$2:$E$104,3,FALSE)),\" \",VLOOKUP(K30,Eje_Pilar_Prop!$C$2:$E$104,3,FALSE))","v":"Eje Transversal 4 Gobierno Legitimo, Fortalecimiento Local y Eficiencia"},1304,35408653,"NANCY ROCIO DEL SOCORRO SARMIENTO FONSECA",20800000,0,0,1,5200000,26000000,26000000,"2020-01-24","2020-01-27",{"$f":"+Y30+30+1","v":"2020-02-27"},120,1,30,null,null,null,null,null,null,"X",null,1,null,null,{"$f":"IF(SUMPRODUCT((A$14:A30=A30)*(B$14:B30=B30)*(D$14:D30=D30))>1,0,1)","v":1},"Contratos de prestación de servicios profesionales y de apoyo a la gestión","Contratación directa",{"$f":"IF(ISBLANK(G30),1,IFERROR(VLOOKUP(G30,Tipo!$C$12:$C$27,1,FALSE),\"NO\"))","v":"Prestación de servicios profesionales y de apoyo a la gestión, o para la ejecución de trabajos artísticos que sólo puedan encomendarse a determinadas personas naturales;"},"Inversión",{"$f":"IF(ISBLANK(K30),1,IFERROR(VLOOKUP(K30,Eje_Pilar_Prop!$C$3:$C$104,1,FALSE),\"NO\"))","v":45},"SECOP II",1,"Bogotá Mejor para Todos"]
["FDLCH-CPS-018-2020",2020,"SECOP II","CPS-018-2020","Contratos de prestación de servicios profesionales y de apoyo a la gestión","Contratación directa","Prestación de servicios profesionales y de apoyo a la gestión, o para la ejecución de trabajos artísticos que sólo puedan encomendarse a determinadas personas naturales;","PRESTACIÓN DE SERVICIOS PROFESIONALES PARA LA ATENCIÓN, ACOMPAÑAMIENTO EN LA REALIZACIÓN Y PRÁCTICA DE LAS DILIGENCIAS CONTENIDAS EN LAS COMISIONES CIVILES ORDENADAS POR LOS JUECES DE LA REPÚBLICA, EN ATENCIÓN A LO ORDENADO EN MANDATO LEGAL CONTENIDO EN LOS ARTÍCULOS 37 Y 38 DEL CÓDIGO GENERAL DEL PROCESO, EN CONCORDANCIA CON LO PREVISTO EN EL ARTÍCULO 206, PARÁGRAFO 1° DEL CÓDIGO NACIONAL DE POLICÍA Y CONVIVENCIA","Inversión","Bogotá Mejor para Todos",45,{"$f":"IF(ISERROR(VLOOKUP(K31,Eje_Pilar_Prop!$C$2:$E$104,2,FALSE)),\" \",VLOOKUP(K31,Eje_Pilar_Prop!$C$2:$E$104,2,FALSE))","v":"Gobernanza e influencia local, regional e internacional"},{"$f":"IF(ISERROR(VLOOKUP(K31,Eje_Pilar_Prop!$C$2:$E$104,3,FALSE)),\" \",VLOOKUP(K31,Eje_Pilar_Prop!$C$2:$E$104,3,FALSE))","v":"Eje Transversal 4 Gobierno Legitimo, Fortalecimiento Local y Eficiencia"},1304,79729789,"ALFREDO ENRIQUE CACERES MENDOZA",24800000,0,0,1,6200000,31000000,31000000,"2020-01-27","2020-01-29",{"$f":"+Y31+30+1","v":"2020-02-29"},120,1,30,null,null,null,null,null,null,"X",null,1,null,null,{"$f":"IF(SUMPRODUCT((A$14:A31=A31)*(B$14:B31=B31)*(D$14:D31=D31))>1,0,1)","v":1},"Contratos de prestación de servicios profesionales y de apoyo a la gestión","Contratación directa",{"$f":"IF(ISBLANK(G31),1,IFERROR(VLOOKUP(G31,Tipo!$C$12:$C$27,1,FALSE),\"NO\"))","v":"Prestación de servicios profesionales y de apoyo a la gestión, o para la ejecución de trabajos artísticos que sólo puedan encomendarse a determinadas personas naturales;"},"Inversión",{"$f":"IF(ISBLANK(K31),1,IFERROR(VLOOKUP(K31,Eje_Pilar_Prop!$C$3:$C$104,1,FALSE),\"NO\"))","v":45},"SECOP II",1,"Bogotá Mejor para Todos"]
["FDLCH-CPS-019-2020",2020,"SECOP II","CPS-019-2020","Contratos de prestación de servicios profesionales y de apoyo a la gestión","Contratación directa","Prestación de servicios profesionales y de apoyo a la gestión, o para la ejecución de trabajos artísticos que sólo puedan encomendarse a determinadas personas naturales;","PRESTACIÓN DE SERVICIOS PROFESIONALES PARA APOYAR A LA ALCALDÍA LOCAL DE CHAPINERO EN EL TRÁMITE Y SEGUIMIENTO DEL ESTADO DE LOS PROCESOS QUE SE ADELANTAN EN EL ÁREA DE GESTIÓN POLICIVA, QUE SE PRESENTEN AL DESPACHO DEL ALCALDE LOCAL","Inversión","Bogotá Mejor para Todos",45,{"$f":"IF(ISERROR(VLOOKUP(K32,Eje_Pilar_Prop!$C$2:$E$104,2,FALSE)),\" \",VLOOKUP(K32,Eje_Pilar_Prop!$C$2:$E$104,2,FALSE))","v":"Gobernanza e influencia local, regional e internacional"},{"$f":"IF(ISERROR(VLOOKUP(K32,Eje_Pilar_Prop!$C$2:$E$104,3,FALSE)),\" \",VLOOKUP(K32,Eje_Pilar_Prop!$C$2:$E$104,3,FALSE))","v":"Eje Transversal 4 Gobierno Legitimo, Fortalecimiento Local y Eficiencia"},1304,1075297036,"MARÍA ANGÉLICA BALAGUERA RUIZ",18698400,0,0,0,0,18698400,18698400,"2020-01-29","2020-02-03",{"$f":"+Y32","v":"2020-02-03"},120,0,0,null,null,null,null,null,null,"X",null,1,null,null,{"$f":"IF(SUMPRODUCT((A$14:A32=A32)*(B$14:B32=B32)*(D$14:D32=D32))>1,0,1)","v":1},"Contratos de prestación de servicios profesionales y de apoyo a la gestión","Contratación directa",{"$f":"IF(ISBLANK(G32),1,IFERROR(VLOOKUP(G32,Tipo!$C$12:$C$27,1,FALSE),\"NO\"))","v":"Prestación de servicios profesionales y de apoyo a la gestión, o para la ejecución de trabajos artísticos que sólo puedan encomendarse a determinadas personas naturales;"},"Inversión",{"$f":"IF(ISBLANK(K32),1,IFERROR(VLOOKUP(K32,Eje_Pilar_Prop!$C$3:$C$104,1,FALSE),\"NO\"))","v":45},"SECOP II",1,"Bogotá Mejor para Todos"]
["FDLCH-CPS-020-2020",2020,"SECOP II","CPS-020-2020","Contratos de prestación de servicios profesionales y de apoyo a la gestión","Contratación directa","Prestación de servicios profesionales y de apoyo a la gestión, o para la ejecución de trabajos artísticos que sólo puedan encomendarse a determinadas personas naturales;","“PRESTACIÓN DE SERVICIOS PROFESIONALES PARA APOYAR AL EQUIPO DE PRENSA Y COMUNICACIONES DE LA ALCALDÍA LOCAL EN LA REALIZACIÓN Y PUBLICACIÓN DE CONTENIDOS DE REDES SOCIALES Y CANALES DE DIVULGACIÓN DIGITAL (SITIO WEB) DE LA ALCALDÍA LOCAL DE CHAPINERO”.","Inversión","Bogotá Mejor para Todos",45,{"$f":"IF(ISERROR(VLOOKUP(K33,Eje_Pilar_Prop!$C$2:$E$104,2,FALSE)),\" \",VLOOKUP(K33,Eje_Pilar_Prop!$C$2:$E$104,2,FALSE))","v":"Gobernanza e influencia local, regional e internacional"},{"$f":"IF(ISERROR(VLOOKUP(K33,Eje_Pilar_Prop!$C$2:$E$104,3,FALSE)),\" \",VLOOKUP(K33,Eje_Pilar_Prop!$C$2:$E$104,3,FALSE))","v":"Eje Transversal 4 Gobierno Legitimo, Fortalecimiento Local y Eficiencia"},1304,35508717,"LUISA FERNANDA ACOSTA LOZANO",22824000,0,0,0,0,22824000,22824000,"2020-01-27","2020-01-29",{"$f":"+Y33","v":"2020-01-29"},120,0,0,null,null,null,null,null,null,"X",null,1,null,null,{"$f":"IF(SUMPRODUCT((A$14:A33=A33)*(B$14:B33=B33)*(D$14:D33=D33))>1,0,1)","v":1},"Contratos de prestación de servicios profesionales y de apoyo a la gestión","Contratación directa",{"$f":"IF(ISBLANK(G33),1,IFERROR(VLOOKUP(G33,Tipo!$C$12:$C$27,1,FALSE),\"NO\"))","v":"Prestación de servicios profesionales y de apoyo a la gestión, o para la ejecución de trabajos artísticos que sólo puedan encomendarse a determinadas personas naturales;"},"Inversión",{"$f":"IF(ISBLANK(K33),1,IFERROR(VLOOKUP(K33,Eje_Pilar_Prop!$C$3:$C$104,1,FALSE),\"NO\"))","v":45},"SECOP II",1,"Bogotá Mejor para Todos"]
["FDLCH-CPS-021-2020",2020,"SECOP II","CPS-021-2020","Contratos de prestación de servicios profesionales y de apoyo a la gestión","Contratación directa","Prestación de servicios profesionales y de apoyo a la gestión, o para la ejecución de trabajos artísticos que sólo puedan encomendarse a determinadas personas naturales;","“PRESTACIÓN DE SERVICIOS TÉCNICOS PARA EL APOYO TRANSVERSAL EN LA ELABORACIÓN DE DOCUMENTOS TÉCNICOS Y ADMINISTRATIVOS DEL ÁREA DE GESTIÓN DEL DESARROLLO LOCAL DE LA ALCALDÍA LOCAL DE CHAPINERO Y EL SEGUIMIENTO A LAS SOLICITUDES EN EL SIPSE”.","Inversión","Bogotá Mejor para Todos",45,{"$f":"IF(ISERROR(VLOOKUP(K34,Eje_Pilar_Prop!$C$2:$E$104,2,FALSE)),\" \",VLOOKUP(K34,Eje_Pilar_Prop!$C$2:$E$104,2,FALSE))","v":"Gobernanza e influencia local, regional e internacional"},{"$f":"IF(ISERROR(VLOOKUP(K34,Eje_Pilar_Prop!$C$2:$E$104,3,FALSE)),\" \",VLOOKUP(K34,Eje_Pilar_Prop!$C$2:$E$104,3,FALSE))","v":"Eje Transversal 4 Gobierno Legitimo, Fortalecimiento Local y Eficiencia"},1304,98557091,"DARIO ANTONIO MAYO GUERRERO",15400000,0,0,0,0,15400000,15400000,"2020-02-04","2020-02-05",{"$f":"+Y34","v":"2020-02-05"},120,0,0,null,null,null,null,null,null,"X",null,1,null,null,{"$f":"IF(SUMPRODUCT((A$14:A34=A34)*(B$14:B34=B34)*(D$14:D34=D34))>1,0,1)","v":1},"Contratos de prestación de servicios profesionales y de apoyo a la gestión","Contratación directa",{"$f":"IF(ISBLANK(G34),1,IFERROR(VLOOKUP(G34,Tipo!$C$12:$C$27,1,FALSE),\"NO\"))","v":"Prestación de servicios profesionales y de apoyo a la gestión, o para la ejecución de trabajos artísticos que sólo puedan encomendarse a determinadas personas naturales;"},"Inversión",{"$f":"IF(ISBLANK(K34),1,IFERROR(VLOOKUP(K34,Eje_Pilar_Prop!$C$3:$C$104,1,FALSE),\"NO\"))","v":45},"SECOP II",null,"Bogotá Mejor para Todos"]
["FDLCH-CPS-022-2020",2020,"SECOP II","CPS-022-2020","Contratos de prestación de servicios profesionales y de apoyo a la gestión","Contratación directa","Prestación de servicios profesionales y de apoyo a la gestión, o para la ejecución de trabajos artísticos que sólo puedan encomendarse a determinadas personas naturales;","PRESTACIÓN DE SERVICIOS PERSONALES NECESARIOS PARA LAS LABORES DE ENTREGA Y RECIBO DE LAS COMUNICACIONES EMITIDAS O RECIBIDAS POR LAS INSPECCIONES DE POLICÍA DE LA LOCALIDAD Y DEPENDENCIAS DE LA ALCALDÍA.","Inversión","Bogotá Mejor para Todos",45,{"$f":"IF(ISERROR(VLOOKUP(K35,Eje_Pilar_Prop!$C$2:$E$104,2,FALSE)),\" \",VLOOKUP(K35,Eje_Pilar_Prop!$C$2:$E$104,2,FALSE))","v":"Gobernanza e influencia local, regional e internacional"},{"$f":"IF(ISERROR(VLOOKUP(K35,Eje_Pilar_Prop!$C$2:$E$104,3,FALSE)),\" \",VLOOKUP(K35,Eje_Pilar_Prop!$C$2:$E$104,3,FALSE))","v":"Eje Transversal 4 Gobierno Legitimo, Fortalecimiento Local y Eficiencia"},1304,1010043355,"DANIEL ALEJANDRO MORENO GARZON",9360000,0,0,0,0,9360000,9360000,"2020-01-27","2020-01-29",{"$f":"+Y35","v":"2020-01-29"},120,0,0,null,null,null,null,null,null,"X",null,1,null,null,{"$f":"IF(SUMPRODUCT((A$14:A35=A35)*(B$14:B35=B35)*(D$14:D35=D35))>1,0,1)","v":1},"Contratos de prestación de servicios profesionales y de apoyo a la gestión","Contratación directa",{"$f":"IF(ISBLANK(G35),1,IFERROR(VLOOKUP(G35,Tipo!$C$12:$C$27,1,FALSE),\"NO\"))","v":"Prestación de servicios profesionales y de apoyo a la gestión, o para la ejecución de trabajos artísticos que sólo puedan encomendarse a determinadas personas naturales;"},"Inversión",{"$f":"IF(ISBLANK(K35),1,IFERROR(VLOOKUP(K35,Eje_Pilar_Prop!$C$3:$C$104,1,FALSE),\"NO\"))","v":45},"SECOP II",{"$f":"IF(OR(YEAR(X35)=2020,ISBLANK(X35)),1,\"NO\")","v":1},"Bogotá Mejor para Todos"]
["FDLCH-CPS-023-2020",2020,"SECOP II","CPS-023-2020","Contratos de prestación de servicios profesionales y de apoyo a la gestión","Contratación directa","Prestación de servicios profesionales y de apoyo a la gestión, o para la ejecución de trabajos artísticos que sólo puedan encomendarse a determinadas personas naturales;","PRESTACIÓN DE SERVICIOS PROFESIONALES PARA APOYAR AL ÁREA DE GESTIÓN DEL DESARROLLO LOCAL DE LA ALCALDÍA LOCAL DE CHAPINERO EN LA FORMULACIÓN, GESTIÓN Y EJECUCIÓN DEL PROYECTO 1295 BRINDAR ACCIONES INTEGRALES PARA PERSONAS CON DISCAPACIDAD Y SUS RESPECTIVOS CUIDADORES Y EN LA SUPERVISIÓN DE CONTRATOS QUE LE SEAN ASIGNADOS.","Inversión","Bogotá Mejor para Todos",3,{"$f":"IF(ISERROR(VLOOKUP(K36,Eje_Pilar_Prop!$C$2:$E$104,2,FALSE)),\" \",VLOOKUP(K36,Eje_Pilar_Prop!$C$2:$E$104,2,FALSE))","v":"Igualdad y autonomía para una Bogotá incluyente"},{"$f":"IF(ISERROR(VLOOKUP(K36,Eje_Pilar_Prop!$C$2:$E$104,3,FALSE)),\" \",VLOOKUP(K36,Eje_Pilar_Prop!$C$2:$E$104,3,FALSE))","v":"Pilar 1 Igualdad de Calidad de Vida"},1295,51674566,"MYRIAM JEANET RUIZ",18800000,0,0,0,0,18800000,18800000,"2020-01-27","2020-01-28",{"$f":"+Y36","v":"2020-01-28"},120,0,0,null,null,null,null,null,null,"X",null,1,null,null,{"$f":"IF(SUMPRODUCT((A$14:A36=A36)*(B$14:B36=B36)*(D$14:D36=D36))>1,0,1)","v":1},"Contratos de prestación de servicios profesionales y de apoyo a la gestión","Contratación directa",{"$f":"IF(ISBLANK(G36),1,IFERROR(VLOOKUP(G36,Tipo!$C$12:$C$27,1,FALSE),\"NO\"))","v":"Prestación de servicios profesionales y de apoyo a la gestión, o para la ejecución de trabajos artísticos que sólo puedan encomendarse a determinadas personas naturales;"},"Inversión",{"$f":"IF(ISBLANK(K36),1,IFERROR(VLOOKUP(K36,Eje_Pilar_Prop!$C$3:$C$104,1,FALSE),\"NO\"))","v":3},"SECOP II",1,"Bogotá Mejor para Todos"]
["FDLCH-CPS-024-2020",2020,"SECOP II","CPS-024-2020","Contratos de prestación de servicios profesionales y de apoyo a la gestión","Contratación directa","Prestación de servicios profesionales y de apoyo a la gestión, o para la ejecución de trabajos artísticos que sólo puedan encomendarse a determinadas personas naturales;","PRESTACIÓN DE SERVICIOS PERSONALES NECESARIOS PARA EL APOYO EN LA EJECUCIÓN DE ACTIVIDADES ADMINISTRATIVAS Y OPERATIVAS TRANSVERSALES AL ÁREA DE GESTIÓN DEL DESARROLLO LOCAL Y AQUELLAS QUE SE ADELANTAN EN LA OFICINA DE CONTRATACIÓN DE LA ALCALDÍA LOCAL DE CHAPINERO","Inversión","Bogotá Mejor para Todos",45,{"$f":"IF(ISERROR(VLOOKUP(K37,Eje_Pilar_Prop!$C$2:$E$104,2,FALSE)),\" \",VLOOKUP(K37,Eje_Pilar_Prop!$C$2:$E$104,2,FALSE))","v":"Gobernanza e influencia local, regional e internacional"},{"$f":"IF(ISERROR(VLOOKUP(K37,Eje_Pilar_Prop!$C$2:$E$104,3,FALSE)),\" \",VLOOKUP(K37,Eje_Pilar_Prop!$C$2:$E$104,3,FALSE))","v":"Eje Transversal 4 Gobierno Legitimo, Fortalecimiento Local y Eficiencia"},1304,1016012242,"MARYARY SUNED QUINCHE SANCHEZ",11600000,1,-1256667,2,5800000,16143333,16143333,"2020-01-27","2020-01-28","2020-07-16",120,2,60,null,null,null,null,null,null,"X",null,1,null,null,{"$f":"IF(SUMPRODUCT((A$14:A37=A37)*(B$14:B37=B37)*(D$14:D37=D37))>1,0,1)","v":1},"Contratos de prestación de servicios profesionales y de apoyo a la gestión","Contratación directa",{"$f":"IF(ISBLANK(G37),1,IFERROR(VLOOKUP(G37,Tipo!$C$12:$C$27,1,FALSE),\"NO\"))","v":"Prestación de servicios profesionales y de apoyo a la gestión, o para la ejecución de trabajos artísticos que sólo puedan encomendarse a determinadas personas naturales;"},"Inversión",{"$f":"IF(ISBLANK(K37),1,IFERROR(VLOOKUP(K37,Eje_Pilar_Prop!$C$3:$C$104,1,FALSE),\"NO\"))","v":45},"SECOP II",1,"Bogotá Mejor para Todos"]
["FDLCH-CPS-025-2020",2020,"SECOP II","CPS-025-2020","Contratos de prestación de servicios profesionales y de apoyo a la gestión","Contratación directa","Prestación de servicios profesionales y de apoyo a la gestión, o para la ejecución de trabajos artísticos que sólo puedan encomendarse a determinadas personas naturales;","PRESTACIÓN DE LOS SERVICIOS PERSONALES NECESARIOS PARA LA CONDUCCIÓN DE LOS VEHÍCULOS QUE CONFORMAN EL PARQUE AUTOMOTOR EN PROPIEDAD O CUSTODIA DEL FONDO DE DESARROLLO LOCAL DE CHAPINERO, Y EL TRANSPORTE DE SERVIDORES PÚBLICOS PARA LA REALIZACIÓN DE LAS ACTIVIDADES MISIONALES DE LA ALCALDÍA LOCAL DE CHAPINERO.”","Inversión","Bogotá Mejor para Todos",45,{"$f":"IF(ISERROR(VLOOKUP(K38,Eje_Pilar_Prop!$C$2:$E$104,2,FALSE)),\" \",VLOOKUP(K38,Eje_Pilar_Prop!$C$2:$E$104,2,FALSE))","v":"Gobernanza e influencia local, regional e internacional"},{"$f":"IF(ISERROR(VLOOKUP(K38,Eje_Pilar_Prop!$C$2:$E$104,3,FALSE)),\" \",VLOOKUP(K38,Eje_Pilar_Prop!$C$2:$E$104,3,FALSE))","v":"Eje Transversal 4 Gobierno Legitimo, Fortalecimiento Local y Eficiencia"},1304,79520294,"CESAR AUGUSTO PEREZ PALACIO",9360000,0,0,0,0,9360000,9282000,"2020-01-27","2020-01-28",{"$f":"+Y38+6+1","v":"2020-02-04"},120,0,0,null,null,null,null,null,null,"X",null,0.9916666666666667,null,null,{"$f":"IF(SUMPRODUCT((A$14:A38=A38)*(B$14:B38=B38)*(D$14:D38=D38))>1,0,1)","v":1},"Contratos de prestación de servicios profesionales y de apoyo a la gestión","Contratación directa",{"$f":"IF(ISBLANK(G38),1,IFERROR(VLOOKUP(G38,Tipo!$C$12:$C$27,1,FALSE),\"NO\"))","v":"Prestación de servicios profesionales y de apoyo a la gestión, o para la ejecución de trabajos artísticos que sólo puedan encomendarse a determinadas personas naturales;"},"Inversión",{"$f":"IF(ISBLANK(K38),1,IFERROR(VLOOKUP(K38,Eje_Pilar_Prop!$C$3:$C$104,1,FALSE),\"NO\"))","v":45},"SECOP II",1,"Bogotá Mejor para Todos"]
["FDLCH-CPS-026-2020",2020,"SECOP II","CPS-026-2020","Contratos de prestación de servicios profesionales y de apoyo a la gestión","Contratación directa","Prestación de servicios profesionales y de apoyo a la gestión, o para la ejecución de trabajos artísticos que sólo puedan encomendarse a determinadas personas naturales;","PRESTACIÓN DE SERVICIOS PROFESIONALES EN DERECHO PARA APOYAR JURÍDICAMENTE LA EJECUCIÓN DE LAS ACCIONES REQUERIDAS PARA LA DEPURACIÓN DE LAS ACTUACIONES ADMINISTRATIVAS QUE CURSAN EN LA ALCALDÍA LOCAL.","Inversión","Bogotá Mejor para Todos",45,{"$f":"IF(ISERROR(VLOOKUP(K39,Eje_Pilar_Prop!$C$2:$E$104,2,FALSE)),\" \",VLOOKUP(K39,Eje_Pilar_Prop!$C$2:$E$104,2,FALSE))","v":"Gobernanza e influencia local, regional e internacional"},{"$f":"IF(ISERROR(VLOOKUP(K39,Eje_Pilar_Prop!$C$2:$E$104,3,FALSE)),\" \",VLOOKUP(K39,Eje_Pilar_Prop!$C$2:$E$104,3,FALSE))","v":"Eje Transversal 4 Gobierno Legitimo, Fortalecimiento Local y Eficiencia"},1304,51700143,"MARIA ALEXANDRA CADENA FERNANDEZ",19845000,0,0,1,4961250,24806250,24806250,"2020-02-04","2020-02-06",{"$f":"+Y39+30","v":"2020-03-07"},120,1,30,null,null,null,null,null,null,"X",null,1,null,null,{"$f":"IF(SUMPRODUCT((A$14:A39=A39)*(B$14:B39=B39)*(D$14:D39=D39))>1,0,1)","v":1},"Contratos de prestación de servicios profesionales y de apoyo a la gestión","Contratación directa",{"$f":"IF(ISBLANK(G39),1,IFERROR(VLOOKUP(G39,Tipo!$C$12:$C$27,1,FALSE),\"NO\"))","v":"Prestación de servicios profesionales y de apoyo a la gestión, o para la ejecución de trabajos artísticos que sólo puedan encomendarse a determinadas personas naturales;"},"Inversión",{"$f":"IF(ISBLANK(K39),1,IFERROR(VLOOKUP(K39,Eje_Pilar_Prop!$C$3:$C$104,1,FALSE),\"NO\"))","v":45},"SECOP II",1,"Bogotá Mejor para Todos"]
["FDLCH-CPS-027-2020",2020,"SECOP II","CPS-027-2020","Contratos de prestación de servicios profesionales y de apoyo a la gestión","Contratación directa","Prestación de servicios profesionales y de apoyo a la gestión, o para la ejecución de trabajos artísticos que sólo puedan encomendarse a determinadas personas naturales;","PRESTACIÓN DE SERVICIOS PROFESIONALES PARA APOYAR TÉCNICAMENTE LAS DISTINTAS ETAPAS DE LOS PROCESOS DE COMPETENCIA DE LA ALCALDÍA LOCAL DE CHAPINERO, PARA LA DEPURACIÓN DE ACTUACIONES ADMINISTRATIVAS","Inversión","Bogotá Mejor para Todos",45,{"$f":"IF(ISERROR(VLOOKUP(K40,Eje_Pilar_Prop!$C$2:$E$104,2,FALSE)),\" \",VLOOKUP(K40,Eje_Pilar_Prop!$C$2:$E$104,2,FALSE))","v":"Gobernanza e influencia local, regional e internacional"},{"$f":"IF(ISERROR(VLOOKUP(K40,Eje_Pilar_Prop!$C$2:$E$104,3,FALSE)),\" \",VLOOKUP(K40,Eje_Pilar_Prop!$C$2:$E$104,3,FALSE))","v":"Eje Transversal 4 Gobierno Legitimo, Fortalecimiento Local y Eficiencia"},1304,80825882,"CARLOS ANDRÉS GIL RUEDA",19845000,0,0,0,0,19845000,19679625,"2020-01-28","2020-01-29",{"$f":"+Y40+7+1","v":"2020-02-06"},120,0,0,null,null,null,null,null,null,"X",null,0.9916666666666667,null,null,{"$f":"IF(SUMPRODUCT((A$14:A40=A40)*(B$14:B40=B40)*(D$14:D40=D40))>1,0,1)","v":1},"Contratos de prestación de servicios profesionales y de apoyo a la gestión","Contratación directa",{"$f":"IF(ISBLANK(G40),1,IFERROR(VLOOKUP(G40,Tipo!$C$12:$C$27,1,FALSE),\"NO\"))","v":"Prestación de servicios profesionales y de apoyo a la gestión, o para la ejecución de trabajos artísticos que sólo puedan encomendarse a determinadas personas naturales;"},"Inversión",{"$f":"IF(ISBLANK(K40),1,IFERROR(VLOOKUP(K40,Eje_Pilar_Prop!$C$3:$C$104,1,FALSE),\"NO\"))","v":45},"SECOP II",1,"Bogotá Mejor para Todos"]
["FDLCH-CPS-028-2020",2020,"SECOP II","CPS-028-2020","Contratos de prestación de servicios profesionales y de apoyo a la gestión","Contratación directa","Prestación de servicios profesionales y de apoyo a la gestión, o para la ejecución de trabajos artísticos que sólo puedan encomendarse a determinadas personas naturales;","PRESTACIÓN DE SERVICIOS PROFESIONALES PARA EL APOYO AL DESPACHO DE LA ALCALDÍA LOCAL DE CHAPINERO EN LA ADMINISTRACIÓN Y SOPORTE A LA INFRAESTRUCTURA TECNOLÓGICA EN PROPIEDAD O CUSTODIA Y PARA REALIZAR ACTIVIDADES DE FORMULACIÓN DE PROYECTOS QUE LE SEAN ASIGNADOS Y ACTIVIDADES DE APOYO A LA SUPERVISIÓN DE LOS CONTRATOS QUE LE FUEREN ASIGNADOS","Inversión","Bogotá Mejor para Todos",45,{"$f":"IF(ISERROR(VLOOKUP(K41,Eje_Pilar_Prop!$C$2:$E$104,2,FALSE)),\" \",VLOOKUP(K41,Eje_Pilar_Prop!$C$2:$E$104,2,FALSE))","v":"Gobernanza e influencia local, regional e internacional"},{"$f":"IF(ISERROR(VLOOKUP(K41,Eje_Pilar_Prop!$C$2:$E$104,3,FALSE)),\" \",VLOOKUP(K41,Eje_Pilar_Prop!$C$2:$E$104,3,FALSE))","v":"Eje Transversal 4 Gobierno Legitimo, Fortalecimiento Local y Eficiencia"},1304,7166701,"FREDY YOVANNI BORDA CEPEDA",19320000,0,0,0,0,19320000,19320000,"2020-01-28","2020-01-29",{"$f":"+Y41+7+1","v":"2020-02-06"},120,0,0,null,null,null,null,null,null,"X",null,1,null,null,{"$f":"IF(SUMPRODUCT((A$14:A41=A41)*(B$14:B41=B41)*(D$14:D41=D41))>1,0,1)","v":1},"Contratos de prestación de servicios profesionales y de apoyo a la gestión","Contratación directa",{"$f":"IF(ISBLANK(G41),1,IFERROR(VLOOKUP(G41,Tipo!$C$12:$C$27,1,FALSE),\"NO\"))","v":"Prestación de servicios profesionales y de apoyo a la gestión, o para la ejecución de trabajos artísticos que sólo puedan encomendarse a determinadas personas naturales;"},"Inversión",{"$f":"IF(ISBLANK(K41),1,IFERROR(VLOOKUP(K41,Eje_Pilar_Prop!$C$3:$C$104,1,FALSE),\"NO\"))","v":45},"SECOP II",1,"Bogotá Mejor para Todos"]
["FDLCH-CPS-029-2020",2020,"SECOP II","CPS-029-2020","Contratos de prestación de servicios profesionales y de apoyo a la gestión","Contratación directa","Prestación de servicios profesionales y de apoyo a la gestión, o para la ejecución de trabajos artísticos que sólo puedan encomendarse a determinadas personas naturales;","PRESTACIÓN DE SERVICIOS PROFESIONALES PARA APOYAR EL ÁREA DE GESTIÓN DEL DESARROLLO LOCAL DE LA ALCALDÍA LOCAL DE CHAPINERO EN LA GESTIÓN CONTRACTUAL DEL PROYECTO 1301 MEJORAR LA CALIDAD DE LA MOVILIDAD.","Inversión","Bogotá Mejor para Todos",18,{"$f":"IF(ISERROR(VLOOKUP(K42,Eje_Pilar_Prop!$C$2:$E$104,2,FALSE)),\" \",VLOOKUP(K42,Eje_Pilar_Prop!$C$2:$E$104,2,FALSE))","v":"Mejor movilidad para todos"},{"$f":"IF(ISERROR(VLOOKUP(K42,Eje_Pilar_Prop!$C$2:$E$104,3,FALSE)),\" \",VLOOKUP(K42,Eje_Pilar_Prop!$C$2:$E$104,3,FALSE))","v":"Pilar 2 Democracía Urbana"},1301,52966422,"JHOANA ANDREA SALOMON CASTRO",36000000,0,0,0,0,36000000,36000000,"2020-01-28","2020-01-30",{"$f":"+Y42","v":"2020-01-30"},120,0,0,null,null,null,null,null,null,"X",null,1,null,null,{"$f":"IF(SUMPRODUCT((A$14:A42=A42)*(B$14:B42=B42)*(D$14:D42=D42))>1,0,1)","v":1},"Contratos de prestación de servicios profesionales y de apoyo a la gestión","Contratación directa",{"$f":"IF(ISBLANK(G42),1,IFERROR(VLOOKUP(G42,Tipo!$C$12:$C$27,1,FALSE),\"NO\"))","v":"Prestación de servicios profesionales y de apoyo a la gestión, o para la ejecución de trabajos artísticos que sólo puedan encomendarse a determinadas personas naturales;"},"Inversión",{"$f":"IF(ISBLANK(K42),1,IFERROR(VLOOKUP(K42,Eje_Pilar_Prop!$C$3:$C$104,1,FALSE),\"NO\"))","v":18},"SECOP II",1,"Bogotá Mejor para Todos"]
["FDLCH-CPS-030-2020",2020,"SECOP II","CPS-030-2020","Contratos de prestación de servicios profesionales y de apoyo a la gestión","Contratación directa","Prestación de servicios profesionales y de apoyo a la gestión, o para la ejecución de trabajos artísticos que sólo puedan encomendarse a determinadas personas naturales;","PRESTAR LOS SERVICIOS PROFESIONALES PARA APOYAR EL ÁREA GESTIÓN DEL DESARROLLO LOCAL DE LA ALCALDÍA LOCAL DE CHAPINERO EN LAS ACTIVIDADES CONTABLES Y PRESUPUESTALES","Inversión","Bogotá Mejor para Todos",45,{"$f":"IF(ISERROR(VLOOKUP(K43,Eje_Pilar_Prop!$C$2:$E$104,2,FALSE)),\" \",VLOOKUP(K43,Eje_Pilar_Prop!$C$2:$E$104,2,FALSE))","v":"Gobernanza e influencia local, regional e internacional"},{"$f":"IF(ISERROR(VLOOKUP(K43,Eje_Pilar_Prop!$C$2:$E$104,3,FALSE)),\" \",VLOOKUP(K43,Eje_Pilar_Prop!$C$2:$E$104,3,FALSE))","v":"Eje Transversal 4 Gobierno Legitimo, Fortalecimiento Local y Eficiencia"},1304,7141790,"LEONARDO OROZCO MARTINEZ ",17440000,0,0,2,8720000,26160000,26160000,"2020-01-27","2020-01-28",{"$f":"+Y43+30+2+30+1","v":"2020-03-31"},120,2,60,null,null,null,null,null,null,"X",null,1,null,null,{"$f":"IF(SUMPRODUCT((A$14:A43=A43)*(B$14:B43=B43)*(D$14:D43=D43))>1,0,1)","v":1},"Contratos de prestación de servicios profesionales y de apoyo a la gestión","Contratación directa",{"$f":"IF(ISBLANK(G43),1,IFERROR(VLOOKUP(G43,Tipo!$C$12:$C$27,1,FALSE),\"NO\"))","v":"Prestación de servicios profesionales y de apoyo a la gestión, o para la ejecución de trabajos artísticos que sólo puedan encomendarse a determinadas personas naturales;"},"Inversión",{"$f":"IF(ISBLANK(K43),1,IFERROR(VLOOKUP(K43,Eje_Pilar_Prop!$C$3:$C$104,1,FALSE),\"NO\"))","v":45},"SECOP II",1,"Bogotá Mejor para Todos"]
["FDLCH-CPS-031-2020",2020,"SECOP II","CPS-031-2020","Contratos de prestación de servicios profesionales y de apoyo a la gestión","Contratación directa","Prestación de servicios profesionales y de apoyo a la gestión, o para la ejecución de trabajos artísticos que sólo puedan encomendarse a determinadas personas naturales;","PRESTAR SUS SERVICIOS PROFESIONALES A LA ALCALDIA LOCAL DE CHAPINERO PARA APOYAR TECNICAMENTE LA EJECUCION DEL PROYECTO 1299 , ASESORIA PARA LA LEGALIZACION DE BARRIOS Y TITULACION DE PREDIOS EN EL COMPONENTE DEMANDAS DE TITULACION CONFORME A GARANTIZAR EL CUMPLIMIENTO DEL PLAN DE DESARROLLO LOCAL","Inversión","Bogotá Mejor para Todos",15,{"$f":"IF(ISERROR(VLOOKUP(K44,Eje_Pilar_Prop!$C$2:$E$104,2,FALSE)),\" \",VLOOKUP(K44,Eje_Pilar_Prop!$C$2:$E$104,2,FALSE))","v":"Recuperación, incorporación, vida urbana y control de la ilegalidad"},{"$f":"IF(ISERROR(VLOOKUP(K44,Eje_Pilar_Prop!$C$2:$E$104,3,FALSE)),\" \",VLOOKUP(K44,Eje_Pilar_Prop!$C$2:$E$104,3,FALSE))","v":"Pilar 2 Democracía Urbana"},1299,1053779393,"JUAN CAMILO ALZATE OCAMPO",26000000,0,0,0,0,26000000,25783334,"2020-01-28","2020-01-30",{"$f":"+Y44+7+1","v":"2020-02-07"},120,0,0,null,null,null,null,null,null,"X",null,0.99166669230769233,null,null,{"$f":"IF(SUMPRODUCT((A$14:A44=A44)*(B$14:B44=B44)*(D$14:D44=D44))>1,0,1)","v":1},"Contratos de prestación de servicios profesionales y de apoyo a la gestión","Contratación directa",{"$f":"IF(ISBLANK(G44),1,IFERROR(VLOOKUP(G44,Tipo!$C$12:$C$27,1,FALSE),\"NO\"))","v":"Prestación de servicios profesionales y de apoyo a la gestión, o para la ejecución de trabajos artísticos que sólo puedan encomendarse a determinadas personas naturales;"},"Inversión",{"$f":"IF(ISBLANK(K44),1,IFERROR(VLOOKUP(K44,Eje_Pilar_Prop!$C$3:$C$104,1,FALSE),\"NO\"))","v":15},"SECOP II",1,"Bogotá Mejor para Todos"]
["FDLCH-CPS-032-2020",2020,"SECOP II","CPS-032-2020","Contratos de prestación de servicios profesionales y de apoyo a la gestión","Contratación directa","Prestación de servicios profesionales y de apoyo a la gestión, o para la ejecución de trabajos artísticos que sólo puedan encomendarse a determinadas personas naturales;","PRESTACIÓN DE SERVICIOS DE APOYO DE LOGÍSTICA QUE SE REQUIERAN EN EL DESARROLLO DE LAS ACTIVIDADES RELATIVAS A RECUPERACIÓN Y EMBELLECIMIENTO DEL ESPACIO PÚBLICO QUE TENGA A CARGO EL FONDO LOCAL DE DESARROLLO DE CHAPINERO","Inversión","Bogotá Mejor para Todos",18,{"$f":"IF(ISERROR(VLOOKUP(K45,Eje_Pilar_Prop!$C$2:$E$104,2,FALSE)),\" \",VLOOKUP(K45,Eje_Pilar_Prop!$C$2:$E$104,2,FALSE))","v":"Mejor movilidad para todos"},{"$f":"IF(ISERROR(VLOOKUP(K45,Eje_Pilar_Prop!$C$2:$E$104,3,FALSE)),\" \",VLOOKUP(K45,Eje_Pilar_Prop!$C$2:$E$104,3,FALSE))","v":"Pilar 2 Democracía Urbana"},1301,79153721,"JORGE ENRIQUE URQUIJO",8224000,0,0,1,2056000,10280000,10280000,"2020-01-30","2020-02-03",{"$f":"+Y45+30","v":"2020-03-04"},120,1,30,null,null,null,null,null,null,"X",null,1,null,null,{"$f":"IF(SUMPRODUCT((A$14:A45=A45)*(B$14:B45=B45)*(D$14:D45=D45))>1,0,1)","v":1},"Contratos de prestación de servicios profesionales y de apoyo a la gestión","Contratación directa",{"$f":"IF(ISBLANK(G45),1,IFERROR(VLOOKUP(G45,Tipo!$C$12:$C$27,1,FALSE),\"NO\"))","v":"Prestación de servicios profesionales y de apoyo a la gestión, o para la ejecución de trabajos artísticos que sólo puedan encomendarse a determinadas personas naturales;"},"Inversión",{"$f":"IF(ISBLANK(K45),1,IFERROR(VLOOKUP(K45,Eje_Pilar_Prop!$C$3:$C$104,1,FALSE),\"NO\"))","v":18},"SECOP II",1,"Bogotá Mejor para Todos"]
["FDLCH-CPS-033-2020",2020,"SECOP II","CPS-033-2020","Contratos de prestación de servicios profesionales y de apoyo a la gestión","Contratación directa","Prestación de servicios profesionales y de apoyo a la gestión, o para la ejecución de trabajos artísticos que sólo puedan encomendarse a determinadas personas naturales;","PRESTACIÓN DE SERVICIOS DE APOYO DE LOGÍSTICA QUE SE REQUIERAN EN EL DESARROLLO DE LAS ACTIVIDADES RELATIVAS A RECUPERACIÓN Y EMBELLECIMIENTO DEL ESPACIO PÚBLICO QUE TENGA A CARGO EL FONDO LOCAL DE DESARROLLO DE CHAPINERO","Inversión","Bogotá Mejor para Todos",18,{"$f":"IF(ISERROR(VLOOKUP(K46,Eje_Pilar_Prop!$C$2:$E$104,2,FALSE)),\" \",VLOOKUP(K46,Eje_Pilar_Prop!$C$2:$E$104,2,FALSE))","v":"Mejor movilidad para todos"},{"$f":"IF(ISERROR(VLOOKUP(K46,Eje_Pilar_Prop!$C$2:$E$104,3,FALSE)),\" \",VLOOKUP(K46,Eje_Pilar_Prop!$C$2:$E$104,3,FALSE))","v":"Pilar 2 Democracía Urbana"},1301,1071166907,"WILSON FERNANDO ORJUELA CHAVEZ",8224000,0,0,1,2056000,10280000,10280000,"2020-02-04","2020-02-06",{"$f":"+Y46+30","v":"2020-03-07"},120,1,30,null,null,null,null,null,null,"X",null,1,null,null,{"$f":"IF(SUMPRODUCT((A$14:A46=A46)*(B$14:B46=B46)*(D$14:D46=D46))>1,0,1)","v":1},"Contratos de prestación de servicios profesionales y de apoyo a la gestión","Contratación directa",{"$f":"IF(ISBLANK(G46),1,IFERROR(VLOOKUP(G46,Tipo!$C$12:$C$27,1,FALSE),\"NO\"))","v":"Prestación de servicios profesionales y de apoyo a la gestión, o para la ejecución de trabajos artísticos que sólo puedan encomendarse a determinadas personas naturales;"},"Inversión",{"$f":"IF(ISBLANK(K46),1,IFERROR(VLOOKUP(K46,Eje_Pilar_Prop!$C$3:$C$104,1,FALSE),\"NO\"))","v":18},"SECOP II",1,"Bogotá Mejor para Todos"]
["FDLCH-CPS-034-2020",2020,"SECOP II","CPS-034-2020","Contratos de prestación de servicios profesionales y de apoyo a la gestión","Contratación directa","Prestación de servicios profesionales y de apoyo a la gestión, o para la ejecución de trabajos artísticos que sólo puedan encomendarse a determinadas personas naturales;","PRESTACIÓN DE SERVICIOS PROFESIONALES PARA APOYAR TÉCNICAMENTE LAS DISTINTAS ETAPAS DE LOS PROCESOS DE COMPETENCIA DE LA ALCALDÍA LOCAL DE CHAPINERO, PARA LA DEPURACIÓN DE ACTUACIONES ADMINISTRATIVAS","Inversión","Bogotá Mejor para Todos",45,{"$f":"IF(ISERROR(VLOOKUP(K47,Eje_Pilar_Prop!$C$2:$E$104,2,FALSE)),\" \",VLOOKUP(K47,Eje_Pilar_Prop!$C$2:$E$104,2,FALSE))","v":"Gobernanza e influencia local, regional e internacional"},{"$f":"IF(ISERROR(VLOOKUP(K47,Eje_Pilar_Prop!$C$2:$E$104,3,FALSE)),\" \",VLOOKUP(K47,Eje_Pilar_Prop!$C$2:$E$104,3,FALSE))","v":"Eje Transversal 4 Gobierno Legitimo, Fortalecimiento Local y Eficiencia"},1304,19171281,"AXEL FERNANDO ALONSO GARRIDO SALCEDO",19845000,1,-5292000,0,0,14553000,13891500,"2020-01-30","2020-02-03","2020-06-02",120,0,0,8725078,"LUIS ALFREDO SILVA TRACEVEDO","2020-03-04",14553000,null,null,"X",null,0.95454545454545459,null,null,{"$f":"IF(SUMPRODUCT((A$14:A47=A47)*(B$14:B47=B47)*(D$14:D47=D47))>1,0,1)","v":1},"Contratos de prestación de servicios profesionales y de apoyo a la gestión","Contratación directa",{"$f":"IF(ISBLANK(G47),1,IFERROR(VLOOKUP(G47,Tipo!$C$12:$C$27,1,FALSE),\"NO\"))","v":"Prestación de servicios profesionales y de apoyo a la gestión, o para la ejecución de trabajos artísticos que sólo puedan encomendarse a determinadas personas naturales;"},"Inversión",{"$f":"IF(ISBLANK(K47),1,IFERROR(VLOOKUP(K47,Eje_Pilar_Prop!$C$3:$C$104,1,FALSE),\"NO\"))","v":45},"SECOP II",1,"Bogotá Mejor para Todos"]
["FDLCH-CPS-035-2020",2020,"SECOP II","CPS-035-2020","Contratos de prestación de servicios profesionales y de apoyo a la gestión","Contratación directa","Prestación de servicios profesionales y de apoyo a la gestión, o para la ejecución de trabajos artísticos que sólo puedan encomendarse a determinadas personas naturales;","PRESTACIÓN DE SERVICIOS PROFESIONALES PARA APOYAR AL ALCALDE LOCAL EN LA GESTIÓN DE LOS ASUNTOS RELACIONADOS CON SEGURIDAD CIUDADANA, CONVIVENCIA Y PREVENCIÓN DE CONFLICTIVIDADES, VIOLENCIAS Y DELITOS EN LA LOCALIDAD, DE CONFORMIDAD CON EL MARCO NORMATIVO APLICABLE EN LA MATERIA.","Inversión","Bogotá Mejor para Todos",19,{"$f":"IF(ISERROR(VLOOKUP(K48,Eje_Pilar_Prop!$C$2:$E$104,2,FALSE)),\" \",VLOOKUP(K48,Eje_Pilar_Prop!$C$2:$E$104,2,FALSE))","v":"Seguridad y convivencia para todos"},{"$f":"IF(ISERROR(VLOOKUP(K48,Eje_Pilar_Prop!$C$2:$E$104,3,FALSE)),\" \",VLOOKUP(K48,Eje_Pilar_Prop!$C$2:$E$104,3,FALSE))","v":"Pilar 3 Construcción de Comunidad y Cultura Ciudadana"},1302,79713457,"JUAN CARLOS MURILLO GUZMAN",19600000,0,0,0,0,19600000,19600000,"2020-01-29","2020-01-30",{"$f":"+Y48+30+1","v":"2020-03-01"},120,1,30,null,null,null,null,null,null,"X",null,1,null,null,{"$f":"IF(SUMPRODUCT((A$14:A48=A48)*(B$14:B48=B48)*(D$14:D48=D48))>1,0,1)","v":1},"Contratos de prestación de servicios profesionales y de apoyo a la gestión","Contratación directa",{"$f":"IF(ISBLANK(G48),1,IFERROR(VLOOKUP(G48,Tipo!$C$12:$C$27,1,FALSE),\"NO\"))","v":"Prestación de servicios profesionales y de apoyo a la gestión, o para la ejecución de trabajos artísticos que sólo puedan encomendarse a determinadas personas naturales;"},"Inversión",{"$f":"IF(ISBLANK(K48),1,IFERROR(VLOOKUP(K48,Eje_Pilar_Prop!$C$3:$C$104,1,FALSE),\"NO\"))","v":19},"SECOP II",1,"Bogotá Mejor para Todos"]
["FDLCH-CPS-036-2020",2020,"SECOP II","CPS-036-2020","Contratos de prestación de servicios profesionales y de apoyo a la gestión","Contratación directa","Prestación de servicios profesionales y de apoyo a la gestión, o para la ejecución de trabajos artísticos que sólo puedan encomendarse a determinadas personas naturales;","PRESTACIÓN DE SERVICIOS PROFESIONALES PARA APOYAR EL ÁREA DE GESTIÓN DEL DESARROLLO LOCAL DE LA ALCALDÍA LOCAL DE CHAPINERO EN LA GESTIÓN CONTRACTUAL DEL PROYECTO 1301 MEJORAR LA CALIDAD DE LA MOVILIDAD","Inversión","Bogotá Mejor para Todos",18,{"$f":"IF(ISERROR(VLOOKUP(K49,Eje_Pilar_Prop!$C$2:$E$104,2,FALSE)),\" \",VLOOKUP(K49,Eje_Pilar_Prop!$C$2:$E$104,2,FALSE))","v":"Mejor movilidad para todos"},{"$f":"IF(ISERROR(VLOOKUP(K49,Eje_Pilar_Prop!$C$2:$E$104,3,FALSE)),\" \",VLOOKUP(K49,Eje_Pilar_Prop!$C$2:$E$104,3,FALSE))","v":"Pilar 2 Democracía Urbana"},1301,52774158,"YENNY ALEXANDRA HERRERA PEÑA",28400000,0,0,0,0,28400000,28400000,"2020-01-31","2020-02-04","2020-06-03",120,0,0,null,null,null,null,null,null,"X",null,1,null,null,{"$f":"IF(SUMPRODUCT((A$14:A49=A49)*(B$14:B49=B49)*(D$14:D49=D49))>1,0,1)","v":1},"Contratos de prestación de servicios profesionales y de apoyo a la gestión","Contratación directa",{"$f":"IF(ISBLANK(G49),1,IFERROR(VLOOKUP(G49,Tipo!$C$12:$C$27,1,FALSE),\"NO\"))","v":"Prestación de servicios profesionales y de apoyo a la gestión, o para la ejecución de trabajos artísticos que sólo puedan encomendarse a determinadas personas naturales;"},"Inversión",{"$f":"IF(ISBLANK(K49),1,IFERROR(VLOOKUP(K49,Eje_Pilar_Prop!$C$3:$C$104,1,FALSE),\"NO\"))","v":18},"SECOP II",1,"Bogotá Mejor para Todos"]
["FDLCH-CPS-037-2020",2020,"SECOP II","CPS-037-2020","Contratos de prestación de servicios profesionales y de apoyo a la gestión","Contratación directa","Prestación de servicios profesionales y de apoyo a la gestión, o para la ejecución de trabajos artísticos que sólo puedan encomendarse a determinadas personas naturales;","PRESTACIÓN DE SERVICIOS PROFESIONALES PARA LA OPERACIÓN, PRESTACIÓN Y SEGUIMIENTO Y CUMPLIMIENTO DE LOS PROCEDIMIENTOS ADMINISTRATIVOS, OPERATIVOS Y PROGRAMÁTICOS DE LOS SERVICIOS SOCIALES DEL PROYECTO DE SUBSIDIO APOYO ECONÓMICO TIPO C, QUE CONTRIBUYAN A LA GARANTÍA DE LOS DERECHOS DE LA POBLACIÓN MAYOR EN EL MARCO DE LA POLÍTICA PÚBLICA SOCIAL PARA EL ENVEJECIMIENTO Y LA VEJEZ EN EL DISTRITO CAPITAL A CARGO DE LA ALCALDÍA LOCAL DE CHAPINERO","Inversión","Bogotá Mejor para Todos",4,{"$f":"IF(ISERROR(VLOOKUP(K50,Eje_Pilar_Prop!$C$2:$E$104,2,FALSE)),\" \",VLOOKUP(K50,Eje_Pilar_Prop!$C$2:$E$104,2,FALSE))","v":"Familias protegidas y adaptadas al cambio climático"},{"$f":"IF(ISERROR(VLOOKUP(K50,Eje_Pilar_Prop!$C$2:$E$104,3,FALSE)),\" \",VLOOKUP(K50,Eje_Pilar_Prop!$C$2:$E$104,3,FALSE))","v":"Pilar 1 Igualdad de Calidad de Vida"},1294,52515541,"BELLA ELOISA KAROLINA MORENO BRIONES",19320000,0,0,0,0,19320000,19320000,"2020-01-29","2020-01-30",{"$f":"+Y50+6+1","v":"2020-02-06"},120,0,0,null,null,null,null,null,null,"X",null,1,null,null,{"$f":"IF(SUMPRODUCT((A$14:A50=A50)*(B$14:B50=B50)*(D$14:D50=D50))>1,0,1)","v":1},"Contratos de prestación de servicios profesionales y de apoyo a la gestión","Contratación directa",{"$f":"IF(ISBLANK(G50),1,IFERROR(VLOOKUP(G50,Tipo!$C$12:$C$27,1,FALSE),\"NO\"))","v":"Prestación de servicios profesionales y de apoyo a la gestión, o para la ejecución de trabajos artísticos que sólo puedan encomendarse a determinadas personas naturales;"},"Inversión",{"$f":"IF(ISBLANK(K50),1,IFERROR(VLOOKUP(K50,Eje_Pilar_Prop!$C$3:$C$104,1,FALSE),\"NO\"))","v":4},"SECOP II",1,"Bogotá Mejor para Todos"]
["FDLCH-CPS-038-2020",2020,"SECOP II","CPS-038-2020","Contratos de prestación de servicios profesionales y de apoyo a la gestión","Contratación directa","Prestación de servicios profesionales y de apoyo a la gestión, o para la ejecución de trabajos artísticos que sólo puedan encomendarse a determinadas personas naturales;","PRESTACIÓN DE SERVICIOS PROFESIONALES PARA EL APOYO AL ÁREA DE GESTIÓN DEL DESARROLLO LOCAL DE LA ALCALDÍA LOCAL DE CHAPINERO EN LA FORMULACIÓN, GESTIÓN, EJECUCIÓN Y SEGUIMIENTO DEL PROYECTO 1301 'MEJORAR LA CALIDAD DE LA MOVILIDAD' Y LA SUPERVISIÓN DE CONTRATOS QUE LE SEAN ASIGNADOS.","Inversión","Bogotá Mejor para Todos",18,{"$f":"IF(ISERROR(VLOOKUP(K51,Eje_Pilar_Prop!$C$2:$E$104,2,FALSE)),\" \",VLOOKUP(K51,Eje_Pilar_Prop!$C$2:$E$104,2,FALSE))","v":"Mejor movilidad para todos"},{"$f":"IF(ISERROR(VLOOKUP(K51,Eje_Pilar_Prop!$C$2:$E$104,3,FALSE)),\" \",VLOOKUP(K51,Eje_Pilar_Prop!$C$2:$E$104,3,FALSE))","v":"Pilar 2 Democracía Urbana"},1301,1090435721,"JORGE ENRIQUE ABREO REYES",28400000,0,0,1,7100000,35500000,35500000,"2020-01-31","2020-02-04","2020-07-03",120,1,30,null,null,null,null,null,null,"X",null,1,null,null,{"$f":"IF(SUMPRODUCT((A$14:A51=A51)*(B$14:B51=B51)*(D$14:D51=D51))>1,0,1)","v":1},"Contratos de prestación de servicios profesionales y de apoyo a la gestión","Contratación directa",{"$f":"IF(ISBLANK(G51),1,IFERROR(VLOOKUP(G51,Tipo!$C$12:$C$27,1,FALSE),\"NO\"))","v":"Prestación de servicios profesionales y de apoyo a la gestión, o para la ejecución de trabajos artísticos que sólo puedan encomendarse a determinadas personas naturales;"},"Inversión",{"$f":"IF(ISBLANK(K51),1,IFERROR(VLOOKUP(K51,Eje_Pilar_Prop!$C$3:$C$104,1,FALSE),\"NO\"))","v":18},"SECOP II",1,"Bogotá Mejor para Todos"]
["FDLCH-CPS-039-2020",2020,"SECOP II","CPS-039-2020","Contratos de prestación de servicios profesionales y de apoyo a la gestión","Contratación directa","Prestación de servicios profesionales y de apoyo a la gestión, o para la ejecución de trabajos artísticos que sólo puedan encomendarse a determinadas personas naturales;","PRESTACIÓN DE SERVICIOS DE APOYO DE LOGÍSTICA QUE SE REQUIERAN EN EL DESARROLLO DE LAS ACTIVIDADES RELATIVAS A RECUPERACIÓN Y EMBELLECIMIENTO DEL ESPACIO PÚBLICO QUE TENGA A CARGO EL FONDO LOCAL DE DESARROLLO DE CHAPINERO","Inversión","Bogotá Mejor para Todos",18,{"$f":"IF(ISERROR(VLOOKUP(K52,Eje_Pilar_Prop!$C$2:$E$104,2,FALSE)),\" \",VLOOKUP(K52,Eje_Pilar_Prop!$C$2:$E$104,2,FALSE))","v":"Mejor movilidad para todos"},{"$f":"IF(ISERROR(VLOOKUP(K52,Eje_Pilar_Prop!$C$2:$E$104,3,FALSE)),\" \",VLOOKUP(K52,Eje_Pilar_Prop!$C$2:$E$104,3,FALSE))","v":"Pilar 2 Democracía Urbana"},1301,11187251,"HEVER AUGUSTO PARADA VANEGAS",10000000,0,0,1,2500000,12500000,12500000,"2020-02-04","2020-02-05",{"$f":"+Y52+30","v":"2020-03-06"},120,1,30,null,null,null,null,null,null,"X",null,1,null,null,{"$f":"IF(SUMPRODUCT((A$14:A52=A52)*(B$14:B52=B52)*(D$14:D52=D52))>1,0,1)","v":1},"Contratos de prestación de servicios profesionales y de apoyo a la gestión","Contratación directa",{"$f":"IF(ISBLANK(G52),1,IFERROR(VLOOKUP(G52,Tipo!$C$12:$C$27,1,FALSE),\"NO\"))","v":"Prestación de servicios profesionales y de apoyo a la gestión, o para la ejecución de trabajos artísticos que sólo puedan encomendarse a determinadas personas naturales;"},"Inversión",{"$f":"IF(ISBLANK(K52),1,IFERROR(VLOOKUP(K52,Eje_Pilar_Prop!$C$3:$C$104,1,FALSE),\"NO\"))","v":18},"SECOP II",1,"Bogotá Mejor para Todos"]
["FDLCH-CPS-040-2020",2020,"SECOP II","CPS-040-2020","Contratos de prestación de servicios profesionales y de apoyo a la gestión","Contratación directa","Prestación de servicios profesionales y de apoyo a la gestión, o para la ejecución de trabajos artísticos que sólo puedan encomendarse a determinadas personas naturales;","PRESTACIÓN DE SERVICIOS PERSONALES NECESARIOS PARA APOYAR LA GESTIÓN Y EJECUCIÓN DE ACTIVIDADES ADMINISTRATIVAS, OPERATIVAS Y LOGÍSTICAS QUE SE ADELANTAN EN EL ÁREA DE GESTIÓN DEL DESARROLLO LOCAL DE LA ALCALDÍA LOCAL DE CHAPINERO","Inversión","Bogotá Mejor para Todos",45,{"$f":"IF(ISERROR(VLOOKUP(K53,Eje_Pilar_Prop!$C$2:$E$104,2,FALSE)),\" \",VLOOKUP(K53,Eje_Pilar_Prop!$C$2:$E$104,2,FALSE))","v":"Gobernanza e influencia local, regional e internacional"},{"$f":"IF(ISERROR(VLOOKUP(K53,Eje_Pilar_Prop!$C$2:$E$104,3,FALSE)),\" \",VLOOKUP(K53,Eje_Pilar_Prop!$C$2:$E$104,3,FALSE))","v":"Eje Transversal 4 Gobierno Legitimo, Fortalecimiento Local y Eficiencia"},1304,2996195,"MEYER JAIRO GACHARNA VILLALBA",8700000,0,0,0,0,8700000,8700000,"2020-01-29","2020-01-30",{"$f":"+Y53+7+1","v":"2020-02-07"},120,0,0,null,null,null,null,null,null,"X",null,1,null,null,{"$f":"IF(SUMPRODUCT((A$14:A53=A53)*(B$14:B53=B53)*(D$14:D53=D53))>1,0,1)","v":1},"Contratos de prestación de servicios profesionales y de apoyo a la gestión","Contratación directa",{"$f":"IF(ISBLANK(G53),1,IFERROR(VLOOKUP(G53,Tipo!$C$12:$C$27,1,FALSE),\"NO\"))","v":"Prestación de servicios profesionales y de apoyo a la gestión, o para la ejecución de trabajos artísticos que sólo puedan encomendarse a determinadas personas naturales;"},"Inversión",{"$f":"IF(ISBLANK(K53),1,IFERROR(VLOOKUP(K53,Eje_Pilar_Prop!$C$3:$C$104,1,FALSE),\"NO\"))","v":45},"SECOP II",1,"Bogotá Mejor para Todos"]
["FDLCH-CPS-041-2020",2020,"SECOP II","CPS-041-2020","Contratos de prestación de servicios profesionales y de apoyo a la gestión","Contratación directa","Prestación de servicios profesionales y de apoyo a la gestión, o para la ejecución de trabajos artísticos que sólo puedan encomendarse a determinadas personas naturales;","APOYAR TÉCNICAMENTE A LOS RESPONSABLES E INTEGRANTES DE LOS PROCESOS EN LA IMPLEMENTACIÓN DE HERRAMIENTAS DE GESTIÓN, SIGUIENDO LOS LINEAMIENTOS METODOLÓGICOS ESTABLECIDOS POR LA OFICINA ASESORA DE PLANEACIÓN DE LA SECRETARÍA DISTRITAL DE GOBIERNO","Inversión","Bogotá Mejor para Todos",45,{"$f":"IF(ISERROR(VLOOKUP(K54,Eje_Pilar_Prop!$C$2:$E$104,2,FALSE)),\" \",VLOOKUP(K54,Eje_Pilar_Prop!$C$2:$E$104,2,FALSE))","v":"Gobernanza e influencia local, regional e internacional"},{"$f":"IF(ISERROR(VLOOKUP(K54,Eje_Pilar_Prop!$C$2:$E$104,3,FALSE)),\" \",VLOOKUP(K54,Eje_Pilar_Prop!$C$2:$E$104,3,FALSE))","v":"Eje Transversal 4 Gobierno Legitimo, Fortalecimiento Local y Eficiencia"},1304,52048570,"DEISY RUTH CONTRERAS RAMOS",19320000,0,0,1,9660000,28980000,28658000,"2020-01-31","2020-02-03",{"$f":"+Y54+60+1","v":"2020-04-04"},120,1,60,null,null,null,null,null,null,"X",null,0.98888888888888893,null,null,{"$f":"IF(SUMPRODUCT((A$14:A54=A54)*(B$14:B54=B54)*(D$14:D54=D54))>1,0,1)","v":1},"Contratos de prestación de servicios profesionales y de apoyo a la gestión","Contratación directa",{"$f":"IF(ISBLANK(G54),1,IFERROR(VLOOKUP(G54,Tipo!$C$12:$C$27,1,FALSE),\"NO\"))","v":"Prestación de servicios profesionales y de apoyo a la gestión, o para la ejecución de trabajos artísticos que sólo puedan encomendarse a determinadas personas naturales;"},"Inversión",{"$f":"IF(ISBLANK(K54),1,IFERROR(VLOOKUP(K54,Eje_Pilar_Prop!$C$3:$C$104,1,FALSE),\"NO\"))","v":45},"SECOP II",1,"Bogotá Mejor para Todos"]
["FDLCH-CPS-042-2020",2020,"SECOP II","CPS-042-2020","Contratos de prestación de servicios profesionales y de apoyo a la gestión","Contratación directa","Prestación de servicios profesionales y de apoyo a la gestión, o para la ejecución de trabajos artísticos que sólo puedan encomendarse a determinadas personas naturales;","PRESTACIÓN DE SERVICIOS TÉCNICOS PARA APOYAR LAS TAREAS OPERATIVAS DE CARÁCTER ARCHIVÍSTICO DESARROLLADAS EN LA ALCALDÍA LOCAL PARA GARANTIZAR LA APLICACIÓN CORRECTA DE LOS PROCEDIMIENTOS TÉCNICOS.","Inversión","Bogotá Mejor para Todos",45,{"$f":"IF(ISERROR(VLOOKUP(K55,Eje_Pilar_Prop!$C$2:$E$104,2,FALSE)),\" \",VLOOKUP(K55,Eje_Pilar_Prop!$C$2:$E$104,2,FALSE))","v":"Gobernanza e influencia local, regional e internacional"},{"$f":"IF(ISERROR(VLOOKUP(K55,Eje_Pilar_Prop!$C$2:$E$104,3,FALSE)),\" \",VLOOKUP(K55,Eje_Pilar_Prop!$C$2:$E$104,3,FALSE))","v":"Eje Transversal 4 Gobierno Legitimo, Fortalecimiento Local y Eficiencia"},1304,52854417,"DIANA CAROLINA CASTRO",15400000,0,0,0,0,15400000,15400000,"2020-01-30","2020-02-04",{"$f":"+Y55+24","v":"2020-02-28"},120,0,0,null,null,null,null,null,null,"X",null,1,null,null,{"$f":"IF(SUMPRODUCT((A$14:A55=A55)*(B$14:B55=B55)*(D$14:D55=D55))>1,0,1)","v":1},"Contratos de prestación de servicios profesionales y de apoyo a la gestión","Contratación directa",{"$f":"IF(ISBLANK(G55),1,IFERROR(VLOOKUP(G55,Tipo!$C$12:$C$27,1,FALSE),\"NO\"))","v":"Prestación de servicios profesionales y de apoyo a la gestión, o para la ejecución de trabajos artísticos que sólo puedan encomendarse a determinadas personas naturales;"},"Inversión",{"$f":"IF(ISBLANK(K55),1,IFERROR(VLOOKUP(K55,Eje_Pilar_Prop!$C$3:$C$104,1,FALSE),\"NO\"))","v":45},"SECOP II",1,"Bogotá Mejor para Todos"]
["FDLCH-CPS-043-2020",2020,"SECOP II","CPS-043-2020","Contratos de prestación de servicios profesionales y de apoyo a la gestión","Contratación directa","Prestación de servicios profesionales y de apoyo a la gestión, o para la ejecución de trabajos artísticos que sólo puedan encomendarse a determinadas personas naturales;","PRESTACIÓN DE SERVICIOS PROFESIONALES PARA APOYAR AL ÁREA DE GESTIÓN DEL DESARROLLO LOCAL DE LA ALCALDÍA LOCAL DE CHAPINERO EN LA FORMULACIÓN, GESTIÓN Y EJECUCIÓN DEL PROYECTO 1298 CULTURA Y DEPORTE: TRANSFORMANDO VIDAS Y HACIENDO CIUDADANOS FELICES Y EN LA SUPERVISIÓN DE CONTRATOS QUE LE SEAN ASIGNADOS.","Inversión","Bogotá Mejor para Todos",11,{"$f":"IF(ISERROR(VLOOKUP(K56,Eje_Pilar_Prop!$C$2:$E$104,2,FALSE)),\" \",VLOOKUP(K56,Eje_Pilar_Prop!$C$2:$E$104,2,FALSE))","v":"Mejores oportunidades para el desarrollo a través de la cultura, la recreación y el deporte"},{"$f":"IF(ISERROR(VLOOKUP(K56,Eje_Pilar_Prop!$C$2:$E$104,3,FALSE)),\" \",VLOOKUP(K56,Eje_Pilar_Prop!$C$2:$E$104,3,FALSE))","v":"Pilar 1 Igualdad de Calidad de Vida"},1298,51957232,"LINA MARIA CORTES GUTIERREZ",28400000,0,0,1,7100000,35500000,35500000,"2020-01-30","2020-02-04",{"$f":"+Y56+30","v":"2020-03-05"},120,1,30,null,null,null,null,null,null,"X",null,1,null,null,{"$f":"IF(SUMPRODUCT((A$14:A56=A56)*(B$14:B56=B56)*(D$14:D56=D56))>1,0,1)","v":1},"Contratos de prestación de servicios profesionales y de apoyo a la gestión","Contratación directa",{"$f":"IF(ISBLANK(G56),1,IFERROR(VLOOKUP(G56,Tipo!$C$12:$C$27,1,FALSE),\"NO\"))","v":"Prestación de servicios profesionales y de apoyo a la gestión, o para la ejecución de trabajos artísticos que sólo puedan encomendarse a determinadas personas naturales;"},"Inversión",{"$f":"IF(ISBLANK(K56),1,IFERROR(VLOOKUP(K56,Eje_Pilar_Prop!$C$3:$C$104,1,FALSE),\"NO\"))","v":11},"SECOP II",1,"Bogotá Mejor para Todos"]
["FDLCH-CPS-044-2020",2020,"SECOP II","CPS-044-2020","Contratos de prestación de servicios profesionales y de apoyo a la gestión","Contratación directa","Prestación de servicios profesionales y de apoyo a la gestión, o para la ejecución de trabajos artísticos que sólo puedan encomendarse a determinadas personas naturales;","PRESTACIÓN DE SERVICIOS PROFESIONALES PARA APOYAR AL ÁREA DE GESTIÓN DEL DESARROLLO LOCAL DE LA ALCALDÍA LOCAL DE CHAPINERO EN LOS PROYECTOS QUE LE SEAN ASIGNADOS Y LA SUPERVISIÓN DE LOS CONTRATOS","Inversión","Bogotá Mejor para Todos",17,{"$f":"IF(ISERROR(VLOOKUP(K57,Eje_Pilar_Prop!$C$2:$E$104,2,FALSE)),\" \",VLOOKUP(K57,Eje_Pilar_Prop!$C$2:$E$104,2,FALSE))","v":"Espacio público, derecho de todos"},{"$f":"IF(ISERROR(VLOOKUP(K57,Eje_Pilar_Prop!$C$2:$E$104,3,FALSE)),\" \",VLOOKUP(K57,Eje_Pilar_Prop!$C$2:$E$104,3,FALSE))","v":"Pilar 2 Democracía Urbana"},1300,80851019,"NELSON LUIS VILLERO GUERRA ",19320000,0,0,0,0,19320000,18998000,"2020-01-29","2020-01-30",{"$f":"+Y57+7+1","v":"2020-02-07"},120,0,0,null,null,null,null,null,null,"X",null,0.98333333333333328,null,null,{"$f":"IF(SUMPRODUCT((A$14:A57=A57)*(B$14:B57=B57)*(D$14:D57=D57))>1,0,1)","v":1},"Contratos de prestación de servicios profesionales y de apoyo a la gestión","Contratación directa",{"$f":"IF(ISBLANK(G57),1,IFERROR(VLOOKUP(G57,Tipo!$C$12:$C$27,1,FALSE),\"NO\"))","v":"Prestación de servicios profesionales y de apoyo a la gestión, o para la ejecución de trabajos artísticos que sólo puedan encomendarse a determinadas personas naturales;"},"Inversión",{"$f":"IF(ISBLANK(K57),1,IFERROR(VLOOKUP(K57,Eje_Pilar_Prop!$C$3:$C$104,1,FALSE),\"NO\"))","v":17},"SECOP II",1,"Bogotá Mejor para Todos"]
["FDLCH-CPS-045-2020",2020,"SECOP II","CPS-045-2020","Contratos de prestación de servicios profesionales y de apoyo a la gestión","Contratación directa","Prestación de servicios profesionales y de apoyo a la gestión, o para la ejecución de trabajos artísticos que sólo puedan encomendarse a determinadas personas naturales;","PRESTACIÓN DE SERVICIOS PROFESIONALES PARA APOYAR AL ÁREA DE GESTIÓN DEL DESARROLLO LOCAL DE LA ALCALDÍA LOCAL DE CHAPINERO EN LA FORMULACIÓN, GESTIÓN Y EJECUCIÓN DEL PROYECTO 1293 'CONTRIBUIR EN EL DESARROLLO DE LA PRIMERA INFANCIA Y LA ELIMINACIÓN DE LAS VIOLENCIAS' Y LA SUPERVISIÓN DE CONTRATOS QUE LE SEAN ASIGNADOS","Inversión","Bogotá Mejor para Todos",2,{"$f":"IF(ISERROR(VLOOKUP(K58,Eje_Pilar_Prop!$C$2:$E$104,2,FALSE)),\" \",VLOOKUP(K58,Eje_Pilar_Prop!$C$2:$E$104,2,FALSE))","v":"Desarrollo integral desde la gestación hasta la adolescencia"},{"$f":"IF(ISERROR(VLOOKUP(K58,Eje_Pilar_Prop!$C$2:$E$104,3,FALSE)),\" \",VLOOKUP(K58,Eje_Pilar_Prop!$C$2:$E$104,3,FALSE))","v":"Pilar 1 Igualdad de Calidad de Vida"},1293,52312234,"CLAUDIA MARCELA LOPEZ SERRATO",21000000,0,0,2,10500000,31500000,31500000,"2020-01-30","2020-02-03",{"$f":"+Y58+30+30+1","v":"2020-04-04"},120,2,60,null,null,null,null,null,null,"X",null,1,null,null,{"$f":"IF(SUMPRODUCT((A$14:A58=A58)*(B$14:B58=B58)*(D$14:D58=D58))>1,0,1)","v":1},"Contratos de prestación de servicios profesionales y de apoyo a la gestión","Contratación directa",{"$f":"IF(ISBLANK(G58),1,IFERROR(VLOOKUP(G58,Tipo!$C$12:$C$27,1,FALSE),\"NO\"))","v":"Prestación de servicios profesionales y de apoyo a la gestión, o para la ejecución de trabajos artísticos que sólo puedan encomendarse a determinadas personas naturales;"},"Inversión",{"$f":"IF(ISBLANK(K58),1,IFERROR(VLOOKUP(K58,Eje_Pilar_Prop!$C$3:$C$104,1,FALSE),\"NO\"))","v":2},"SECOP II",1,"Bogotá Mejor para Todos"]
["FDLCH-CPS-046-2020",2020,"SECOP II","CPS-046-2020","Contratos de prestación de servicios profesionales y de apoyo a la gestión","Contratación directa","Prestación de servicios profesionales y de apoyo a la gestión, o para la ejecución de trabajos artísticos que sólo puedan encomendarse a determinadas personas naturales;","PRESTACIÓN DE SERVICIOS TÉCNICOS PARA APOYAR LA GESTIÓN DOCUMENTAL DE LA ALCALDÍA LOCAL PARA LA IMPLEMENTACIÓN DEL PROCESO DE VERIFICACIÓN, SOPORTE Y ACOMPAÑAMIENTO, EN EL DESARROLLO DE LAS ACTIVIDADES PROPIAS DE LOS PROCESOS Y ACTUACIONES ADMINISTRATIVAS EXISTENTES","Inversión","Bogotá Mejor para Todos",45,{"$f":"IF(ISERROR(VLOOKUP(K59,Eje_Pilar_Prop!$C$2:$E$104,2,FALSE)),\" \",VLOOKUP(K59,Eje_Pilar_Prop!$C$2:$E$104,2,FALSE))","v":"Gobernanza e influencia local, regional e internacional"},{"$f":"IF(ISERROR(VLOOKUP(K59,Eje_Pilar_Prop!$C$2:$E$104,3,FALSE)),\" \",VLOOKUP(K59,Eje_Pilar_Prop!$C$2:$E$104,3,FALSE))","v":"Eje Transversal 4 Gobierno Legitimo, Fortalecimiento Local y Eficiencia"},1304,1094948656,"CARMEN IRENE REYES GAÑAN",11920000,0,0,1,2980000,14900000,14403333,"2020-02-04","2020-02-06",{"$f":"+Y59+30","v":"2020-03-07"},120,1,30,null,null,null,null,null,null,"X",null,0.96666664429530202,null,null,{"$f":"IF(SUMPRODUCT((A$14:A59=A59)*(B$14:B59=B59)*(D$14:D59=D59))>1,0,1)","v":1},"Contratos de prestación de servicios profesionales y de apoyo a la gestión","Contratación directa",{"$f":"IF(ISBLANK(G59),1,IFERROR(VLOOKUP(G59,Tipo!$C$12:$C$27,1,FALSE),\"NO\"))","v":"Prestación de servicios profesionales y de apoyo a la gestión, o para la ejecución de trabajos artísticos que sólo puedan encomendarse a determinadas personas naturales;"},"Inversión",{"$f":"IF(ISBLANK(K59),1,IFERROR(VLOOKUP(K59,Eje_Pilar_Prop!$C$3:$C$104,1,FALSE),\"NO\"))","v":45},"SECOP II",1,"Bogotá Mejor para Todos"]
["FDLCH-CPS-047-2020",2020,"SECOP II","CPS-047-2020","Contratos de prestación de servicios profesionales y de apoyo a la gestión","Contratación directa","Prestación de servicios profesionales y de apoyo a la gestión, o para la ejecución de trabajos artísticos que sólo puedan encomendarse a determinadas personas naturales;","PRESTAR LOS SERVICIOS TÉCNICOS PARA LA OPERACIÓN, SEGUIMIENTO Y CUMPLIMIENTO DE LOS PROCESOS Y PROCEDIMIENTOS DEL SERVICIO APOYOS PARA LA SEGURIDAD ECONÓMICA TIPO C, REQUERIDOS PARA EL OPORTUNO Y ADEC","Inversión","Bogotá Mejor para Todos",4,{"$f":"IF(ISERROR(VLOOKUP(K60,Eje_Pilar_Prop!$C$2:$E$104,2,FALSE)),\" \",VLOOKUP(K60,Eje_Pilar_Prop!$C$2:$E$104,2,FALSE))","v":"Familias protegidas y adaptadas al cambio climático"},{"$f":"IF(ISERROR(VLOOKUP(K60,Eje_Pilar_Prop!$C$2:$E$104,3,FALSE)),\" \",VLOOKUP(K60,Eje_Pilar_Prop!$C$2:$E$104,3,FALSE))","v":"Pilar 1 Igualdad de Calidad de Vida"},1294,52213327,"ANDREA DEL PILAR PASTRANA PEREZ",11920000,0,0,2,5960000,17880000,17482667,"2020-02-04","2020-02-05",{"$f":"+Y60+30+31","v":"2020-04-06"},120,2,60,null,null,null,null,null,null,"X",null,0.9777777964205816,null,null,{"$f":"IF(SUMPRODUCT((A$14:A60=A60)*(B$14:B60=B60)*(D$14:D60=D60))>1,0,1)","v":1},"Contratos de prestación de servicios profesionales y de apoyo a la gestión","Contratación directa",{"$f":"IF(ISBLANK(G60),1,IFERROR(VLOOKUP(G60,Tipo!$C$12:$C$27,1,FALSE),\"NO\"))","v":"Prestación de servicios profesionales y de apoyo a la gestión, o para la ejecución de trabajos artísticos que sólo puedan encomendarse a determinadas personas naturales;"},"Inversión",{"$f":"IF(ISBLANK(K60),1,IFERROR(VLOOKUP(K60,Eje_Pilar_Prop!$C$3:$C$104,1,FALSE),\"NO\"))","v":4},"SECOP II",1,"Bogotá Mejor para Todos"]
["FDLCH-CPS-048-2020",2020,"SECOP II","CPS-048-2020","Contratos de prestación de servicios profesionales y de apoyo a la gestión","Contratación directa","Prestación de servicios profesionales y de apoyo a la gestión, o para la ejecución de trabajos artísticos que sólo puedan encomendarse a determinadas personas naturales;","PRESTACIÓN DE SERVICIOS PERSONALES NECESARIOS PARA APOYAR LA GESTIÓN DOCUMENTAL DE LA ALCALDÍA LOCAL, ACOMPAÑANDO AL EQUIPO JURÍDICO DE DEPURACIÓN EN LAS LABORES OPERATIVAS QUE GENERA EL PROCESO DE IMPULSO DE LAS ACTUACIONES ADMINISTRATIVAS EXISTENTES EN LAS DIFERENTES ALCALDÍAS LOCALES","Inversión","Bogotá Mejor para Todos",45,{"$f":"IF(ISERROR(VLOOKUP(K61,Eje_Pilar_Prop!$C$2:$E$104,2,FALSE)),\" \",VLOOKUP(K61,Eje_Pilar_Prop!$C$2:$E$104,2,FALSE))","v":"Gobernanza e influencia local, regional e internacional"},{"$f":"IF(ISERROR(VLOOKUP(K61,Eje_Pilar_Prop!$C$2:$E$104,3,FALSE)),\" \",VLOOKUP(K61,Eje_Pilar_Prop!$C$2:$E$104,3,FALSE))","v":"Eje Transversal 4 Gobierno Legitimo, Fortalecimiento Local y Eficiencia"},1304,79955421,"PAULO  CESAR RAMIREZ INFANTE",9800000,0,0,1,4900000,14700000,14536667,"2020-01-31","2020-02-03",{"$f":"+Y61+60+1","v":"2020-04-04"},120,1,60,null,null,null,null,null,null,"X",null,0.98888891156462588,null,null,{"$f":"IF(SUMPRODUCT((A$14:A61=A61)*(B$14:B61=B61)*(D$14:D61=D61))>1,0,1)","v":1},"Contratos de prestación de servicios profesionales y de apoyo a la gestión","Contratación directa",{"$f":"IF(ISBLANK(G61),1,IFERROR(VLOOKUP(G61,Tipo!$C$12:$C$27,1,FALSE),\"NO\"))","v":"Prestación de servicios profesionales y de apoyo a la gestión, o para la ejecución de trabajos artísticos que sólo puedan encomendarse a determinadas personas naturales;"},"Inversión",{"$f":"IF(ISBLANK(K61),1,IFERROR(VLOOKUP(K61,Eje_Pilar_Prop!$C$3:$C$104,1,FALSE),\"NO\"))","v":45},"SECOP II",1,"Bogotá Mejor para Todos"]
["FDLCH-CPS-049-2020",2020,"SECOP II","CPS-049-2020","Contratos de prestación de servicios profesionales y de apoyo a la gestión","Contratación directa","Prestación de servicios profesionales y de apoyo a la gestión, o para la ejecución de trabajos artísticos que sólo puedan encomendarse a determinadas personas naturales;","PRESTACIÓN DE SERVICIOS PERSONALES NECESARIOS PARA EL APOYO A LA GESTIÓN Y EJECUCIÓN DE LAS ACTIVIDADES ADMINISTRATIVAS Y OPERATIVAS QUE SE ADELANTAN EN EL ÀREA DE GESTIÓN PILICIVA JURÍDICA DE LA ALCALDÍA LOCAL DE CHAPINERO","Inversión","Bogotá Mejor para Todos",45,{"$f":"IF(ISERROR(VLOOKUP(K62,Eje_Pilar_Prop!$C$2:$E$104,2,FALSE)),\" \",VLOOKUP(K62,Eje_Pilar_Prop!$C$2:$E$104,2,FALSE))","v":"Gobernanza e influencia local, regional e internacional"},{"$f":"IF(ISERROR(VLOOKUP(K62,Eje_Pilar_Prop!$C$2:$E$104,3,FALSE)),\" \",VLOOKUP(K62,Eje_Pilar_Prop!$C$2:$E$104,3,FALSE))","v":"Eje Transversal 4 Gobierno Legitimo, Fortalecimiento Local y Eficiencia"},1304,52253361,"OLGA LUCIA OBANDO CHACA",9816660,0,0,1,4908330,14724990,14561379,"2020-01-31","2020-02-03",{"$f":"+Y62+60+1","v":"2020-04-04"},120,1,60,null,null,null,null,null,null,"X",null,0.98888888888888893,null,null,{"$f":"IF(SUMPRODUCT((A$14:A62=A62)*(B$14:B62=B62)*(D$14:D62=D62))>1,0,1)","v":1},"Contratos de prestación de servicios profesionales y de apoyo a la gestión","Contratación directa",{"$f":"IF(ISBLANK(G62),1,IFERROR(VLOOKUP(G62,Tipo!$C$12:$C$27,1,FALSE),\"NO\"))","v":"Prestación de servicios profesionales y de apoyo a la gestión, o para la ejecución de trabajos artísticos que sólo puedan encomendarse a determinadas personas naturales;"},"Inversión",{"$f":"IF(ISBLANK(K62),1,IFERROR(VLOOKUP(K62,Eje_Pilar_Prop!$C$3:$C$104,1,FALSE),\"NO\"))","v":45},"SECOP II",1,"Bogotá Mejor para Todos"]
["FDLCH-CPS-050-2020",2020,"SECOP II","CPS-050-2020","Contratos de prestación de servicios profesionales y de apoyo a la gestión","Contratación directa","Prestación de servicios profesionales y de apoyo a la gestión, o para la ejecución de trabajos artísticos que sólo puedan encomendarse a determinadas personas naturales;","PRESTACIÓN DE SERVICIOS PERSONALES NECESARIOS PARA EL APOYO DE LAS ACTIVIDADES ADMINISTRATIVAS Y OPERATIVAS QUE ADELANTEN EN EL ÁREA DE GESTIÓN POLICIVA OBRAS EN LA ALCALDÍA LOCAL DE CHAPINERO","Inversión","Bogotá Mejor para Todos",45,{"$f":"IF(ISERROR(VLOOKUP(K63,Eje_Pilar_Prop!$C$2:$E$104,2,FALSE)),\" \",VLOOKUP(K63,Eje_Pilar_Prop!$C$2:$E$104,2,FALSE))","v":"Gobernanza e influencia local, regional e internacional"},{"$f":"IF(ISERROR(VLOOKUP(K63,Eje_Pilar_Prop!$C$2:$E$104,3,FALSE)),\" \",VLOOKUP(K63,Eje_Pilar_Prop!$C$2:$E$104,3,FALSE))","v":"Eje Transversal 4 Gobierno Legitimo, Fortalecimiento Local y Eficiencia"},1304,1136880515,"DIEGO ALEJANDRO PORTILLA UBATE",8780000,0,0,1,2195000,10975000,10975000,"2020-02-07","2020-02-10",{"$f":"+Y63+30","v":"2020-03-11"},120,1,30,null,null,null,null,null,null,"X",null,1,null,null,{"$f":"IF(SUMPRODUCT((A$14:A63=A63)*(B$14:B63=B63)*(D$14:D63=D63))>1,0,1)","v":1},"Contratos de prestación de servicios profesionales y de apoyo a la gestión","Contratación directa",{"$f":"IF(ISBLANK(G63),1,IFERROR(VLOOKUP(G63,Tipo!$C$12:$C$27,1,FALSE),\"NO\"))","v":"Prestación de servicios profesionales y de apoyo a la gestión, o para la ejecución de trabajos artísticos que sólo puedan encomendarse a determinadas personas naturales;"},"Inversión",{"$f":"IF(ISBLANK(K63),1,IFERROR(VLOOKUP(K63,Eje_Pilar_Prop!$C$3:$C$104,1,FALSE),\"NO\"))","v":45},"SECOP II",1,"Bogotá Mejor para Todos"]
["FDLCH-CPS-051-2020",2020,"SECOP II","CPS-051-2020","Contratos de prestación de servicios profesionales y de apoyo a la gestión","Contratación directa","Prestación de servicios profesionales y de apoyo a la gestión, o para la ejecución de trabajos artísticos que sólo puedan encomendarse a determinadas personas naturales;","PRESTACIÓN DE SERVICIOS PROFESIONALES PARA APOYAR TÉCNICAMENTE LAS DISTINTAS ETAPAS DE LOS PROCESOS DE COMPETENCIA DE LAS INSPECCIONES DE POLICÍA DE LA LOCALIDAD DE CHAPINERO, SEGÚN REPARTO","Inversión","Bogotá Mejor para Todos",45,{"$f":"IF(ISERROR(VLOOKUP(K64,Eje_Pilar_Prop!$C$2:$E$104,2,FALSE)),\" \",VLOOKUP(K64,Eje_Pilar_Prop!$C$2:$E$104,2,FALSE))","v":"Gobernanza e influencia local, regional e internacional"},{"$f":"IF(ISERROR(VLOOKUP(K64,Eje_Pilar_Prop!$C$2:$E$104,3,FALSE)),\" \",VLOOKUP(K64,Eje_Pilar_Prop!$C$2:$E$104,3,FALSE))","v":"Eje Transversal 4 Gobierno Legitimo, Fortalecimiento Local y Eficiencia"},1304,1032368645,"YULIHED ANDREA ARIZA CONSUEGRA",22823920,0,0,1,5705980,28529900,28529900,"2020-02-03","2020-02-06",{"$f":"+Y64+30","v":"2020-03-07"},120,1,30,null,null,null,null,null,null,"X",null,1,null,null,{"$f":"IF(SUMPRODUCT((A$14:A64=A64)*(B$14:B64=B64)*(D$14:D64=D64))>1,0,1)","v":1},"Contratos de prestación de servicios profesionales y de apoyo a la gestión","Contratación directa",{"$f":"IF(ISBLANK(G64),1,IFERROR(VLOOKUP(G64,Tipo!$C$12:$C$27,1,FALSE),\"NO\"))","v":"Prestación de servicios profesionales y de apoyo a la gestión, o para la ejecución de trabajos artísticos que sólo puedan encomendarse a determinadas personas naturales;"},"Inversión",{"$f":"IF(ISBLANK(K64),1,IFERROR(VLOOKUP(K64,Eje_Pilar_Prop!$C$3:$C$104,1,FALSE),\"NO\"))","v":45},"SECOP II",1,"Bogotá Mejor para Todos"]
["FDLCH-CPS-052-2020",2020,"SECOP II","CPS-052-2020","Contratos de prestación de servicios profesionales y de apoyo a la gestión","Contratación directa","Prestación de servicios profesionales y de apoyo a la gestión, o para la ejecución de trabajos artísticos que sólo puedan encomendarse a determinadas personas naturales;","PRESTACIÓN DE SERVICIOS PROFESIONALES PARA APOYAR TÉCNICAMENTE LAS DISTINTAS ETAPAS DE LOS PROCESOS DE COMPETENCIA DE LAS INSPECCIONES DE POLICÍA DE LA LOCALIDAD DE CHAPINERO, SEGÚN REPARTO.","Inversión","Bogotá Mejor para Todos",45,{"$f":"IF(ISERROR(VLOOKUP(K65,Eje_Pilar_Prop!$C$2:$E$104,2,FALSE)),\" \",VLOOKUP(K65,Eje_Pilar_Prop!$C$2:$E$104,2,FALSE))","v":"Gobernanza e influencia local, regional e internacional"},{"$f":"IF(ISERROR(VLOOKUP(K65,Eje_Pilar_Prop!$C$2:$E$104,3,FALSE)),\" \",VLOOKUP(K65,Eje_Pilar_Prop!$C$2:$E$104,3,FALSE))","v":"Eje Transversal 4 Gobierno Legitimo, Fortalecimiento Local y Eficiencia"},1304,1032445959,"MARIA ALEJANDRA JIMENEZ AUCIQUE",22823920,0,0,1,5705980,28529900,28529900,"2020-02-04","2020-02-05",{"$f":"+Y65+30","v":"2020-03-06"},120,1,30,null,null,null,null,null,null,"X",null,1,null,null,{"$f":"IF(SUMPRODUCT((A$14:A65=A65)*(B$14:B65=B65)*(D$14:D65=D65))>1,0,1)","v":1},"Contratos de prestación de servicios profesionales y de apoyo a la gestión","Contratación directa",{"$f":"IF(ISBLANK(G65),1,IFERROR(VLOOKUP(G65,Tipo!$C$12:$C$27,1,FALSE),\"NO\"))","v":"Prestación de servicios profesionales y de apoyo a la gestión, o para la ejecución de trabajos artísticos que sólo puedan encomendarse a determinadas personas naturales;"},"Inversión",{"$f":"IF(ISBLANK(K65),1,IFERROR(VLOOKUP(K65,Eje_Pilar_Prop!$C$3:$C$104,1,FALSE),\"NO\"))","v":45},"SECOP II",1,"Bogotá Mejor para Todos"]
["FDLCH-CPS-053-2020",2020,"SECOP II","CPS-053-2020","Contratos de prestación de servicios profesionales y de apoyo a la gestión","Contratación directa","Prestación de servicios profesionales y de apoyo a la gestión, o para la ejecución de trabajos artísticos que sólo puedan encomendarse a determinadas personas naturales;","DESCRIPCIÓN: PRESTACIÓN DE SERVICIOS PROFESIONALES PARA APOYAR AL ALCALDE LOCAL EN LA PROMOCIÓN, ACOMPAÑAMIENTO, COORDINACIÓN Y ATENCIÓN DE LAS INSTANCIAS DE COORDINACIÓN INTERINSTITUCIONALES Y LAS INSTANCIAS DE PARTICIPACIÓN LOCALES, ASÍ COMO LOS PROCESOS COMUNITARIOS EN LA LOCALIDAD","Inversión","Bogotá Mejor para Todos",45,{"$f":"IF(ISERROR(VLOOKUP(K66,Eje_Pilar_Prop!$C$2:$E$104,2,FALSE)),\" \",VLOOKUP(K66,Eje_Pilar_Prop!$C$2:$E$104,2,FALSE))","v":"Gobernanza e influencia local, regional e internacional"},{"$f":"IF(ISERROR(VLOOKUP(K66,Eje_Pilar_Prop!$C$2:$E$104,3,FALSE)),\" \",VLOOKUP(K66,Eje_Pilar_Prop!$C$2:$E$104,3,FALSE))","v":"Eje Transversal 4 Gobierno Legitimo, Fortalecimiento Local y Eficiencia"},1305,1090489409,"CARLOS ARTURO BARBOSA PEREZ",16800000,0,0,1,8400000,25200000,25200000,"2020-02-04","2020-02-05",{"$f":"+Y66+60+1","v":"2020-04-06"},120,1,60,null,null,null,null,null,null,"X",null,1,null,null,{"$f":"IF(SUMPRODUCT((A$14:A66=A66)*(B$14:B66=B66)*(D$14:D66=D66))>1,0,1)","v":1},"Contratos de prestación de servicios profesionales y de apoyo a la gestión","Contratación directa",{"$f":"IF(ISBLANK(G66),1,IFERROR(VLOOKUP(G66,Tipo!$C$12:$C$27,1,FALSE),\"NO\"))","v":"Prestación de servicios profesionales y de apoyo a la gestión, o para la ejecución de trabajos artísticos que sólo puedan encomendarse a determinadas personas naturales;"},"Inversión",{"$f":"IF(ISBLANK(K66),1,IFERROR(VLOOKUP(K66,Eje_Pilar_Prop!$C$3:$C$104,1,FALSE),\"NO\"))","v":45},"SECOP II",1,"Bogotá Mejor para Todos"]
["FDLCH-CPS-054-2020",2020,"SECOP II","CPS-054-2020","Contratos de prestación de servicios profesionales y de apoyo a la gestión","Contratación directa","Prestación de servicios profesionales y de apoyo a la gestión, o para la ejecución de trabajos artísticos que sólo puedan encomendarse a determinadas personas naturales;","PRESTACIÓN DE SERVICIOS PERSONALES NECESARIOS PARA EL APOYO AL ÁREA DE GESTIÓN POLICIVA DE INSPECCIONES DE LA ALCALDÍA LOCAL DE CHAPINERO EN LAS ACTIVIDADES DE RADICACIÓN Y CORRESPONDENCIA","Inversión","Bogotá Mejor para Todos",45,{"$f":"IF(ISERROR(VLOOKUP(K67,Eje_Pilar_Prop!$C$2:$E$104,2,FALSE)),\" \",VLOOKUP(K67,Eje_Pilar_Prop!$C$2:$E$104,2,FALSE))","v":"Gobernanza e influencia local, regional e internacional"},{"$f":"IF(ISERROR(VLOOKUP(K67,Eje_Pilar_Prop!$C$2:$E$104,3,FALSE)),\" \",VLOOKUP(K67,Eje_Pilar_Prop!$C$2:$E$104,3,FALSE))","v":"Eje Transversal 4 Gobierno Legitimo, Fortalecimiento Local y Eficiencia"},1304,1063134906,"VANESA ALEXANDRA JIMENEZ ARTEAGA",9360000,0,0,1,4680000,14040000,14040000,"2020-02-07","2020-02-08",{"$f":"+Y67+60+1","v":"2020-04-09"},120,1,60,null,null,null,null,null,null,"X",null,1,null,null,{"$f":"IF(SUMPRODUCT((A$14:A67=A67)*(B$14:B67=B67)*(D$14:D67=D67))>1,0,1)","v":1},"Contratos de prestación de servicios profesionales y de apoyo a la gestión","Contratación directa",{"$f":"IF(ISBLANK(G67),1,IFERROR(VLOOKUP(G67,Tipo!$C$12:$C$27,1,FALSE),\"NO\"))","v":"Prestación de servicios profesionales y de apoyo a la gestión, o para la ejecución de trabajos artísticos que sólo puedan encomendarse a determinadas personas naturales;"},"Inversión",{"$f":"IF(ISBLANK(K67),1,IFERROR(VLOOKUP(K67,Eje_Pilar_Prop!$C$3:$C$104,1,FALSE),\"NO\"))","v":45},"SECOP II",1,"Bogotá Mejor para Todos"]
["FDLCH-CPS-055 A-2020",2020,"SECOP II","CPS-055-2020","Contratos de prestación de servicios profesionales y de apoyo a la gestión","Contratación directa","Prestación de servicios profesionales y de apoyo a la gestión, o para la ejecución de trabajos artísticos que sólo puedan encomendarse a determinadas personas naturales;","DESCRIPCIÓN: PRESTACIÓN DE SERVICIOS PROFESIONALES PARA APOYAR JURÍDICAMENTE LA EJECUCIÓN DE LAS ACCIONES REQUERIDAS PARA EL TRÁMITE E IMPULSO PROCESAL DE LAS ACTUACIONES CONTRAVENCIONES Y/O QUERELLAS QUE CURSEN EN LAS INSPECCIONES DE POLICÍA DE LA LOCALIDAD DE CHAPINERO","Inversión","Bogotá Mejor para Todos",45,{"$f":"IF(ISERROR(VLOOKUP(K68,Eje_Pilar_Prop!$C$2:$E$104,2,FALSE)),\" \",VLOOKUP(K68,Eje_Pilar_Prop!$C$2:$E$104,2,FALSE))","v":"Gobernanza e influencia local, regional e internacional"},{"$f":"IF(ISERROR(VLOOKUP(K68,Eje_Pilar_Prop!$C$2:$E$104,3,FALSE)),\" \",VLOOKUP(K68,Eje_Pilar_Prop!$C$2:$E$104,3,FALSE))","v":"Eje Transversal 4 Gobierno Legitimo, Fortalecimiento Local y Eficiencia"},1304,53139176,"DENNIS NATALIA BERNAL RAMIREZ",19845000,0,0,1,4961250,24806250,24806250,"2020-02-10","2020-02-13",{"$f":"+Y68+30","v":"2020-03-14"},120,1,30,null,null,null,null,null,null,"X",null,1,null,null,{"$f":"IF(SUMPRODUCT((A$14:A68=A68)*(B$14:B68=B68)*(D$14:D68=D68))>1,0,1)","v":1},"Contratos de prestación de servicios profesionales y de apoyo a la gestión","Contratación directa",{"$f":"IF(ISBLANK(G68),1,IFERROR(VLOOKUP(G68,Tipo!$C$12:$C$27,1,FALSE),\"NO\"))","v":"Prestación de servicios profesionales y de apoyo a la gestión, o para la ejecución de trabajos artísticos que sólo puedan encomendarse a determinadas personas naturales;"},"Inversión",{"$f":"IF(ISBLANK(K68),1,IFERROR(VLOOKUP(K68,Eje_Pilar_Prop!$C$3:$C$104,1,FALSE),\"NO\"))","v":45},"SECOP II",1,"Bogotá Mejor para Todos"]
["FDLCH-CPS-056-2020",2020,"SECOP II","CPS-056-2020","Contratos de prestación de servicios profesionales y de apoyo a la gestión","Contratación directa","Prestación de servicios profesionales y de apoyo a la gestión, o para la ejecución de trabajos artísticos que sólo puedan encomendarse a determinadas personas naturales;","PRESTACIÓN DE SERVICIOS PROFESIONALES PARA APOYAR AL ÁREA DE GESTIÓN DEL DESARROLLO LOCAL DE LA ALCALDÍA LOCAL DE CHAPINERO EN LA FORMULACIÓN, GESTIÓN Y EJECUCIÓN DEL PROYECTO 1302 ENTORNOS SEGUROS PARA LA CIUDADANÍA","Inversión","Bogotá Mejor para Todos",19,{"$f":"IF(ISERROR(VLOOKUP(K69,Eje_Pilar_Prop!$C$2:$E$104,2,FALSE)),\" \",VLOOKUP(K69,Eje_Pilar_Prop!$C$2:$E$104,2,FALSE))","v":"Seguridad y convivencia para todos"},{"$f":"IF(ISERROR(VLOOKUP(K69,Eje_Pilar_Prop!$C$2:$E$104,3,FALSE)),\" \",VLOOKUP(K69,Eje_Pilar_Prop!$C$2:$E$104,3,FALSE))","v":"Pilar 3 Construcción de Comunidad y Cultura Ciudadana"},1302,52011159,"ALBA TERESA TRIANA RUBIANO",28400000,0,0,0,0,28400000,28400000,"2020-02-06","2020-02-12",{"$f":"+Y69","v":"2020-02-12"},120,0,0,null,null,null,null,null,null,"X",null,1,null,null,{"$f":"IF(SUMPRODUCT((A$14:A69=A69)*(B$14:B69=B69)*(D$14:D69=D69))>1,0,1)","v":1},"Contratos de prestación de servicios profesionales y de apoyo a la gestión","Contratación directa",{"$f":"IF(ISBLANK(G69),1,IFERROR(VLOOKUP(G69,Tipo!$C$12:$C$27,1,FALSE),\"NO\"))","v":"Prestación de servicios profesionales y de apoyo a la gestión, o para la ejecución de trabajos artísticos que sólo puedan encomendarse a determinadas personas naturales;"},"Inversión",{"$f":"IF(ISBLANK(K69),1,IFERROR(VLOOKUP(K69,Eje_Pilar_Prop!$C$3:$C$104,1,FALSE),\"NO\"))","v":19},"SECOP II",1,"Bogotá Mejor para Todos"]
["FDLCH-CPS-057-2020",2020,"SECOP II","CPS-057-2020","Contratos de prestación de servicios profesionales y de apoyo a la gestión","Contratación directa","Prestación de servicios profesionales y de apoyo a la gestión, o para la ejecución de trabajos artísticos que sólo puedan encomendarse a determinadas personas naturales;","PRESTACIÓN DE LOS SERVICIOS PROFESIONALES PARA APOYAR LA FORMULACIÓN, GESTIÓN Y SEGUIMIENTO DE ACTIVIDADES ENFOCADAS A LA GESTIÓN AMBIENTAL EXTERNA, ENCAMINADAS A LA MITIGACIÓN DE LOS DIFERENTES IMPACTOS AMBIENTALES Y LA CONSERVACIÓN DE LOS RECURSOS NATURALES DE LA LOCALIDAD DE CHAPINERO","Inversión","Bogotá Mejor para Todos",41,{"$f":"IF(ISERROR(VLOOKUP(K70,Eje_Pilar_Prop!$C$2:$E$104,2,FALSE)),\" \",VLOOKUP(K70,Eje_Pilar_Prop!$C$2:$E$104,2,FALSE))","v":"Desarrollo rural sostenible"},{"$f":"IF(ISERROR(VLOOKUP(K70,Eje_Pilar_Prop!$C$2:$E$104,3,FALSE)),\" \",VLOOKUP(K70,Eje_Pilar_Prop!$C$2:$E$104,3,FALSE))","v":"Eje Transversal 3 Sostenibilidad Ambiental basada en la eficiencia energética"},1303,1030542408,"JOHN ELKIN FEO DUITAMA",19845000,0,0,1,9922500,29767500,29767500,"2020-02-07","2020-02-11",{"$f":"+Y70+60+1","v":"2020-04-12"},120,1,60,null,null,null,null,null,null,"X",null,1,null,null,{"$f":"IF(SUMPRODUCT((A$14:A70=A70)*(B$14:B70=B70)*(D$14:D70=D70))>1,0,1)","v":1},"Contratos de prestación de servicios profesionales y de apoyo a la gestión","Contratación directa",{"$f":"IF(ISBLANK(G70),1,IFERROR(VLOOKUP(G70,Tipo!$C$12:$C$27,1,FALSE),\"NO\"))","v":"Prestación de servicios profesionales y de apoyo a la gestión, o para la ejecución de trabajos artísticos que sólo puedan encomendarse a determinadas personas naturales;"},"Inversión",{"$f":"IF(ISBLANK(K70),1,IFERROR(VLOOKUP(K70,Eje_Pilar_Prop!$C$3:$C$104,1,FALSE),\"NO\"))","v":41},"SECOP II",1,"Bogotá Mejor para Todos"]
["FDLCH-CPS-058-2020",2020,"SECOP II","CPS-058-2020","Contratos de prestación de servicios profesionales y de apoyo a la gestión","Contratación directa","Prestación de servicios profesionales y de apoyo a la gestión, o para la ejecución de trabajos artísticos que sólo puedan encomendarse a determinadas personas naturales;","PRESTACIÓN DE SERVICIOS TÉCNICOS PARA APOYAR AL ÁREA DE GESTIÓN DEL DESARROLLO LOCAL DE LA ALCALDÍA LOCAL DE CHAPINERO EN LA GESTIÓN DEL PROYECTO 1298 CULTURA Y DEPORTE: TRANSFORMANDO VIDAS Y HACIENDO CIUDADANOS FELICES","Inversión","Bogotá Mejor para Todos",11,{"$f":"IF(ISERROR(VLOOKUP(K71,Eje_Pilar_Prop!$C$2:$E$104,2,FALSE)),\" \",VLOOKUP(K71,Eje_Pilar_Prop!$C$2:$E$104,2,FALSE))","v":"Mejores oportunidades para el desarrollo a través de la cultura, la recreación y el deporte"},{"$f":"IF(ISERROR(VLOOKUP(K71,Eje_Pilar_Prop!$C$2:$E$104,3,FALSE)),\" \",VLOOKUP(K71,Eje_Pilar_Prop!$C$2:$E$104,3,FALSE))","v":"Pilar 1 Igualdad de Calidad de Vida"},1298,53108007,"TAMIA PALOMA RIBADENEIRA MIÑO",14000000,0,0,0,0,14000000,14000000,"2020-02-12","2020-02-13",{"$f":"+Y71","v":"2020-02-13"},120,0,0,null,null,null,null,null,null,"X",null,1,null,null,{"$f":"IF(SUMPRODUCT((A$14:A71=A71)*(B$14:B71=B71)*(D$14:D71=D71))>1,0,1)","v":1},"Contratos de prestación de servicios profesionales y de apoyo a la gestión","Contratación directa",{"$f":"IF(ISBLANK(G71),1,IFERROR(VLOOKUP(G71,Tipo!$C$12:$C$27,1,FALSE),\"NO\"))","v":"Prestación de servicios profesionales y de apoyo a la gestión, o para la ejecución de trabajos artísticos que sólo puedan encomendarse a determinadas personas naturales;"},"Inversión",{"$f":"IF(ISBLANK(K71),1,IFERROR(VLOOKUP(K71,Eje_Pilar_Prop!$C$3:$C$104,1,FALSE),\"NO\"))","v":11},"SECOP II",1,"Bogotá Mejor para Todos"]
["FDLCH-CPS-059-2020",2020,"SECOP II","CPS-059-2020","Contratos de prestación de servicios profesionales y de apoyo a la gestión","Contratación directa","Prestación de servicios profesionales y de apoyo a la gestión, o para la ejecución de trabajos artísticos que sólo puedan encomendarse a determinadas personas naturales;","PRESTACIÓN DE SERVICIOS PROFESIONALES PARA APOYAR JURÍDICAMENTE LA EJECUCIÓN DE LAS ACCIONES REQUERIDAS PARA EL TRÁMITE E IMPULSO PROCESAL DE LAS ACTUACIONES CONTRAVENCIONES Y/O QUERELLAS QUE CURSEN EN LAS INSPECCIONES DE POLICÍA DE LA LOCALIDAD DE CHAPINERO","Inversión","Bogotá Mejor para Todos",45,{"$f":"IF(ISERROR(VLOOKUP(K72,Eje_Pilar_Prop!$C$2:$E$104,2,FALSE)),\" \",VLOOKUP(K72,Eje_Pilar_Prop!$C$2:$E$104,2,FALSE))","v":"Gobernanza e influencia local, regional e internacional"},{"$f":"IF(ISERROR(VLOOKUP(K72,Eje_Pilar_Prop!$C$2:$E$104,3,FALSE)),\" \",VLOOKUP(K72,Eje_Pilar_Prop!$C$2:$E$104,3,FALSE))","v":"Eje Transversal 4 Gobierno Legitimo, Fortalecimiento Local y Eficiencia"},1304,78075269,"ALVARO ENRIQUE CORRALES HERRERA",19845000,0,0,1,4961250,24806250,24792469,"2020-02-19","2020-02-21",{"$f":"+Y72+30","v":"2020-03-22"},119,1,30,78075269,"ALVARO ENRIQUE CORRALES HERRERA","2020-02-20",19679625,null,null,"X",null,0.99944445452254971,null,null,{"$f":"IF(SUMPRODUCT((A$14:A72=A72)*(B$14:B72=B72)*(D$14:D72=D72))>1,0,1)","v":1},"Contratos de prestación de servicios profesionales y de apoyo a la gestión","Contratación directa",{"$f":"IF(ISBLANK(G72),1,IFERROR(VLOOKUP(G72,Tipo!$C$12:$C$27,1,FALSE),\"NO\"))","v":"Prestación de servicios profesionales y de apoyo a la gestión, o para la ejecución de trabajos artísticos que sólo puedan encomendarse a determinadas personas naturales;"},"Inversión",{"$f":"IF(ISBLANK(K72),1,IFERROR(VLOOKUP(K72,Eje_Pilar_Prop!$C$3:$C$104,1,FALSE),\"NO\"))","v":45},"SECOP II",1,"Bogotá Mejor para Todos"]
["FDLCH-CPS-060-2020",2020,"SECOP II","CPS-060-2020","Contratos de prestación de servicios profesionales y de apoyo a la gestión","Contratación directa","Prestación de servicios profesionales y de apoyo a la gestión, o para la ejecución de trabajos artísticos que sólo puedan encomendarse a determinadas personas naturales;","PRESTACIÓN DE SERVICIOS PROFESIONALES PARA APOYAR LA GESTIÓN JURÍDICA DEL DESPACHO DE LA ALCALDÍA LOCAL DE CHAPINERO Y LA DE LAS DEPENDENCIAS QUE LA CONFORMAN EN CUMPLIMIENTO DE LAS FUNCIONES ESTABLECIDAS POR MANDATO CONSTITUCIONAL Y LEGAL","Inversión","Bogotá Mejor para Todos",45,{"$f":"IF(ISERROR(VLOOKUP(K73,Eje_Pilar_Prop!$C$2:$E$104,2,FALSE)),\" \",VLOOKUP(K73,Eje_Pilar_Prop!$C$2:$E$104,2,FALSE))","v":"Gobernanza e influencia local, regional e internacional"},{"$f":"IF(ISERROR(VLOOKUP(K73,Eje_Pilar_Prop!$C$2:$E$104,3,FALSE)),\" \",VLOOKUP(K73,Eje_Pilar_Prop!$C$2:$E$104,3,FALSE))","v":"Eje Transversal 4 Gobierno Legitimo, Fortalecimiento Local y Eficiencia"},1304,77193263,"RAFAEL EDUARDO VARGAS CASTRO",36000000,0,0,1,9000000,45000000,45000000,"2020-02-06","2020-02-07",{"$f":"+Y73+30","v":"2020-03-08"},120,1,30,null,null,null,null,null,null,"X",null,1,null,null,{"$f":"IF(SUMPRODUCT((A$14:A73=A73)*(B$14:B73=B73)*(D$14:D73=D73))>1,0,1)","v":1},"Contratos de prestación de servicios profesionales y de apoyo a la gestión","Contratación directa",{"$f":"IF(ISBLANK(G73),1,IFERROR(VLOOKUP(G73,Tipo!$C$12:$C$27,1,FALSE),\"NO\"))","v":"Prestación de servicios profesionales y de apoyo a la gestión, o para la ejecución de trabajos artísticos que sólo puedan encomendarse a determinadas personas naturales;"},"Inversión",{"$f":"IF(ISBLANK(K73),1,IFERROR(VLOOKUP(K73,Eje_Pilar_Prop!$C$3:$C$104,1,FALSE),\"NO\"))","v":45},"SECOP II",1,"Bogotá Mejor para Todos"]
["FDLCH-CPS-061-2020",2020,"SECOP II","CPS-061-2020","Contratos de prestación de servicios profesionales y de apoyo a la gestión","Contratación directa","Prestación de servicios profesionales y de apoyo a la gestión, o para la ejecución de trabajos artísticos que sólo puedan encomendarse a determinadas personas naturales;","PRESTACIÓN DE SERVICIOS PROFESIONALES PARA APOYAR JURÍDICAMENTE LA EJECUCIÓN DE LAS ACCIONES REQUERIDAS PARA EL TRÁMITE E IMPULSO PROCESAL DE LAS ACTUACIONES CONTRAVENCIONES Y/O QUERELLAS QUE CURSEN EN LAS INSPECCIONES DE POLICÍA DE LA LOCALIDAD DE CHAPINERO","Inversión","Bogotá Mejor para Todos",45,{"$f":"IF(ISERROR(VLOOKUP(K74,Eje_Pilar_Prop!$C$2:$E$104,2,FALSE)),\" \",VLOOKUP(K74,Eje_Pilar_Prop!$C$2:$E$104,2,FALSE))","v":"Gobernanza e influencia local, regional e internacional"},{"$f":"IF(ISERROR(VLOOKUP(K74,Eje_Pilar_Prop!$C$2:$E$104,3,FALSE)),\" \",VLOOKUP(K74,Eje_Pilar_Prop!$C$2:$E$104,3,FALSE))","v":"Eje Transversal 4 Gobierno Legitimo, Fortalecimiento Local y Eficiencia"},1304,38254256,"MARTHA LUCIA  SUAREZ OSORIO",19845000,0,0,1,4961250,24806250,24806250,"2020-02-10","2020-02-11",{"$f":"+Y74+30","v":"2020-03-12"},120,1,30,null,null,null,null,null,null,"X",null,1,null,null,{"$f":"IF(SUMPRODUCT((A$14:A74=A74)*(B$14:B74=B74)*(D$14:D74=D74))>1,0,1)","v":1},"Contratos de prestación de servicios profesionales y de apoyo a la gestión","Contratación directa",{"$f":"IF(ISBLANK(G74),1,IFERROR(VLOOKUP(G74,Tipo!$C$12:$C$27,1,FALSE),\"NO\"))","v":"Prestación de servicios profesionales y de apoyo a la gestión, o para la ejecución de trabajos artísticos que sólo puedan encomendarse a determinadas personas naturales;"},"Inversión",{"$f":"IF(ISBLANK(K74),1,IFERROR(VLOOKUP(K74,Eje_Pilar_Prop!$C$3:$C$104,1,FALSE),\"NO\"))","v":45},"SECOP II",1,"Bogotá Mejor para Todos"]
["FDLCH-CPS-062-2020",2020,"SECOP II","CPS-062-2020","Contratos de prestación de servicios profesionales y de apoyo a la gestión","Contratación directa","Prestación de servicios profesionales y de apoyo a la gestión, o para la ejecución de trabajos artísticos que sólo puedan encomendarse a determinadas personas naturales;","APOYAR LA FORMULACIÓN, EJECUCIÓN, SEGUIMIENTO Y MEJORA CONTINUA DE LAS HERRAMIENTAS QUE CONFORMAN LA GESTIÓN AMBIENTAL INSTITUCIONAL DE LA ALCALDÍA LOCAL DE CHAPINERO.","Inversión","Bogotá Mejor para Todos",45,{"$f":"IF(ISERROR(VLOOKUP(K75,Eje_Pilar_Prop!$C$2:$E$104,2,FALSE)),\" \",VLOOKUP(K75,Eje_Pilar_Prop!$C$2:$E$104,2,FALSE))","v":"Gobernanza e influencia local, regional e internacional"},{"$f":"IF(ISERROR(VLOOKUP(K75,Eje_Pilar_Prop!$C$2:$E$104,3,FALSE)),\" \",VLOOKUP(K75,Eje_Pilar_Prop!$C$2:$E$104,3,FALSE))","v":"Eje Transversal 4 Gobierno Legitimo, Fortalecimiento Local y Eficiencia"},1304,1019031184,"RAYMON ALEXANDER JIMÉNEZ ARTEAGA",19320000,0,0,1,4830000,24150000,24150000,"2020-02-19","2020-02-20",{"$f":"+Y75+30","v":"2020-03-21"},120,1,30,null,null,null,null,null,null,"X",null,1,null,null,{"$f":"IF(SUMPRODUCT((A$14:A75=A75)*(B$14:B75=B75)*(D$14:D75=D75))>1,0,1)","v":1},"Contratos de prestación de servicios profesionales y de apoyo a la gestión","Contratación directa",{"$f":"IF(ISBLANK(G75),1,IFERROR(VLOOKUP(G75,Tipo!$C$12:$C$27,1,FALSE),\"NO\"))","v":"Prestación de servicios profesionales y de apoyo a la gestión, o para la ejecución de trabajos artísticos que sólo puedan encomendarse a determinadas personas naturales;"},"Inversión",{"$f":"IF(ISBLANK(K75),1,IFERROR(VLOOKUP(K75,Eje_Pilar_Prop!$C$3:$C$104,1,FALSE),\"NO\"))","v":45},"SECOP II",1,"Bogotá Mejor para Todos"]
["FDLCH-CPS-063-2020",2020,"SECOP II","CPS-063-2020","Contratos de prestación de servicios profesionales y de apoyo a la gestión","Contratación directa","Prestación de servicios profesionales y de apoyo a la gestión, o para la ejecución de trabajos artísticos que sólo puedan encomendarse a determinadas personas naturales;","PRESTACIÓN DE SERVICIOS PERSONALES NECESARIOS PARA EL APOYO AL ÁREA DE GESTIÓN DEL DESARROLLO LOCAL DE LA ALCALDÍA LOCAL DE CHAPINERO EN LAS ACTIVIDADES DE RADICACIÓN Y CORRESPONDENCIA","Inversión","Bogotá Mejor para Todos",45,{"$f":"IF(ISERROR(VLOOKUP(K76,Eje_Pilar_Prop!$C$2:$E$104,2,FALSE)),\" \",VLOOKUP(K76,Eje_Pilar_Prop!$C$2:$E$104,2,FALSE))","v":"Gobernanza e influencia local, regional e internacional"},{"$f":"IF(ISERROR(VLOOKUP(K76,Eje_Pilar_Prop!$C$2:$E$104,3,FALSE)),\" \",VLOOKUP(K76,Eje_Pilar_Prop!$C$2:$E$104,3,FALSE))","v":"Eje Transversal 4 Gobierno Legitimo, Fortalecimiento Local y Eficiencia"},1304,1031147236,"DEISY YINETH FRANCO PENAGOS",9349200,0,0,1,4674600,14023800,14023800,"2020-02-07","2020-02-11",{"$f":"+Y76+60+1","v":"2020-04-12"},120,1,60,null,null,null,null,null,null,"X",null,1,null,null,{"$f":"IF(SUMPRODUCT((A$14:A76=A76)*(B$14:B76=B76)*(D$14:D76=D76))>1,0,1)","v":1},"Contratos de prestación de servicios profesionales y de apoyo a la gestión","Contratación directa",{"$f":"IF(ISBLANK(G76),1,IFERROR(VLOOKUP(G76,Tipo!$C$12:$C$27,1,FALSE),\"NO\"))","v":"Prestación de servicios profesionales y de apoyo a la gestión, o para la ejecución de trabajos artísticos que sólo puedan encomendarse a determinadas personas naturales;"},"Inversión",{"$f":"IF(ISBLANK(K76),1,IFERROR(VLOOKUP(K76,Eje_Pilar_Prop!$C$3:$C$104,1,FALSE),\"NO\"))","v":45},"SECOP II",1,"Bogotá Mejor para Todos"]
["FDLCH-CPS-065-2020",2020,"SECOP II","CPS-065-2020","Contratos de prestación de servicios profesionales y de apoyo a la gestión","Contratación directa","Prestación de servicios profesionales y de apoyo a la gestión, o para la ejecución de trabajos artísticos que sólo puedan encomendarse a determinadas personas naturales;","PRESTACIÓN DESERVICIOS DE APOYO ALÀREA DE GESTIÓN DEL DESARROLLO LOCAL DE LA ALCALDÇIA LOCAL DE CHAPINERO EN LAGESTIÓN DEL PROYECTO 1305,EN CHAPINERO PARTICIPAMOS TODOS","Inversión","Bogotá Mejor para Todos",45,{"$f":"IF(ISERROR(VLOOKUP(K77,Eje_Pilar_Prop!$C$2:$E$104,2,FALSE)),\" \",VLOOKUP(K77,Eje_Pilar_Prop!$C$2:$E$104,2,FALSE))","v":"Gobernanza e influencia local, regional e internacional"},{"$f":"IF(ISERROR(VLOOKUP(K77,Eje_Pilar_Prop!$C$2:$E$104,3,FALSE)),\" \",VLOOKUP(K77,Eje_Pilar_Prop!$C$2:$E$104,3,FALSE))","v":"Eje Transversal 4 Gobierno Legitimo, Fortalecimiento Local y Eficiencia"},1305,52311510,"MILENA YINETH VELASQUEZ MOYA",8720000,0,0,0,0,8720000,8720000,"2020-02-12","2020-02-13",{"$f":"+Y77","v":"2020-02-13"},120,0,0,null,null,null,null,null,null,"X",null,1,null,null,{"$f":"IF(SUMPRODUCT((A$14:A77=A77)*(B$14:B77=B77)*(D$14:D77=D77))>1,0,1)","v":1},"Contratos de prestación de servicios profesionales y de apoyo a la gestión","Contratación directa",{"$f":"IF(ISBLANK(G77),1,IFERROR(VLOOKUP(G77,Tipo!$C$12:$C$27,1,FALSE),\"NO\"))","v":"Prestación de servicios profesionales y de apoyo a la gestión, o para la ejecución de trabajos artísticos que sólo puedan encomendarse a determinadas personas naturales;"},"Inversión",{"$f":"IF(ISBLANK(K77),1,IFERROR(VLOOKUP(K77,Eje_Pilar_Prop!$C$3:$C$104,1,FALSE),\"NO\"))","v":45},"SECOP II",1,"Bogotá Mejor para Todos"]
["FDLCH-CPS-066-2020",2020,"SECOP II","CPS-066-2020","Contratos de prestación de servicios profesionales y de apoyo a la gestión","Contratación directa","Prestación de servicios profesionales y de apoyo a la gestión, o para la ejecución de trabajos artísticos que sólo puedan encomendarse a determinadas personas naturales;","PRESTACIÓN DE SERVICIOS PROFESIONALES EN DERECHO PARA APOYAR JURÍDICAMENTE LA EJECUCIÓN DE LAS ACCIONES REQUERIDAS PARA LA DEPURACIÓN DE LAS ACTUACIONES ADMINISTRATIVAS QUE CURSAN EN LA ALCALDÍA LOCAL","Inversión","Bogotá Mejor para Todos",45,{"$f":"IF(ISERROR(VLOOKUP(K78,Eje_Pilar_Prop!$C$2:$E$104,2,FALSE)),\" \",VLOOKUP(K78,Eje_Pilar_Prop!$C$2:$E$104,2,FALSE))","v":"Gobernanza e influencia local, regional e internacional"},{"$f":"IF(ISERROR(VLOOKUP(K78,Eje_Pilar_Prop!$C$2:$E$104,3,FALSE)),\" \",VLOOKUP(K78,Eje_Pilar_Prop!$C$2:$E$104,3,FALSE))","v":"Eje Transversal 4 Gobierno Legitimo, Fortalecimiento Local y Eficiencia"},1304,1022369618,"JUAN SEBASTIAN GACHARNA BELLO",19845000,0,0,1,4961250,24806250,24806250,"2020-02-10","2020-02-13",{"$f":"+Y78+30","v":"2020-03-14"},120,1,30,null,null,null,null,null,null,"X",null,{"$f":"IF(ISERROR(W78/V78),\"-\",(W78/V78))","v":1},null,null,{"$f":"IF(SUMPRODUCT((A$14:A78=A78)*(B$14:B78=B78)*(D$14:D78=D78))>1,0,1)","v":1},"Contratos de prestación de servicios profesionales y de apoyo a la gestión","Contratación directa",{"$f":"IF(ISBLANK(G78),1,IFERROR(VLOOKUP(G78,Tipo!$C$12:$C$27,1,FALSE),\"NO\"))","v":"Prestación de servicios profesionales y de apoyo a la gestión, o para la ejecución de trabajos artísticos que sólo puedan encomendarse a determinadas personas naturales;"},"Inversión",{"$f":"IF(ISBLANK(K78),1,IFERROR(VLOOKUP(K78,Eje_Pilar_Prop!$C$3:$C$104,1,FALSE),\"NO\"))","v":45},"SECOP II",1,"Bogotá Mejor para Todos"]
["FDLCH-CPS-067-2020",2020,"SECOP II","CPS-067-2020","Contratos de prestación de servicios profesionales y de apoyo a la gestión","Contratación directa","Prestación de servicios profesionales y de apoyo a la gestión, o para la ejecución de trabajos artísticos que sólo puedan encomendarse a determinadas personas naturales;","PRESTACIÓN DE SERVICIOS PROFESIONALES EN DERECHO PARA APOYAR JURÍDICAMENTE LA EJECUCIÓN DE LAS ACCIONES REQUERIDAS PARA LA DEPURACIÓN DE LAS ACTUACIONES ADMINISTRATIVAS QUE CURSAN EN LA ALCALDÍA LOCAL","Inversión","Bogotá Mejor para Todos",45,{"$f":"IF(ISERROR(VLOOKUP(K79,Eje_Pilar_Prop!$C$2:$E$104,2,FALSE)),\" \",VLOOKUP(K79,Eje_Pilar_Prop!$C$2:$E$104,2,FALSE))","v":"Gobernanza e influencia local, regional e internacional"},{"$f":"IF(ISERROR(VLOOKUP(K79,Eje_Pilar_Prop!$C$2:$E$104,3,FALSE)),\" \",VLOOKUP(K79,Eje_Pilar_Prop!$C$2:$E$104,3,FALSE))","v":"Eje Transversal 4 Gobierno Legitimo, Fortalecimiento Local y Eficiencia"},1304,19271830,"MANUEL FALLA BUSTOS",19845000,0,0,1,4961250,24806250,24310125,"2020-02-17","2020-02-19",{"$f":"+Y79+30","v":"2020-03-20"},120,1,30,null,null,null,null,null,null,"X",null,0.98,null,null,{"$f":"IF(SUMPRODUCT((A$14:A79=A79)*(B$14:B79=B79)*(D$14:D79=D79))>1,0,1)","v":1},"Contratos de prestación de servicios profesionales y de apoyo a la gestión","Contratación directa",{"$f":"IF(ISBLANK(G79),1,IFERROR(VLOOKUP(G79,Tipo!$C$12:$C$27,1,FALSE),\"NO\"))","v":"Prestación de servicios profesionales y de apoyo a la gestión, o para la ejecución de trabajos artísticos que sólo puedan encomendarse a determinadas personas naturales;"},"Inversión",{"$f":"IF(ISBLANK(K79),1,IFERROR(VLOOKUP(K79,Eje_Pilar_Prop!$C$3:$C$104,1,FALSE),\"NO\"))","v":45},"SECOP II",1,"Bogotá Mejor para Todos"]
["FDLCH-CPS-068-2020",2020,"SECOP II","CPS-068-2020","Contratos de prestación de servicios profesionales y de apoyo a la gestión","Contratación directa","Prestación de servicios profesionales y de apoyo a la gestión, o para la ejecución de trabajos artísticos que sólo puedan encomendarse a determinadas personas naturales;","PRESTACIÓN DE SERVICIOS DE APOYO DE LOGÍSTICA QUE SE REQUIERAN EN EL DESARROLLO DE LAS ACTIVIDADES RELATIVAS A RECUPERACIÓN Y EMBELLECIMIENTO DEL ESPACIO PÚBLICO QUE TENGA A CARGO EL FONDO LOCAL DE DESARROLLO DE CHAPINERO","Inversión","Bogotá Mejor para Todos",18,{"$f":"IF(ISERROR(VLOOKUP(K80,Eje_Pilar_Prop!$C$2:$E$104,2,FALSE)),\" \",VLOOKUP(K80,Eje_Pilar_Prop!$C$2:$E$104,2,FALSE))","v":"Mejor movilidad para todos"},{"$f":"IF(ISERROR(VLOOKUP(K80,Eje_Pilar_Prop!$C$2:$E$104,3,FALSE)),\" \",VLOOKUP(K80,Eje_Pilar_Prop!$C$2:$E$104,3,FALSE))","v":"Pilar 2 Democracía Urbana"},1301,80412953,"JUAN MANUEL CASTIBLANCO VARGAS",8224000,0,0,1,2056000,{"$f":"+Q80+S80+U80","v":10280000},10280000,"2020-02-10","2020-02-11",{"$f":"+Y80+30","v":"2020-03-12"},120,1,30,null,null,null,null,null,null,"X",null,1,null,null,{"$f":"IF(SUMPRODUCT((A$14:A80=A80)*(B$14:B80=B80)*(D$14:D80=D80))>1,0,1)","v":1},"Contratos de prestación de servicios profesionales y de apoyo a la gestión",{"$f":"IF(ISBLANK(F80),1,IFERROR(VLOOKUP(F80,modal,1,FALSE),\"NO\"))","v":"Contratación directa"},{"$f":"IF(ISBLANK(G80),1,IFERROR(VLOOKUP(G80,Tipo!$C$12:$C$27,1,FALSE),\"NO\"))","v":"Prestación de servicios profesionales y de apoyo a la gestión, o para la ejecución de trabajos artísticos que sólo puedan encomendarse a determinadas personas naturales;"},{"$f":"IF(ISBLANK(I80),1,IFERROR(VLOOKUP(I80,afectacion,1,FALSE),\"NO\"))","v":"Inversión"},{"$f":"IF(ISBLANK(K80),1,IFERROR(VLOOKUP(K80,Eje_Pilar_Prop!$C$3:$C$104,1,FALSE),\"NO\"))","v":18},{"$f":"IF(ISBLANK(C80),1,IFERROR(VLOOKUP(C80,SECOP,1,FALSE),\"NO\"))","v":"SECOP II"},1,{"$f":"IF(ISBLANK(J80),1,IFERROR(VLOOKUP(J80,pdd,1,FALSE),\"NO\"))","v":"Bogotá Mejor para Todos"}]
["FDLCH-CPS-069-2020",2020,"SECOP II","CPS-069-2020","Contratos de prestación de servicios profesionales y de apoyo a la gestión","Contratación directa","Prestación de servicios profesionales y de apoyo a la gestión, o para la ejecución de trabajos artísticos que sólo puedan encomendarse a determinadas personas naturales;","PRESTACIÓN DE SERVICIOS DE APOYO DE LOGÍSTICO QUE SE REQUIERAN EN EL DESARROLLO DE LAS ACTIVIDADES RELATIVAS A RECUPERACIÓN Y EMBELLECIMIENTO DEL ESPACIO PÚBLICO QUE TENGA A CARGO EL FONDO LOCAL DE DESARROLLO DE CHAPINERO.","Inversión","Bogotá Mejor para Todos",18,{"$f":"IF(ISERROR(VLOOKUP(K81,Eje_Pilar_Prop!$C$2:$E$104,2,FALSE)),\" \",VLOOKUP(K81,Eje_Pilar_Prop!$C$2:$E$104,2,FALSE))","v":"Mejor movilidad para todos"},{"$f":"IF(ISERROR(VLOOKUP(K81,Eje_Pilar_Prop!$C$2:$E$104,3,FALSE)),\" \",VLOOKUP(K81,Eje_Pilar_Prop!$C$2:$E$104,3,FALSE))","v":"Pilar 2 Democracía Urbana"},1301,80410411,"CARLOS JULIO MARTINEZ RIPE",8224000,0,0,0,0,8224000,8224000,"2020-02-10","2020-02-11",{"$f":"+Y81","v":"2020-02-11"},120,0,0,null,null,null,null,null,null,"X",null,1,null,null,{"$f":"IF(SUMPRODUCT((A$14:A81=A81)*(B$14:B81=B81)*(D$14:D81=D81))>1,0,1)","v":1},"Contratos de prestación de servicios profesionales y de apoyo a la gestión","Contratación directa",{"$f":"IF(ISBLANK(G81),1,IFERROR(VLOOKUP(G81,Tipo!$C$12:$C$27,1,FALSE),\"NO\"))","v":"Prestación de servicios profesionales y de apoyo a la gestión, o para la ejecución de trabajos artísticos que sólo puedan encomendarse a determinadas personas naturales;"},"Inversión",{"$f":"IF(ISBLANK(K81),1,IFERROR(VLOOKUP(K81,Eje_Pilar_Prop!$C$3:$C$104,1,FALSE),\"NO\"))","v":18},"SECOP II",1,"Bogotá Mejor para Todos"]
["FDLCH-CPS-070-2020",2020,"SECOP II","CPS-070-2020","Contratos de prestación de servicios profesionales y de apoyo a la gestión","Contratación directa","Prestación de servicios profesionales y de apoyo a la gestión, o para la ejecución de trabajos artísticos que sólo puedan encomendarse a determinadas personas naturales;"," PRESTACIÓN DE SERVICIOS PROFESIONALES PARA EL APOYO AL ÁREA DE GESTIÓN DEL DESARROLLO LOCAL DE LA ALCALDÍA LOCAL DE CHAPINERO EN LA FORMULACIÓN, GESTIÓN, EJECUCIÓN Y SEGUIMIENTO DEL PROYECTO 1301 'MEJORAR LA CALIDAD DE LA MOVILIDAD' Y LA SUPERVISIÓN DE CONTRATOS QUE LE SEAN ASIGNADOS.","Inversión","Bogotá Mejor para Todos",18,{"$f":"IF(ISERROR(VLOOKUP(K82,Eje_Pilar_Prop!$C$2:$E$104,2,FALSE)),\" \",VLOOKUP(K82,Eje_Pilar_Prop!$C$2:$E$104,2,FALSE))","v":"Mejor movilidad para todos"},{"$f":"IF(ISERROR(VLOOKUP(K82,Eje_Pilar_Prop!$C$2:$E$104,3,FALSE)),\" \",VLOOKUP(K82,Eje_Pilar_Prop!$C$2:$E$104,3,FALSE))","v":"Pilar 2 Democracía Urbana"},1301,79053874,"LUIS FERNANDO ALARCON PEÑA",28400000,0,0,0,0,28400000,28400000,"2020-02-10","2020-02-11",{"$f":"+Y82","v":"2020-02-11"},120,0,0,null,null,null,null,null,null,"X",null,1,null,null,{"$f":"IF(SUMPRODUCT((A$14:A82=A82)*(B$14:B82=B82)*(D$14:D82=D82))>1,0,1)","v":1},"Contratos de prestación de servicios profesionales y de apoyo a la gestión","Contratación directa",{"$f":"IF(ISBLANK(G82),1,IFERROR(VLOOKUP(G82,Tipo!$C$12:$C$27,1,FALSE),\"NO\"))","v":"Prestación de servicios profesionales y de apoyo a la gestión, o para la ejecución de trabajos artísticos que sólo puedan encomendarse a determinadas personas naturales;"},"Inversión",{"$f":"IF(ISBLANK(K82),1,IFERROR(VLOOKUP(K82,Eje_Pilar_Prop!$C$3:$C$104,1,FALSE),\"NO\"))","v":18},"SECOP II",1,"Bogotá Mejor para Todos"]
["FDLCH-CPS-071-2020",2020,"SECOP II","CPS-071-2020","Contratos de prestación de servicios profesionales y de apoyo a la gestión","Contratación directa","Prestación de servicios profesionales y de apoyo a la gestión, o para la ejecución de trabajos artísticos que sólo puedan encomendarse a determinadas personas naturales;","PRESTACIÓN DE SERVICIOS PROFESIONALES PARA APOYAR TÉCNICAMENTE LAS DISTINTAS ETAPAS DE LOS PROCESOS DE COMPETENCIA DE LA ALCALDÍA LOCAL DE CHAPINERO, PARA LA DEPURACIÓN DE ACTUACIONES ADMINISTRATIVAS","Inversión","Bogotá Mejor para Todos",45,{"$f":"IF(ISERROR(VLOOKUP(K83,Eje_Pilar_Prop!$C$2:$E$104,2,FALSE)),\" \",VLOOKUP(K83,Eje_Pilar_Prop!$C$2:$E$104,2,FALSE))","v":"Gobernanza e influencia local, regional e internacional"},{"$f":"IF(ISERROR(VLOOKUP(K83,Eje_Pilar_Prop!$C$2:$E$104,3,FALSE)),\" \",VLOOKUP(K83,Eje_Pilar_Prop!$C$2:$E$104,3,FALSE))","v":"Eje Transversal 4 Gobierno Legitimo, Fortalecimiento Local y Eficiencia"},1304,80799927,"SALOMON RODRÍGUEZ LAGUNA",19845000,0,0,1,4961250,24806250,24806250,"2020-02-18","2020-02-19","2020-07-16",120,1,30,null,null,null,null,null,null,"X",null,1,null,null,{"$f":"IF(SUMPRODUCT((A$14:A83=A83)*(B$14:B83=B83)*(D$14:D83=D83))>1,0,1)","v":1},"Contratos de prestación de servicios profesionales y de apoyo a la gestión","Contratación directa",{"$f":"IF(ISBLANK(G83),1,IFERROR(VLOOKUP(G83,Tipo!$C$12:$C$27,1,FALSE),\"NO\"))","v":"Prestación de servicios profesionales y de apoyo a la gestión, o para la ejecución de trabajos artísticos que sólo puedan encomendarse a determinadas personas naturales;"},"Inversión",{"$f":"IF(ISBLANK(K83),1,IFERROR(VLOOKUP(K83,Eje_Pilar_Prop!$C$3:$C$104,1,FALSE),\"NO\"))","v":45},"SECOP II",1,"Bogotá Mejor para Todos"]
["FDLCH-CPS-072-2020",2020,"SECOP II","CPS-072-2020","Contratos de prestación de servicios profesionales y de apoyo a la gestión","Contratación directa","Prestación de servicios profesionales y de apoyo a la gestión, o para la ejecución de trabajos artísticos que sólo puedan encomendarse a determinadas personas naturales;","PRESTACIÓN DE SERVICIOS PROFESIONALES PARA APOYAR TÉCNICAMENTE LAS DISTINTAS ETAPAS DE LOS PROCESOS DE COMPETENCIA DE LA ALCALDÍA LOCAL DE CHAPINERO, PARA LA DEPURACIÓN DE ACTUACIONES ADMINISTRATIVAS","Inversión","Bogotá Mejor para Todos",45,{"$f":"IF(ISERROR(VLOOKUP(K84,Eje_Pilar_Prop!$C$2:$E$104,2,FALSE)),\" \",VLOOKUP(K84,Eje_Pilar_Prop!$C$2:$E$104,2,FALSE))","v":"Gobernanza e influencia local, regional e internacional"},{"$f":"IF(ISERROR(VLOOKUP(K84,Eje_Pilar_Prop!$C$2:$E$104,3,FALSE)),\" \",VLOOKUP(K84,Eje_Pilar_Prop!$C$2:$E$104,3,FALSE))","v":"Eje Transversal 4 Gobierno Legitimo, Fortalecimiento Local y Eficiencia"},1304,79531247,"RICARDO ALBERTO CORNEJO GONZALEZ",19845000,0,0,1,4961250,24806250,24806250,"2020-02-01","2020-02-13",{"$f":"+Y84+30","v":"2020-03-14"},120,1,30,null,null,null,null,null,null,"X",null,1,null,null,{"$f":"IF(SUMPRODUCT((A$14:A84=A84)*(B$14:B84=B84)*(D$14:D84=D84))>1,0,1)","v":1},"Contratos de prestación de servicios profesionales y de apoyo a la gestión","Contratación directa",{"$f":"IF(ISBLANK(G84),1,IFERROR(VLOOKUP(G84,Tipo!$C$12:$C$27,1,FALSE),\"NO\"))","v":"Prestación de servicios profesionales y de apoyo a la gestión, o para la ejecución de trabajos artísticos que sólo puedan encomendarse a determinadas personas naturales;"},"Inversión",{"$f":"IF(ISBLANK(K84),1,IFERROR(VLOOKUP(K84,Eje_Pilar_Prop!$C$3:$C$104,1,FALSE),\"NO\"))","v":45},"SECOP II",1,"Bogotá Mejor para Todos"]
["FDLCH-CPS-073-2020",2020,"SECOP II","CPS-073-2020","Contratos de prestación de servicios profesionales y de apoyo a la gestión","Contratación directa","Prestación de servicios profesionales y de apoyo a la gestión, o para la ejecución de trabajos artísticos que sólo puedan encomendarse a determinadas personas naturales;","PRESTACIÓN DE SERVICIOS PROFESIONALES PARA APOYAR AL EQUIPO DE PRENSA Y CONUNICACIONES DE LA ALCALDIA LOCAL EN LA REALIZACION DE PRODUCTOS Y PIEZAS DIGITALES , IMPRESAS Y PUBLICITARIAS DE GRAN FORMATO Y DE ANIMACIÓN GRAFICA , ASI COMO APOYAR LA PRODUCCIÓN Y MONTAJE DE EVENTOS","Inversión","Bogotá Mejor para Todos",45,{"$f":"IF(ISERROR(VLOOKUP(K85,Eje_Pilar_Prop!$C$2:$E$104,2,FALSE)),\" \",VLOOKUP(K85,Eje_Pilar_Prop!$C$2:$E$104,2,FALSE))","v":"Gobernanza e influencia local, regional e internacional"},{"$f":"IF(ISERROR(VLOOKUP(K85,Eje_Pilar_Prop!$C$2:$E$104,3,FALSE)),\" \",VLOOKUP(K85,Eje_Pilar_Prop!$C$2:$E$104,3,FALSE))","v":"Eje Transversal 4 Gobierno Legitimo, Fortalecimiento Local y Eficiencia"},1304,79718485,"HENRRY DAVID CAJICA RINCON",16800000,0,0,0,0,16800000,15540000,"2020-02-12","2020-02-13",{"$f":"+Y85+10","v":"2020-02-23"},120,0,0,53032679,"LILIANA MONTAÑEZ SALGADO","2020-02-20",15680000,null,null,"X",null,0.92500000000000004,null,null,{"$f":"IF(SUMPRODUCT((A$14:A85=A85)*(B$14:B85=B85)*(D$14:D85=D85))>1,0,1)","v":1},"Contratos de prestación de servicios profesionales y de apoyo a la gestión","Contratación directa",{"$f":"IF(ISBLANK(G85),1,IFERROR(VLOOKUP(G85,Tipo!$C$12:$C$27,1,FALSE),\"NO\"))","v":"Prestación de servicios profesionales y de apoyo a la gestión, o para la ejecución de trabajos artísticos que sólo puedan encomendarse a determinadas personas naturales;"},"Inversión",{"$f":"IF(ISBLANK(K85),1,IFERROR(VLOOKUP(K85,Eje_Pilar_Prop!$C$3:$C$104,1,FALSE),\"NO\"))","v":45},"SECOP II",1,"Bogotá Mejor para Todos"]
["FDLCH-CPS-074-2020",2020,"SECOP II","CPS-074-2020","Contratos de prestación de servicios profesionales y de apoyo a la gestión","Contratación directa","Prestación de servicios profesionales y de apoyo a la gestión, o para la ejecución de trabajos artísticos que sólo puedan encomendarse a determinadas personas naturales;","PRESTACIÓN DE SERVICIOS PERSONALES NECESARIOS PARA LAS LABORES DE ENTREGA Y RECIBO DE LAS COMUNICACIONES EMITIDAS O RECIBIDAS POR LAS INSPECCIONES DE POLICÍA DE LA LOCALIDAD Y DEPENDENCIAS DE LA ALCALDÍA.","Inversión","Bogotá Mejor para Todos",45,{"$f":"IF(ISERROR(VLOOKUP(K86,Eje_Pilar_Prop!$C$2:$E$104,2,FALSE)),\" \",VLOOKUP(K86,Eje_Pilar_Prop!$C$2:$E$104,2,FALSE))","v":"Gobernanza e influencia local, regional e internacional"},{"$f":"IF(ISERROR(VLOOKUP(K86,Eje_Pilar_Prop!$C$2:$E$104,3,FALSE)),\" \",VLOOKUP(K86,Eje_Pilar_Prop!$C$2:$E$104,3,FALSE))","v":"Eje Transversal 4 Gobierno Legitimo, Fortalecimiento Local y Eficiencia"},1304,1014213166,"SANTIAGO LEON NISPERUZA",9360000,0,0,0,0,9360000,8112000,"2020-02-14","2020-02-17",{"$f":"+Y86","v":"2020-02-17"},120,0,0,null,null,null,null,null,null,"X",null,0.8666666666666667,null,null,{"$f":"IF(SUMPRODUCT((A$14:A86=A86)*(B$14:B86=B86)*(D$14:D86=D86))>1,0,1)","v":1},"Contratos de prestación de servicios profesionales y de apoyo a la gestión","Contratación directa",{"$f":"IF(ISBLANK(G86),1,IFERROR(VLOOKUP(G86,Tipo!$C$12:$C$27,1,FALSE),\"NO\"))","v":"Prestación de servicios profesionales y de apoyo a la gestión, o para la ejecución de trabajos artísticos que sólo puedan encomendarse a determinadas personas naturales;"},"Inversión",{"$f":"IF(ISBLANK(K86),1,IFERROR(VLOOKUP(K86,Eje_Pilar_Prop!$C$3:$C$104,1,FALSE),\"NO\"))","v":45},"SECOP II",1,"Bogotá Mejor para Todos"]
["FDLCH-CPS-075-2020",2020,"SECOP II","CPS-075-2020","Contratos de prestación de servicios profesionales y de apoyo a la gestión","Contratación directa","Prestación de servicios profesionales y de apoyo a la gestión, o para la ejecución de trabajos artísticos que sólo puedan encomendarse a determinadas personas naturales;","PRESTACIÓN DE LOS SERVICIOS PROFESIONALES PARA APOYAR AL DESPACHO LA EJECUCIÓN DE ACTIVIDADES DE PLANEACIÓN Y GESTIÓN DEL RIESGO Y CAMBIO CLIMÁTICO EN LA LOCALIDAD DE CHAPINERO.","Inversión","Bogotá Mejor para Todos",4,{"$f":"IF(ISERROR(VLOOKUP(K87,Eje_Pilar_Prop!$C$2:$E$104,2,FALSE)),\" \",VLOOKUP(K87,Eje_Pilar_Prop!$C$2:$E$104,2,FALSE))","v":"Familias protegidas y adaptadas al cambio climático"},{"$f":"IF(ISERROR(VLOOKUP(K87,Eje_Pilar_Prop!$C$2:$E$104,3,FALSE)),\" \",VLOOKUP(K87,Eje_Pilar_Prop!$C$2:$E$104,3,FALSE))","v":"Pilar 1 Igualdad de Calidad de Vida"},1296,1019031184,"RAYMOND ALEXANDER JIMENEZ ARTEAGA",22000000,0,0,1,5500000,27500000,27500000,"2020-02-13","2020-02-14",{"$f":"+Y87+30","v":"2020-03-15"},120,1,30,79268761,"MAURICIO BOHORQUEZ ESCOBAR ","2020-02-18",21083333,null,null,"X",null,1,null,null,{"$f":"IF(SUMPRODUCT((A$14:A87=A87)*(B$14:B87=B87)*(D$14:D87=D87))>1,0,1)","v":1},"Contratos de prestación de servicios profesionales y de apoyo a la gestión","Contratación directa",{"$f":"IF(ISBLANK(G87),1,IFERROR(VLOOKUP(G87,Tipo!$C$12:$C$27,1,FALSE),\"NO\"))","v":"Prestación de servicios profesionales y de apoyo a la gestión, o para la ejecución de trabajos artísticos que sólo puedan encomendarse a determinadas personas naturales;"},"Inversión",{"$f":"IF(ISBLANK(K87),1,IFERROR(VLOOKUP(K87,Eje_Pilar_Prop!$C$3:$C$104,1,FALSE),\"NO\"))","v":4},"SECOP II",1,"Bogotá Mejor para Todos"]
["FDLCH-CPS-076-2020",2020,"SECOP II","CPS-076-2020","Contratos de prestación de servicios profesionales y de apoyo a la gestión","Contratación directa","Prestación de servicios profesionales y de apoyo a la gestión, o para la ejecución de trabajos artísticos que sólo puedan encomendarse a determinadas personas naturales;","PRESTACIÓN DE SERVICIOS PERSONALES NECESARIOS PARA EL APOYO DE LAS ACTIVIDADES ADMINISTRATIVAS Y OPERATIVAS QUE ADELANTEN EN EL ÁREA DE GESTIÓN POLICIVA OBRAS EN LA ALCALDÍA LOCAL DE CHAPINERO","Inversión","Bogotá Mejor para Todos",45,{"$f":"IF(ISERROR(VLOOKUP(K88,Eje_Pilar_Prop!$C$2:$E$104,2,FALSE)),\" \",VLOOKUP(K88,Eje_Pilar_Prop!$C$2:$E$104,2,FALSE))","v":"Gobernanza e influencia local, regional e internacional"},{"$f":"IF(ISERROR(VLOOKUP(K88,Eje_Pilar_Prop!$C$2:$E$104,3,FALSE)),\" \",VLOOKUP(K88,Eje_Pilar_Prop!$C$2:$E$104,3,FALSE))","v":"Eje Transversal 4 Gobierno Legitimo, Fortalecimiento Local y Eficiencia"},1304,1015413788,"LEONARD YESID GARCIA ROJAS",8780000,0,0,0,0,8780000,8780000,"2020-02-18","2020-02-19",{"$f":"+Y88","v":"2020-02-19"},120,0,0,null,null,null,null,null,null,"X",null,1,null,null,{"$f":"IF(SUMPRODUCT((A$14:A88=A88)*(B$14:B88=B88)*(D$14:D88=D88))>1,0,1)","v":1},"Contratos de prestación de servicios profesionales y de apoyo a la gestión","Contratación directa",{"$f":"IF(ISBLANK(G88),1,IFERROR(VLOOKUP(G88,Tipo!$C$12:$C$27,1,FALSE),\"NO\"))","v":"Prestación de servicios profesionales y de apoyo a la gestión, o para la ejecución de trabajos artísticos que sólo puedan encomendarse a determinadas personas naturales;"},"Inversión",{"$f":"IF(ISBLANK(K88),1,IFERROR(VLOOKUP(K88,Eje_Pilar_Prop!$C$3:$C$104,1,FALSE),\"NO\"))","v":45},"SECOP II",1,"Bogotá Mejor para Todos"]
["FDLCH-CPS-078-2020",2020,"SECOP II","CPS-078-2020","Contratos de prestación de servicios profesionales y de apoyo a la gestión","Contratación directa","Prestación de servicios profesionales y de apoyo a la gestión, o para la ejecución de trabajos artísticos que sólo puedan encomendarse a determinadas personas naturales;","DESCRIPCIÓN: PRESTACIÓN DE SERVICIOS PROFESIONALES PARA APOYAR JURÍDICAMENTE LA EJECUCIÓN DE LAS ACCIONES REQUERIDAS PARA EL TRÁMITE E IMPULSO PROCESAL DE LAS ACTUACIONES CONTRAVENCIONES Y/O QUERELLAS QUE CURSEN EN LAS INSPECCIONES DE POLICÍA DE LA LOCALIDAD DE CHAPINERO","Inversión","Bogotá Mejor para Todos",45,{"$f":"IF(ISERROR(VLOOKUP(K89,Eje_Pilar_Prop!$C$2:$E$104,2,FALSE)),\" \",VLOOKUP(K89,Eje_Pilar_Prop!$C$2:$E$104,2,FALSE))","v":"Gobernanza e influencia local, regional e internacional"},{"$f":"IF(ISERROR(VLOOKUP(K89,Eje_Pilar_Prop!$C$2:$E$104,3,FALSE)),\" \",VLOOKUP(K89,Eje_Pilar_Prop!$C$2:$E$104,3,FALSE))","v":"Eje Transversal 4 Gobierno Legitimo, Fortalecimiento Local y Eficiencia"},1304,3058039,"VIDAL ROBERTO MENDEZ LASPRIELLA",19845000,0,0,1,4961250,24806250,24806250,"2020-02-18","2020-02-19",{"$f":"+Y89+30","v":"2020-03-20"},120,1,30,null,null,null,null,null,null,"X",null,1,null,null,{"$f":"IF(SUMPRODUCT((A$14:A89=A89)*(B$14:B89=B89)*(D$14:D89=D89))>1,0,1)","v":1},"Contratos de prestación de servicios profesionales y de apoyo a la gestión","Contratación directa",{"$f":"IF(ISBLANK(G89),1,IFERROR(VLOOKUP(G89,Tipo!$C$12:$C$27,1,FALSE),\"NO\"))","v":"Prestación de servicios profesionales y de apoyo a la gestión, o para la ejecución de trabajos artísticos que sólo puedan encomendarse a determinadas personas naturales;"},"Inversión",{"$f":"IF(ISBLANK(K89),1,IFERROR(VLOOKUP(K89,Eje_Pilar_Prop!$C$3:$C$104,1,FALSE),\"NO\"))","v":45},"SECOP II",1,"Bogotá Mejor para Todos"]
["FDLCH-CPS-079-2020",2020,"SECOP II","CPS-079-2020","Contratos de prestación de servicios profesionales y de apoyo a la gestión","Contratación directa","Prestación de servicios profesionales y de apoyo a la gestión, o para la ejecución de trabajos artísticos que sólo puedan encomendarse a determinadas personas naturales;","PRESTACIÓN DE SERVICIOS PROFESIONALES PARA EL APOYO AL ÁREA DE GESTIÓN DEL DESARROLLO LOCAL DE LA ALCALDÍA LOCAL DE CHAPINERO EN LA FORMULACIÓN, GESTIÓN, EJECUCIÓN Y SEGUIMIENTO DEL PROYECTO 1301 'MEJORAR LA CALIDAD DE LA MOVILIDAD' Y LA SUPERVISIÓN DE CONTRATOS QUE LE SEAN ASIGNADOS.","Inversión","Bogotá Mejor para Todos",18,{"$f":"IF(ISERROR(VLOOKUP(K90,Eje_Pilar_Prop!$C$2:$E$104,2,FALSE)),\" \",VLOOKUP(K90,Eje_Pilar_Prop!$C$2:$E$104,2,FALSE))","v":"Mejor movilidad para todos"},{"$f":"IF(ISERROR(VLOOKUP(K90,Eje_Pilar_Prop!$C$2:$E$104,3,FALSE)),\" \",VLOOKUP(K90,Eje_Pilar_Prop!$C$2:$E$104,3,FALSE))","v":"Pilar 2 Democracía Urbana"},1301,1018451268,"DIEGO IVAN HORTUA VILLALBA",18978876,0,0,0,0,18978876,18978876,"2020-02-18","2020-02-18",{"$f":"+Y90","v":"2020-02-18"},120,0,0,null,null,null,null,null,null,"X",null,1,null,null,{"$f":"IF(SUMPRODUCT((A$14:A90=A90)*(B$14:B90=B90)*(D$14:D90=D90))>1,0,1)","v":1},"Contratos de prestación de servicios profesionales y de apoyo a la gestión","Contratación directa",{"$f":"IF(ISBLANK(G90),1,IFERROR(VLOOKUP(G90,Tipo!$C$12:$C$27,1,FALSE),\"NO\"))","v":"Prestación de servicios profesionales y de apoyo a la gestión, o para la ejecución de trabajos artísticos que sólo puedan encomendarse a determinadas personas naturales;"},"Inversión",{"$f":"IF(ISBLANK(K90),1,IFERROR(VLOOKUP(K90,Eje_Pilar_Prop!$C$3:$C$104,1,FALSE),\"NO\"))","v":18},"SECOP II",1,"Bogotá Mejor para Todos"]
["FDLCH-CPS-080-2020",2020,"SECOP II","CPS-080-2020","Contratos de prestación de servicios profesionales y de apoyo a la gestión","Contratación directa","Prestación de servicios profesionales y de apoyo a la gestión, o para la ejecución de trabajos artísticos que sólo puedan encomendarse a determinadas personas naturales;","PRESTACIÓN DE SERVICIOS PROFESIONALES PARA APOYAR AL ÁREA DE GESTIÓN DEL DESARROLLO LOCAL DE LA ALCALDÍA LOCAL DE CHAPINERO EN LA FORMULACIÓN, GESTIÓN Y EJECUCIÓN DEL PROYECTO 1297 POR UN TERRITORIO EDUCADO, INCLUYENTE Y DIVERSO","Inversión","Bogotá Mejor para Todos",7,{"$f":"IF(ISERROR(VLOOKUP(K91,Eje_Pilar_Prop!$C$2:$E$104,2,FALSE)),\" \",VLOOKUP(K91,Eje_Pilar_Prop!$C$2:$E$104,2,FALSE))","v":"Inclusión educativa para la equidad"},{"$f":"IF(ISERROR(VLOOKUP(K91,Eje_Pilar_Prop!$C$2:$E$104,3,FALSE)),\" \",VLOOKUP(K91,Eje_Pilar_Prop!$C$2:$E$104,3,FALSE))","v":"Pilar 1 Igualdad de Calidad de Vida"},1297,22798512,"ELIANA CRISTINA VERA PEREA",22000000,0,0,0,0,22000000,22000000,"2020-02-17","2020-02-18",{"$f":"+Y91","v":"2020-02-18"},120,0,0,null,null,null,null,null,null,"X",null,1,null,null,{"$f":"IF(SUMPRODUCT((A$14:A91=A91)*(B$14:B91=B91)*(D$14:D91=D91))>1,0,1)","v":1},"Contratos de prestación de servicios profesionales y de apoyo a la gestión","Contratación directa",{"$f":"IF(ISBLANK(G91),1,IFERROR(VLOOKUP(G91,Tipo!$C$12:$C$27,1,FALSE),\"NO\"))","v":"Prestación de servicios profesionales y de apoyo a la gestión, o para la ejecución de trabajos artísticos que sólo puedan encomendarse a determinadas personas naturales;"},"Inversión",{"$f":"IF(ISBLANK(K91),1,IFERROR(VLOOKUP(K91,Eje_Pilar_Prop!$C$3:$C$104,1,FALSE),\"NO\"))","v":7},"SECOP II",1,"Bogotá Mejor para Todos"]
["FDLCH-CPS-081-2020",2020,"SECOP II","CPS-081-2020","Contratos de prestación de servicios profesionales y de apoyo a la gestión","Contratación directa","Prestación de servicios profesionales y de apoyo a la gestión, o para la ejecución de trabajos artísticos que sólo puedan encomendarse a determinadas personas naturales;","PRESTACIÓN DE SERVICIOS PROFESIONALES PARA APOYAR TÉCNICAMENTE LAS DISTINTAS ETAPAS DE LOS PROCESOS DE COMPETENCIA DE LAS INSPECCIONES DE POLICÍA DE LA LOCALIDAD DE CHAPINERO, SEGÚN REPARTO.","Inversión","Bogotá Mejor para Todos",45,{"$f":"IF(ISERROR(VLOOKUP(K92,Eje_Pilar_Prop!$C$2:$E$104,2,FALSE)),\" \",VLOOKUP(K92,Eje_Pilar_Prop!$C$2:$E$104,2,FALSE))","v":"Gobernanza e influencia local, regional e internacional"},{"$f":"IF(ISERROR(VLOOKUP(K92,Eje_Pilar_Prop!$C$2:$E$104,3,FALSE)),\" \",VLOOKUP(K92,Eje_Pilar_Prop!$C$2:$E$104,3,FALSE))","v":"Eje Transversal 4 Gobierno Legitimo, Fortalecimiento Local y Eficiencia"},1304,11449647,"WILLIAM RENE DIAZ GARAY",22823920,0,0,1,5705980,28529900,28529900,"2020-02-18","2020-02-19",{"$f":"+Y92+30","v":"2020-03-20"},120,1,30,null,null,null,null,null,null,"X",null,1,null,null,{"$f":"IF(SUMPRODUCT((A$14:A92=A92)*(B$14:B92=B92)*(D$14:D92=D92))>1,0,1)","v":1},{"$f":"IF(ISBLANK(E92),1,IFERROR(VLOOKUP(E92,tipo,1,FALSE),\"NO\"))","v":"Contratos de prestación de servicios profesionales y de apoyo a la gestión"},"Contratación directa",{"$f":"IF(ISBLANK(G92),1,IFERROR(VLOOKUP(G92,Tipo!$C$12:$C$27,1,FALSE),\"NO\"))","v":"Prestación de servicios profesionales y de apoyo a la gestión, o para la ejecución de trabajos artísticos que sólo puedan encomendarse a determinadas personas naturales;"},"Inversión",{"$f":"IF(ISBLANK(K92),1,IFERROR(VLOOKUP(K92,Eje_Pilar_Prop!$C$3:$C$104,1,FALSE),\"NO\"))","v":45},"SECOP II",1,"Bogotá Mejor para Todos"]
["FDLCH-CPS-082-2020",2020,"SECOP II","CPS-082-2020","Contratos de prestación de servicios profesionales y de apoyo a la gestión","Contratación directa","Prestación de servicios profesionales y de apoyo a la gestión, o para la ejecución de trabajos artísticos que sólo puedan encomendarse a determinadas personas naturales;","PRESTAR SUS SERVICIOS PROFESIONALES A LA ALCALDÍA LOCAL DE CHAPINERO APOYANDO LA EJECUCIÓN DEL PROYECTO 1299 ASESORÍA PARA LA LEGALIZACIÓN DE BARRIOS Y TITULACIÓN DE PREDIOS EN EL COMPONENTE DEMANDAS DE TITULACIÓN CONFORME A GARANTIZAR EL CUMPLIMIENTO DEL PLAN DE DESARROLLO LOCAL.","Inversión","Bogotá Mejor para Todos",15,{"$f":"IF(ISERROR(VLOOKUP(K93,Eje_Pilar_Prop!$C$2:$E$104,2,FALSE)),\" \",VLOOKUP(K93,Eje_Pilar_Prop!$C$2:$E$104,2,FALSE))","v":"Recuperación, incorporación, vida urbana y control de la ilegalidad"},{"$f":"IF(ISERROR(VLOOKUP(K93,Eje_Pilar_Prop!$C$2:$E$104,3,FALSE)),\" \",VLOOKUP(K93,Eje_Pilar_Prop!$C$2:$E$104,3,FALSE))","v":"Pilar 2 Democracía Urbana"},1299,78075269,"ALVARO ENRIQUE CORRALES HERRERA",19200000,0,0,0,0,19200000,19200000,"2020-02-21","2020-02-24","2020-06-23",120,0,0,null,null,null,null,null,null,"X",null,1,null,null,{"$f":"IF(SUMPRODUCT((A$14:A93=A93)*(B$14:B93=B93)*(D$14:D93=D93))>1,0,1)","v":1},"Contratos de prestación de servicios profesionales y de apoyo a la gestión","Contratación directa",{"$f":"IF(ISBLANK(G93),1,IFERROR(VLOOKUP(G93,Tipo!$C$12:$C$27,1,FALSE),\"NO\"))","v":"Prestación de servicios profesionales y de apoyo a la gestión, o para la ejecución de trabajos artísticos que sólo puedan encomendarse a determinadas personas naturales;"},"Inversión",{"$f":"IF(ISBLANK(K93),1,IFERROR(VLOOKUP(K93,Eje_Pilar_Prop!$C$3:$C$104,1,FALSE),\"NO\"))","v":15},"SECOP II",1,"Bogotá Mejor para Todos"]
["FDLCH-CPS-083-2020",2020,"SECOP II","CPS-083-2020","Contratos de prestación de servicios profesionales y de apoyo a la gestión","Contratación directa","Prestación de servicios profesionales y de apoyo a la gestión, o para la ejecución de trabajos artísticos que sólo puedan encomendarse a determinadas personas naturales;","PRESTACIÓN DE SERVICIOS PROFESIONALES PARA APOYAR EL ÁREA DE GESTIÓN DEL DESARROLLO LOCAL DE LA ALCALDÍA LOCAL DE CHAPINERO EN LA GESTIÓN CONTRACTUAL DEL PROYECTO 1301 MEJORAR LA CALIDAD DE LA MOVILIDAD","Inversión","Bogotá Mejor para Todos",18,{"$f":"IF(ISERROR(VLOOKUP(K94,Eje_Pilar_Prop!$C$2:$E$104,2,FALSE)),\" \",VLOOKUP(K94,Eje_Pilar_Prop!$C$2:$E$104,2,FALSE))","v":"Mejor movilidad para todos"},{"$f":"IF(ISERROR(VLOOKUP(K94,Eje_Pilar_Prop!$C$2:$E$104,3,FALSE)),\" \",VLOOKUP(K94,Eje_Pilar_Prop!$C$2:$E$104,3,FALSE))","v":"Pilar 2 Democracía Urbana"},1301,49772886,"PAOLA KARINA ESCALONA PABON",28400000,0,0,0,0,28400000,28400000,"2020-02-19","2020-02-20",{"$f":"+Y94","v":"2020-02-20"},120,0,0,null,null,null,null,null,null,"X",null,1,null,null,{"$f":"IF(SUMPRODUCT((A$14:A94=A94)*(B$14:B94=B94)*(D$14:D94=D94))>1,0,1)","v":1},"Contratos de prestación de servicios profesionales y de apoyo a la gestión","Contratación directa",{"$f":"IF(ISBLANK(G94),1,IFERROR(VLOOKUP(G94,Tipo!$C$12:$C$27,1,FALSE),\"NO\"))","v":"Prestación de servicios profesionales y de apoyo a la gestión, o para la ejecución de trabajos artísticos que sólo puedan encomendarse a determinadas personas naturales;"},"Inversión",{"$f":"IF(ISBLANK(K94),1,IFERROR(VLOOKUP(K94,Eje_Pilar_Prop!$C$3:$C$104,1,FALSE),\"NO\"))","v":18},"SECOP II",1,"Bogotá Mejor para Todos"]
["FDLCH-CPS-084-2020",2020,"SECOP II","CPS-084-2020","Contratos de prestación de servicios profesionales y de apoyo a la gestión","Contratación directa","Prestación de servicios profesionales y de apoyo a la gestión, o para la ejecución de trabajos artísticos que sólo puedan encomendarse a determinadas personas naturales;","PRESTACIÓN DE SERVICIOS PROFESIONALES PARA EL APOYO AL ÁREA DE GESTIÓN DEL DESARROLLO LOCAL DE LA ALCALDÍA LOCAL DE CHAPINERO EN LA FORMULACIÓN, GESTIÓN, EJECUCIÓN Y SEGUIMIENTO DEL PROYECTO 1301 'MEJORAR LA CALIDAD DE LA MOVILIDAD' Y LA SUPERVISIÓN DE CONTRATOS QUE LE SEAN ASIGNADOS.","Inversión","Bogotá Mejor para Todos",18,{"$f":"IF(ISERROR(VLOOKUP(K95,Eje_Pilar_Prop!$C$2:$E$104,2,FALSE)),\" \",VLOOKUP(K95,Eje_Pilar_Prop!$C$2:$E$104,2,FALSE))","v":"Mejor movilidad para todos"},{"$f":"IF(ISERROR(VLOOKUP(K95,Eje_Pilar_Prop!$C$2:$E$104,3,FALSE)),\" \",VLOOKUP(K95,Eje_Pilar_Prop!$C$2:$E$104,3,FALSE))","v":"Pilar 2 Democracía Urbana"},1301,51923843,"NANCY LOPEZ PINEDA",28400000,0,0,0,0,28400000,28400000,"2020-02-19","2020-02-20",{"$f":"+Y95","v":"2020-02-20"},120,0,0,null,null,null,null,null,null,"X",null,1,null,null,{"$f":"IF(SUMPRODUCT((A$14:A95=A95)*(B$14:B95=B95)*(D$14:D95=D95))>1,0,1)","v":1},"Contratos de prestación de servicios profesionales y de apoyo a la gestión","Contratación directa",{"$f":"IF(ISBLANK(G95),1,IFERROR(VLOOKUP(G95,Tipo!$C$12:$C$27,1,FALSE),\"NO\"))","v":"Prestación de servicios profesionales y de apoyo a la gestión, o para la ejecución de trabajos artísticos que sólo puedan encomendarse a determinadas personas naturales;"},"Inversión",{"$f":"IF(ISBLANK(K95),1,IFERROR(VLOOKUP(K95,Eje_Pilar_Prop!$C$3:$C$104,1,FALSE),\"NO\"))","v":18},"SECOP II",1,"Bogotá Mejor para Todos"]
["FDLCH-CPS-085-2020",2020,"SECOP II","CPS-085-2020","Contratos de prestación de servicios profesionales y de apoyo a la gestión","Contratación directa","Prestación de servicios profesionales y de apoyo a la gestión, o para la ejecución de trabajos artísticos que sólo puedan encomendarse a determinadas personas naturales;","PRESTACIÓN DE SERVICIOS PROFESIONALES PARA APOYAR TÉCNICAMENTE LAS DISTINTAS ETAPAS DE LOS PROCESOS DE COMPETENCIA DE LAS INSPECCIONES DE POLICÍA DE LA LOCALIDAD DE CHAPINERO, SEGÚN REPARTO","Inversión","Bogotá Mejor para Todos",45,{"$f":"IF(ISERROR(VLOOKUP(K96,Eje_Pilar_Prop!$C$2:$E$104,2,FALSE)),\" \",VLOOKUP(K96,Eje_Pilar_Prop!$C$2:$E$104,2,FALSE))","v":"Gobernanza e influencia local, regional e internacional"},{"$f":"IF(ISERROR(VLOOKUP(K96,Eje_Pilar_Prop!$C$2:$E$104,3,FALSE)),\" \",VLOOKUP(K96,Eje_Pilar_Prop!$C$2:$E$104,3,FALSE))","v":"Eje Transversal 4 Gobierno Legitimo, Fortalecimiento Local y Eficiencia"},1304,1030625256,"ANDRES FELIPE RAMOS ARENAS",22823920,0,0,1,5705980,28529900,28529900,"2020-02-20","2020-02-21",{"$f":"+Y96+30","v":"2020-03-22"},120,1,30,null,null,null,null,null,null,"X",null,1,null,null,{"$f":"IF(SUMPRODUCT((A$14:A96=A96)*(B$14:B96=B96)*(D$14:D96=D96))>1,0,1)","v":1},"Contratos de prestación de servicios profesionales y de apoyo a la gestión","Contratación directa",{"$f":"IF(ISBLANK(G96),1,IFERROR(VLOOKUP(G96,Tipo!$C$12:$C$27,1,FALSE),\"NO\"))","v":"Prestación de servicios profesionales y de apoyo a la gestión, o para la ejecución de trabajos artísticos que sólo puedan encomendarse a determinadas personas naturales;"},"Inversión",{"$f":"IF(ISBLANK(K96),1,IFERROR(VLOOKUP(K96,Eje_Pilar_Prop!$C$3:$C$104,1,FALSE),\"NO\"))","v":45},"SECOP II",1,"Bogotá Mejor para Todos"]
["FDLCH-CPS-086-2020",2020,"SECOP II","CPS-086-2020","Contratos de prestación de servicios profesionales y de apoyo a la gestión","Contratación directa","Prestación de servicios profesionales y de apoyo a la gestión, o para la ejecución de trabajos artísticos que sólo puedan encomendarse a determinadas personas naturales;","PRESTACIÓN DE SERVICIOS PROFESIONALES EN DERECHO PARA  APOYAR JURÍDICAMENTE LA EJECUCIÓN DE LAS ACCIONES REQUERIDAS PARA LA DEPURACIÓN DE LAS ACTUACIONES ADMINISTRATIVAS QUE CURSAN  EN LA ALCALDÍA LOCAL","Inversión","Bogotá Mejor para Todos",45,{"$f":"IF(ISERROR(VLOOKUP(K97,Eje_Pilar_Prop!$C$2:$E$104,2,FALSE)),\" \",VLOOKUP(K97,Eje_Pilar_Prop!$C$2:$E$104,2,FALSE))","v":"Gobernanza e influencia local, regional e internacional"},{"$f":"IF(ISERROR(VLOOKUP(K97,Eje_Pilar_Prop!$C$2:$E$104,3,FALSE)),\" \",VLOOKUP(K97,Eje_Pilar_Prop!$C$2:$E$104,3,FALSE))","v":"Eje Transversal 4 Gobierno Legitimo, Fortalecimiento Local y Eficiencia"},1304,1136885606,"MICHELLE MARGARITA CABALLERO GOMEZ",16800000,0,0,0,0,16800000,16240000,"2020-03-03","2020-03-05",{"$f":"+Y97","v":"2020-03-05"},120,0,0,null,null,null,null,null,null,"X",null,0.96666666666666667,null,null,{"$f":"IF(SUMPRODUCT((A$14:A97=A97)*(B$14:B97=B97)*(D$14:D97=D97))>1,0,1)","v":1},"Contratos de prestación de servicios profesionales y de apoyo a la gestión","Contratación directa",{"$f":"IF(ISBLANK(G97),1,IFERROR(VLOOKUP(G97,Tipo!$C$12:$C$27,1,FALSE),\"NO\"))","v":"Prestación de servicios profesionales y de apoyo a la gestión, o para la ejecución de trabajos artísticos que sólo puedan encomendarse a determinadas personas naturales;"},"Inversión",{"$f":"IF(ISBLANK(K97),1,IFERROR(VLOOKUP(K97,Eje_Pilar_Prop!$C$3:$C$104,1,FALSE),\"NO\"))","v":45},"SECOP II",1,"Bogotá Mejor para Todos"]
["FDLCH-CPS-087-2020",2020,"SECOP II","CPS-087-2020","Contratos de prestación de servicios profesionales y de apoyo a la gestión","Contratación directa","Prestación de servicios profesionales y de apoyo a la gestión, o para la ejecución de trabajos artísticos que sólo puedan encomendarse a determinadas personas naturales;","PRESTAR SERVICIOS PERSONALES NECESARIOS PARA EL APOYO ADMINISTRATIVO, ASISTENCIALMENTE A LAS  INSPECCIONES DE POLICÍA DE LA LOCALIDAD DE CHAPINERO","Inversión","Bogotá Mejor para Todos",45,{"$f":"IF(ISERROR(VLOOKUP(K98,Eje_Pilar_Prop!$C$2:$E$104,2,FALSE)),\" \",VLOOKUP(K98,Eje_Pilar_Prop!$C$2:$E$104,2,FALSE))","v":"Gobernanza e influencia local, regional e internacional"},{"$f":"IF(ISERROR(VLOOKUP(K98,Eje_Pilar_Prop!$C$2:$E$104,3,FALSE)),\" \",VLOOKUP(K98,Eje_Pilar_Prop!$C$2:$E$104,3,FALSE))","v":"Eje Transversal 4 Gobierno Legitimo, Fortalecimiento Local y Eficiencia"},1304,1032462820,"JENNIFER VANNESA DIAZ NIÑO",9360000,0,0,0,0,9360000,9360000,"2020-03-03","2020-03-05","2020-03-05",120,0,0,null,null,null,null,null,null,"X",null,1,null,null,{"$f":"IF(SUMPRODUCT((A$14:A98=A98)*(B$14:B98=B98)*(D$14:D98=D98))>1,0,1)","v":1},"Contratos de prestación de servicios profesionales y de apoyo a la gestión","Contratación directa",{"$f":"IF(ISBLANK(G98),1,IFERROR(VLOOKUP(G98,Tipo!$C$12:$C$27,1,FALSE),\"NO\"))","v":"Prestación de servicios profesionales y de apoyo a la gestión, o para la ejecución de trabajos artísticos que sólo puedan encomendarse a determinadas personas naturales;"},"Inversión",{"$f":"IF(ISBLANK(K98),1,IFERROR(VLOOKUP(K98,Eje_Pilar_Prop!$C$3:$C$104,1,FALSE),\"NO\"))","v":45},"SECOP II",1,"Bogotá Mejor para Todos"]
["FDLCH-CPS-088-2020",2020,"SECOP II","CPS-088-2020","Contratos de prestación de servicios profesionales y de apoyo a la gestión","Contratación directa","Prestación de servicios profesionales y de apoyo a la gestión, o para la ejecución de trabajos artísticos que sólo puedan encomendarse a determinadas personas naturales;","PRESTACIÓN DE SERVICIOS PROFESIONALES EN DERECHO PARA  APOYAR JURÍDICAMENTE LA EJECUCIÓN DE LAS ACCIONES REQUERIDAS PARA LA DEPURACIÓN DE LAS ACTUACIONES ADMINISTRATIVAS QUE CURSAN  EN LA ALCALDÍA LOCAL","Inversión","Bogotá Mejor para Todos",45,{"$f":"IF(ISERROR(VLOOKUP(K99,Eje_Pilar_Prop!$C$2:$E$104,2,FALSE)),\" \",VLOOKUP(K99,Eje_Pilar_Prop!$C$2:$E$104,2,FALSE))","v":"Gobernanza e influencia local, regional e internacional"},{"$f":"IF(ISERROR(VLOOKUP(K99,Eje_Pilar_Prop!$C$2:$E$104,3,FALSE)),\" \",VLOOKUP(K99,Eje_Pilar_Prop!$C$2:$E$104,3,FALSE))","v":"Eje Transversal 4 Gobierno Legitimo, Fortalecimiento Local y Eficiencia"},1304,1020771235,"KEYLA MILENA DELUQUEZ MEDINA",16800000,0,0,0,0,16800000,16240000,"2020-03-03","2020-03-05","2020-03-05",120,0,0,null,null,null,null,null,null,"X",null,0.96666666666666667,null,null,{"$f":"IF(SUMPRODUCT((A$14:A99=A99)*(B$14:B99=B99)*(D$14:D99=D99))>1,0,1)","v":1},"Contratos de prestación de servicios profesionales y de apoyo a la gestión","Contratación directa",{"$f":"IF(ISBLANK(G99),1,IFERROR(VLOOKUP(G99,Tipo!$C$12:$C$27,1,FALSE),\"NO\"))","v":"Prestación de servicios profesionales y de apoyo a la gestión, o para la ejecución de trabajos artísticos que sólo puedan encomendarse a determinadas personas naturales;"},"Inversión",{"$f":"IF(ISBLANK(K99),1,IFERROR(VLOOKUP(K99,Eje_Pilar_Prop!$C$3:$C$104,1,FALSE),\"NO\"))","v":45},"SECOP II",{"$f":"IF(OR(YEAR(X99)=2020,ISBLANK(X99)),1,\"NO\")","v":1},"Bogotá Mejor para Todos"]
["FDLCH-CPS-089-2020",2020,"SECOP II","CPS-089-2020","Contratos de prestación de servicios profesionales y de apoyo a la gestión","Contratación directa","Prestación de servicios profesionales y de apoyo a la gestión, o para la ejecución de trabajos artísticos que sólo puedan encomendarse a determinadas personas naturales;","PRESTACIÓN DE SERVICIOS PROFESIONALES PARA EL ÀREA DE GESTIÓN DEL DESARROLLO DE LA ALCALDÍA DECHAPINERO PARA EL APOYO A LA SUPERVISIÓN DE LOS CONTRATOS DERIVADOS DEL PROYECTO 1302 ENTORNOS SEGUROS PARA LA CIUDADANÍA","Inversión","Bogotá Mejor para Todos",19,{"$f":"IF(ISERROR(VLOOKUP(K100,Eje_Pilar_Prop!$C$2:$E$104,2,FALSE)),\" \",VLOOKUP(K100,Eje_Pilar_Prop!$C$2:$E$104,2,FALSE))","v":"Seguridad y convivencia para todos"},{"$f":"IF(ISERROR(VLOOKUP(K100,Eje_Pilar_Prop!$C$2:$E$104,3,FALSE)),\" \",VLOOKUP(K100,Eje_Pilar_Prop!$C$2:$E$104,3,FALSE))","v":"Pilar 3 Construcción de Comunidad y Cultura Ciudadana"},1302,1032360697,"ANDREA MARCELA RODRIGUEZ ARANGO",22000000,0,0,0,0,22000000,22000000,"2020-03-10","2020-03-11","2020-03-11",120,0,0,null,null,null,null,null,null,"X",null,1,null,null,{"$f":"IF(SUMPRODUCT((A$14:A100=A100)*(B$14:B100=B100)*(D$14:D100=D100))>1,0,1)","v":1},"Contratos de prestación de servicios profesionales y de apoyo a la gestión","Contratación directa",{"$f":"IF(ISBLANK(G100),1,IFERROR(VLOOKUP(G100,Tipo!$C$12:$C$27,1,FALSE),\"NO\"))","v":"Prestación de servicios profesionales y de apoyo a la gestión, o para la ejecución de trabajos artísticos que sólo puedan encomendarse a determinadas personas naturales;"},"Inversión",{"$f":"IF(ISBLANK(K100),1,IFERROR(VLOOKUP(K100,Eje_Pilar_Prop!$C$3:$C$104,1,FALSE),\"NO\"))","v":19},"SECOP II",1,"Bogotá Mejor para Todos"]
["FDLCH-CPS-090-2020",2020,"SECOP II","CPS-090-2020","Contratos de prestación de servicios profesionales y de apoyo a la gestión","Contratación directa","Prestación de servicios profesionales y de apoyo a la gestión, o para la ejecución de trabajos artísticos que sólo puedan encomendarse a determinadas personas naturales;","PRESTACIÓN DE SERVICIOS PERSONALES NECEARIOS PARA EL APOYO A LA GESTIÓN  Y EJECUCIÓN DE LASACTIVIDADES ADMINISTRATIVAS Y OPERATIVAS  QUE SE ADELANTAN  EN EL ÁREA  DE GESTIÓN POLICIVA JURÍDICA DE LA ACALDÍA LOCAL DE CHAPINERO","Inversión","Bogotá Mejor para Todos",45,{"$f":"IF(ISERROR(VLOOKUP(K101,Eje_Pilar_Prop!$C$2:$E$104,2,FALSE)),\" \",VLOOKUP(K101,Eje_Pilar_Prop!$C$2:$E$104,2,FALSE))","v":"Gobernanza e influencia local, regional e internacional"},{"$f":"IF(ISERROR(VLOOKUP(K101,Eje_Pilar_Prop!$C$2:$E$104,3,FALSE)),\" \",VLOOKUP(K101,Eje_Pilar_Prop!$C$2:$E$104,3,FALSE))","v":"Eje Transversal 4 Gobierno Legitimo, Fortalecimiento Local y Eficiencia"},1304,52386463,"YOLANDA VARGAS MORA",8780000,0,0,0,0,8780000,8194667,"2020-03-05","2020-03-09","2020-03-09",120,0,0,null,null,null,null,null,null,"X",null,0.93333337129840543,null,null,{"$f":"IF(SUMPRODUCT((A$14:A101=A101)*(B$14:B101=B101)*(D$14:D101=D101))>1,0,1)","v":1},"Contratos de prestación de servicios profesionales y de apoyo a la gestión","Contratación directa",{"$f":"IF(ISBLANK(G101),1,IFERROR(VLOOKUP(G101,Tipo!$C$12:$C$27,1,FALSE),\"NO\"))","v":"Prestación de servicios profesionales y de apoyo a la gestión, o para la ejecución de trabajos artísticos que sólo puedan encomendarse a determinadas personas naturales;"},"Inversión",{"$f":"IF(ISBLANK(K101),1,IFERROR(VLOOKUP(K101,Eje_Pilar_Prop!$C$3:$C$104,1,FALSE),\"NO\"))","v":45},"SECOP II",1,"Bogotá Mejor para Todos"]
["FDLCH-OC-091-2020",2020,"SECOP II","OC-091-2020 \n46708","Contratos de prestación de servicios","Selección abreviada","Acuerdo marco de precios ","PRESTACIÓN DEL SERVICIO INTEGRAL DE ASEO Y CAFETERÍA PARA LA ALCALDÍA LOCAL DE CHAPINERO EN LAS CONDICIONES DEL ACUERDO MARCO DE PRECIOS CCE-972-AMP-2019","Funcionamiento","Bogotá Mejor para Todos",null,{"$f":"IF(ISERROR(VLOOKUP(K102,[1]Eje_Pilar_Prop!$C$2:$E$104,2,FALSE)),\" \",VLOOKUP(K102,[1]Eje_Pilar_Prop!$C$2:$E$104,2,FALSE))","v":" "},{"$f":"IF(ISERROR(VLOOKUP(K102,[1]Eje_Pilar_Prop!$C$2:$E$104,3,FALSE)),\" \",VLOOKUP(K102,[1]Eje_Pilar_Prop!$C$2:$E$104,3,FALSE))","v":" "},13102020203050,901351524,"UNIÓN TEMPORAL ASEO COLOMBIA 2",151559127,0,0,0,0,151559127,99335727,"2020-03-30","2020-04-03","2020-04-03",330,0,0,null,null,null,null,null,"X",null,null,0.65542556866271739,null,null,{"$f":"IF(SUMPRODUCT((A$14:A102=A102)*(B$14:B102=B102)*(D$14:D102=D102))>1,0,1)","v":1},"Contratos de prestación de servicios","Selección abreviada",{"$f":"IF(ISBLANK(G102),1,IFERROR(VLOOKUP(G102,Tipo!$C$12:$C$27,1,FALSE),\"NO\"))","v":"Acuerdo marco de precios "},"Funcionamiento",{"$f":"IF(ISBLANK(K102),1,IFERROR(VLOOKUP(K102,Eje_Pilar_Prop!$C$3:$C$104,1,FALSE),\"NO\"))","v":1},"SECOP II",1,"Bogotá Mejor para Todos"]
["FDLCH-CA-092-2020",2020,"SECOP II","PMINC-001-2020","Contratos de prestación de servicios","Contratación mínima cuantia","No aplica","PRESTACIÓN DE SERVICIOS DE MANTENIMIENTO PREVENTIVO, MANTENIMIENTO CORRECTIVO Y SUMINISTRO DE REPUESTOS PARA EL PARQUE AUTOMOTOR DE PROPIEDAD DEL FONDO DE DESARROLLO LOCAL DE CHAPINERO","Funcionamiento","Bogotá Mejor para Todos",null,{"$f":"IF(ISERROR(VLOOKUP(K103,[1]Eje_Pilar_Prop!$C$2:$E$104,2,FALSE)),\" \",VLOOKUP(K103,[1]Eje_Pilar_Prop!$C$2:$E$104,2,FALSE))","v":" "},{"$f":"IF(ISERROR(VLOOKUP(K103,[1]Eje_Pilar_Prop!$C$2:$E$104,3,FALSE)),\" \",VLOOKUP(K103,[1]Eje_Pilar_Prop!$C$2:$E$104,3,FALSE))","v":" "},13102020203060,800250589,"CENTRO CAR 19 LTDA",24500000,0,0,1,12000000,36500000,24074935,"2020-04-07","2020-04-15","2021-01-23",240,1,39,null,null,null,null,null,"X",null,null,0.65958726027397263,null,null,{"$f":"IF(SUMPRODUCT((A$14:A103=A103)*(B$14:B103=B103)*(D$14:D103=D103))>1,0,1)","v":1},"Contratos de prestación de servicios","Contratación mínima cuantia",{"$f":"IF(ISBLANK(G103),1,IFERROR(VLOOKUP(G103,Tipo!$C$12:$C$27,1,FALSE),\"NO\"))","v":"NO"},"Funcionamiento",{"$f":"IF(ISBLANK(K103),1,IFERROR(VLOOKUP(K103,Eje_Pilar_Prop!$C$3:$C$104,1,FALSE),\"NO\"))","v":1},"SECOP II",1,"Bogotá Mejor para Todos"]
["FDLCH-CS-093-2020",2020,"SECOP II","SAMC-001-2020","Seguros","Selección abreviada","Selección abreviada por menor cuantía ","CONTRATAR LOS SEGUROS QUE AMPAREN LOS INTERESES PATRIMONIALES ACTUALES Y FUTUROS, ASÍ COMO LOS BIENES DE PROPIEDAD DEL FONDO DE DESARROLLO LOCAL DE CHAPINERO, QUE ESTÉN BAJO SU RESPONSABILIDAD Y CUSTODIA Y AQUELLOS QUE SEAN ADQUIRIDOS PARA DESARROLLAR LAS FUNCIONES INHERENTES A SU ACTIVIDAD”","Funcionamiento","Bogotá Mejor para Todos",null,{"$f":"IF(ISERROR(VLOOKUP(K104,[1]Eje_Pilar_Prop!$C$2:$E$104,2,FALSE)),\" \",VLOOKUP(K104,[1]Eje_Pilar_Prop!$C$2:$E$104,2,FALSE))","v":" "},{"$f":"IF(ISERROR(VLOOKUP(K104,[1]Eje_Pilar_Prop!$C$2:$E$104,3,FALSE)),\" \",VLOOKUP(K104,[1]Eje_Pilar_Prop!$C$2:$E$104,3,FALSE))","v":" "},131020202020107,860002400,"LA PREVISORA S.A  COMPAÑÍA DE SEGUROS",54492947,0,0,1,22597611,77090558,74994669,"2020-04-17","2020-04-16","2021-03-11",230,1,98,null,null,null,null,null,"X",null,null,0.97281263679528696,null,null,{"$f":"IF(SUMPRODUCT((A$14:A104=A104)*(B$14:B104=B104)*(D$14:D104=D104))>1,0,1)","v":1},"Seguros","Selección abreviada",{"$f":"IF(ISBLANK(G104),1,IFERROR(VLOOKUP(G104,Tipo!$C$12:$C$27,1,FALSE),\"NO\"))","v":"Selección abreviada por menor cuantía "},"Funcionamiento",{"$f":"IF(ISBLANK(K104),1,IFERROR(VLOOKUP(K104,Eje_Pilar_Prop!$C$3:$C$104,1,FALSE),\"NO\"))","v":1},"SECOP II",1,"Bogotá Mejor para Todos"]
["FDLCH-CCBMC-094-2020",2020,"SECOP II","FDCLH-CCBMC-001-2020","Contratos de prestación de servicios","Licitación pública","No aplica","PRESTACIÓN DE LOS SERVICIOS DE VIGILANCIA Y SEGURIDAD PRIVADA INTEGRAL PERMANENTE EN LA MODALIDAD FIJA PARA LA PROTECCIÓN Y CUIDADO DE LOS FUNCIONARIOS, USUARIOS Y TODOS LOS BIENES MUEBLES E INMUEBLES DE PROPIEDAD O EN CUSTODIA DEL FONDO DE DESARROLLO LOCAL DE CHAPINERO Y DE TODOS AQUELLOS DE LOS QUE LLEGARE A ADQUIRIR","Funcionamiento","Bogotá Mejor para Todos",null,{"$f":"IF(ISERROR(VLOOKUP(K105,[2]Eje_Pilar_Prop!$C$2:$E$104,2,FALSE)),\" \",VLOOKUP(K105,[2]Eje_Pilar_Prop!$C$2:$E$104,2,FALSE))","v":" "},{"$f":"IF(ISERROR(VLOOKUP(K105,[2]Eje_Pilar_Prop!$C$2:$E$104,3,FALSE)),\" \",VLOOKUP(K105,[2]Eje_Pilar_Prop!$C$2:$E$104,3,FALSE))","v":" "},13102020203050,830103828,"AGROBOLSA - SEJARPI COOPERATIVA DE TRABAJO ASOCIADO C.T.A. ",241411258,0,0,1,96587376,{"$f":"+Q105+S105+U105","v":337998634},244486960,"2020-04-22","2020-05-10","2021-03-02",210,1,81,null,null,null,null,null,"X",null,null,{"$f":"IF(ISERROR(W105/V105),\"-\",(W105/V105))","v":0.72333712449263921},null,null,{"$f":"IF(SUMPRODUCT((A$14:A105=A105)*(B$14:B105=B105)*(D$14:D105=D105))>1,0,1)","v":1},"Contratos de prestación de servicios","Licitación pública",{"$f":"IF(ISBLANK(G105),1,IFERROR(VLOOKUP(G105,Tipo!$C$12:$C$27,1,FALSE),\"NO\"))","v":"NO"},"Funcionamiento",{"$f":"IF(ISBLANK(K105),1,IFERROR(VLOOKUP(K105,Eje_Pilar_Prop!$C$3:$C$104,1,FALSE),\"NO\"))","v":1},"SECOP II",1,"Bogotá Mejor para Todos"]
["FDLCH-CCBMC-094-2020",2020,"SECOP II","FDCLH-CCBMC-001-2020","Contratos de prestación de servicios","Licitación pública","No aplica","PRESTACIÓN DE LOS SERVICIOS DE VIGILANCIA Y SEGURIDAD PRIVADA INTEGRAL PERMANENTE EN LA MODALIDAD FIJA PARA LA PROTECCIÓN Y CUIDADO DE LOS FUNCIONARIOS, USUARIOS Y TODOS LOS BIENES MUEBLES E INMUEBLES DE PROPIEDAD O EN CUSTODIA DEL FONDO DE DESARROLLO LOCAL DE CHAPINERO Y DE TODOS AQUELLOS DE LOS QUE LLEGARE A ADQUIRIR","Funcionamiento","Bogotá Mejor para Todos",null,{"$f":"IF(ISERROR(VLOOKUP(K106,[2]Eje_Pilar_Prop!$C$2:$E$104,2,FALSE)),\" \",VLOOKUP(K106,[2]Eje_Pilar_Prop!$C$2:$E$104,2,FALSE))","v":" "},{"$f":"IF(ISERROR(VLOOKUP(K106,[2]Eje_Pilar_Prop!$C$2:$E$104,3,FALSE)),\" \",VLOOKUP(K106,[2]Eje_Pilar_Prop!$C$2:$E$104,3,FALSE))","v":" "},1310202020101,830103828,"AGROBOLSA - SEJARPI COOPERATIVA DE TRABAJO ASOCIADO C.T.A. ",null,0,0,1,17100000,{"$f":"+Q106+S106+U106","v":17100000},0,"2020-04-16","2020-04-25",{"$f":"+Y106","v":"2020-04-25"},365,0,0,null,null,null,null,null,"X",null,null,{"$f":"IF(ISERROR(W106/V106),\"-\",(W106/V106))","v":0}]
["FDLCH-OC-095-2020",2020,"SECOP II","OC-095-2020 \n 47290","Suministro","Selección abreviada","Acuerdo marco de precios ","CONTRATAR EL SUMINISTRO DE COMBUSTIBLE GASOLINA CORRIENTE Y ACPM) PARA LOS VEHÍCULOS QUE CONFORMAN EL PARQUE AUTOMOTOR DE PROPIEDAD AL SERVICIO DEL FONDO DE DESARROLLO LOCAL DE CHAPINERO EN LAS CONDICIONES DEL ACUERDO MARCO DE PRECIOS CCE-715-1-AMP-2018, MODIFICACIÓN Y ACLARACIÓN N° 1- ORDEN DE COMPRA 47290","Funcionamiento","Bogotá Mejor para Todos",null,{"$f":"IF(ISERROR(VLOOKUP(K107,Eje_Pilar_Prop!$C$2:$E$104,2,FALSE)),\" \",VLOOKUP(K107,Eje_Pilar_Prop!$C$2:$E$104,2,FALSE))","v":" "},{"$f":"IF(ISERROR(VLOOKUP(K107,Eje_Pilar_Prop!$C$2:$E$104,3,FALSE)),\" \",VLOOKUP(K107,Eje_Pilar_Prop!$C$2:$E$104,3,FALSE))","v":" "},1310202010203,830095213,"ORGANIZACIÓN TERPEL SA",32257491,0,0,0,0,32257491,{"$f":"7307450+7589900","v":14897350},"2020-05-19","2020-05-19",{"$f":"+Y107","v":"2020-05-19"},150,0,0,null,null,null,null,null,null,"X",null,0.46182606080553507,null,null,{"$f":"IF(SUMPRODUCT((A$14:A107=A107)*(B$14:B107=B107)*(D$14:D107=D107))>1,0,1)","v":1},"Suministro","Selección abreviada",{"$f":"IF(ISBLANK(G107),1,IFERROR(VLOOKUP(G107,Tipo!$C$12:$C$27,1,FALSE),\"NO\"))","v":"Acuerdo marco de precios "},"Funcionamiento",{"$f":"IF(ISBLANK(K107),1,IFERROR(VLOOKUP(K107,Eje_Pilar_Prop!$C$3:$C$104,1,FALSE),\"NO\"))","v":1},"SECOP II",1,"Bogotá Mejor para Todos"]
["FDLCH-CPS-096-2020",2020,"SECOP II","CPS-096-2020","Contratos de prestación de servicios profesionales y de apoyo a la gestión","Contratación directa","Prestación de servicios profesionales y de apoyo a la gestión, o para la ejecución de trabajos artísticos que sólo puedan encomendarse a determinadas personas naturales;","PRESTAR LOS SERVICIOS PROFESIONALES ESPECIALIZADOS PARA APOYAR LA GESTIÓN JURÍDICA DEL DESPACHO DE LA ALCALDÍA LOCAL DE CHAPINERO Y LA DE LAS DEPENDENCIAS QUE LA CONFORMAN\n","Inversión","Bogotá Mejor para Todos",45,{"$f":"IF(ISERROR(VLOOKUP(K108,Eje_Pilar_Prop!$C$2:$E$104,2,FALSE)),\" \",VLOOKUP(K108,Eje_Pilar_Prop!$C$2:$E$104,2,FALSE))","v":"Gobernanza e influencia local, regional e internacional"},{"$f":"IF(ISERROR(VLOOKUP(K108,Eje_Pilar_Prop!$C$2:$E$104,3,FALSE)),\" \",VLOOKUP(K108,Eje_Pilar_Prop!$C$2:$E$104,3,FALSE))","v":"Eje Transversal 4 Gobierno Legitimo, Fortalecimiento Local y Eficiencia"},1304,1018418729,"JONATHAN RAMIREZ NIEVES",44500000,1,-3856667,0,0,40643333,40643333,"2020-05-05","2020-05-15","2020-10-09",140,2,20,null,null,null,null,null,null,"X",null,1,null,null,{"$f":"IF(SUMPRODUCT((A$14:A108=A108)*(B$14:B108=B108)*(D$14:D108=D108))>1,0,1)","v":1},"Contratos de prestación de servicios profesionales y de apoyo a la gestión","Contratación directa",{"$f":"IF(ISBLANK(G108),1,IFERROR(VLOOKUP(G108,Tipo!$C$12:$C$27,1,FALSE),\"NO\"))","v":"Prestación de servicios profesionales y de apoyo a la gestión, o para la ejecución de trabajos artísticos que sólo puedan encomendarse a determinadas personas naturales;"},"Inversión",{"$f":"IF(ISBLANK(K108),1,IFERROR(VLOOKUP(K108,Eje_Pilar_Prop!$C$3:$C$104,1,FALSE),\"NO\"))","v":45},"SECOP II",1,"Bogotá Mejor para Todos"]
["FDLCH-CPS-097-2020",2020,"SECOP I","20-22-15386","Contratos de prestación de servicios","Contratación directa","Urgencia manifiesta","LA CRUZ ROJA SE OBLIGA A PRESTAR, A MONTO AGOTABLE, LOS SERVICIOS Y REALIZAR LAS ACCIONES NECESARIAS PARA LA ATENCIÓN INTEGRAL, PROVISIÓN Y ENTREGA DE AYUDA HUMANITARIA Y ASISTENCIA PARA LA CONTINGENCIA DE LA POBLACIÓN POBRE Y VULNERABLE DE BOGOTÁ D.C., EN EL MARCO DE LA CONTENCIÓN Y MITIGACIÓN DEL COVID-19, LA DECLARATORIA DE EMERGENCIA SANITARIA EN TODO EL TERRITORIO NACIONAL Y LA CALAMIDAD PÚBLICA DECLARADA EN LA CIUDAD DE BOGOTÁ D.C., DE ACUERDO A LO ESTABLECIDO EN EL MANUAL OPERATIVO DEL SISTEMA DISTRITAL BOGOTÁ SOLIDARIA EN CASA\n\n\nLA CRUZ ROJA SE OBLIGA A PRESTAR, A MONTO AGOTABLE, LOS SERVICIOS Y REALIZAR LAS ACCIONES NECESARIAS PARA LA PROVISIÓN Y ENTREGA DE AYUDA HUMANITARITA Y ASISTENCIA PARA LA CONTINGENCIA POBRE Y VULNERABLE DE BOGOTÁ D.C., EN EL MARCO DE LA CONTINGENCIA Y MITIGACIÓN DEL COVID-19, LA DECLARATORIA DE EMERGENCIA SANITARIA EN TODO EL TERRITORIO NACIONAL  Y LA CALAMIDAD PÚBLICA DECLARADA EN LA CIUDAD DE BOGOTÁ D.C., DE ACUERDO A LO ESTABLECIDO EN EL MANUAL OPERATIVO DEL SISTEMA DISTRITAL BOGOTÁ  SOLIDARIA EN  CASA.  PARÁGRAFO. ALCANCE DEL OBJETO: EL ALCANCE DEL PRESENTE CONTRATO COMPRENDE LA ADMINISTRACIÓN, PLANEACIÓN ESTRATÉGICA, LOGÍSTICA Y OPERACIÓN PARA LA ENTREGA DE AYUDAS HUMANITARIAS BAJO SOMETIMIENTO DE LOS PRINCIPIOS DE CALIDAD, OPORTUNIDAD, PERTINENCIA Y EFICACIA, QUE PERMITA SOCORRER, ASISTIR, PROTEGER Y ATENDER LAS NECESIDADES DE ALIMENTACIÓN, ASEO PERSONAL MANEJO DE ABASTECIMIENTOS, UTENSILIOS, VESTUARIO, MEDICAMENTOS, TRANSPORTE Y TRASLADO DE EMERGENCIA, ALOJAMIENTO TEMPORAL, ASISTENCIA DE GASTOS FUNERARIOS, TRÁMITES DOCUMENTALES, EN CONDICIONES DIGNAS PARA LA POBLACIÓN POBRE Y VULNERABLE DE BOGOTÁ D.C., O LA ENTREGA DE BONOS CANJEABLES, TARJETAS MONEDERO O SIMILARES, DENTRO DE LOS LINEAMIENTOS DEL SISTEMA DISTRITAL SOLIDARIA EN CASA Y SU MANUAL OPERATIVO.","Inversión","Bogotá Mejor para Todos",4,{"$f":"IF(ISERROR(VLOOKUP(K109,Eje_Pilar_Prop!$C$2:$E$104,2,FALSE)),\" \",VLOOKUP(K109,Eje_Pilar_Prop!$C$2:$E$104,2,FALSE))","v":"Familias protegidas y adaptadas al cambio climático"},{"$f":"IF(ISERROR(VLOOKUP(K109,Eje_Pilar_Prop!$C$2:$E$104,3,FALSE)),\" \",VLOOKUP(K109,Eje_Pilar_Prop!$C$2:$E$104,3,FALSE))","v":"Pilar 1 Igualdad de Calidad de Vida"},1294,860070301,"CRUZ ROJA COLOMBIANA SECCIONAL CUNDINAMARCA Y BOGOTA",494230097,1,-35251166,0,0,458978931,458978931,"2020-06-03","2020-06-04",{"$f":"+Y109","v":"2020-06-04"},120,0,0,null,null,null,null,null,null,"X",null,1,null,null,{"$f":"IF(SUMPRODUCT((A$14:A109=A109)*(B$14:B109=B109)*(D$14:D109=D109))>1,0,1)","v":1},"Contratos de prestación de servicios","Contratación directa",{"$f":"IF(ISBLANK(G109),1,IFERROR(VLOOKUP(G109,Tipo!$C$12:$C$27,1,FALSE),\"NO\"))","v":"Urgencia manifiesta"},"Inversión",{"$f":"IF(ISBLANK(K109),1,IFERROR(VLOOKUP(K109,Eje_Pilar_Prop!$C$3:$C$104,1,FALSE),\"NO\"))","v":4},"SECOP I",1,"Bogotá Mejor para Todos"]
["FDLCH-CPS-098-2020",2020,"SECOP II","CPS-098-2020","Contratos de prestación de servicios profesionales y de apoyo a la gestión","Contratación directa","Prestación de servicios profesionales y de apoyo a la gestión, o para la ejecución de trabajos artísticos que sólo puedan encomendarse a determinadas personas naturales;"," PRESTAR LOS SERVICIOS PROFESIONALES ESPECIALIZADOS PARA APOYAR LA PLANEACIÓN, GESTIÓN Y SEGUIMIENTO A LAS NECESIDADES DE ÍNDOLE SOCIAL, EN ATENCIÓN AL DESARROLLO DE LA LOCALIDAD DE CHAPINERO","Inversión","Bogotá Mejor para Todos",45,{"$f":"IF(ISERROR(VLOOKUP(K110,Eje_Pilar_Prop!$C$2:$E$104,2,FALSE)),\" \",VLOOKUP(K110,Eje_Pilar_Prop!$C$2:$E$104,2,FALSE))","v":"Gobernanza e influencia local, regional e internacional"},{"$f":"IF(ISERROR(VLOOKUP(K110,Eje_Pilar_Prop!$C$2:$E$104,3,FALSE)),\" \",VLOOKUP(K110,Eje_Pilar_Prop!$C$2:$E$104,3,FALSE))","v":"Eje Transversal 4 Gobierno Legitimo, Fortalecimiento Local y Eficiencia"},1304,51736917,"OLGA LUCIA BRICEÑO GARCIA",30200000,0,0,0,0,30200000,30200000,"2020-05-19","2020-05-20","2020-11-19",120,1,60,null,null,null,null,null,null,"X",null,1,null,null,{"$f":"IF(SUMPRODUCT((A$14:A110=A110)*(B$14:B110=B110)*(D$14:D110=D110))>1,0,1)","v":1},"Contratos de prestación de servicios profesionales y de apoyo a la gestión","Contratación directa",{"$f":"IF(ISBLANK(G110),1,IFERROR(VLOOKUP(G110,Tipo!$C$12:$C$27,1,FALSE),\"NO\"))","v":"Prestación de servicios profesionales y de apoyo a la gestión, o para la ejecución de trabajos artísticos que sólo puedan encomendarse a determinadas personas naturales;"},"Inversión",{"$f":"IF(ISBLANK(K110),1,IFERROR(VLOOKUP(K110,Eje_Pilar_Prop!$C$3:$C$104,1,FALSE),\"NO\"))","v":45},"SECOP II",1,"Bogotá Mejor para Todos"]
["FDLCH-CPS-099-2020",2020,"SECOP II","CPS-099-2020","Contratos de prestación de servicios profesionales y de apoyo a la gestión","Contratación directa","Prestación de servicios profesionales y de apoyo a la gestión, o para la ejecución de trabajos artísticos que sólo puedan encomendarse a determinadas personas naturales;","PRESTAR LOS SERVICIOS PROFESIONALES PARA APOYAR LOS MECANISMOS DE COMUNICACIÓN LOCAL, ADMINISTRANDO CON LAS DIFERENTES INSTANCIAS LA APLICACIÓN DE ESTUDIOS Y NORMAS TÉCNICAS PARA LA PROYECCIÓN Y DIVULGACIÓN DE LA IMAGEN CORPORATIVA DE LA LOCALIDAD DE CHAPINERO.","Inversión","Bogotá Mejor para Todos",45,{"$f":"IF(ISERROR(VLOOKUP(K111,Eje_Pilar_Prop!$C$2:$E$104,2,FALSE)),\" \",VLOOKUP(K111,Eje_Pilar_Prop!$C$2:$E$104,2,FALSE))","v":"Gobernanza e influencia local, regional e internacional"},{"$f":"IF(ISERROR(VLOOKUP(K111,Eje_Pilar_Prop!$C$2:$E$104,3,FALSE)),\" \",VLOOKUP(K111,Eje_Pilar_Prop!$C$2:$E$104,3,FALSE))","v":"Eje Transversal 4 Gobierno Legitimo, Fortalecimiento Local y Eficiencia"},1304,1026576669,"FABIAN ESTIVEN HIGUERA ROMERO",18000000,0,0,1,9000000,27000000,27000000,"2020-05-19","2020-05-22","2020-12-31",219,0,0,null,null,null,null,null,null,"X",null,1,null,null,{"$f":"IF(SUMPRODUCT((A$14:A111=A111)*(B$14:B111=B111)*(D$14:D111=D111))>1,0,1)","v":1},"Contratos de prestación de servicios profesionales y de apoyo a la gestión","Contratación directa",{"$f":"IF(ISBLANK(G111),1,IFERROR(VLOOKUP(G111,Tipo!$C$12:$C$27,1,FALSE),\"NO\"))","v":"Prestación de servicios profesionales y de apoyo a la gestión, o para la ejecución de trabajos artísticos que sólo puedan encomendarse a determinadas personas naturales;"},"Inversión",{"$f":"IF(ISBLANK(K111),1,IFERROR(VLOOKUP(K111,Eje_Pilar_Prop!$C$3:$C$104,1,FALSE),\"NO\"))","v":45},"SECOP II",1,"Bogotá Mejor para Todos"]
["FDLCH-CPS-100-2020",2020,"SECOP II","PMINC-002-2020","Contratos de prestación de servicios","Contratación mínima cuantia","No aplica","PRESTACIÓN DE SERVICIOS DE FOTOCOPIADO Y REPRODUCCIÓN DE DOCUMENTOS PARA LA ALCALDÍA LOCAL DE CHAPINERO","Funcionamiento","Bogotá Mejor para Todos",null,{"$f":"IF(ISERROR(VLOOKUP(K112,Eje_Pilar_Prop!$C$2:$E$104,2,FALSE)),\" \",VLOOKUP(K112,Eje_Pilar_Prop!$C$2:$E$104,2,FALSE))","v":" "},{"$f":"IF(ISERROR(VLOOKUP(K112,Eje_Pilar_Prop!$C$2:$E$104,3,FALSE)),\" \",VLOOKUP(K112,Eje_Pilar_Prop!$C$2:$E$104,3,FALSE))","v":" "},13102020203050,8300319767,"COPIERS MARKET EU",21058681,0,0,0,0,21058681,0,"2020-05-21","2020-05-22",{"$f":"+Y112","v":"2020-05-22"},120,0,0,null,null,null,null,null,null,"X",null,0,null,null,{"$f":"IF(SUMPRODUCT((A$14:A112=A112)*(B$14:B112=B112)*(D$14:D112=D112))>1,0,1)","v":1},"Contratos de prestación de servicios","Contratación mínima cuantia",{"$f":"IF(ISBLANK(G112),1,IFERROR(VLOOKUP(G112,Tipo!$C$12:$C$27,1,FALSE),\"NO\"))","v":"NO"},"Funcionamiento",{"$f":"IF(ISBLANK(K112),1,IFERROR(VLOOKUP(K112,Eje_Pilar_Prop!$C$3:$C$104,1,FALSE),\"NO\"))","v":1},"SECOP II",1,"Bogotá Mejor para Todos"]
["FDLCH-CPS-102-2020",2020,"SECOP II","CPS-102-2020","Contratos de prestación de servicios profesionales y de apoyo a la gestión","Contratación directa","Prestación de servicios profesionales y de apoyo a la gestión, o para la ejecución de trabajos artísticos que sólo puedan encomendarse a determinadas personas naturales;","PRESTAR LOS SERVICIOS TÉCNICOS PARA APOYAR LA GESTIÓN Y EJECUCIÓN DE ACTIVIDADES ADMINISTRATIVAS QUE SE ADELANTAN EN EL DESPACHO DE LA ALCALDÍA LOCAL DE CHAPINERO DE ACUERDO CON LAS CONDICIONES Y ESPECIFICACIONES TÉCNICAS DESCRITAS EN LOS ESTUDIOS PREVIOS","Inversión","Bogotá Mejor para Todos",45,{"$f":"IF(ISERROR(VLOOKUP(K113,Eje_Pilar_Prop!$C$2:$E$104,2,FALSE)),\" \",VLOOKUP(K113,Eje_Pilar_Prop!$C$2:$E$104,2,FALSE))","v":"Gobernanza e influencia local, regional e internacional"},{"$f":"IF(ISERROR(VLOOKUP(K113,Eje_Pilar_Prop!$C$2:$E$104,3,FALSE)),\" \",VLOOKUP(K113,Eje_Pilar_Prop!$C$2:$E$104,3,FALSE))","v":"Eje Transversal 4 Gobierno Legitimo, Fortalecimiento Local y Eficiencia"},1304,1091663411,"JUAN PABLO SANJUAN ARIAS",10400000,0,0,0,0,10400000,10400000,"2020-05-22","2020-05-26","2020-09-22",120,0,0,null,null,null,null,null,null,"X",null,1,null,null,{"$f":"IF(SUMPRODUCT((A$14:A113=A113)*(B$14:B113=B113)*(D$14:D113=D113))>1,0,1)","v":1},"Contratos de prestación de servicios profesionales y de apoyo a la gestión","Contratación directa",{"$f":"IF(ISBLANK(G113),1,IFERROR(VLOOKUP(G113,Tipo!$C$12:$C$27,1,FALSE),\"NO\"))","v":"Prestación de servicios profesionales y de apoyo a la gestión, o para la ejecución de trabajos artísticos que sólo puedan encomendarse a determinadas personas naturales;"},"Inversión",{"$f":"IF(ISBLANK(K113),1,IFERROR(VLOOKUP(K113,Eje_Pilar_Prop!$C$3:$C$104,1,FALSE),\"NO\"))","v":45},"SECOP II",1,"Bogotá Mejor para Todos"]
["FDLCH-CPS-103-2020",2020,"SECOP II","CPS-103-2020","Contratos de prestación de servicios profesionales y de apoyo a la gestión","Contratación directa","Prestación de servicios profesionales y de apoyo a la gestión, o para la ejecución de trabajos artísticos que sólo puedan encomendarse a determinadas personas naturales;","PRESTAR LOS SERVICIOS DE APOYO A LA GESTIÓN PARA ASISTIR LOGÍSTICAMENTE AL DESPACHO DE LA ALCALDÍA LOCAL DE CHAPINERO DE ACUERDO CON LAS CONDICIONES Y ESPECIFICACIONES TÉCNICAS DESCRITAS EN LOS ESTUDIOS PREVIOS","Inversión","Bogotá Mejor para Todos",45,{"$f":"IF(ISERROR(VLOOKUP(K114,Eje_Pilar_Prop!$C$2:$E$104,2,FALSE)),\" \",VLOOKUP(K114,Eje_Pilar_Prop!$C$2:$E$104,2,FALSE))","v":"Gobernanza e influencia local, regional e internacional"},{"$f":"IF(ISERROR(VLOOKUP(K114,Eje_Pilar_Prop!$C$2:$E$104,3,FALSE)),\" \",VLOOKUP(K114,Eje_Pilar_Prop!$C$2:$E$104,3,FALSE))","v":"Eje Transversal 4 Gobierno Legitimo, Fortalecimiento Local y Eficiencia"},1304,73159185,"GERMAN ENRIQUE CASTILLO CORREA",8000000,0,0,0,0,8000000,7800000,"2020-05-26","2020-05-27","2020-09-14",120,0,0,null,null,null,null,null,null,"X",null,0.97499999999999998,null,null,{"$f":"IF(SUMPRODUCT((A$14:A114=A114)*(B$14:B114=B114)*(D$14:D114=D114))>1,0,1)","v":1},"Contratos de prestación de servicios profesionales y de apoyo a la gestión","Contratación directa",{"$f":"IF(ISBLANK(G114),1,IFERROR(VLOOKUP(G114,Tipo!$C$12:$C$27,1,FALSE),\"NO\"))","v":"Prestación de servicios profesionales y de apoyo a la gestión, o para la ejecución de trabajos artísticos que sólo puedan encomendarse a determinadas personas naturales;"},"Inversión",{"$f":"IF(ISBLANK(K114),1,IFERROR(VLOOKUP(K114,Eje_Pilar_Prop!$C$3:$C$104,1,FALSE),\"NO\"))","v":45},"SECOP II",1,"Bogotá Mejor para Todos"]
["FDLCH-CPS-104-2020",2020,"SECOP II","CPS-104-2020","Contratos de prestación de servicios profesionales y de apoyo a la gestión","Contratación directa","Prestación de servicios profesionales y de apoyo a la gestión, o para la ejecución de trabajos artísticos que sólo puedan encomendarse a determinadas personas naturales;","PRESTAR LOS SERVICIOS PROFESIONALES PARA APOYAR LA PLANEACIÓN Y SEGUIMIENTO DE LA GESTIÓN TERRITORIAL DE LA LOCALIDAD DE CHAPINERO","Inversión","Bogotá Mejor para Todos",45,{"$f":"IF(ISERROR(VLOOKUP(K115,Eje_Pilar_Prop!$C$2:$E$104,2,FALSE)),\" \",VLOOKUP(K115,Eje_Pilar_Prop!$C$2:$E$104,2,FALSE))","v":"Gobernanza e influencia local, regional e internacional"},{"$f":"IF(ISERROR(VLOOKUP(K115,Eje_Pilar_Prop!$C$2:$E$104,3,FALSE)),\" \",VLOOKUP(K115,Eje_Pilar_Prop!$C$2:$E$104,3,FALSE))","v":"Eje Transversal 4 Gobierno Legitimo, Fortalecimiento Local y Eficiencia"},1304,1123320414,"KAREN JOHANA CASTRO NUÑEZ",20000000,1,-2166667,0,0,17833333,17833334,"2020-06-03","2020-06-04",{"$f":"+Y115","v":"2020-06-04"},120,0,0,null,null,null,null,null,null,"X",null,1.0000000560747675,null,null,{"$f":"IF(SUMPRODUCT((A$14:A115=A115)*(B$14:B115=B115)*(D$14:D115=D115))>1,0,1)","v":1},"Contratos de prestación de servicios profesionales y de apoyo a la gestión","Contratación directa",{"$f":"IF(ISBLANK(G115),1,IFERROR(VLOOKUP(G115,Tipo!$C$12:$C$27,1,FALSE),\"NO\"))","v":"Prestación de servicios profesionales y de apoyo a la gestión, o para la ejecución de trabajos artísticos que sólo puedan encomendarse a determinadas personas naturales;"},"Inversión",{"$f":"IF(ISBLANK(K115),1,IFERROR(VLOOKUP(K115,Eje_Pilar_Prop!$C$3:$C$104,1,FALSE),\"NO\"))","v":45},"SECOP II",1,"Bogotá Mejor para Todos"]
["FDLCH-CPS-105-2020",2020,"SECOP II","CPS-105-2020","Contratos de prestación de servicios profesionales y de apoyo a la gestión","Contratación directa","Prestación de servicios profesionales y de apoyo a la gestión, o para la ejecución de trabajos artísticos que sólo puedan encomendarse a determinadas personas naturales;"," PRESTAR LOS SERVICIOS DE APOYO A LA GESTIÓN EN LA EJECUCIÓN DE LAS ACTIVIDADES ADMINISTRATIVAS QUE SE ADELANTAN POR EL PERSONAL JURÍDICO DEL DESPACHO DE LA ALCALDÍA LOCAL DE CHAPINERO","Inversión","Bogotá Mejor para Todos",45,{"$f":"IF(ISERROR(VLOOKUP(K116,Eje_Pilar_Prop!$C$2:$E$104,2,FALSE)),\" \",VLOOKUP(K116,Eje_Pilar_Prop!$C$2:$E$104,2,FALSE))","v":"Gobernanza e influencia local, regional e internacional"},{"$f":"IF(ISERROR(VLOOKUP(K116,Eje_Pilar_Prop!$C$2:$E$104,3,FALSE)),\" \",VLOOKUP(K116,Eje_Pilar_Prop!$C$2:$E$104,3,FALSE))","v":"Eje Transversal 4 Gobierno Legitimo, Fortalecimiento Local y Eficiencia"},1304,51765934,"MARIA DIACLIN RODRIGUEZ PULECIO",7376000,0,0,0,0,7376000,7376000,"2020-06-10","2020-06-12","2020-09-08",88,0,0,null,null,null,null,null,null,"X",null,1,null,null,{"$f":"IF(SUMPRODUCT((A$14:A116=A116)*(B$14:B116=B116)*(D$14:D116=D116))>1,0,1)","v":1},"Contratos de prestación de servicios profesionales y de apoyo a la gestión","Contratación directa",{"$f":"IF(ISBLANK(G116),1,IFERROR(VLOOKUP(G116,Tipo!$C$12:$C$27,1,FALSE),\"NO\"))","v":"Prestación de servicios profesionales y de apoyo a la gestión, o para la ejecución de trabajos artísticos que sólo puedan encomendarse a determinadas personas naturales;"},"Inversión",{"$f":"IF(ISBLANK(K116),1,IFERROR(VLOOKUP(K116,Eje_Pilar_Prop!$C$3:$C$104,1,FALSE),\"NO\"))","v":45},"SECOP II",1,"Bogotá Mejor para Todos"]
["FDLCH-OC-106-2020",2020,"SECOP II","OC-106-2020 \n50292","Compraventa de bienes muebles","Contratación mínima cuantia","No aplica","LA ALCALDÍA LOCAL DE CHAPINERO REQUIERE ADQUIRIR ELEMENTOS DE BIOSEGURIDAD, EN RAZÓN A LA DECLARATORIA DE ESTADO DE EMERGENCIA Y CALAMIDAD PÚBLICA, POR EL COVID 19, Y EN ARAS DE LLENAR TODOS LOS PROTOCOLOS DE BIOSEGURIDAD EN SUS INSTALACIONES, DEBIDO A LA ATENCIÓN AL PÚBLICO, Y TAMBIÉN PARA PROTEGER A LOS FUNCIONARIOS Y CONTRATISTAS, QUE LABORAN EN LA ENTIDAD","Inversión","Bogotá Mejor para Todos",45,{"$f":"IF(ISERROR(VLOOKUP(K117,Eje_Pilar_Prop!$C$2:$E$104,2,FALSE)),\" \",VLOOKUP(K117,Eje_Pilar_Prop!$C$2:$E$104,2,FALSE))","v":"Gobernanza e influencia local, regional e internacional"},{"$f":"IF(ISERROR(VLOOKUP(K117,Eje_Pilar_Prop!$C$2:$E$104,3,FALSE)),\" \",VLOOKUP(K117,Eje_Pilar_Prop!$C$2:$E$104,3,FALSE))","v":"Eje Transversal 4 Gobierno Legitimo, Fortalecimiento Local y Eficiencia"},1304,890900943,"COLOMBIANA DE COMERCIO S.A Y/O ALKOSTO S.A",11891320,1,-6314,0,0,11885006,11885006,"2020-06-10","2020-06-12","2020-12-21",120,1,60,null,null,null,null,null,null,"X",null,1,null,null,{"$f":"IF(SUMPRODUCT((A$14:A117=A117)*(B$14:B117=B117)*(D$14:D117=D117))>1,0,1)","v":1},"Compraventa de bienes muebles","Contratación mínima cuantia",{"$f":"IF(ISBLANK(G117),1,IFERROR(VLOOKUP(G117,Tipo!$C$12:$C$27,1,FALSE),\"NO\"))","v":"NO"},"Inversión",{"$f":"IF(ISBLANK(K117),1,IFERROR(VLOOKUP(K117,Eje_Pilar_Prop!$C$3:$C$104,1,FALSE),\"NO\"))","v":45},"SECOP II",1,"Bogotá Mejor para Todos"]
["FDLCH-CPS-107-2020",2020,"SECOP II","CPS-107-2020","Contratos de prestación de servicios profesionales y de apoyo a la gestión","Contratación directa","Prestación de servicios profesionales y de apoyo a la gestión, o para la ejecución de trabajos artísticos que sólo puedan encomendarse a determinadas personas naturales;","PRESTACIÓN DE SERVICIOS PROFESIONALES PARA EL APOYO AL DESPACHO DE LA ALCALDÍA LOCAL DE CHAPINERO EN LA ADMINISTRACIÓN Y SOPORTE A LA INFRAESTRUCTURA TECNOLÓGICA EN PROPIEDAD O CUSTODIA Y PARA REALIZAR ACTIVIDADES DE FORMULACIÓN DE PROYECTOS QUE LE SEAN ASIGNADOS Y ACTIVIDADES DE APOYO A LA SUPERVISIÓN DE LOS CONTRATOS QUE LE FUEREN ASIGNADOS","Inversión","Bogotá Mejor para Todos",45,{"$f":"IF(ISERROR(VLOOKUP(K118,Eje_Pilar_Prop!$C$2:$E$104,2,FALSE)),\" \",VLOOKUP(K118,Eje_Pilar_Prop!$C$2:$E$104,2,FALSE))","v":"Gobernanza e influencia local, regional e internacional"},{"$f":"IF(ISERROR(VLOOKUP(K118,Eje_Pilar_Prop!$C$2:$E$104,3,FALSE)),\" \",VLOOKUP(K118,Eje_Pilar_Prop!$C$2:$E$104,3,FALSE))","v":"Eje Transversal 4 Gobierno Legitimo, Fortalecimiento Local y Eficiencia"},1304,7166701,"FREDY YOVANNI BORDA CEPEDA",19320000,0,0,1,9660000,28980000,25599000,"2020-06-11","2020-06-12",{"$f":"+Y118","v":"2020-06-12"},120,0,0,null,null,null,null,null,null,"X",null,0.8833333333333333,null,null,{"$f":"IF(SUMPRODUCT((A$14:A118=A118)*(B$14:B118=B118)*(D$14:D118=D118))>1,0,1)","v":1},"Contratos de prestación de servicios profesionales y de apoyo a la gestión","Contratación directa",{"$f":"IF(ISBLANK(G118),1,IFERROR(VLOOKUP(G118,Tipo!$C$12:$C$27,1,FALSE),\"NO\"))","v":"Prestación de servicios profesionales y de apoyo a la gestión, o para la ejecución de trabajos artísticos que sólo puedan encomendarse a determinadas personas naturales;"},"Inversión",{"$f":"IF(ISBLANK(K118),1,IFERROR(VLOOKUP(K118,Eje_Pilar_Prop!$C$3:$C$104,1,FALSE),\"NO\"))","v":45},"SECOP II",1,"Bogotá Mejor para Todos"]
["FDLCH-CPS-108-2020",2020,"SECOP II","CPS-108-2020","Contratos de prestación de servicios profesionales y de apoyo a la gestión","Contratación directa","Prestación de servicios profesionales y de apoyo a la gestión, o para la ejecución de trabajos artísticos que sólo puedan encomendarse a determinadas personas naturales;","PRESTAR LOS SERVICIOS PROFESIONALES DE APOYO AL ÁREA DE GESTIÓN DEL DESARROLLO LOCAL, EN TEMAS ESPECÍFICOS DE PLANEACIÓN, PARA LAS ACTIVIDADES RELACIONADAS CON LA FORMULACIÓN, SEGUIMIENTO Y CIERRE DE PROYECTOS Y ESTRUCTURACIÓN Y CIERRE DE LOS PLANES DE DESARROLLO LOCAL, ASÍ COMO EL SEGUIMIENTO PRESUPUESTAL DE LA VIGENCIA","Inversión","Bogotá Mejor para Todos",45,{"$f":"IF(ISERROR(VLOOKUP(K119,Eje_Pilar_Prop!$C$2:$E$104,2,FALSE)),\" \",VLOOKUP(K119,Eje_Pilar_Prop!$C$2:$E$104,2,FALSE))","v":"Gobernanza e influencia local, regional e internacional"},{"$f":"IF(ISERROR(VLOOKUP(K119,Eje_Pilar_Prop!$C$2:$E$104,3,FALSE)),\" \",VLOOKUP(K119,Eje_Pilar_Prop!$C$2:$E$104,3,FALSE))","v":"Eje Transversal 4 Gobierno Legitimo, Fortalecimiento Local y Eficiencia"},1304,1032381420,"JENNIFER TORRES TORRES",21200000,0,0,0,0,21200000,21200000,"2020-06-11","2020-06-12","2020-12-21",120,1,60,null,null,null,null,null,null,"X",null,1,null,null,{"$f":"IF(SUMPRODUCT((A$14:A119=A119)*(B$14:B119=B119)*(D$14:D119=D119))>1,0,1)","v":1},"Contratos de prestación de servicios profesionales y de apoyo a la gestión","Contratación directa",{"$f":"IF(ISBLANK(G119),1,IFERROR(VLOOKUP(G119,Tipo!$C$12:$C$27,1,FALSE),\"NO\"))","v":"Prestación de servicios profesionales y de apoyo a la gestión, o para la ejecución de trabajos artísticos que sólo puedan encomendarse a determinadas personas naturales;"},"Inversión",{"$f":"IF(ISBLANK(K119),1,IFERROR(VLOOKUP(K119,Eje_Pilar_Prop!$C$3:$C$104,1,FALSE),\"NO\"))","v":45},"SECOP II",1,"Bogotá Mejor para Todos"]
["FDLCH-CPS-109-2020",2020,"SECOP II","CPS-109-2020","Contratos de prestación de servicios profesionales y de apoyo a la gestión","Contratación directa","Prestación de servicios profesionales y de apoyo a la gestión, o para la ejecución de trabajos artísticos que sólo puedan encomendarse a determinadas personas naturales;","PRESTAR LOS SERVICIOS PROFESIONALES DE APOYO AL ÁREA DE GESTIÓN DEL DESARROLLO LOCAL, EN TEMAS DE PLANEACIÓN, PRESUPUESTACIÓN Y MECANISMOS DE COOPERACIÓN DEL FONDO DE DESARROLLO LOCAL","Inversión","Bogotá Mejor para Todos",45,{"$f":"IF(ISERROR(VLOOKUP(K120,Eje_Pilar_Prop!$C$2:$E$104,2,FALSE)),\" \",VLOOKUP(K120,Eje_Pilar_Prop!$C$2:$E$104,2,FALSE))","v":"Gobernanza e influencia local, regional e internacional"},{"$f":"IF(ISERROR(VLOOKUP(K120,Eje_Pilar_Prop!$C$2:$E$104,3,FALSE)),\" \",VLOOKUP(K120,Eje_Pilar_Prop!$C$2:$E$104,3,FALSE))","v":"Eje Transversal 4 Gobierno Legitimo, Fortalecimiento Local y Eficiencia"},1304,1062876986,"NADIA PAOLA MARQUEZ LARA",16000000,0,0,1,8000000,24000000,21200000,"2020-06-10","2020-06-12","2020-09-08",88,0,0,null,null,null,null,null,null,"X",null,0.8833333333333333,null,null,{"$f":"IF(SUMPRODUCT((A$14:A120=A120)*(B$14:B120=B120)*(D$14:D120=D120))>1,0,1)","v":1},"Contratos de prestación de servicios profesionales y de apoyo a la gestión","Contratación directa",{"$f":"IF(ISBLANK(G120),1,IFERROR(VLOOKUP(G120,Tipo!$C$12:$C$27,1,FALSE),\"NO\"))","v":"Prestación de servicios profesionales y de apoyo a la gestión, o para la ejecución de trabajos artísticos que sólo puedan encomendarse a determinadas personas naturales;"},"Inversión",{"$f":"IF(ISBLANK(K120),1,IFERROR(VLOOKUP(K120,Eje_Pilar_Prop!$C$3:$C$104,1,FALSE),\"NO\"))","v":45},"SECOP II",1,"Bogotá Mejor para Todos"]
["FDLCH-OC-110-2020",2020,"SECOP II","OC-110-2020 \n50293","Compraventa de bienes muebles","Contratación mínima cuantia","No aplica","LA ALCALDÍA LOCAL DE CHAPINERO REQUIERE ADQUIRIR ELEMENTOS DE BIOSEGURIDAD, EN RAZÓN A LA DECLARATORIA DE ESTADO DE EMERGENCIA Y CALAMIDAD PÚBLICA, POR EL COVID 19, Y EN ARAS DE LLENAR TODOS LOS PROTOCOLOS DE BIOSEGURIDAD EN SUS INSTALACIONES, DEBIDO A LA ATENCIÓN AL PÚBLICO, Y TAMBIÉN PARA PROTEGER A LOS FUNCIONARIOS Y CONTRATISTAS, QUE LABORAN EN LA ENTIDAD","Inversión","Bogotá Mejor para Todos",45,{"$f":"IF(ISERROR(VLOOKUP(K121,Eje_Pilar_Prop!$C$2:$E$104,2,FALSE)),\" \",VLOOKUP(K121,Eje_Pilar_Prop!$C$2:$E$104,2,FALSE))","v":"Gobernanza e influencia local, regional e internacional"},{"$f":"IF(ISERROR(VLOOKUP(K121,Eje_Pilar_Prop!$C$2:$E$104,3,FALSE)),\" \",VLOOKUP(K121,Eje_Pilar_Prop!$C$2:$E$104,3,FALSE))","v":"Eje Transversal 4 Gobierno Legitimo, Fortalecimiento Local y Eficiencia"},1304,800237412,"FERRICENTROS S.A.S.",904400,0,0,0,0,904400,0,"2020-06-10","2020-06-12","2020-09-08",88,0,0,null,null,null,null,null,null,"X",null,0,null,null,{"$f":"IF(SUMPRODUCT((A$14:A121=A121)*(B$14:B121=B121)*(D$14:D121=D121))>1,0,1)","v":1},"Compraventa de bienes muebles","Contratación mínima cuantia",{"$f":"IF(ISBLANK(G121),1,IFERROR(VLOOKUP(G121,Tipo!$C$12:$C$27,1,FALSE),\"NO\"))","v":"NO"},"Inversión",{"$f":"IF(ISBLANK(K121),1,IFERROR(VLOOKUP(K121,Eje_Pilar_Prop!$C$3:$C$104,1,FALSE),\"NO\"))","v":45},"SECOP II",1,"Bogotá Mejor para Todos"]
["FDLCH-OC-111-2020",2020,"SECOP II","OC-111-2020 \n50294","Compraventa de bienes muebles","Contratación mínima cuantia","No aplica","LA ALCALDÍA LOCAL DE CHAPINERO REQUIERE ADQUIRIR ELEMENTOS DE BIOSEGURIDAD, EN RAZÓN A LA DECLARATORIA DE ESTADO DE EMERGENCIA Y CALAMIDAD PÚBLICA, POR EL COVID 19, Y EN ARAS DE LLENAR TODOS LOS PROTOCOLOS DE BIOSEGURIDAD EN SUS INSTALACIONES, DEBIDO A LA ATENCIÓN AL PÚBLICO, Y TAMBIÉN PARA PROTEGER A LOS FUNCIONARIOS Y CONTRATISTAS, QUE LABORAN EN LA ENTIDAD","Inversión","Bogotá Mejor para Todos",45,{"$f":"IF(ISERROR(VLOOKUP(K122,Eje_Pilar_Prop!$C$2:$E$104,2,FALSE)),\" \",VLOOKUP(K122,Eje_Pilar_Prop!$C$2:$E$104,2,FALSE))","v":"Gobernanza e influencia local, regional e internacional"},{"$f":"IF(ISERROR(VLOOKUP(K122,Eje_Pilar_Prop!$C$2:$E$104,3,FALSE)),\" \",VLOOKUP(K122,Eje_Pilar_Prop!$C$2:$E$104,3,FALSE))","v":"Eje Transversal 4 Gobierno Legitimo, Fortalecimiento Local y Eficiencia"},1304,830037946,"PANAMERICANA LIBRERÍA Y PAPELERÍA S.A.",3986520,1,-590520,0,0,3396000,3396000,"2020-06-17","2020-06-19",{"$f":"+Y122","v":"2020-06-19"},120,0,0,null,null,null,null,null,null,"X",null,1,null,null,{"$f":"IF(SUMPRODUCT((A$14:A122=A122)*(B$14:B122=B122)*(D$14:D122=D122))>1,0,1)","v":1},"Compraventa de bienes muebles","Contratación mínima cuantia",{"$f":"IF(ISBLANK(G122),1,IFERROR(VLOOKUP(G122,Tipo!$C$12:$C$27,1,FALSE),\"NO\"))","v":"NO"},"Inversión",{"$f":"IF(ISBLANK(K122),1,IFERROR(VLOOKUP(K122,Eje_Pilar_Prop!$C$3:$C$104,1,FALSE),\"NO\"))","v":45},"SECOP II",1,"Bogotá Mejor para Todos"]
["FDLCH-CPS-112-2020",2020,"SECOP II","CPS-112-2020","Contratos de prestación de servicios profesionales y de apoyo a la gestión","Contratación directa","Prestación de servicios profesionales y de apoyo a la gestión, o para la ejecución de trabajos artísticos que sólo puedan encomendarse a determinadas personas naturales;","PRESTACIÓN DE SERVICIOS PROFESIONALES PARA COORDINAR, LIDERAR Y ASESORAR LOS PLANES Y ESTRATEGIAS DE COMUNICACIÓN INTERNA Y EXTERNA PARA LA DIVULGACIÓN DE LOS PROGRAMAS, PROYECTOS Y ACTIVIDADES DE LA ALCALDÍA LOCAL","Inversión","Bogotá Mejor para Todos",45,{"$f":"IF(ISERROR(VLOOKUP(K123,Eje_Pilar_Prop!$C$2:$E$104,2,FALSE)),\" \",VLOOKUP(K123,Eje_Pilar_Prop!$C$2:$E$104,2,FALSE))","v":"Gobernanza e influencia local, regional e internacional"},{"$f":"IF(ISERROR(VLOOKUP(K123,Eje_Pilar_Prop!$C$2:$E$104,3,FALSE)),\" \",VLOOKUP(K123,Eje_Pilar_Prop!$C$2:$E$104,3,FALSE))","v":"Eje Transversal 4 Gobierno Legitimo, Fortalecimiento Local y Eficiencia"},1304,1026283792,"ESTEFANIA AYALA QUICENO",22000000,0,0,0,0,22000000,22000000,"2020-06-23","2020-06-24","2020-12-23",120,1,60,null,null,null,null,null,null,"X",null,1,null,null,{"$f":"IF(SUMPRODUCT((A$14:A123=A123)*(B$14:B123=B123)*(D$14:D123=D123))>1,0,1)","v":1},"Contratos de prestación de servicios profesionales y de apoyo a la gestión","Contratación directa",{"$f":"IF(ISBLANK(G123),1,IFERROR(VLOOKUP(G123,Tipo!$C$12:$C$27,1,FALSE),\"NO\"))","v":"Prestación de servicios profesionales y de apoyo a la gestión, o para la ejecución de trabajos artísticos que sólo puedan encomendarse a determinadas personas naturales;"},"Inversión",{"$f":"IF(ISBLANK(K123),1,IFERROR(VLOOKUP(K123,Eje_Pilar_Prop!$C$3:$C$104,1,FALSE),\"NO\"))","v":45},"SECOP II",1,"Bogotá Mejor para Todos"]
["FDLCH-CPS-113-2020",2020,"SECOP II","CPS-113-2020","Contratos de prestación de servicios profesionales y de apoyo a la gestión","Contratación directa","Prestación de servicios profesionales y de apoyo a la gestión, o para la ejecución de trabajos artísticos que sólo puedan encomendarse a determinadas personas naturales;","PRESTACIÓN DE SERVICIOS PERSONALES NECESARIOS PARA APOYAR LA GESTIÓN Y EJECUCIÓN DE ACTIVIDADES ADMINISTRATIVAS, OPERATIVAS Y LOGÍSTICAS QUE SE ADELANTAN EN EL ÁREA DE GESTIÓN DEL DESARROLLO LOCAL DE LA ALCALDÍA LOCAL DE CHAPINERO. ","Inversión","Bogotá Mejor para Todos",45,{"$f":"IF(ISERROR(VLOOKUP(K124,Eje_Pilar_Prop!$C$2:$E$104,2,FALSE)),\" \",VLOOKUP(K124,Eje_Pilar_Prop!$C$2:$E$104,2,FALSE))","v":"Gobernanza e influencia local, regional e internacional"},{"$f":"IF(ISERROR(VLOOKUP(K124,Eje_Pilar_Prop!$C$2:$E$104,3,FALSE)),\" \",VLOOKUP(K124,Eje_Pilar_Prop!$C$2:$E$104,3,FALSE))","v":"Eje Transversal 4 Gobierno Legitimo, Fortalecimiento Local y Eficiencia"},1304,2996195,"MEYER JAIRO GACHARNA VILLALBA",8700000,0,0,1,4350000,13050000,11382500,"2020-06-18","2020-06-19","2020-12-18",120,1,60,null,null,null,null,null,null,"X",null,0.87222222222222223,null,null,{"$f":"IF(SUMPRODUCT((A$14:A124=A124)*(B$14:B124=B124)*(D$14:D124=D124))>1,0,1)","v":1},"Contratos de prestación de servicios profesionales y de apoyo a la gestión","Contratación directa",{"$f":"IF(ISBLANK(G124),1,IFERROR(VLOOKUP(G124,Tipo!$C$12:$C$27,1,FALSE),\"NO\"))","v":"Prestación de servicios profesionales y de apoyo a la gestión, o para la ejecución de trabajos artísticos que sólo puedan encomendarse a determinadas personas naturales;"},"Inversión",{"$f":"IF(ISBLANK(K124),1,IFERROR(VLOOKUP(K124,Eje_Pilar_Prop!$C$3:$C$104,1,FALSE),\"NO\"))","v":45},"SECOP II",1,"Bogotá Mejor para Todos"]
["FDLCH-CPS-114-2020",2020,"SECOP II","CPS-114-2020","Contratos de prestación de servicios profesionales y de apoyo a la gestión","Contratación directa","Prestación de servicios profesionales y de apoyo a la gestión, o para la ejecución de trabajos artísticos que sólo puedan encomendarse a determinadas personas naturales;","PRESTACIÓN DE SERVICIOS PARA EL APOYO EN LA EJECUCIÓN DE ACTIVIDADES ADMINISTRATIVAS Y OPERATIVAS TRANSVERSALES AL ÁREA DE GESTIÓN DEL DESARROLLO LOCAL RELACIONADAS CON LA GESTIÓN CONTRACTUAL DE LA ALCALDÍA LOCAL DE CHAPINERO","Inversión","Bogotá Mejor para Todos",45,{"$f":"IF(ISERROR(VLOOKUP(K125,Eje_Pilar_Prop!$C$2:$E$104,2,FALSE)),\" \",VLOOKUP(K125,Eje_Pilar_Prop!$C$2:$E$104,2,FALSE))","v":"Gobernanza e influencia local, regional e internacional"},{"$f":"IF(ISERROR(VLOOKUP(K125,Eje_Pilar_Prop!$C$2:$E$104,3,FALSE)),\" \",VLOOKUP(K125,Eje_Pilar_Prop!$C$2:$E$104,3,FALSE))","v":"Eje Transversal 4 Gobierno Legitimo, Fortalecimiento Local y Eficiencia"},1304,52119337,"MARTHA YANETH VASQUEZ FIGUEROA",9816660,0,0,1,4908330,14724990,14724990,"2020-06-17","2020-06-18",{"$f":"+Y124","v":"2020-06-19"},120,0,0,null,null,null,null,null,null,"X",null,1,null,null,{"$f":"IF(SUMPRODUCT((A$14:A125=A125)*(B$14:B125=B125)*(D$14:D125=D125))>1,0,1)","v":1},"Contratos de prestación de servicios profesionales y de apoyo a la gestión","Contratación directa",{"$f":"IF(ISBLANK(G125),1,IFERROR(VLOOKUP(G125,Tipo!$C$12:$C$27,1,FALSE),\"NO\"))","v":"Prestación de servicios profesionales y de apoyo a la gestión, o para la ejecución de trabajos artísticos que sólo puedan encomendarse a determinadas personas naturales;"},"Inversión",{"$f":"IF(ISBLANK(K125),1,IFERROR(VLOOKUP(K125,Eje_Pilar_Prop!$C$3:$C$104,1,FALSE),\"NO\"))","v":45},"SECOP II",1,"Bogotá Mejor para Todos"]
["FDLCH-CPS-115-2020",2020,"SECOP II","CPS-115-2020","Contratos de prestación de servicios profesionales y de apoyo a la gestión","Contratación directa","Prestación de servicios profesionales y de apoyo a la gestión, o para la ejecución de trabajos artísticos que sólo puedan encomendarse a determinadas personas naturales;","PRESTAR LOS SERVICIOS PROFESIONALES ESPECIALIZADOS PARA APOYAR LA COORDINACIÓN Y LA ARTICULACIÓN DE LA INTERVENCIÓN DEL EJERCICIO POLICIVO EN LA ALCALDÍA LOCAL DE CHAPINERO EN EL MARCO DE LA NORMATIVIDAD VIGENTE","Inversión","Bogotá Mejor para Todos",45,{"$f":"IF(ISERROR(VLOOKUP(K126,Eje_Pilar_Prop!$C$2:$E$104,2,FALSE)),\" \",VLOOKUP(K126,Eje_Pilar_Prop!$C$2:$E$104,2,FALSE))","v":"Gobernanza e influencia local, regional e internacional"},{"$f":"IF(ISERROR(VLOOKUP(K126,Eje_Pilar_Prop!$C$2:$E$104,3,FALSE)),\" \",VLOOKUP(K126,Eje_Pilar_Prop!$C$2:$E$104,3,FALSE))","v":"Eje Transversal 4 Gobierno Legitimo, Fortalecimiento Local y Eficiencia"},1304,79696907,"JUAN CARLOS GÓMEZ MELGAREJO ",28000000,0,0,0,0,28000000,28000000,"2020-06-18","2020-06-19",{"$f":"+Y125","v":"2020-06-18"},120,0,0,null,null,null,null,null,null,"X",null,1,null,null,{"$f":"IF(SUMPRODUCT((A$14:A126=A126)*(B$14:B126=B126)*(D$14:D126=D126))>1,0,1)","v":1},"Contratos de prestación de servicios profesionales y de apoyo a la gestión","Contratación directa",{"$f":"IF(ISBLANK(G126),1,IFERROR(VLOOKUP(G126,Tipo!$C$12:$C$27,1,FALSE),\"NO\"))","v":"Prestación de servicios profesionales y de apoyo a la gestión, o para la ejecución de trabajos artísticos que sólo puedan encomendarse a determinadas personas naturales;"},"Inversión",{"$f":"IF(ISBLANK(K126),1,IFERROR(VLOOKUP(K126,Eje_Pilar_Prop!$C$3:$C$104,1,FALSE),\"NO\"))","v":45},"SECOP II",1,"Bogotá Mejor para Todos"]
["FDLCH-CPS-116-2020",2020,"SECOP II","CPS-116-2020","Contratos de prestación de servicios profesionales y de apoyo a la gestión","Contratación directa","Prestación de servicios profesionales y de apoyo a la gestión, o para la ejecución de trabajos artísticos que sólo puedan encomendarse a determinadas personas naturales;","PRESTAR SERVICIOS PROFESIONALES PARA APOYAR LA GESTIÓN PRECONTRACTUAL Y CONTRACTUAL QUE ADELANTE EL FONDO DE DESARROLLO LOCAL DE CHAPINERO","Inversión","Bogotá Mejor para Todos",45,{"$f":"IF(ISERROR(VLOOKUP(K127,Eje_Pilar_Prop!$C$2:$E$104,2,FALSE)),\" \",VLOOKUP(K127,Eje_Pilar_Prop!$C$2:$E$104,2,FALSE))","v":"Gobernanza e influencia local, regional e internacional"},{"$f":"IF(ISERROR(VLOOKUP(K127,Eje_Pilar_Prop!$C$2:$E$104,3,FALSE)),\" \",VLOOKUP(K127,Eje_Pilar_Prop!$C$2:$E$104,3,FALSE))","v":"Eje Transversal 4 Gobierno Legitimo, Fortalecimiento Local y Eficiencia"},1304,79580307,"CESAR FRUTO CORREDOR GÓMEZ",24000000,0,0,0,0,24000000,24000000,"2020-06-17","2020-06-18",{"$f":"+Y126","v":"2020-06-19"},120,0,0,null,null,null,null,null,null,"X",null,1,null,null,{"$f":"IF(SUMPRODUCT((A$14:A127=A127)*(B$14:B127=B127)*(D$14:D127=D127))>1,0,1)","v":1},"Contratos de prestación de servicios profesionales y de apoyo a la gestión","Contratación directa",{"$f":"IF(ISBLANK(G127),1,IFERROR(VLOOKUP(G127,Tipo!$C$12:$C$27,1,FALSE),\"NO\"))","v":"Prestación de servicios profesionales y de apoyo a la gestión, o para la ejecución de trabajos artísticos que sólo puedan encomendarse a determinadas personas naturales;"},"Inversión",{"$f":"IF(ISBLANK(K127),1,IFERROR(VLOOKUP(K127,Eje_Pilar_Prop!$C$3:$C$104,1,FALSE),\"NO\"))","v":45},"SECOP II",1,"Bogotá Mejor para Todos"]
["FDLCH-CPS-117-2020",2020,"SECOP II","CPS-117-2020","Contratos de prestación de servicios profesionales y de apoyo a la gestión","Contratación directa","Prestación de servicios profesionales y de apoyo a la gestión, o para la ejecución de trabajos artísticos que sólo puedan encomendarse a determinadas personas naturales;","PRESTAR LOS SERVICIOS PROFESIONALES EN DERECHO PARA APOYAR JURÍDICAMENTE LA EJECUCIÓN DE LAS ACCIONES REQUERIDAS PARA LA DEPURACIÓN DE LAS ACTUACIONES ADMINISTRATIVAS QUE CURSAN EN LA ALCALDÍA LOCAL DE CHAPINERO","Inversión","Bogotá Mejor para Todos",45,{"$f":"IF(ISERROR(VLOOKUP(K128,Eje_Pilar_Prop!$C$2:$E$104,2,FALSE)),\" \",VLOOKUP(K128,Eje_Pilar_Prop!$C$2:$E$104,2,FALSE))","v":"Gobernanza e influencia local, regional e internacional"},{"$f":"IF(ISERROR(VLOOKUP(K128,Eje_Pilar_Prop!$C$2:$E$104,3,FALSE)),\" \",VLOOKUP(K128,Eje_Pilar_Prop!$C$2:$E$104,3,FALSE))","v":"Eje Transversal 4 Gobierno Legitimo, Fortalecimiento Local y Eficiencia"},1304,1012402720,"NATHALY TORRES TORRES",16800000,0,0,0,0,16800000,16800000,"2020-06-19","2020-06-19","2020-08-31",42,1,30,null,null,null,null,null,null,"X",null,1,null,null,{"$f":"IF(SUMPRODUCT((A$14:A128=A128)*(B$14:B128=B128)*(D$14:D128=D128))>1,0,1)","v":1},"Contratos de prestación de servicios profesionales y de apoyo a la gestión","Contratación directa",{"$f":"IF(ISBLANK(G128),1,IFERROR(VLOOKUP(G128,Tipo!$C$12:$C$27,1,FALSE),\"NO\"))","v":"Prestación de servicios profesionales y de apoyo a la gestión, o para la ejecución de trabajos artísticos que sólo puedan encomendarse a determinadas personas naturales;"},"Inversión",{"$f":"IF(ISBLANK(K128),1,IFERROR(VLOOKUP(K128,Eje_Pilar_Prop!$C$3:$C$104,1,FALSE),\"NO\"))","v":45},"SECOP II",1,"Bogotá Mejor para Todos"]
["FDLCH-CI-118-2020",2020,"SECOP I","20-22-16306","Contratos de prestación de servicios","Contratación directa","Contratos interadministrativos","PROVEER UNA PLATAFORMA VIRTUAL Y SERVICIOS TECNOLÓGICOS NECESARIOS A LOS FONDOS DE DESARROLLO LOCAL, EN LA REALIZACIÓN DE LAS ASAMBLEAS, EVENTOS Y FOROS DIGITALES, EN EL MARCO DE LOS ENCUENTROS CIUDADANOS Y PRESUPUESTOS PARTICIPATIVOS, DE ACUERDO CON LOS LINEAMIENTOS  ESTRATÉGICOS  QUE  DETERMINEN  LOS  FDL","Inversión","Bogotá Mejor para Todos",45,{"$f":"IF(ISERROR(VLOOKUP(K129,Eje_Pilar_Prop!$C$2:$E$104,2,FALSE)),\" \",VLOOKUP(K129,Eje_Pilar_Prop!$C$2:$E$104,2,FALSE))","v":"Gobernanza e influencia local, regional e internacional"},{"$f":"IF(ISERROR(VLOOKUP(K129,Eje_Pilar_Prop!$C$2:$E$104,3,FALSE)),\" \",VLOOKUP(K129,Eje_Pilar_Prop!$C$2:$E$104,3,FALSE))","v":"Eje Transversal 4 Gobierno Legitimo, Fortalecimiento Local y Eficiencia"},1305,899999115,"EMPRESA DE TELECOMUNICACIONES DE BOGOTA S.A.ESP - ETB",16130836,0,0,0,0,16130836,16130836,"2020-06-24","2020-06-24","2020-10-24",120,0,0,null,null,null,null,null,null,"X",null,1,null,null,{"$f":"IF(SUMPRODUCT((A$14:A129=A129)*(B$14:B129=B129)*(D$14:D129=D129))>1,0,1)","v":1},"Contratos de prestación de servicios","Contratación directa",{"$f":"IF(ISBLANK(G129),1,IFERROR(VLOOKUP(G129,Tipo!$C$12:$C$27,1,FALSE),\"NO\"))","v":"Contratos interadministrativos"},"Inversión",{"$f":"IF(ISBLANK(K129),1,IFERROR(VLOOKUP(K129,Eje_Pilar_Prop!$C$3:$C$104,1,FALSE),\"NO\"))","v":45},"SECOP I",1,"Bogotá Mejor para Todos"]
["FDLCH-CPS-119-2020",2020,"SECOP II","CPS-119-2020","Contratos de prestación de servicios profesionales y de apoyo a la gestión","Contratación directa","Prestación de servicios profesionales y de apoyo a la gestión, o para la ejecución de trabajos artísticos que sólo puedan encomendarse a determinadas personas naturales;"," PRESTACIÓN DE SERVICIOS PROFESIONALES PARA APOYAR AL EQUIPO DE PRENSA Y COMUNICACIONES DE LA ALCALDÍA LOCAL EN LA REALIZACIÓN DE PRODUCTOS Y PIEZAS DIGITALES, IMPRESAS Y PUBLICITARIAS DE GRAN FORMATO Y DE ANIMACIÓN GRÁFICA, ASÍ COMO APOYAR LA PRODUCCIÓN Y MONTAJE DE EVENTOS.","Inversión","Bogotá Mejor para Todos",45,{"$f":"IF(ISERROR(VLOOKUP(K130,Eje_Pilar_Prop!$C$2:$E$104,2,FALSE)),\" \",VLOOKUP(K130,Eje_Pilar_Prop!$C$2:$E$104,2,FALSE))","v":"Gobernanza e influencia local, regional e internacional"},{"$f":"IF(ISERROR(VLOOKUP(K130,Eje_Pilar_Prop!$C$2:$E$104,3,FALSE)),\" \",VLOOKUP(K130,Eje_Pilar_Prop!$C$2:$E$104,3,FALSE))","v":"Eje Transversal 4 Gobierno Legitimo, Fortalecimiento Local y Eficiencia"},1304,1032463045,"CRHISTIAN FELIPE FORIGUA CHACON",15452000,0,0,0,0,15452000,15452000,"2020-06-23","2020-06-24","2020-12-07",120,2,45,null,null,null,null,null,null,"X",null,1,null,null,{"$f":"IF(SUMPRODUCT((A$14:A130=A130)*(B$14:B130=B130)*(D$14:D130=D130))>1,0,1)","v":1},"Contratos de prestación de servicios profesionales y de apoyo a la gestión","Contratación directa",{"$f":"IF(ISBLANK(G130),1,IFERROR(VLOOKUP(G130,Tipo!$C$12:$C$27,1,FALSE),\"NO\"))","v":"Prestación de servicios profesionales y de apoyo a la gestión, o para la ejecución de trabajos artísticos que sólo puedan encomendarse a determinadas personas naturales;"},"Inversión",{"$f":"IF(ISBLANK(K130),1,IFERROR(VLOOKUP(K130,Eje_Pilar_Prop!$C$3:$C$104,1,FALSE),\"NO\"))","v":45},"SECOP II",1,"Bogotá Mejor para Todos"]
["FDLCH-CPS-120-2020",2020,"SECOP II","CPS-120-2020","Contratos de prestación de servicios profesionales y de apoyo a la gestión","Contratación directa","Prestación de servicios profesionales y de apoyo a la gestión, o para la ejecución de trabajos artísticos que sólo puedan encomendarse a determinadas personas naturales;","PRESTACIÓN DE SERVICIOS PROFESIONALES PARA EL APOYO AL ÁREA DE GESTIÓN DEL DESARROLLO LOCAL DE LA ALCALDÍA LOCAL DE CHAPINERO EN LA FORMULACIÓN, GESTIÓN, EJECUCIÓN Y SEGUIMIENTO DERIVADOS DEL PROYECTO 1301 'MEJORAR LA CALIDAD DE LA MOVILIDAD' Y LA SUPERVISIÓN DE CONTRATOS QUE LE SEAN ASIGNADOS","Inversión","Bogotá Mejor para Todos",18,{"$f":"IF(ISERROR(VLOOKUP(K131,Eje_Pilar_Prop!$C$2:$E$104,2,FALSE)),\" \",VLOOKUP(K131,Eje_Pilar_Prop!$C$2:$E$104,2,FALSE))","v":"Mejor movilidad para todos"},{"$f":"IF(ISERROR(VLOOKUP(K131,Eje_Pilar_Prop!$C$2:$E$104,3,FALSE)),\" \",VLOOKUP(K131,Eje_Pilar_Prop!$C$2:$E$104,3,FALSE))","v":"Pilar 2 Democracía Urbana"},1301,1073533479,"JAIME HERNANDO PRIETO ÁLVAREZ",20000000,0,0,2,7500000,27500000,27500000,"2020-06-30","2020-07-01","2020-10-30",120,0,0,null,null,null,null,null,null,"X",null,1,null,null,{"$f":"IF(SUMPRODUCT((A$14:A131=A131)*(B$14:B131=B131)*(D$14:D131=D131))>1,0,1)","v":1},"Contratos de prestación de servicios profesionales y de apoyo a la gestión","Contratación directa",{"$f":"IF(ISBLANK(G131),1,IFERROR(VLOOKUP(G131,Tipo!$C$12:$C$27,1,FALSE),\"NO\"))","v":"Prestación de servicios profesionales y de apoyo a la gestión, o para la ejecución de trabajos artísticos que sólo puedan encomendarse a determinadas personas naturales;"},"Inversión",{"$f":"IF(ISBLANK(K131),1,IFERROR(VLOOKUP(K131,Eje_Pilar_Prop!$C$3:$C$104,1,FALSE),\"NO\"))","v":18},"SECOP II",1,"Bogotá Mejor para Todos"]
["FDLCH-CPS-121-2020",2020,"SECOP II","CPS-121-2020","Contratos de prestación de servicios profesionales y de apoyo a la gestión","Contratación directa","Prestación de servicios profesionales y de apoyo a la gestión, o para la ejecución de trabajos artísticos que sólo puedan encomendarse a determinadas personas naturales;","Prestar los servicios profesionales de apoyo al área de gestión del desarrollo local, en temas de planeación y presupuestación del Fondo de Desarrollo Local.","Inversión","Bogotá Mejor para Todos",45,{"$f":"IF(ISERROR(VLOOKUP(K132,Eje_Pilar_Prop!$C$2:$E$104,2,FALSE)),\" \",VLOOKUP(K132,Eje_Pilar_Prop!$C$2:$E$104,2,FALSE))","v":"Gobernanza e influencia local, regional e internacional"},{"$f":"IF(ISERROR(VLOOKUP(K132,Eje_Pilar_Prop!$C$2:$E$104,3,FALSE)),\" \",VLOOKUP(K132,Eje_Pilar_Prop!$C$2:$E$104,3,FALSE))","v":"Eje Transversal 4 Gobierno Legitimo, Fortalecimiento Local y Eficiencia"},1304,60256522,"NUBIA CONSTANZA MOGOLLON ACEVEDO",18800000,0,0,0,0,18800000,18800000,"2020-06-24","2020-06-25","2020-12-24",120,1,60,null,null,null,null,null,null,"X",null,1,null,null,{"$f":"IF(SUMPRODUCT((A$14:A132=A132)*(B$14:B132=B132)*(D$14:D132=D132))>1,0,1)","v":1},"Contratos de prestación de servicios profesionales y de apoyo a la gestión","Contratación directa",{"$f":"IF(ISBLANK(G132),1,IFERROR(VLOOKUP(G132,Tipo!$C$12:$C$27,1,FALSE),\"NO\"))","v":"Prestación de servicios profesionales y de apoyo a la gestión, o para la ejecución de trabajos artísticos que sólo puedan encomendarse a determinadas personas naturales;"},"Inversión",{"$f":"IF(ISBLANK(K132),1,IFERROR(VLOOKUP(K132,Eje_Pilar_Prop!$C$3:$C$104,1,FALSE),\"NO\"))","v":45},"SECOP II",1,"Bogotá Mejor para Todos"]
["FDLCH-CPS-122-2020",2020,"SECOP II","CPS-122-2020","Contratos de prestación de servicios profesionales y de apoyo a la gestión","Contratación directa","Prestación de servicios profesionales y de apoyo a la gestión, o para la ejecución de trabajos artísticos que sólo puedan encomendarse a determinadas personas naturales;","Prestación de servicios profesionales para apoyar al equipo de prensa y comunicaciones de la Alcaldía Local en la realización y publicación de contenidos de redes sociales y canales de divulgación digital (sitio web) de la Alcaldía local","Inversión","Bogotá Mejor para Todos",45,{"$f":"IF(ISERROR(VLOOKUP(K133,Eje_Pilar_Prop!$C$2:$E$104,2,FALSE)),\" \",VLOOKUP(K133,Eje_Pilar_Prop!$C$2:$E$104,2,FALSE))","v":"Gobernanza e influencia local, regional e internacional"},{"$f":"IF(ISERROR(VLOOKUP(K133,Eje_Pilar_Prop!$C$2:$E$104,3,FALSE)),\" \",VLOOKUP(K133,Eje_Pilar_Prop!$C$2:$E$104,3,FALSE))","v":"Eje Transversal 4 Gobierno Legitimo, Fortalecimiento Local y Eficiencia"},1304,1019110016,"JUAN SEBASTIAN CASTRO VANEGAS",15452000,0,0,1,7726000,23178000,22019100,"2020-07-03","2020-07-06","2021-01-31",176,1,30,null,null,null,null,null,"X",null,null,0.95,null,null,{"$f":"IF(SUMPRODUCT((A$14:A133=A133)*(B$14:B133=B133)*(D$14:D133=D133))>1,0,1)","v":1},"Contratos de prestación de servicios profesionales y de apoyo a la gestión","Contratación directa",{"$f":"IF(ISBLANK(G133),1,IFERROR(VLOOKUP(G133,Tipo!$C$12:$C$27,1,FALSE),\"NO\"))","v":"Prestación de servicios profesionales y de apoyo a la gestión, o para la ejecución de trabajos artísticos que sólo puedan encomendarse a determinadas personas naturales;"},"Inversión",{"$f":"IF(ISBLANK(K133),1,IFERROR(VLOOKUP(K133,Eje_Pilar_Prop!$C$3:$C$104,1,FALSE),\"NO\"))","v":45},"SECOP II",1,"Bogotá Mejor para Todos"]
["FDLCH-CA-123-2020",2020,"SECOP II","CA-123-2020","Arrendamiento de bienes inmuebles","Contratación directa","El arrendamiento o adquisición de inmuebles","CONTRATAR EN ARRIENDO UNA BODEGA, CON EL PROPÓSITO DE GUARDAR LOS ELEMENTOS DECOMISADOS DURANTE LOS OPERATIVOS DE CONTROL DE ESPACIO PÚBLICO, ADELANTADOS POR LA ALCALDÍA LOCAL DE CHAPINERO","Funcionamiento","Bogotá Mejor para Todos",null,{"$f":"IF(ISERROR(VLOOKUP(K134,Eje_Pilar_Prop!$C$2:$E$104,2,FALSE)),\" \",VLOOKUP(K134,Eje_Pilar_Prop!$C$2:$E$104,2,FALSE))","v":" "},{"$f":"IF(ISERROR(VLOOKUP(K134,Eje_Pilar_Prop!$C$2:$E$104,3,FALSE)),\" \",VLOOKUP(K134,Eje_Pilar_Prop!$C$2:$E$104,3,FALSE))","v":" "},131020202020201,20185010,"ANA GRACIELA GALAN DE ALVAREZ",23466667,0,0,1,4000000,27466667,19466667,"2020-07-06","2020-07-07","2021-01-04",120,1,40,null,null,null,null,null,null,"X",null,0.70873786761240454,null,null,{"$f":"IF(SUMPRODUCT((A$14:A134=A134)*(B$14:B134=B134)*(D$14:D134=D134))>1,0,1)","v":1},"Arrendamiento de bienes inmuebles","Contratación directa",{"$f":"IF(ISBLANK(G134),1,IFERROR(VLOOKUP(G134,Tipo!$C$12:$C$27,1,FALSE),\"NO\"))","v":"El arrendamiento o adquisición de inmuebles"},"Funcionamiento",{"$f":"IF(ISBLANK(K134),1,IFERROR(VLOOKUP(K134,Eje_Pilar_Prop!$C$3:$C$104,1,FALSE),\"NO\"))","v":1},"SECOP II",1,"Bogotá Mejor para Todos"]
["FDLCH-CPS-124-2020",2020,"SECOP II","CPS-124-2020","Contratos de prestación de servicios profesionales y de apoyo a la gestión","Contratación directa","Prestación de servicios profesionales y de apoyo a la gestión, o para la ejecución de trabajos artísticos que sólo puedan encomendarse a determinadas personas naturales;","PRESTAR LOS SERVICIOS PROFESIONALES EN DERECHO PARA APOYAR AL ALCALDE LOCAL EN LA FORMULACIÓN, SEGUIMIENTO E IMPLEMENTACIÓN DE LA ESTRATEGIA LOCAL PARA LA TERMINACIÓN JURÍDICA DE LAS ACTUACIONES ADMINISTRATIVAS QUE CURSAN EN LA ALCALDÍA LOCAL.","Inversión","Bogotá Mejor para Todos",45,{"$f":"IF(ISERROR(VLOOKUP(K135,Eje_Pilar_Prop!$C$2:$E$104,2,FALSE)),\" \",VLOOKUP(K135,Eje_Pilar_Prop!$C$2:$E$104,2,FALSE))","v":"Gobernanza e influencia local, regional e internacional"},{"$f":"IF(ISERROR(VLOOKUP(K135,Eje_Pilar_Prop!$C$2:$E$104,3,FALSE)),\" \",VLOOKUP(K135,Eje_Pilar_Prop!$C$2:$E$104,3,FALSE))","v":"Eje Transversal 4 Gobierno Legitimo, Fortalecimiento Local y Eficiencia"},1304,52904967,"ANGELA CRISTINA CARVAJAL TOVAR",22000000,0,0,1,7333333,29333333,26950000,"2020-07-02","2020-07-03","2020-12-23",120,2,59,null,null,null,null,null,null,"X",null,0.91875001044034099,null,null,{"$f":"IF(SUMPRODUCT((A$14:A135=A135)*(B$14:B135=B135)*(D$14:D135=D135))>1,0,1)","v":1},"Contratos de prestación de servicios profesionales y de apoyo a la gestión","Contratación directa",{"$f":"IF(ISBLANK(G135),1,IFERROR(VLOOKUP(G135,Tipo!$C$12:$C$27,1,FALSE),\"NO\"))","v":"Prestación de servicios profesionales y de apoyo a la gestión, o para la ejecución de trabajos artísticos que sólo puedan encomendarse a determinadas personas naturales;"},"Inversión",{"$f":"IF(ISBLANK(K135),1,IFERROR(VLOOKUP(K135,Eje_Pilar_Prop!$C$3:$C$104,1,FALSE),\"NO\"))","v":45},"SECOP II",1,"Bogotá Mejor para Todos"]
["FDLCH-CPS-125-2020",2020,"SECOP II","CPS-125-2020","Contratos de prestación de servicios profesionales y de apoyo a la gestión","Contratación directa","Prestación de servicios profesionales y de apoyo a la gestión, o para la ejecución de trabajos artísticos que sólo puedan encomendarse a determinadas personas naturales;","PRESTACIÓN DE SERVICIOS PROFESIONALES PARA APOYAR AL ALCALDE LOCAL EN LA PROMOCIÓN, ACOMPAÑAMIENTO, COORDINACIÓN Y ATENCIÓN DE LAS INSTANCIAS DE COORDINACIÓN INTERINSTITUCIONALES Y LAS INSTANCIAS DE PARTICIPACIÓN LOCALES, ASÍ COMO LOS PROCESOS COMUNITARIOS EN LA LOCALIDAD","Inversión","Bogotá Mejor para Todos",45,{"$f":"IF(ISERROR(VLOOKUP(K136,Eje_Pilar_Prop!$C$2:$E$104,2,FALSE)),\" \",VLOOKUP(K136,Eje_Pilar_Prop!$C$2:$E$104,2,FALSE))","v":"Gobernanza e influencia local, regional e internacional"},{"$f":"IF(ISERROR(VLOOKUP(K136,Eje_Pilar_Prop!$C$2:$E$104,3,FALSE)),\" \",VLOOKUP(K136,Eje_Pilar_Prop!$C$2:$E$104,3,FALSE))","v":"Eje Transversal 4 Gobierno Legitimo, Fortalecimiento Local y Eficiencia"},1305,1022331685,"NELSON MAURICIO REY PEÑA\n",21000000,0,0,2,10325000,31325000,29925000,"2020-07-03","2020-07-06","2020-11-23",120,1,18,null,null,null,null,null,null,"X",null,0.95530726256983245,null,null,{"$f":"IF(SUMPRODUCT((A$14:A136=A136)*(B$14:B136=B136)*(D$14:D136=D136))>1,0,1)","v":1},"Contratos de prestación de servicios profesionales y de apoyo a la gestión","Contratación directa",{"$f":"IF(ISBLANK(G136),1,IFERROR(VLOOKUP(G136,Tipo!$C$12:$C$27,1,FALSE),\"NO\"))","v":"Prestación de servicios profesionales y de apoyo a la gestión, o para la ejecución de trabajos artísticos que sólo puedan encomendarse a determinadas personas naturales;"},"Inversión",{"$f":"IF(ISBLANK(K136),1,IFERROR(VLOOKUP(K136,Eje_Pilar_Prop!$C$3:$C$104,1,FALSE),\"NO\"))","v":45},"SECOP II",1,"Bogotá Mejor para Todos"]
["FDLCH-CPS-126-2020",2020,"SECOP II","CPS-126-2020","Contratos de prestación de servicios profesionales y de apoyo a la gestión","Contratación directa","Prestación de servicios profesionales y de apoyo a la gestión, o para la ejecución de trabajos artísticos que sólo puedan encomendarse a determinadas personas naturales;","PRESTACIÓN DE SERVICIOS PROFESIONALES PARA EL APOYO AL ÁREA DE GESTIÓN DEL DESARROLLO LOCAL DE LA ALCALDÍA LOCAL DE CHAPINERO EN LA FORMULACIÓN, GESTIÓN, EJECUCIÓN Y SEGUIMIENTO DEL PROYECTO 1301 'MEJORAR LA CALIDAD DE LA MOVILIDAD' Y LA SUPERVISIÓN DE CONTRATOS QUE LE SEAN ASIGNADOS","Inversión","Bogotá Mejor para Todos",18,{"$f":"IF(ISERROR(VLOOKUP(K137,Eje_Pilar_Prop!$C$2:$E$104,2,FALSE)),\" \",VLOOKUP(K137,Eje_Pilar_Prop!$C$2:$E$104,2,FALSE))","v":"Mejor movilidad para todos"},{"$f":"IF(ISERROR(VLOOKUP(K137,Eje_Pilar_Prop!$C$2:$E$104,3,FALSE)),\" \",VLOOKUP(K137,Eje_Pilar_Prop!$C$2:$E$104,3,FALSE))","v":"Pilar 2 Democracía Urbana"},1301,1090435721,"JORGE ENRIQUE ABREO REYES",24000000,0,0,1,3600000,27600000,27600000,"2020-07-03","2020-07-06","2021-01-05",120,1,60,null,null,null,null,null,null,"X",null,1,null,null,{"$f":"IF(SUMPRODUCT((A$14:A137=A137)*(B$14:B137=B137)*(D$14:D137=D137))>1,0,1)","v":1},"Contratos de prestación de servicios profesionales y de apoyo a la gestión","Contratación directa",{"$f":"IF(ISBLANK(G137),1,IFERROR(VLOOKUP(G137,Tipo!$C$12:$C$27,1,FALSE),\"NO\"))","v":"Prestación de servicios profesionales y de apoyo a la gestión, o para la ejecución de trabajos artísticos que sólo puedan encomendarse a determinadas personas naturales;"},"Inversión",{"$f":"IF(ISBLANK(K137),1,IFERROR(VLOOKUP(K137,Eje_Pilar_Prop!$C$3:$C$104,1,FALSE),\"NO\"))","v":18},"SECOP II",1,"Bogotá Mejor para Todos"]
["FDLCH-CPS-127-2020",2020,"SECOP II","CPS-127-2020","Contratos de prestación de servicios profesionales y de apoyo a la gestión","Contratación directa","Prestación de servicios profesionales y de apoyo a la gestión, o para la ejecución de trabajos artísticos que sólo puedan encomendarse a determinadas personas naturales;"," PRESTACIÓN DE SERVICIOS PROFESIONALES PARA APOYAR EL ALCALDE LOCAL EN LA GESTIÓN DE LOS ASUNTOS RELACIONADOS CON SEGURIDAD CIUDADANA, CONVIVENCIA Y PREVENCIÓN DE CONFLICTIVIDADES, VIOLENCIAS Y DELITOS EN LA LOCALIDAD, DE CONFORMIDAD CON EL MARCO NORMATIVO APLICABLE EN LA MATERIA","Inversión","Bogotá Mejor para Todos",19,{"$f":"IF(ISERROR(VLOOKUP(K138,Eje_Pilar_Prop!$C$2:$E$104,2,FALSE)),\" \",VLOOKUP(K138,Eje_Pilar_Prop!$C$2:$E$104,2,FALSE))","v":"Seguridad y convivencia para todos"},{"$f":"IF(ISERROR(VLOOKUP(K138,Eje_Pilar_Prop!$C$2:$E$104,3,FALSE)),\" \",VLOOKUP(K138,Eje_Pilar_Prop!$C$2:$E$104,3,FALSE))","v":"Pilar 3 Construcción de Comunidad y Cultura Ciudadana"},1302,11801497,"FELIPE CÓRDOBA MENDOZA",19600000,0,0,1,9800000,29400000,27276666,"2020-07-08","2020-07-09","2021-01-08",120,1,60,78036035,"JAIME MANUEL PINEDA MÉNDEZ","2020-12-03",8400000,null,null,"X",null,0.92777775510204086,null,null,{"$f":"IF(SUMPRODUCT((A$14:A138=A138)*(B$14:B138=B138)*(D$14:D138=D138))>1,0,1)","v":1},"Contratos de prestación de servicios profesionales y de apoyo a la gestión","Contratación directa",{"$f":"IF(ISBLANK(G138),1,IFERROR(VLOOKUP(G138,Tipo!$C$12:$C$27,1,FALSE),\"NO\"))","v":"Prestación de servicios profesionales y de apoyo a la gestión, o para la ejecución de trabajos artísticos que sólo puedan encomendarse a determinadas personas naturales;"},"Inversión",{"$f":"IF(ISBLANK(K138),1,IFERROR(VLOOKUP(K138,Eje_Pilar_Prop!$C$3:$C$104,1,FALSE),\"NO\"))","v":19},"SECOP II",1,"Bogotá Mejor para Todos"]
["FDLCH-CPS-128-2020",2020,"SECOP II","CPS-128-2020","Contratos de prestación de servicios profesionales y de apoyo a la gestión","Contratación directa","Prestación de servicios profesionales y de apoyo a la gestión, o para la ejecución de trabajos artísticos que sólo puedan encomendarse a determinadas personas naturales;"," PRESTACIÓN DE SERVICIOS PROFESIONALES ESPECIALIZADOS PARA APOYAR EL ÁREA DE GESTIÓN DEL DESARROLLO LOCAL DE LA ALCALDÍA LOCAL DE CHAPINERO EN LA FORMULACIÓN, GESTIÓN Y EJECUCIÓN DEL PROYECTO 1302 ENTORNOS SEGUROS PARA LA CIUDADANÍA.","Inversión","Bogotá Mejor para Todos",19,{"$f":"IF(ISERROR(VLOOKUP(K139,Eje_Pilar_Prop!$C$2:$E$104,2,FALSE)),\" \",VLOOKUP(K139,Eje_Pilar_Prop!$C$2:$E$104,2,FALSE))","v":"Seguridad y convivencia para todos"},{"$f":"IF(ISERROR(VLOOKUP(K139,Eje_Pilar_Prop!$C$2:$E$104,3,FALSE)),\" \",VLOOKUP(K139,Eje_Pilar_Prop!$C$2:$E$104,3,FALSE))","v":"Pilar 3 Construcción de Comunidad y Cultura Ciudadana"},1302,112490471,"JESÚS ÁNIBAL VERGARA MEJÍA",28000000,0,0,1,14000000,42000000,37800000,"2020-07-07","2020-07-08","2020-11-27",120,1,20,null,null,null,null,null,null,"X",null,0.9,null,null,{"$f":"IF(SUMPRODUCT((A$14:A139=A139)*(B$14:B139=B139)*(D$14:D139=D139))>1,0,1)","v":1},"Contratos de prestación de servicios profesionales y de apoyo a la gestión","Contratación directa",{"$f":"IF(ISBLANK(G139),1,IFERROR(VLOOKUP(G139,Tipo!$C$12:$C$27,1,FALSE),\"NO\"))","v":"Prestación de servicios profesionales y de apoyo a la gestión, o para la ejecución de trabajos artísticos que sólo puedan encomendarse a determinadas personas naturales;"},"Inversión",{"$f":"IF(ISBLANK(K139),1,IFERROR(VLOOKUP(K139,Eje_Pilar_Prop!$C$3:$C$104,1,FALSE),\"NO\"))","v":19},"SECOP II",1,"Bogotá Mejor para Todos"]
["FDLCH-CPS-129-2020",2020,"SECOP II","CPS-129-2020","Contratos de prestación de servicios profesionales y de apoyo a la gestión","Contratación directa","Prestación de servicios profesionales y de apoyo a la gestión, o para la ejecución de trabajos artísticos que sólo puedan encomendarse a determinadas personas naturales;"," PRESTACIÓN DE SERVICIOS PROFESIONALES PARA EL APOYO AL ÁREA DE GESTIÓN DEL DESARROLLO LOCAL DE LA ALCALDÍA LOCAL DE CHAPINERO EN LA FORMULACIÓN, GESTIÓN, EJECUCIÓN Y SEGUIMIENTO DEL PROYECTO 1301 'MEJORAR LA CALIDAD DE LA MOVILIDAD' Y LA SUPERVISIÓN DE CONTRATOS QUE LE SEAN ASIGNADOS","Inversión","Bogotá Mejor para Todos",18,{"$f":"IF(ISERROR(VLOOKUP(K140,Eje_Pilar_Prop!$C$2:$E$104,2,FALSE)),\" \",VLOOKUP(K140,Eje_Pilar_Prop!$C$2:$E$104,2,FALSE))","v":"Mejor movilidad para todos"},{"$f":"IF(ISERROR(VLOOKUP(K140,Eje_Pilar_Prop!$C$2:$E$104,3,FALSE)),\" \",VLOOKUP(K140,Eje_Pilar_Prop!$C$2:$E$104,3,FALSE))","v":"Pilar 2 Democracía Urbana"},1301,1015470441,"RICARDO ANDRÉS SÁNCHEZ VARGAS",15600000,0,0,1,2600000,18200000,18200000,"2020-07-21","2020-07-22","2021-01-05",120,1,45,null,null,null,null,null,null,"X",null,1,null,null,{"$f":"IF(SUMPRODUCT((A$14:A140=A140)*(B$14:B140=B140)*(D$14:D140=D140))>1,0,1)","v":1},"Contratos de prestación de servicios profesionales y de apoyo a la gestión","Contratación directa",{"$f":"IF(ISBLANK(G140),1,IFERROR(VLOOKUP(G140,Tipo!$C$12:$C$27,1,FALSE),\"NO\"))","v":"Prestación de servicios profesionales y de apoyo a la gestión, o para la ejecución de trabajos artísticos que sólo puedan encomendarse a determinadas personas naturales;"},"Inversión",{"$f":"IF(ISBLANK(K140),1,IFERROR(VLOOKUP(K140,Eje_Pilar_Prop!$C$3:$C$104,1,FALSE),\"NO\"))","v":18},"SECOP II",1,"Bogotá Mejor para Todos"]
["FDLCH-CPS-131-2020",2020,"SECOP II","CPS-131-2020","Contratos de prestación de servicios profesionales y de apoyo a la gestión","Contratación directa","Prestación de servicios profesionales y de apoyo a la gestión, o para la ejecución de trabajos artísticos que sólo puedan encomendarse a determinadas personas naturales;"," PRESTACIÓN DE SERVICIOS PERSONALES NECESARIOS PARA APOYAR ADMINISTRATIVA Y ASISTENCIALMENTE A LAS INSPECCIONES DE POLICÍA DE LA LOCALIDAD DE CHAPINERO.","Inversión","Bogotá Mejor para Todos",45,{"$f":"IF(ISERROR(VLOOKUP(K141,Eje_Pilar_Prop!$C$2:$E$104,2,FALSE)),\" \",VLOOKUP(K141,Eje_Pilar_Prop!$C$2:$E$104,2,FALSE))","v":"Gobernanza e influencia local, regional e internacional"},{"$f":"IF(ISERROR(VLOOKUP(K141,Eje_Pilar_Prop!$C$2:$E$104,3,FALSE)),\" \",VLOOKUP(K141,Eje_Pilar_Prop!$C$2:$E$104,3,FALSE))","v":"Eje Transversal 4 Gobierno Legitimo, Fortalecimiento Local y Eficiencia"},1304,1032462820,"JENNIFER VANNESA DIAZ NIÑO",8800000,0,0,1,3300000,12100000,11073333,"2020-07-15","2020-07-16","2021-01-03",120,1,45,null,null,null,null,null,null,"X",null,0.91515148760330578,null,null,{"$f":"IF(SUMPRODUCT((A$14:A141=A141)*(B$14:B141=B141)*(D$14:D141=D141))>1,0,1)","v":1},"Contratos de prestación de servicios profesionales y de apoyo a la gestión","Contratación directa",{"$f":"IF(ISBLANK(G141),1,IFERROR(VLOOKUP(G141,Tipo!$C$12:$C$27,1,FALSE),\"NO\"))","v":"Prestación de servicios profesionales y de apoyo a la gestión, o para la ejecución de trabajos artísticos que sólo puedan encomendarse a determinadas personas naturales;"},"Inversión",{"$f":"IF(ISBLANK(K141),1,IFERROR(VLOOKUP(K141,Eje_Pilar_Prop!$C$3:$C$104,1,FALSE),\"NO\"))","v":45},"SECOP II",1,"Bogotá Mejor para Todos"]
["FDLCH-CPS-132-2020",2020,"SECOP II","CPS-132-2020","Contratos de prestación de servicios profesionales y de apoyo a la gestión","Contratación directa","Prestación de servicios profesionales y de apoyo a la gestión, o para la ejecución de trabajos artísticos que sólo puedan encomendarse a determinadas personas naturales;","PRESTACIÓN DE SERVICIOS PERSONALES NECESARIOS PARA EL APOYO EN LA EJECUCIÓN DE ACTIVIDADES ADMINISTRATIVAS Y OPERATIVAS ADELANTADAS EN LA JUNTA ADMINISTRADORA LOCAL DE CHAPINERO","Inversión","Bogotá Mejor para Todos",45,{"$f":"IF(ISERROR(VLOOKUP(K142,Eje_Pilar_Prop!$C$2:$E$104,2,FALSE)),\" \",VLOOKUP(K142,Eje_Pilar_Prop!$C$2:$E$104,2,FALSE))","v":"Gobernanza e influencia local, regional e internacional"},{"$f":"IF(ISERROR(VLOOKUP(K142,Eje_Pilar_Prop!$C$2:$E$104,3,FALSE)),\" \",VLOOKUP(K142,Eje_Pilar_Prop!$C$2:$E$104,3,FALSE))","v":"Eje Transversal 4 Gobierno Legitimo, Fortalecimiento Local y Eficiencia"},1304,52523548,"SANDRA MILENA GÓMEZ SALAZAR",9922500,0,0,1,3720937,13643437,12651187,"2020-07-10","2020-07-13","2021-01-12",120,1,60,null,null,null,null,null,null,"X",null,0.92727272460744314,null,null,{"$f":"IF(SUMPRODUCT((A$14:A142=A142)*(B$14:B142=B142)*(D$14:D142=D142))>1,0,1)","v":1},"Contratos de prestación de servicios profesionales y de apoyo a la gestión","Contratación directa",{"$f":"IF(ISBLANK(G142),1,IFERROR(VLOOKUP(G142,Tipo!$C$12:$C$27,1,FALSE),\"NO\"))","v":"Prestación de servicios profesionales y de apoyo a la gestión, o para la ejecución de trabajos artísticos que sólo puedan encomendarse a determinadas personas naturales;"},"Inversión",{"$f":"IF(ISBLANK(K142),1,IFERROR(VLOOKUP(K142,Eje_Pilar_Prop!$C$3:$C$104,1,FALSE),\"NO\"))","v":45},"SECOP II",1,"Bogotá Mejor para Todos"]
["FDLCH-CPS-133-2020",2020,"SECOP II","CPS-133-2020","Contratos de prestación de servicios profesionales y de apoyo a la gestión","Contratación directa","Prestación de servicios profesionales y de apoyo a la gestión, o para la ejecución de trabajos artísticos que sólo puedan encomendarse a determinadas personas naturales;"," PRESTACIÓN DE SERVICIOS PROFESIONALES PARA EL APOYO AL ÁREA DE GESTIÓN DEL DESARROLLO LOCAL DE LA ALCALDÍA LOCAL DE CHAPINERO EN LA FORMULACIÓN, GESTIÓN, EJECUCIÓN Y SEGUIMIENTO DEL PROYECTO 1301 'MEJORAR LA CALIDAD DE LA MOVILIDAD' Y LA SUPERVISIÓN DE CONTRATOS QUE LE SEAN ASIGNADOS","Inversión","Bogotá Mejor para Todos",18,{"$f":"IF(ISERROR(VLOOKUP(K143,Eje_Pilar_Prop!$C$2:$E$104,2,FALSE)),\" \",VLOOKUP(K143,Eje_Pilar_Prop!$C$2:$E$104,2,FALSE))","v":"Mejor movilidad para todos"},{"$f":"IF(ISERROR(VLOOKUP(K143,Eje_Pilar_Prop!$C$2:$E$104,3,FALSE)),\" \",VLOOKUP(K143,Eje_Pilar_Prop!$C$2:$E$104,3,FALSE))","v":"Pilar 2 Democracía Urbana"},1301,1053779393,"JUAN CAMILO ALZATE OCAMPO",22800000,0,0,1,11400000,34200000,30400000,"2020-08-13","2020-08-14","2020-12-30",120,1,17,null,null,null,null,null,null,"X",null,0.88888888888888884,null,null,{"$f":"IF(SUMPRODUCT((A$14:A143=A143)*(B$14:B143=B143)*(D$14:D143=D143))>1,0,1)","v":1},"Contratos de prestación de servicios profesionales y de apoyo a la gestión","Contratación directa",{"$f":"IF(ISBLANK(G143),1,IFERROR(VLOOKUP(G143,Tipo!$C$12:$C$27,1,FALSE),\"NO\"))","v":"Prestación de servicios profesionales y de apoyo a la gestión, o para la ejecución de trabajos artísticos que sólo puedan encomendarse a determinadas personas naturales;"},"Inversión",{"$f":"IF(ISBLANK(K143),1,IFERROR(VLOOKUP(K143,Eje_Pilar_Prop!$C$3:$C$104,1,FALSE),\"NO\"))","v":18},"SECOP II",1,"Bogotá Mejor para Todos"]
["FDLCH-CPS-134-2020",2020,"SECOP II","CPS-134-2020","Contratos de prestación de servicios profesionales y de apoyo a la gestión","Contratación directa","Prestación de servicios profesionales y de apoyo a la gestión, o para la ejecución de trabajos artísticos que sólo puedan encomendarse a determinadas personas naturales;","PRESTACIÓN DE SERVICIOS PROFESIONALES PARA APOYAR TÉCNICAMENTE LAS DISTINTAS ETAPAS DE LOS PROCESOS DE COMPETENCIA DE LAS INSPECCIONES DE POLICÍA DE LA LOCALIDAD, SEGÚN REPARTO","Inversión","Bogotá Mejor para Todos",45,{"$f":"IF(ISERROR(VLOOKUP(K144,Eje_Pilar_Prop!$C$2:$E$104,2,FALSE)),\" \",VLOOKUP(K144,Eje_Pilar_Prop!$C$2:$E$104,2,FALSE))","v":"Gobernanza e influencia local, regional e internacional"},{"$f":"IF(ISERROR(VLOOKUP(K144,Eje_Pilar_Prop!$C$2:$E$104,3,FALSE)),\" \",VLOOKUP(K144,Eje_Pilar_Prop!$C$2:$E$104,3,FALSE))","v":"Eje Transversal 4 Gobierno Legitimo, Fortalecimiento Local y Eficiencia"},1304,79531247,"RICARDO ALBERTO CORNEJO GONZALEZ",18000000,0,0,1,2550000,20550000,19350000,"2020-08-03","2020-08-05","2020-12-29",120,1,29,null,null,null,null,null,null,"X",null,0.94160583941605835,null,null,{"$f":"IF(SUMPRODUCT((A$14:A144=A144)*(B$14:B144=B144)*(D$14:D144=D144))>1,0,1)","v":1},"Contratos de prestación de servicios profesionales y de apoyo a la gestión","Contratación directa",{"$f":"IF(ISBLANK(G144),1,IFERROR(VLOOKUP(G144,Tipo!$C$12:$C$27,1,FALSE),\"NO\"))","v":"Prestación de servicios profesionales y de apoyo a la gestión, o para la ejecución de trabajos artísticos que sólo puedan encomendarse a determinadas personas naturales;"},"Inversión",{"$f":"IF(ISBLANK(K144),1,IFERROR(VLOOKUP(K144,Eje_Pilar_Prop!$C$3:$C$104,1,FALSE),\"NO\"))","v":45},"SECOP II",1,"Bogotá Mejor para Todos"]
["FDLCH-CPS-135-2020",2020,"SECOP II","CPS-135-2020","Contratos de prestación de servicios profesionales y de apoyo a la gestión","Contratación directa","Prestación de servicios profesionales y de apoyo a la gestión, o para la ejecución de trabajos artísticos que sólo puedan encomendarse a determinadas personas naturales;"," PRESTACIÓN DE SERVICIOS PROFESIONALES PARA APOYAR TÉCNICAMENTE LAS DISTINTAS ETAPAS DE LOS PROCESOS DE COMPETENCIA DE LAS INSPECCIONES DE POLICÍA DE LA LOCALIDAD, SEGÚN REPARTO","Inversión","Bogotá Mejor para Todos",45,{"$f":"IF(ISERROR(VLOOKUP(K145,Eje_Pilar_Prop!$C$2:$E$104,2,FALSE)),\" \",VLOOKUP(K145,Eje_Pilar_Prop!$C$2:$E$104,2,FALSE))","v":"Gobernanza e influencia local, regional e internacional"},{"$f":"IF(ISERROR(VLOOKUP(K145,Eje_Pilar_Prop!$C$2:$E$104,3,FALSE)),\" \",VLOOKUP(K145,Eje_Pilar_Prop!$C$2:$E$104,3,FALSE))","v":"Eje Transversal 4 Gobierno Legitimo, Fortalecimiento Local y Eficiencia"},1304,1032368645," YULIHED ANDREA ARIZA CONSUEGRA",18000000,0,0,1,3750000,{"$f":"+Q145+S145+U145","v":21750000},17400000,"2020-07-10","2020-07-13","2020-11-27",120,1,15,null,null,null,null,null,null,"X",null,0.8,null,null,{"$f":"IF(SUMPRODUCT((A$14:A145=A145)*(B$14:B145=B145)*(D$14:D145=D145))>1,0,1)","v":1},"Contratos de prestación de servicios profesionales y de apoyo a la gestión",{"$f":"IF(ISBLANK(F145),1,IFERROR(VLOOKUP(F145,modal,1,FALSE),\"NO\"))","v":"Contratación directa"},{"$f":"IF(ISBLANK(G145),1,IFERROR(VLOOKUP(G145,Tipo!$C$12:$C$27,1,FALSE),\"NO\"))","v":"Prestación de servicios profesionales y de apoyo a la gestión, o para la ejecución de trabajos artísticos que sólo puedan encomendarse a determinadas personas naturales;"},{"$f":"IF(ISBLANK(I145),1,IFERROR(VLOOKUP(I145,afectacion,1,FALSE),\"NO\"))","v":"Inversión"},{"$f":"IF(ISBLANK(K145),1,IFERROR(VLOOKUP(K145,Eje_Pilar_Prop!$C$3:$C$104,1,FALSE),\"NO\"))","v":45},{"$f":"IF(ISBLANK(C145),1,IFERROR(VLOOKUP(C145,SECOP,1,FALSE),\"NO\"))","v":"SECOP II"},1,{"$f":"IF(ISBLANK(J145),1,IFERROR(VLOOKUP(J145,pdd,1,FALSE),\"NO\"))","v":"Bogotá Mejor para Todos"}]
["FDLCH-CPS-136-2020",2020,"SECOP II","CPS-136-2020","Contratos de prestación de servicios profesionales y de apoyo a la gestión","Contratación directa","Prestación de servicios profesionales y de apoyo a la gestión, o para la ejecución de trabajos artísticos que sólo puedan encomendarse a determinadas personas naturales;","PRESTACIÓN DE SERVICIOS PROFESIONALES PARA EL APOYO AL ÁREA DE GESTIÓN DEL DESARROLLO LOCAL DE LA ALCALDÍA LOCAL DE CHAPINERO EN LA FORMULACIÓN, GESTIÓN, EJECUCIÓN Y SEGUIMIENTO DEL PROYECTO 1301 'MEJORAR LA CALIDAD DE LA MOVILIDAD' Y LA SUPERVISIÓN DE CONTRATOS QUE LE SEAN ASIGNADOS.","Inversión","Bogotá Mejor para Todos",18,{"$f":"IF(ISERROR(VLOOKUP(K146,Eje_Pilar_Prop!$C$2:$E$104,2,FALSE)),\" \",VLOOKUP(K146,Eje_Pilar_Prop!$C$2:$E$104,2,FALSE))","v":"Mejor movilidad para todos"},{"$f":"IF(ISERROR(VLOOKUP(K146,Eje_Pilar_Prop!$C$2:$E$104,3,FALSE)),\" \",VLOOKUP(K146,Eje_Pilar_Prop!$C$2:$E$104,3,FALSE))","v":"Pilar 2 Democracía Urbana"},1301,1070011854,"SANDRA PAOLA SALAMANCA RIAÑO",15600000,0,0,1,1950000,17550000,17550000,"2020-07-10","2020-07-13","2021-01-18",120,1,60,null,null,null,null,null,null,"X",null,1,null,null,{"$f":"IF(SUMPRODUCT((A$14:A146=A146)*(B$14:B146=B146)*(D$14:D146=D146))>1,0,1)","v":1},"Contratos de prestación de servicios profesionales y de apoyo a la gestión","Contratación directa",{"$f":"IF(ISBLANK(G146),1,IFERROR(VLOOKUP(G146,Tipo!$C$12:$C$27,1,FALSE),\"NO\"))","v":"Prestación de servicios profesionales y de apoyo a la gestión, o para la ejecución de trabajos artísticos que sólo puedan encomendarse a determinadas personas naturales;"},"Inversión",{"$f":"IF(ISBLANK(K146),1,IFERROR(VLOOKUP(K146,Eje_Pilar_Prop!$C$3:$C$104,1,FALSE),\"NO\"))","v":18},"SECOP II",1,"Bogotá Mejor para Todos"]
["FDLCH-CPS-137-2020",2020,"SECOP II","CPS-137-2020","Contratos de prestación de servicios profesionales y de apoyo a la gestión","Contratación directa","Prestación de servicios profesionales y de apoyo a la gestión, o para la ejecución de trabajos artísticos que sólo puedan encomendarse a determinadas personas naturales;","PRESTACIÓN DE SERVICIOS PERSONALES NECESARIOS PARA LAS LABORES DE ENTREGA Y RECIBO DE LAS COMUNICACIONES EMITIDAS O RECIBIDAS POR LAS INSPECCIONES DE POLICÍA DE LA LOCALIDAD Y DEPENDENCIAS DE LA ALCALDÍA.","Inversión","Bogotá Mejor para Todos",45,{"$f":"IF(ISERROR(VLOOKUP(K147,Eje_Pilar_Prop!$C$2:$E$104,2,FALSE)),\" \",VLOOKUP(K147,Eje_Pilar_Prop!$C$2:$E$104,2,FALSE))","v":"Gobernanza e influencia local, regional e internacional"},{"$f":"IF(ISERROR(VLOOKUP(K147,Eje_Pilar_Prop!$C$2:$E$104,3,FALSE)),\" \",VLOOKUP(K147,Eje_Pilar_Prop!$C$2:$E$104,3,FALSE))","v":"Eje Transversal 4 Gobierno Legitimo, Fortalecimiento Local y Eficiencia"},1304,1019024025," EFRAÍN ANDRÉS MONROY CEPEDA",8000000,0,0,1,4000000,12000000,10266667,"2020-07-15","2020-07-16","2020-11-15",120,0,0,null,null,null,null,null,null,"X",null,0.85555558333333337,null,null,{"$f":"IF(SUMPRODUCT((A$14:A147=A147)*(B$14:B147=B147)*(D$14:D147=D147))>1,0,1)","v":1},"Contratos de prestación de servicios profesionales y de apoyo a la gestión","Contratación directa",{"$f":"IF(ISBLANK(G147),1,IFERROR(VLOOKUP(G147,Tipo!$C$12:$C$27,1,FALSE),\"NO\"))","v":"Prestación de servicios profesionales y de apoyo a la gestión, o para la ejecución de trabajos artísticos que sólo puedan encomendarse a determinadas personas naturales;"},"Inversión",{"$f":"IF(ISBLANK(K147),1,IFERROR(VLOOKUP(K147,Eje_Pilar_Prop!$C$3:$C$104,1,FALSE),\"NO\"))","v":45},"SECOP II",1,"Bogotá Mejor para Todos"]
["FDLCH-CPS-138-2020",2020,"SECOP II","CPS-138-2020","Contratos de prestación de servicios profesionales y de apoyo a la gestión","Contratación directa","Prestación de servicios profesionales y de apoyo a la gestión, o para la ejecución de trabajos artísticos que sólo puedan encomendarse a determinadas personas naturales;"," PRESTACIÓN DE SERVICIOS PERSONALES NECESARIOS PARA EL APOYO AL ÁREA DE GESTIÓN DEL DESARROLLO LOCAL DE LA ALCALDÍA LOCAL DE CHAPINERO EN LAS ACTIVIDADES DE RADICACIÓN Y CORRESPONDENCIA","Inversión","Bogotá Mejor para Todos",45,{"$f":"IF(ISERROR(VLOOKUP(K148,Eje_Pilar_Prop!$C$2:$E$104,2,FALSE)),\" \",VLOOKUP(K148,Eje_Pilar_Prop!$C$2:$E$104,2,FALSE))","v":"Gobernanza e influencia local, regional e internacional"},{"$f":"IF(ISERROR(VLOOKUP(K148,Eje_Pilar_Prop!$C$2:$E$104,3,FALSE)),\" \",VLOOKUP(K148,Eje_Pilar_Prop!$C$2:$E$104,3,FALSE))","v":"Eje Transversal 4 Gobierno Legitimo, Fortalecimiento Local y Eficiencia"},1304,53051061,"DENIS PATRICIA RODRIGUEZ JAIMES",8000000,0,0,0,0,8000000,8000000,"2020-07-10","2020-07-13","2021-01-12",120,1,60,null,null,null,null,null,null,"X",null,1,null,null,{"$f":"IF(SUMPRODUCT((A$14:A148=A148)*(B$14:B148=B148)*(D$14:D148=D148))>1,0,1)","v":1},"Contratos de prestación de servicios profesionales y de apoyo a la gestión","Contratación directa",{"$f":"IF(ISBLANK(G148),1,IFERROR(VLOOKUP(G148,Tipo!$C$12:$C$27,1,FALSE),\"NO\"))","v":"Prestación de servicios profesionales y de apoyo a la gestión, o para la ejecución de trabajos artísticos que sólo puedan encomendarse a determinadas personas naturales;"},"Inversión",{"$f":"IF(ISBLANK(K148),1,IFERROR(VLOOKUP(K148,Eje_Pilar_Prop!$C$3:$C$104,1,FALSE),\"NO\"))","v":45},"SECOP II",1,"Bogotá Mejor para Todos"]
["FDLCH-CPS-139-2020",2020,"SECOP II","CPS-139-2020","Contratos de prestación de servicios profesionales y de apoyo a la gestión","Contratación directa","Prestación de servicios profesionales y de apoyo a la gestión, o para la ejecución de trabajos artísticos que sólo puedan encomendarse a determinadas personas naturales;"," PRESTACIÓN DE SERVICIOS PROFESIONALES PARA LA OPERACIÓN, PRESTACIÓN Y SEGUIMIENTO Y CUMPLIMIENTO DE LOS PROCEDIMIENTOS ADMINISTRATIVOS, OPERATIVOS Y PROGRAMÁTICOS DE LOS SERVICIOS SOCIALES DEL PROYECTO DE SUBSIDIO APOYO ECONÓMICO TIPO C, QUE CONTRIBUYAN A LA GARANTÍA DE LOS DERECHOS DE LA POBLACIÓN MAYOR EN EL MARCO DE LA POLÍTICA PÚBLICA SOCIAL PARA EL ENVEJECIMIENTO Y LA VEJEZ EN EL DISTRITO CAPITAL A CARGO DE LA ALCALDÍA LOCAL DE CHAPINERO","Inversión","Bogotá Mejor para Todos",4,{"$f":"IF(ISERROR(VLOOKUP(K149,Eje_Pilar_Prop!$C$2:$E$104,2,FALSE)),\" \",VLOOKUP(K149,Eje_Pilar_Prop!$C$2:$E$104,2,FALSE))","v":"Familias protegidas y adaptadas al cambio climático"},{"$f":"IF(ISERROR(VLOOKUP(K149,Eje_Pilar_Prop!$C$2:$E$104,3,FALSE)),\" \",VLOOKUP(K149,Eje_Pilar_Prop!$C$2:$E$104,3,FALSE))","v":"Pilar 1 Igualdad de Calidad de Vida"},1294,52515541,"BELLA ELOISA KAROLINA MORENO BRIONES",18400000,0,0,1,9200000,27600000,24533333,"2020-07-17","2020-07-22","2021-01-21",120,1,60,80449648,"JUAN CARLOS AREVALO","2020-11-19",385000,null,null,"X",null,0.88888887681159423,null,null,{"$f":"IF(SUMPRODUCT((A$14:A149=A149)*(B$14:B149=B149)*(D$14:D149=D149))>1,0,1)","v":1},"Contratos de prestación de servicios profesionales y de apoyo a la gestión","Contratación directa",{"$f":"IF(ISBLANK(G149),1,IFERROR(VLOOKUP(G149,Tipo!$C$12:$C$27,1,FALSE),\"NO\"))","v":"Prestación de servicios profesionales y de apoyo a la gestión, o para la ejecución de trabajos artísticos que sólo puedan encomendarse a determinadas personas naturales;"},"Inversión",{"$f":"IF(ISBLANK(K149),1,IFERROR(VLOOKUP(K149,Eje_Pilar_Prop!$C$3:$C$104,1,FALSE),\"NO\"))","v":4},"SECOP II",1,"Bogotá Mejor para Todos"]
["FDLCH-CPS-140-2020",2020,"SECOP II","CPS-140-2020","Contratos de prestación de servicios profesionales y de apoyo a la gestión","Contratación directa","Prestación de servicios profesionales y de apoyo a la gestión, o para la ejecución de trabajos artísticos que sólo puedan encomendarse a determinadas personas naturales;","PRESTAR LOS SERVICIOS TÉCNICOS PARA LA OPERACIÓN, SEGUIMIENTO Y CUMPLIMIENTO DE LOS PROCESOS Y PROCEDIMIENTOS DEL SERVICIO APOYOS PARA LA SEGURIDAD ECONÓMICA TIPO C, REQUERIDOS PARA EL OPORTUNO Y ADECUADO REGISTRO, CRUCE Y REPORTE DE LOS DATOS EN EL SISTEMA MISIONAL SIRBE, QUE CONTRIBUYAN A LA GARANTÍA DE LOS DERECHOS DE LA POBLACIÓN MAYOR EN EL MARCO DE LA POLÍTICA PÚBLICA SOCIAL PARA EL ENVEJECIMIENTO Y LA VEJEZ EN EL DISTRITO CAPITAL A CARGO DE LA ALCALDÍA LOCAL DE CHAPINERO","Inversión","Bogotá Mejor para Todos",4,{"$f":"IF(ISERROR(VLOOKUP(K150,Eje_Pilar_Prop!$C$2:$E$104,2,FALSE)),\" \",VLOOKUP(K150,Eje_Pilar_Prop!$C$2:$E$104,2,FALSE))","v":"Familias protegidas y adaptadas al cambio climático"},{"$f":"IF(ISERROR(VLOOKUP(K150,Eje_Pilar_Prop!$C$2:$E$104,3,FALSE)),\" \",VLOOKUP(K150,Eje_Pilar_Prop!$C$2:$E$104,3,FALSE))","v":"Pilar 1 Igualdad de Calidad de Vida"},1294,22511864,"SONIA MILENA PORTILLO OSORIO",15400000,1,-385000,1,8085000,23100000,17068333,"2020-07-16","2020-07-16","2020-12-30",120,1,45,null,null,null,null,null,null,"X",null,0.73888887445887441,null,null,{"$f":"IF(SUMPRODUCT((A$14:A150=A150)*(B$14:B150=B150)*(D$14:D150=D150))>1,0,1)","v":1},"Contratos de prestación de servicios profesionales y de apoyo a la gestión","Contratación directa",{"$f":"IF(ISBLANK(G150),1,IFERROR(VLOOKUP(G150,Tipo!$C$12:$C$27,1,FALSE),\"NO\"))","v":"Prestación de servicios profesionales y de apoyo a la gestión, o para la ejecución de trabajos artísticos que sólo puedan encomendarse a determinadas personas naturales;"},"Inversión",{"$f":"IF(ISBLANK(K150),1,IFERROR(VLOOKUP(K150,Eje_Pilar_Prop!$C$3:$C$104,1,FALSE),\"NO\"))","v":4},"SECOP II",1,"Bogotá Mejor para Todos"]
["FDLCH-CPS-141-2020",2020,"SECOP II","CPS-141-2020","Contratos de prestación de servicios profesionales y de apoyo a la gestión","Contratación directa","Prestación de servicios profesionales y de apoyo a la gestión, o para la ejecución de trabajos artísticos que sólo puedan encomendarse a determinadas personas naturales;","PRESTACIÓN DE LOS SERVICIOS PERSONALES NECESARIOS PARA LA CONDUCCIÓN DE LOS VEHÍCULOS QUE CONFORMAN EL PARQUE AUTOMOTOR EN PROPIEDAD O CUSTODIA DEL FONDO DE DESARROLLO LOCAL DE CHAPINERO, Y EL TRANSPORTE DE SERVIDORES PÚBLICOS PARA LA REALIZACIÓN DE LAS ACTIVIDADES MISIONALES DE LA ALCALDÍA LOCAL DE CHAPINERO","Inversión","Bogotá Mejor para Todos",45,{"$f":"IF(ISERROR(VLOOKUP(K151,Eje_Pilar_Prop!$C$2:$E$104,2,FALSE)),\" \",VLOOKUP(K151,Eje_Pilar_Prop!$C$2:$E$104,2,FALSE))","v":"Gobernanza e influencia local, regional e internacional"},{"$f":"IF(ISERROR(VLOOKUP(K151,Eje_Pilar_Prop!$C$2:$E$104,3,FALSE)),\" \",VLOOKUP(K151,Eje_Pilar_Prop!$C$2:$E$104,3,FALSE))","v":"Eje Transversal 4 Gobierno Legitimo, Fortalecimiento Local y Eficiencia"},1304,3220879,"BENEDICTO VANEGAS CASTELLANOS",9360000,0,0,1,3510000,12870000,12246000,"2020-07-17","2020-07-23","2021-01-06",120,1,45,null,null,null,null,null,null,"X",null,0.95151515151515154,null,null,{"$f":"IF(SUMPRODUCT((A$14:A151=A151)*(B$14:B151=B151)*(D$14:D151=D151))>1,0,1)","v":1},"Contratos de prestación de servicios profesionales y de apoyo a la gestión","Contratación directa",{"$f":"IF(ISBLANK(G151),1,IFERROR(VLOOKUP(G151,Tipo!$C$12:$C$27,1,FALSE),\"NO\"))","v":"Prestación de servicios profesionales y de apoyo a la gestión, o para la ejecución de trabajos artísticos que sólo puedan encomendarse a determinadas personas naturales;"},"Inversión",{"$f":"IF(ISBLANK(K151),1,IFERROR(VLOOKUP(K151,Eje_Pilar_Prop!$C$3:$C$104,1,FALSE),\"NO\"))","v":45},"SECOP II",1,"Bogotá Mejor para Todos"]
["FDLCH-CPS-142-2020",2020,"SECOP II","CPS-142-2020","Contratos de prestación de servicios profesionales y de apoyo a la gestión","Contratación directa","Prestación de servicios profesionales y de apoyo a la gestión, o para la ejecución de trabajos artísticos que sólo puedan encomendarse a determinadas personas naturales;"," PRESTACIÓN DE SERVICIOS PERSONALES NECESARIOS PARA APOYAR ADMINISTRATIVA Y ASISTENCIALMENTE A LAS INSPECCIONES DE POLICÍA DE LA LOCALIDAD DE CHAPINERO","Inversión","Bogotá Mejor para Todos",45,{"$f":"IF(ISERROR(VLOOKUP(K152,Eje_Pilar_Prop!$C$2:$E$104,2,FALSE)),\" \",VLOOKUP(K152,Eje_Pilar_Prop!$C$2:$E$104,2,FALSE))","v":"Gobernanza e influencia local, regional e internacional"},{"$f":"IF(ISERROR(VLOOKUP(K152,Eje_Pilar_Prop!$C$2:$E$104,3,FALSE)),\" \",VLOOKUP(K152,Eje_Pilar_Prop!$C$2:$E$104,3,FALSE))","v":"Eje Transversal 4 Gobierno Legitimo, Fortalecimiento Local y Eficiencia"},1304,1121913188,"LAURA MELISSA PALACIO RODRÍGUEZ",8800000,0,0,1,3300000,12100000,11000000,"2020-08-19","2020-08-20","2020-12-30",120,1,11,null,null,null,null,null,null,"X",null,0.90909090909090906,null,null,{"$f":"IF(SUMPRODUCT((A$14:A152=A152)*(B$14:B152=B152)*(D$14:D152=D152))>1,0,1)","v":1},"Contratos de prestación de servicios profesionales y de apoyo a la gestión","Contratación directa",{"$f":"IF(ISBLANK(G152),1,IFERROR(VLOOKUP(G152,Tipo!$C$12:$C$27,1,FALSE),\"NO\"))","v":"Prestación de servicios profesionales y de apoyo a la gestión, o para la ejecución de trabajos artísticos que sólo puedan encomendarse a determinadas personas naturales;"},"Inversión",{"$f":"IF(ISBLANK(K152),1,IFERROR(VLOOKUP(K152,Eje_Pilar_Prop!$C$3:$C$104,1,FALSE),\"NO\"))","v":45},"SECOP II",1,"Bogotá Mejor para Todos"]
["FDLCH-CPS-143-2020",2020,"SECOP II","CPS-143-2020","Contratos de prestación de servicios profesionales y de apoyo a la gestión","Contratación directa","Prestación de servicios profesionales y de apoyo a la gestión, o para la ejecución de trabajos artísticos que sólo puedan encomendarse a determinadas personas naturales;","PRESTACIÓN DE SERVICIOS PROFESIONALES PARA APOYAR TÉCNICAMENTE LAS DISTINTAS ETAPAS DE LOS PROCESOS DE COMPETENCIA DE LAS INSPECCIONES DE POLICÍA DE LA LOCALIDAD, SEGÚN REPARTO","Inversión","Bogotá Mejor para Todos",45,{"$f":"IF(ISERROR(VLOOKUP(K153,Eje_Pilar_Prop!$C$2:$E$104,2,FALSE)),\" \",VLOOKUP(K153,Eje_Pilar_Prop!$C$2:$E$104,2,FALSE))","v":"Gobernanza e influencia local, regional e internacional"},{"$f":"IF(ISERROR(VLOOKUP(K153,Eje_Pilar_Prop!$C$2:$E$104,3,FALSE)),\" \",VLOOKUP(K153,Eje_Pilar_Prop!$C$2:$E$104,3,FALSE))","v":"Eje Transversal 4 Gobierno Legitimo, Fortalecimiento Local y Eficiencia"},1304,1032445959,"MARIA ALEJANDRA JIMENEZ AUCIQUE",18000000,0,0,1,1650000,19650000,15150000,"2020-07-31","2020-08-03","2020-12-30",120,1,28,null,null,null,null,null,null,"X",null,0.77099236641221369,null,null,{"$f":"IF(SUMPRODUCT((A$14:A153=A153)*(B$14:B153=B153)*(D$14:D153=D153))>1,0,1)","v":1},"Contratos de prestación de servicios profesionales y de apoyo a la gestión","Contratación directa",{"$f":"IF(ISBLANK(G153),1,IFERROR(VLOOKUP(G153,Tipo!$C$12:$C$27,1,FALSE),\"NO\"))","v":"Prestación de servicios profesionales y de apoyo a la gestión, o para la ejecución de trabajos artísticos que sólo puedan encomendarse a determinadas personas naturales;"},"Inversión",{"$f":"IF(ISBLANK(K153),1,IFERROR(VLOOKUP(K153,Eje_Pilar_Prop!$C$3:$C$104,1,FALSE),\"NO\"))","v":45},"SECOP II",1,"Bogotá Mejor para Todos"]
["FDLCH-CPS-144-2020",2020,"SECOP II","CPS-144-2020","Contratos de prestación de servicios profesionales y de apoyo a la gestión","Contratación directa","Prestación de servicios profesionales y de apoyo a la gestión, o para la ejecución de trabajos artísticos que sólo puedan encomendarse a determinadas personas naturales;"," PRESTACIÓN DE SERVICIOS PROFESIONALES PARA APOYAR TÉCNICAMENTE LAS DISTINTAS ETAPAS DE LOS PROCESOS DE COMPETENCIA DE LAS INSPECCIONES DE POLICÍA DE LA LOCALIDAD, SEGÚN REPARTO","Inversión","Bogotá Mejor para Todos",45,{"$f":"IF(ISERROR(VLOOKUP(K154,Eje_Pilar_Prop!$C$2:$E$104,2,FALSE)),\" \",VLOOKUP(K154,Eje_Pilar_Prop!$C$2:$E$104,2,FALSE))","v":"Gobernanza e influencia local, regional e internacional"},{"$f":"IF(ISERROR(VLOOKUP(K154,Eje_Pilar_Prop!$C$2:$E$104,3,FALSE)),\" \",VLOOKUP(K154,Eje_Pilar_Prop!$C$2:$E$104,3,FALSE))","v":"Eje Transversal 4 Gobierno Legitimo, Fortalecimiento Local y Eficiencia"},1304,11449647,"WILLIAM RENE DIAZ GARAY",18000000,0,0,1,4200000,22200000,21000000,"2020-07-10","2020-07-13","2020-12-12",120,1,30,null,null,null,null,null,null,"X",null,0.94594594594594594,null,null,{"$f":"IF(SUMPRODUCT((A$14:A154=A154)*(B$14:B154=B154)*(D$14:D154=D154))>1,0,1)","v":1},"Contratos de prestación de servicios profesionales y de apoyo a la gestión","Contratación directa",{"$f":"IF(ISBLANK(G154),1,IFERROR(VLOOKUP(G154,Tipo!$C$12:$C$27,1,FALSE),\"NO\"))","v":"Prestación de servicios profesionales y de apoyo a la gestión, o para la ejecución de trabajos artísticos que sólo puedan encomendarse a determinadas personas naturales;"},"Inversión",{"$f":"IF(ISBLANK(K154),1,IFERROR(VLOOKUP(K154,Eje_Pilar_Prop!$C$3:$C$104,1,FALSE),\"NO\"))","v":45},"SECOP II",1,"Bogotá Mejor para Todos"]
["FDLCH-CPS-145-2020",2020,"SECOP II","CPS-145-2020","Contratos de prestación de servicios profesionales y de apoyo a la gestión","Contratación directa","Prestación de servicios profesionales y de apoyo a la gestión, o para la ejecución de trabajos artísticos que sólo puedan encomendarse a determinadas personas naturales;"," PRESTACIÓN DE SERVICIOS PROFESIONALES PARA APOYAR EL ALCALDE LOCAL EN EL ACOMPAÑAMIENTO, ATENCIÓN, PROMOCIÓN Y FORTALECIMIENTO DE LOS PROCESOS LOCALES DE PARTICIPACIÓN CIUDADANA, LOS ESPACIOS E INSTANCIAS INTERINSTITUCIONALES DE PARTICIPACIÓN CIUDADANA, ASÍ COMO LOS PROCESOS COMUNITARIOS EN LA LOCALIDAD","Inversión","Bogotá Mejor para Todos",45,{"$f":"IF(ISERROR(VLOOKUP(K155,Eje_Pilar_Prop!$C$2:$E$104,2,FALSE)),\" \",VLOOKUP(K155,Eje_Pilar_Prop!$C$2:$E$104,2,FALSE))","v":"Gobernanza e influencia local, regional e internacional"},{"$f":"IF(ISERROR(VLOOKUP(K155,Eje_Pilar_Prop!$C$2:$E$104,3,FALSE)),\" \",VLOOKUP(K155,Eje_Pilar_Prop!$C$2:$E$104,3,FALSE))","v":"Eje Transversal 4 Gobierno Legitimo, Fortalecimiento Local y Eficiencia"},1305,1075297036,"MARÍA ANGÉLICA BALAGUERA RUIZ",16000000,0,0,1,4000000,20000000,18400000,"2020-07-15","2020-07-15","2021-01-14",120,1,60,null,null,null,null,null,null,"X",null,0.92,null,null,{"$f":"IF(SUMPRODUCT((A$14:A155=A155)*(B$14:B155=B155)*(D$14:D155=D155))>1,0,1)","v":1},"Contratos de prestación de servicios profesionales y de apoyo a la gestión","Contratación directa",{"$f":"IF(ISBLANK(G155),1,IFERROR(VLOOKUP(G155,Tipo!$C$12:$C$27,1,FALSE),\"NO\"))","v":"Prestación de servicios profesionales y de apoyo a la gestión, o para la ejecución de trabajos artísticos que sólo puedan encomendarse a determinadas personas naturales;"},"Inversión",{"$f":"IF(ISBLANK(K155),1,IFERROR(VLOOKUP(K155,Eje_Pilar_Prop!$C$3:$C$104,1,FALSE),\"NO\"))","v":45},"SECOP II",1,"Bogotá Mejor para Todos"]
["FDLCH-CPS-146-2020",2020,"SECOP II","CPS-146-2020","Contratos de prestación de servicios profesionales y de apoyo a la gestión","Contratación directa","Prestación de servicios profesionales y de apoyo a la gestión, o para la ejecución de trabajos artísticos que sólo puedan encomendarse a determinadas personas naturales;","PRESTACIÓN DE SERVICIOS PROFESIONALES PARA APOYAR EL ALCALDE LOCAL EN LA GESTIÓN DE LOS ASUNTOS RELACIONADOS CON SEGURIDAD CIUDADANA, CONVIVENCIA Y PREVENCIÓN DE CONFLICTIVIDADES, VIOLENCIAS Y DELITOS EN LA LOCALIDAD, DE CONFORMIDAD CON EL MARCO NORMATIVO APLICABLE EN LA MATERIA.","Inversión","Bogotá Mejor para Todos",19,{"$f":"IF(ISERROR(VLOOKUP(K156,Eje_Pilar_Prop!$C$2:$E$104,2,FALSE)),\" \",VLOOKUP(K156,Eje_Pilar_Prop!$C$2:$E$104,2,FALSE))","v":"Seguridad y convivencia para todos"},{"$f":"IF(ISERROR(VLOOKUP(K156,Eje_Pilar_Prop!$C$2:$E$104,3,FALSE)),\" \",VLOOKUP(K156,Eje_Pilar_Prop!$C$2:$E$104,3,FALSE))","v":"Pilar 3 Construcción de Comunidad y Cultura Ciudadana"},1302,79720862,"IVAN GUILLERMO RAMIREZ REYES",19600000,0,0,1,9800000,29400000,25806666,"2020-07-15","2020-07-17","2020-12-31",120,2,45,null,null,null,null,null,null,"X",null,0.87777775510204081,null,null,{"$f":"IF(SUMPRODUCT((A$14:A156=A156)*(B$14:B156=B156)*(D$14:D156=D156))>1,0,1)","v":1},"Contratos de prestación de servicios profesionales y de apoyo a la gestión","Contratación directa",{"$f":"IF(ISBLANK(G156),1,IFERROR(VLOOKUP(G156,Tipo!$C$12:$C$27,1,FALSE),\"NO\"))","v":"Prestación de servicios profesionales y de apoyo a la gestión, o para la ejecución de trabajos artísticos que sólo puedan encomendarse a determinadas personas naturales;"},"Inversión",{"$f":"IF(ISBLANK(K156),1,IFERROR(VLOOKUP(K156,Eje_Pilar_Prop!$C$3:$C$104,1,FALSE),\"NO\"))","v":19},"SECOP II",1,"Bogotá Mejor para Todos"]
["FDLCH-CPS-147-2020",2020,"SECOP II","CPS-147-2020","Contratos de prestación de servicios profesionales y de apoyo a la gestión","Contratación directa","Prestación de servicios profesionales y de apoyo a la gestión, o para la ejecución de trabajos artísticos que sólo puedan encomendarse a determinadas personas naturales;"," PRESTACIÓN DE SERVICIOS PROFESIONALES PARA APOYAR EL ALCALDE LOCAL EN EL ACOMPAÑAMIENTO, ATENCIÓN, PROMOCIÓN Y FORTALECIMIENTO DE LOS PROCESOS LOCALES DE PARTICIPACIÓN CIUDADANA, LOS ESPACIOS E INSTANCIAS INTERINSTITUCIONALES DE PARTICIPACIÓN CIUDADANA, ASÍ COMO LOS PROCESOS COMUNITARIOS EN LA LOCALIDAD","Inversión","Bogotá Mejor para Todos",45,{"$f":"IF(ISERROR(VLOOKUP(K157,Eje_Pilar_Prop!$C$2:$E$104,2,FALSE)),\" \",VLOOKUP(K157,Eje_Pilar_Prop!$C$2:$E$104,2,FALSE))","v":"Gobernanza e influencia local, regional e internacional"},{"$f":"IF(ISERROR(VLOOKUP(K157,Eje_Pilar_Prop!$C$2:$E$104,3,FALSE)),\" \",VLOOKUP(K157,Eje_Pilar_Prop!$C$2:$E$104,3,FALSE))","v":"Eje Transversal 4 Gobierno Legitimo, Fortalecimiento Local y Eficiencia"},1305,53037864,"DIANA CAROLINA MORENO RINCÓN",19200000,0,0,2,7200000,26400000,24960000,"2020-08-04","2020-08-05","2020-12-23",120,1,19,null,null,null,null,null,null,"X",null,0.94545454545454544,null,null,{"$f":"IF(SUMPRODUCT((A$14:A157=A157)*(B$14:B157=B157)*(D$14:D157=D157))>1,0,1)","v":1},{"$f":"IF(ISBLANK(E157),1,IFERROR(VLOOKUP(E157,tipo,1,FALSE),\"NO\"))","v":"Contratos de prestación de servicios profesionales y de apoyo a la gestión"},"Contratación directa",{"$f":"IF(ISBLANK(G157),1,IFERROR(VLOOKUP(G157,Tipo!$C$12:$C$27,1,FALSE),\"NO\"))","v":"Prestación de servicios profesionales y de apoyo a la gestión, o para la ejecución de trabajos artísticos que sólo puedan encomendarse a determinadas personas naturales;"},"Inversión",{"$f":"IF(ISBLANK(K157),1,IFERROR(VLOOKUP(K157,Eje_Pilar_Prop!$C$3:$C$104,1,FALSE),\"NO\"))","v":45},"SECOP II",1,"Bogotá Mejor para Todos"]
["FDLCH-CPS-148-2020",2020,"SECOP II","CPS-148-2020","Contratos de prestación de servicios profesionales y de apoyo a la gestión","Contratación directa","Prestación de servicios profesionales y de apoyo a la gestión, o para la ejecución de trabajos artísticos que sólo puedan encomendarse a determinadas personas naturales;"," PRESTACIÓN DE SERVICIOS PROFESIONALES PARA EL ÁREA DE GESTIÓN JURÍDICA Y POLICÍA EN LA ATENCIÓN INTEGRAL DEL MANEJO DE LAS COMISIONES JUDICIALES ORDENADAS POR LAS AUTORIDADES JURISDICCIONALES, EN CUMPLIMIENTO DE LO ORDENADO POR LOS ARTÍCULOS 37 Y SIGUIENTES DEL CÓDIGO GENERAL DEL PROCESO, EN CONCORDANCIA CON LO PREVISTO EN EL ARTÍCULO 206 DE LA LEY 1801 DE 2016, Y APOYAR EVENTUALMENTE LA GESTIÓN POLICIVA Y JURÍDICA EN TEMAS DE DESCONGESTIÓN DEL ÁREA EN MATERIA DE IMPULSOS PROCESALES.","Inversión","Bogotá Mejor para Todos",45,{"$f":"IF(ISERROR(VLOOKUP(K158,Eje_Pilar_Prop!$C$2:$E$104,2,FALSE)),\" \",VLOOKUP(K158,Eje_Pilar_Prop!$C$2:$E$104,2,FALSE))","v":"Gobernanza e influencia local, regional e internacional"},{"$f":"IF(ISERROR(VLOOKUP(K158,Eje_Pilar_Prop!$C$2:$E$104,3,FALSE)),\" \",VLOOKUP(K158,Eje_Pilar_Prop!$C$2:$E$104,3,FALSE))","v":"Eje Transversal 4 Gobierno Legitimo, Fortalecimiento Local y Eficiencia"},1304,79729789," ALFREDO ENRIQUE CACERES MENDOZA",20400000,0,0,1,3230000,23630000,19720000,"2020-08-03","2020-08-04","2021-01-13",120,2,40,null,null,null,null,null,null,"X",null,0.83453237410071945,null,null,{"$f":"IF(SUMPRODUCT((A$14:A158=A158)*(B$14:B158=B158)*(D$14:D158=D158))>1,0,1)","v":1},"Contratos de prestación de servicios profesionales y de apoyo a la gestión","Contratación directa",{"$f":"IF(ISBLANK(G158),1,IFERROR(VLOOKUP(G158,Tipo!$C$12:$C$27,1,FALSE),\"NO\"))","v":"Prestación de servicios profesionales y de apoyo a la gestión, o para la ejecución de trabajos artísticos que sólo puedan encomendarse a determinadas personas naturales;"},"Inversión",{"$f":"IF(ISBLANK(K158),1,IFERROR(VLOOKUP(K158,Eje_Pilar_Prop!$C$3:$C$104,1,FALSE),\"NO\"))","v":45},"SECOP II",1,"Bogotá Mejor para Todos"]
["FDLCH-CPS-149-2020",2020,"SECOP II","CPS-149-2020","Contratos de prestación de servicios profesionales y de apoyo a la gestión","Contratación directa","Prestación de servicios profesionales y de apoyo a la gestión, o para la ejecución de trabajos artísticos que sólo puedan encomendarse a determinadas personas naturales;"," EL CONTRATO QUE SE PRETENDE CELEBRAR, TENDRÁ POR OBJETO PRESTACIÓN DE SERVICIOS PARA APOYAR EN LAS TAREAS OPERATIVAS DE CARÁCTER ARCHIVÍSTICO DESARROLLADAS EN LA ALCALDÍA LOCAL PARA GARANTIZAR LA APLICACIÓN CORRECTA DE LOS PROCEDIMIENTOS TÉCNICOS DE ACUERDO CON LO CONTEMPLADO EN EL(LOS) PROYECTO(S) 1304 – GOBERNANZA Y FORTALECIMIENTO DEL DESARROLLO INSTITUCIONAL","Inversión","Bogotá Mejor para Todos",45,{"$f":"IF(ISERROR(VLOOKUP(K159,Eje_Pilar_Prop!$C$2:$E$104,2,FALSE)),\" \",VLOOKUP(K159,Eje_Pilar_Prop!$C$2:$E$104,2,FALSE))","v":"Gobernanza e influencia local, regional e internacional"},{"$f":"IF(ISERROR(VLOOKUP(K159,Eje_Pilar_Prop!$C$2:$E$104,3,FALSE)),\" \",VLOOKUP(K159,Eje_Pilar_Prop!$C$2:$E$104,3,FALSE))","v":"Eje Transversal 4 Gobierno Legitimo, Fortalecimiento Local y Eficiencia"},1304,52423626,"DIANA PAOLA OVALLE RODRÍGUEZ",12000000,0,0,2,4000000,16000000,13900000,"2020-07-15","2020-07-16","2021-01-03",120,1,45,null,null,null,null,null,null,"X",null,0.86875000000000002,null,null,{"$f":"IF(SUMPRODUCT((A$14:A159=A159)*(B$14:B159=B159)*(D$14:D159=D159))>1,0,1)","v":1},"Contratos de prestación de servicios profesionales y de apoyo a la gestión","Contratación directa",{"$f":"IF(ISBLANK(G159),1,IFERROR(VLOOKUP(G159,Tipo!$C$12:$C$27,1,FALSE),\"NO\"))","v":"Prestación de servicios profesionales y de apoyo a la gestión, o para la ejecución de trabajos artísticos que sólo puedan encomendarse a determinadas personas naturales;"},"Inversión",{"$f":"IF(ISBLANK(K159),1,IFERROR(VLOOKUP(K159,Eje_Pilar_Prop!$C$3:$C$104,1,FALSE),\"NO\"))","v":45},"SECOP II",1,"Bogotá Mejor para Todos"]
["FDLCH-CPS-150-2020",2020,"SECOP II","CPS-150-2020","Contratos de prestación de servicios profesionales y de apoyo a la gestión","Contratación directa","Prestación de servicios profesionales y de apoyo a la gestión, o para la ejecución de trabajos artísticos que sólo puedan encomendarse a determinadas personas naturales;"," PRESTACIÓN DE SERVICIOS PERSONALES NECESARIOS PARA EL APOYO EN LA EJECUCIÓN DE ACTIVIDADES ADMINISTRATIVAS Y OPERATIVAS ADELANTADAS EN LA JUNTA ADMINISTRADORA LOCAL DE CHAPINERO.","Inversión","Bogotá Mejor para Todos",45,{"$f":"IF(ISERROR(VLOOKUP(K160,Eje_Pilar_Prop!$C$2:$E$104,2,FALSE)),\" \",VLOOKUP(K160,Eje_Pilar_Prop!$C$2:$E$104,2,FALSE))","v":"Gobernanza e influencia local, regional e internacional"},{"$f":"IF(ISERROR(VLOOKUP(K160,Eje_Pilar_Prop!$C$2:$E$104,3,FALSE)),\" \",VLOOKUP(K160,Eje_Pilar_Prop!$C$2:$E$104,3,FALSE))","v":"Eje Transversal 4 Gobierno Legitimo, Fortalecimiento Local y Eficiencia"},1304,51968302,"DIANA SOFIA MELO CASTRO",9922500,0,0,1,3720937,13643437,12651188,"2020-07-15","2020-07-16","2020-12-30",120,1,45,null,null,null,null,null,null,"X",null,0.92727279790275718,null,null,{"$f":"IF(SUMPRODUCT((A$14:A160=A160)*(B$14:B160=B160)*(D$14:D160=D160))>1,0,1)","v":1},"Contratos de prestación de servicios profesionales y de apoyo a la gestión","Contratación directa",{"$f":"IF(ISBLANK(G160),1,IFERROR(VLOOKUP(G160,Tipo!$C$12:$C$27,1,FALSE),\"NO\"))","v":"Prestación de servicios profesionales y de apoyo a la gestión, o para la ejecución de trabajos artísticos que sólo puedan encomendarse a determinadas personas naturales;"},"Inversión",{"$f":"IF(ISBLANK(K160),1,IFERROR(VLOOKUP(K160,Eje_Pilar_Prop!$C$3:$C$104,1,FALSE),\"NO\"))","v":45},"SECOP II",1,"Bogotá Mejor para Todos"]
["FDLCH-CPS-151-2020",2020,"SECOP II","CPS-151-2020","Contratos de prestación de servicios profesionales y de apoyo a la gestión","Contratación directa","Prestación de servicios profesionales y de apoyo a la gestión, o para la ejecución de trabajos artísticos que sólo puedan encomendarse a determinadas personas naturales;","PRESTACIÓN DE SERVICIOS PROFESIONALES PARA APOYAR AL ÁREA DE GESTIÓN DEL DESARROLLO LOCAL DE LA ALCALDÍA LOCAL DE CHAPINERO EN LA GESTIÓN DE LOS PROYECTOS RELACIONADOS CON LOS TEMAS DE RECREACIÓN Y DEPORTE, INCLUIDO EL PROYECTO 1298 CULTURA Y DEPORTE: TRANSFORMANDO VIDAS Y HACIENDO CIUDADANOS FELICES Y EN LA SUPERVISIÓN DE LOS CONTRATOS QUE LE SEAN ASIGNADOS","Inversión","Bogotá Mejor para Todos",11,{"$f":"IF(ISERROR(VLOOKUP(K161,Eje_Pilar_Prop!$C$2:$E$104,2,FALSE)),\" \",VLOOKUP(K161,Eje_Pilar_Prop!$C$2:$E$104,2,FALSE))","v":"Mejores oportunidades para el desarrollo a través de la cultura, la recreación y el deporte"},{"$f":"IF(ISERROR(VLOOKUP(K161,Eje_Pilar_Prop!$C$2:$E$104,3,FALSE)),\" \",VLOOKUP(K161,Eje_Pilar_Prop!$C$2:$E$104,3,FALSE))","v":"Pilar 1 Igualdad de Calidad de Vida"},1298,52724711,"ADRIANA SIABATTO FERNÁNDEZ",20400000,0,0,1,7650000,28050000,22950000,"2020-07-16","2020-07-16","2020-12-30",120,1,45,null,null,null,null,null,null,"X",null,0.81818181818181823,null,null,{"$f":"IF(SUMPRODUCT((A$14:A161=A161)*(B$14:B161=B161)*(D$14:D161=D161))>1,0,1)","v":1},"Contratos de prestación de servicios profesionales y de apoyo a la gestión","Contratación directa",{"$f":"IF(ISBLANK(G161),1,IFERROR(VLOOKUP(G161,Tipo!$C$12:$C$27,1,FALSE),\"NO\"))","v":"Prestación de servicios profesionales y de apoyo a la gestión, o para la ejecución de trabajos artísticos que sólo puedan encomendarse a determinadas personas naturales;"},"Inversión",{"$f":"IF(ISBLANK(K161),1,IFERROR(VLOOKUP(K161,Eje_Pilar_Prop!$C$3:$C$104,1,FALSE),\"NO\"))","v":11},"SECOP II",1,"Bogotá Mejor para Todos"]
["FDLCH-CPS-152-2020",2020,"SECOP II","CPS-152-2020","Contratos de prestación de servicios profesionales y de apoyo a la gestión","Contratación directa","Prestación de servicios profesionales y de apoyo a la gestión, o para la ejecución de trabajos artísticos que sólo puedan encomendarse a determinadas personas naturales;","PRESTACIÓN DE LOS SERVICIOS PERSONALES NECESARIOS PARA LA CONDUCCIÓN DE LOS VEHÍCULOS QUE CONFORMAN EL PARQUE AUTOMOTOR EN PROPIEDAD O CUSTODIA DEL FONDO DE DESARROLLO LOCAL DE CHAPINERO, Y EL TRANSPORTE DE SERVIDORES PÚBLICOS PARA LA REALIZACIÓN DE LAS ACTIVIDADES MISIONALES DE LA ALCALDÍA LOCAL DE CHAPINERO","Inversión","Bogotá Mejor para Todos",45,{"$f":"IF(ISERROR(VLOOKUP(K162,Eje_Pilar_Prop!$C$2:$E$104,2,FALSE)),\" \",VLOOKUP(K162,Eje_Pilar_Prop!$C$2:$E$104,2,FALSE))","v":"Gobernanza e influencia local, regional e internacional"},{"$f":"IF(ISERROR(VLOOKUP(K162,Eje_Pilar_Prop!$C$2:$E$104,3,FALSE)),\" \",VLOOKUP(K162,Eje_Pilar_Prop!$C$2:$E$104,3,FALSE))","v":"Eje Transversal 4 Gobierno Legitimo, Fortalecimiento Local y Eficiencia"},1304,79518739,"GERARDO MORENO HERRERA",9360000,0,0,1,3510000,12870000,12246000,"2020-07-16","2020-07-16","2021-01-14",120,2,60,null,null,null,null,null,null,"X",null,0.95151515151515154,null,null,{"$f":"IF(SUMPRODUCT((A$14:A162=A162)*(B$14:B162=B162)*(D$14:D162=D162))>1,0,1)","v":1},"Contratos de prestación de servicios profesionales y de apoyo a la gestión","Contratación directa",{"$f":"IF(ISBLANK(G162),1,IFERROR(VLOOKUP(G162,Tipo!$C$12:$C$27,1,FALSE),\"NO\"))","v":"Prestación de servicios profesionales y de apoyo a la gestión, o para la ejecución de trabajos artísticos que sólo puedan encomendarse a determinadas personas naturales;"},"Inversión",{"$f":"IF(ISBLANK(K162),1,IFERROR(VLOOKUP(K162,Eje_Pilar_Prop!$C$3:$C$104,1,FALSE),\"NO\"))","v":45},"SECOP II",1,"Bogotá Mejor para Todos"]
["FDLCH-CPS-153-2020",2020,"SECOP II","CPS-153-2020","Contratos de prestación de servicios profesionales y de apoyo a la gestión","Contratación directa","Prestación de servicios profesionales y de apoyo a la gestión, o para la ejecución de trabajos artísticos que sólo puedan encomendarse a determinadas personas naturales;","PRESTACIÓN DE LOS SERVICIOS PERSONALES NECESARIOS PARA LA CONDUCCIÓN DE LOS VEHÍCULOS QUE CONFORMAN EL PARQUE AUTOMOTOR EN PROPIEDAD O CUSTODIA DEL FONDO DE DESARROLLO LOCAL DE CHAPINERO, Y EL TRANSPORTE DE SERVIDORES PÚBLICOS PARA LA REALIZACIÓN DE LAS ACTIVIDADES MISIONALES DE LA ALCALDÍA LOCAL DE CHAPINERO","Inversión","Bogotá Mejor para Todos",45,{"$f":"IF(ISERROR(VLOOKUP(K163,Eje_Pilar_Prop!$C$2:$E$104,2,FALSE)),\" \",VLOOKUP(K163,Eje_Pilar_Prop!$C$2:$E$104,2,FALSE))","v":"Gobernanza e influencia local, regional e internacional"},{"$f":"IF(ISERROR(VLOOKUP(K163,Eje_Pilar_Prop!$C$2:$E$104,3,FALSE)),\" \",VLOOKUP(K163,Eje_Pilar_Prop!$C$2:$E$104,3,FALSE))","v":"Eje Transversal 4 Gobierno Legitimo, Fortalecimiento Local y Eficiencia"},1304,1018445848,"JUAN DAVID CHICACAUSA SALAS",9360000,0,0,2,4680000,14040000,12246000,"2020-07-16","2020-07-16","2021-01-14",120,2,60,null,null,null,null,null,null,"X",null,0.87222222222222223,null,null,{"$f":"IF(SUMPRODUCT((A$14:A163=A163)*(B$14:B163=B163)*(D$14:D163=D163))>1,0,1)","v":1},"Contratos de prestación de servicios profesionales y de apoyo a la gestión","Contratación directa",{"$f":"IF(ISBLANK(G163),1,IFERROR(VLOOKUP(G163,Tipo!$C$12:$C$27,1,FALSE),\"NO\"))","v":"Prestación de servicios profesionales y de apoyo a la gestión, o para la ejecución de trabajos artísticos que sólo puedan encomendarse a determinadas personas naturales;"},"Inversión",{"$f":"IF(ISBLANK(K163),1,IFERROR(VLOOKUP(K163,Eje_Pilar_Prop!$C$3:$C$104,1,FALSE),\"NO\"))","v":45},"SECOP II",1,"Bogotá Mejor para Todos"]
["FDLCH-CPS-154-2020",2020,"SECOP II","CPS-154-2020","Contratos de prestación de servicios profesionales y de apoyo a la gestión","Contratación directa","Prestación de servicios profesionales y de apoyo a la gestión, o para la ejecución de trabajos artísticos que sólo puedan encomendarse a determinadas personas naturales;"," PRESTACIÓN DE LOS SERVICIOS PERSONALES NECESARIOS PARA LA CONDUCCIÓN DE LOS VEHÍCULOS QUE CONFORMAN EL PARQUE AUTOMOTOR EN PROPIEDAD O CUSTODIA DEL FONDO DE DESARROLLO LOCAL DE CHAPINERO, Y EL TRANSPORTE DE SERVIDORES PÚBLICOS PARA LA REALIZACIÓN DE LAS ACTIVIDADES MISIONALES DE LA ALCALDÍA LOCAL DE CHAPINERO","Inversión","Bogotá Mejor para Todos",45,{"$f":"IF(ISERROR(VLOOKUP(K164,Eje_Pilar_Prop!$C$2:$E$104,2,FALSE)),\" \",VLOOKUP(K164,Eje_Pilar_Prop!$C$2:$E$104,2,FALSE))","v":"Gobernanza e influencia local, regional e internacional"},{"$f":"IF(ISERROR(VLOOKUP(K164,Eje_Pilar_Prop!$C$2:$E$104,3,FALSE)),\" \",VLOOKUP(K164,Eje_Pilar_Prop!$C$2:$E$104,3,FALSE))","v":"Eje Transversal 4 Gobierno Legitimo, Fortalecimiento Local y Eficiencia"},1304,80157713,"FERNANDO MEDINA MONTERO",9360000,0,0,2,4680000,14040000,12246000,"2020-07-14","2020-07-15","2020-12-29",120,1,45,null,null,null,null,null,null,"X",null,0.87222222222222223,null,null,{"$f":"IF(SUMPRODUCT((A$14:A164=A164)*(B$14:B164=B164)*(D$14:D164=D164))>1,0,1)","v":1},"Contratos de prestación de servicios profesionales y de apoyo a la gestión","Contratación directa",{"$f":"IF(ISBLANK(G164),1,IFERROR(VLOOKUP(G164,Tipo!$C$12:$C$27,1,FALSE),\"NO\"))","v":"Prestación de servicios profesionales y de apoyo a la gestión, o para la ejecución de trabajos artísticos que sólo puedan encomendarse a determinadas personas naturales;"},"Inversión",{"$f":"IF(ISBLANK(K164),1,IFERROR(VLOOKUP(K164,Eje_Pilar_Prop!$C$3:$C$104,1,FALSE),\"NO\"))","v":45},"SECOP II",{"$f":"IF(OR(YEAR(X164)=2020,ISBLANK(X164)),1,\"NO\")","v":1},"Bogotá Mejor para Todos"]
["FDLCH-CPS-155-2020",2020,"SECOP II","CPS-155-2020","Contratos de prestación de servicios profesionales y de apoyo a la gestión","Contratación directa","Prestación de servicios profesionales y de apoyo a la gestión, o para la ejecución de trabajos artísticos que sólo puedan encomendarse a determinadas personas naturales;","PRESTACIÓN DE SERVICIOS PROFESIONALES PARA APOYAR AL ÁREA DE GESTIÓN DEL DESARROLLO LOCAL DE LA ALCALDÍA LOCAL DE CHAPINERO EN LA FORMULACIÓN, GESTIÓN Y EJECUCIÓN DE LOS PROYECTOS RELACIONADOS CON LOS TEMAS DE EDUCACIÓN, INCLUIDO EL PROYECTO 1297 POR UN TERRITORIO EDUCADO, INCLUYENTE Y DIVERSO Y LA SUPERVISIÓN DE CONTRATOS QUE LE SEAN ASIGNADOS","Inversión","Bogotá Mejor para Todos",7,{"$f":"IF(ISERROR(VLOOKUP(K165,Eje_Pilar_Prop!$C$2:$E$104,2,FALSE)),\" \",VLOOKUP(K165,Eje_Pilar_Prop!$C$2:$E$104,2,FALSE))","v":"Inclusión educativa para la equidad"},{"$f":"IF(ISERROR(VLOOKUP(K165,Eje_Pilar_Prop!$C$2:$E$104,3,FALSE)),\" \",VLOOKUP(K165,Eje_Pilar_Prop!$C$2:$E$104,3,FALSE))","v":"Pilar 1 Igualdad de Calidad de Vida"},1297,1026252093,"NADIA ROJAS MUÑOZ",16800000,0,0,1,6300000,23100000,19040000,"2020-07-14","2020-07-15","2021-01-22",120,1,60,79728807,"HOSMAN HERNAN ARIAS GUTIERREZ","2020-09-22",9963333,null,null,"X",null,0.82424242424242422,null,null,{"$f":"IF(SUMPRODUCT((A$14:A165=A165)*(B$14:B165=B165)*(D$14:D165=D165))>1,0,1)","v":1},"Contratos de prestación de servicios profesionales y de apoyo a la gestión","Contratación directa",{"$f":"IF(ISBLANK(G165),1,IFERROR(VLOOKUP(G165,Tipo!$C$12:$C$27,1,FALSE),\"NO\"))","v":"Prestación de servicios profesionales y de apoyo a la gestión, o para la ejecución de trabajos artísticos que sólo puedan encomendarse a determinadas personas naturales;"},"Inversión",{"$f":"IF(ISBLANK(K165),1,IFERROR(VLOOKUP(K165,Eje_Pilar_Prop!$C$3:$C$104,1,FALSE),\"NO\"))","v":7},"SECOP II",1,"Bogotá Mejor para Todos"]
["FDLCH-CPS-156-2020",2020,"SECOP II","CPS-156-2020","Contratos de prestación de servicios profesionales y de apoyo a la gestión","Contratación directa","Prestación de servicios profesionales y de apoyo a la gestión, o para la ejecución de trabajos artísticos que sólo puedan encomendarse a determinadas personas naturales;"," PRESTACIÓN DE SERVICIOS PROFESIONALES PARA APOYAR AL ÁREA DE GESTIÓN DEL DESARROLLO LOCAL DE LA ALCALDÍA LOCAL DE CHAPINERO, EN LA FORMULACIÓN, GESTIÓN Y EJECUCIÓN DE LOS PROYECTOS RELACIONADOS CON EL TEMA DE CULTURA, INCLUIDO EL PROYECTO 1298 CULTURA Y DEPORTE: TRANSFORMANDO VIDAS Y HACIENDO CIUDADANOS FELICES Y EN LA SUPERVISIÓN DE LOS CONTRATOS QUE LE SEAN ASIGNADOS","Inversión","Bogotá Mejor para Todos",11,{"$f":"IF(ISERROR(VLOOKUP(K166,Eje_Pilar_Prop!$C$2:$E$104,2,FALSE)),\" \",VLOOKUP(K166,Eje_Pilar_Prop!$C$2:$E$104,2,FALSE))","v":"Mejores oportunidades para el desarrollo a través de la cultura, la recreación y el deporte"},{"$f":"IF(ISERROR(VLOOKUP(K166,Eje_Pilar_Prop!$C$2:$E$104,3,FALSE)),\" \",VLOOKUP(K166,Eje_Pilar_Prop!$C$2:$E$104,3,FALSE))","v":"Pilar 1 Igualdad de Calidad de Vida"},1298,1032433601,"TATIANA ANDREA BONILLA SEGURA",19600000,0,0,1,9800000,29400000,22376666,"2020-07-16","2020-07-17","2020-11-16",120,0,0,null,null,null,null,null,null,"X",null,0.76111108843537412,null,null,{"$f":"IF(SUMPRODUCT((A$14:A166=A166)*(B$14:B166=B166)*(D$14:D166=D166))>1,0,1)","v":1},"Contratos de prestación de servicios profesionales y de apoyo a la gestión","Contratación directa",{"$f":"IF(ISBLANK(G166),1,IFERROR(VLOOKUP(G166,Tipo!$C$12:$C$27,1,FALSE),\"NO\"))","v":"Prestación de servicios profesionales y de apoyo a la gestión, o para la ejecución de trabajos artísticos que sólo puedan encomendarse a determinadas personas naturales;"},"Inversión",{"$f":"IF(ISBLANK(K166),1,IFERROR(VLOOKUP(K166,Eje_Pilar_Prop!$C$3:$C$104,1,FALSE),\"NO\"))","v":11},"SECOP II",1,"Bogotá Mejor para Todos"]
["FDLCH-CPS-157-2020",2020,"SECOP II","CPS-157-2020","Contratos de prestación de servicios profesionales y de apoyo a la gestión","Contratación directa","Prestación de servicios profesionales y de apoyo a la gestión, o para la ejecución de trabajos artísticos que sólo puedan encomendarse a determinadas personas naturales;"," PRESTACIÓN DE SERVICIOS PROFESIONALES PARA APOYAR AL ÁREA DE GESTIÓN DEL DESARROLLO LOCAL DE LA ALCALDÍA LOCAL DE CHAPINERO EN LOS PROYECTOS QUE LE SEAN ASIGNADOS Y LA SUPERVISIÓN DE LOS CONTRATOS","Inversión","Bogotá Mejor para Todos",17,{"$f":"IF(ISERROR(VLOOKUP(K167,Eje_Pilar_Prop!$C$2:$E$104,2,FALSE)),\" \",VLOOKUP(K167,Eje_Pilar_Prop!$C$2:$E$104,2,FALSE))","v":"Espacio público, derecho de todos"},{"$f":"IF(ISERROR(VLOOKUP(K167,Eje_Pilar_Prop!$C$2:$E$104,3,FALSE)),\" \",VLOOKUP(K167,Eje_Pilar_Prop!$C$2:$E$104,3,FALSE))","v":"Pilar 2 Democracía Urbana"},1300,79268761,"MAURICIO BOHÓRQUEZ ESCOBAR",20000000,0,0,0,0,20000000,20000000,"2020-07-16","2020-07-17","2020-12-22",120,1,30,null,null,null,null,null,null,"X",null,1,null,null,{"$f":"IF(SUMPRODUCT((A$14:A167=A167)*(B$14:B167=B167)*(D$14:D167=D167))>1,0,1)","v":1},"Contratos de prestación de servicios profesionales y de apoyo a la gestión","Contratación directa",{"$f":"IF(ISBLANK(G167),1,IFERROR(VLOOKUP(G167,Tipo!$C$12:$C$27,1,FALSE),\"NO\"))","v":"Prestación de servicios profesionales y de apoyo a la gestión, o para la ejecución de trabajos artísticos que sólo puedan encomendarse a determinadas personas naturales;"},"Inversión",{"$f":"IF(ISBLANK(K167),1,IFERROR(VLOOKUP(K167,Eje_Pilar_Prop!$C$3:$C$104,1,FALSE),\"NO\"))","v":17},"SECOP II",1,"Bogotá Mejor para Todos"]
["FDLCH-CPS-158-2020",2020,"SECOP II","CPS-158-2020","Contratos de prestación de servicios profesionales y de apoyo a la gestión","Contratación directa","Prestación de servicios profesionales y de apoyo a la gestión, o para la ejecución de trabajos artísticos que sólo puedan encomendarse a determinadas personas naturales;"," PRESTAR LOS SERVICIOS PROFESIONALES DE APOYO AL ÁREA DE GESTIÓN DEL DESARROLLO LOCAL, EN TEMAS DE PLANEACIÓN, REACTIVACIÓN ECONÓMICA Y DE COOPERACIÓN DEL FONDO DE DESARROLLO LOCAL","Inversión","Bogotá Mejor para Todos",45,{"$f":"IF(ISERROR(VLOOKUP(K168,Eje_Pilar_Prop!$C$2:$E$104,2,FALSE)),\" \",VLOOKUP(K168,Eje_Pilar_Prop!$C$2:$E$104,2,FALSE))","v":"Gobernanza e influencia local, regional e internacional"},{"$f":"IF(ISERROR(VLOOKUP(K168,Eje_Pilar_Prop!$C$2:$E$104,3,FALSE)),\" \",VLOOKUP(K168,Eje_Pilar_Prop!$C$2:$E$104,3,FALSE))","v":"Eje Transversal 4 Gobierno Legitimo, Fortalecimiento Local y Eficiencia"},1304,79216761,"BORIS IVAN RODRIGUEZ DELGADO",16000000,0,0,1,4000000,20000000,17066667,"2020-07-17","2020-07-21","2021-01-08",120,2,49,null,null,null,null,null,null,"X",null,0.85333334999999999,null,null,{"$f":"IF(SUMPRODUCT((A$14:A168=A168)*(B$14:B168=B168)*(D$14:D168=D168))>1,0,1)","v":1},"Contratos de prestación de servicios profesionales y de apoyo a la gestión","Contratación directa",{"$f":"IF(ISBLANK(G168),1,IFERROR(VLOOKUP(G168,Tipo!$C$12:$C$27,1,FALSE),\"NO\"))","v":"Prestación de servicios profesionales y de apoyo a la gestión, o para la ejecución de trabajos artísticos que sólo puedan encomendarse a determinadas personas naturales;"},"Inversión",{"$f":"IF(ISBLANK(K168),1,IFERROR(VLOOKUP(K168,Eje_Pilar_Prop!$C$3:$C$104,1,FALSE),\"NO\"))","v":45},"SECOP II",1,"Bogotá Mejor para Todos"]
["FDLCH-CPS-159-2020",2020,"SECOP II","CPS-159-2020","Contratos de prestación de servicios profesionales y de apoyo a la gestión","Contratación directa","Prestación de servicios profesionales y de apoyo a la gestión, o para la ejecución de trabajos artísticos que sólo puedan encomendarse a determinadas personas naturales;"," PRESTACIÓN DE SERVICIOS PERSONALES NECESARIOS PARA EL APOYO EN LA EJECUCIÓN DE ACTIVIDADES ADMINISTRATIVAS Y OPERATIVAS TRANSVERSALES AL ÁREA DE GESTIÓN DEL DESARROLLO LOCAL Y AQUELLAS QUE SE ADELANTAN EN LA OFICINA DE CONTRATACIÓN DE LA ALCALDÍA LOCAL DE CHAPINERO","Inversión","Bogotá Mejor para Todos",45,{"$f":"IF(ISERROR(VLOOKUP(K169,Eje_Pilar_Prop!$C$2:$E$104,2,FALSE)),\" \",VLOOKUP(K169,Eje_Pilar_Prop!$C$2:$E$104,2,FALSE))","v":"Gobernanza e influencia local, regional e internacional"},{"$f":"IF(ISERROR(VLOOKUP(K169,Eje_Pilar_Prop!$C$2:$E$104,3,FALSE)),\" \",VLOOKUP(K169,Eje_Pilar_Prop!$C$2:$E$104,3,FALSE))","v":"Eje Transversal 4 Gobierno Legitimo, Fortalecimiento Local y Eficiencia"},1304,1016012242,"MARYARY SUNED QUINCHE SANCHEZ",10400000,0,0,1,4246666,14646666,13173334,"2020-07-23","2020-07-23","2020-01-09",120,2,48,null,null,null,null,null,null,"X",null,0.89940837047830546,null,null,{"$f":"IF(SUMPRODUCT((A$14:A169=A169)*(B$14:B169=B169)*(D$14:D169=D169))>1,0,1)","v":1},"Contratos de prestación de servicios profesionales y de apoyo a la gestión","Contratación directa",{"$f":"IF(ISBLANK(G169),1,IFERROR(VLOOKUP(G169,Tipo!$C$12:$C$27,1,FALSE),\"NO\"))","v":"Prestación de servicios profesionales y de apoyo a la gestión, o para la ejecución de trabajos artísticos que sólo puedan encomendarse a determinadas personas naturales;"},"Inversión",{"$f":"IF(ISBLANK(K169),1,IFERROR(VLOOKUP(K169,Eje_Pilar_Prop!$C$3:$C$104,1,FALSE),\"NO\"))","v":45},"SECOP II",1,"Bogotá Mejor para Todos"]
["FDLCH-CPS-160-2020",2020,"SECOP II","CPS-160-2020","Contratos de prestación de servicios profesionales y de apoyo a la gestión","Contratación directa","Prestación de servicios profesionales y de apoyo a la gestión, o para la ejecución de trabajos artísticos que sólo puedan encomendarse a determinadas personas naturales;","PRESTACIÓN DE SERVICIOS PROFESIONALES PARA APOYAR LA PROYECCIÓN DE CONCEPTOS TÉCNICOS RELACIONADOS CON EL CUMPLIMIENTO DE LAS NORMAS DE URBANISMO, CONSTRUCCIÓN E INFRAESTRUCTURA LOCAL, QUE PERMITAN SOPORTAR EL CUMPLIMIENTO DE LOS PROCESOS QUE DEBE ATENDER LA ALCALDÍA LOCAL DE CHAPINERO EN ESTOS TEMAS, DE CONFORMIDAD CON LOS LINEAMIENTOS ESTABLECIDOS.","Inversión","Bogotá Mejor para Todos",45,{"$f":"IF(ISERROR(VLOOKUP(K170,Eje_Pilar_Prop!$C$2:$E$104,2,FALSE)),\" \",VLOOKUP(K170,Eje_Pilar_Prop!$C$2:$E$104,2,FALSE))","v":"Gobernanza e influencia local, regional e internacional"},{"$f":"IF(ISERROR(VLOOKUP(K170,Eje_Pilar_Prop!$C$2:$E$104,3,FALSE)),\" \",VLOOKUP(K170,Eje_Pilar_Prop!$C$2:$E$104,3,FALSE))","v":"Eje Transversal 4 Gobierno Legitimo, Fortalecimiento Local y Eficiencia"},1304,80825882,"CARLOS ANDRÉS GIL RUEDA",18000000,0,0,2,7200000,25200000,22500000,"2020-07-14","2020-07-15","2021-01-24",120,1,60,null,null,null,null,null,"X",null,null,0.8928571428571429,null,null,{"$f":"IF(SUMPRODUCT((A$14:A170=A170)*(B$14:B170=B170)*(D$14:D170=D170))>1,0,1)","v":1},"Contratos de prestación de servicios profesionales y de apoyo a la gestión","Contratación directa",{"$f":"IF(ISBLANK(G170),1,IFERROR(VLOOKUP(G170,Tipo!$C$12:$C$27,1,FALSE),\"NO\"))","v":"Prestación de servicios profesionales y de apoyo a la gestión, o para la ejecución de trabajos artísticos que sólo puedan encomendarse a determinadas personas naturales;"},"Inversión",{"$f":"IF(ISBLANK(K170),1,IFERROR(VLOOKUP(K170,Eje_Pilar_Prop!$C$3:$C$104,1,FALSE),\"NO\"))","v":45},"SECOP II",1,"Bogotá Mejor para Todos"]
["FDLCH-CPS-161-2020",2020,"SECOP II","CPS-161-2020","Contratos de prestación de servicios profesionales y de apoyo a la gestión","Contratación directa","Prestación de servicios profesionales y de apoyo a la gestión, o para la ejecución de trabajos artísticos que sólo puedan encomendarse a determinadas personas naturales;","PRESTACIÓN DE SERVICIOS PROFESIONALES PARA APOYAR EL ÁREA DE GESTIÓN DEL DESARROLLO LOCAL DE LA ALCALDÍA LOCAL DE CHAPINERO EN LA GESTIÓN CONTRACTUAL DEL PROYECTO 1301 MEJORAR LA CALIDAD DE LA MOVILIDAD","Inversión","Bogotá Mejor para Todos",18,{"$f":"IF(ISERROR(VLOOKUP(K171,Eje_Pilar_Prop!$C$2:$E$104,2,FALSE)),\" \",VLOOKUP(K171,Eje_Pilar_Prop!$C$2:$E$104,2,FALSE))","v":"Mejor movilidad para todos"},{"$f":"IF(ISERROR(VLOOKUP(K171,Eje_Pilar_Prop!$C$2:$E$104,3,FALSE)),\" \",VLOOKUP(K171,Eje_Pilar_Prop!$C$2:$E$104,3,FALSE))","v":"Pilar 2 Democracía Urbana"},1301,1077443879,"JUAN CARLOS RESTREPO RENGIFO",20000000,0,0,1,10000000,30000000,24666667,"2020-07-17","2020-07-22","2020-12-30",120,2,39,null,null,null,null,null,null,"X",null,{"$f":"IF(ISERROR(W171/V171),\"-\",(W171/V171))","v":0.82222223333333333},null,null,{"$f":"IF(SUMPRODUCT((A$14:A171=A171)*(B$14:B171=B171)*(D$14:D171=D171))>1,0,1)","v":1},"Contratos de prestación de servicios profesionales y de apoyo a la gestión","Contratación directa",{"$f":"IF(ISBLANK(G171),1,IFERROR(VLOOKUP(G171,Tipo!$C$12:$C$27,1,FALSE),\"NO\"))","v":"Prestación de servicios profesionales y de apoyo a la gestión, o para la ejecución de trabajos artísticos que sólo puedan encomendarse a determinadas personas naturales;"},"Inversión",{"$f":"IF(ISBLANK(K171),1,IFERROR(VLOOKUP(K171,Eje_Pilar_Prop!$C$3:$C$104,1,FALSE),\"NO\"))","v":18},"SECOP II",1,"Bogotá Mejor para Todos"]
["FDLCH-CPS-162-2020",2020,"SECOP II","CPS-162-2020","Contratos de prestación de servicios profesionales y de apoyo a la gestión","Contratación directa","Prestación de servicios profesionales y de apoyo a la gestión, o para la ejecución de trabajos artísticos que sólo puedan encomendarse a determinadas personas naturales;","PRESTACIÓN DE SERVICIOS PROFESIONALES PARA APOYAR AL ÁREA DE GESTIÓN DEL DESARROLLO LOCAL DE LA ALCALDÍA LOCAL DE CHAPINERO EN LA FORMULACIÓN, GESTIÓN Y EJECUCIÓN DE LOS PROYECTOS RELACIONADOS CON LOS TEMAS DE SALUD EN GENERAL, INCLUIDA LA SALUD MENTAL PARA CONTRIBUIR CON EL MEJORAMIENTO DE LA CALIDAD DE VIDA DE LAS PERSONAS DE MANERA INTEGRAL Y EN LA SUPERVISIÓN DE CONTRATOS QUE LE SEAN ASIGNADOS.","Inversión","Bogotá Mejor para Todos",3,{"$f":"IF(ISERROR(VLOOKUP(K172,Eje_Pilar_Prop!$C$2:$E$104,2,FALSE)),\" \",VLOOKUP(K172,Eje_Pilar_Prop!$C$2:$E$104,2,FALSE))","v":"Igualdad y autonomía para una Bogotá incluyente"},{"$f":"IF(ISERROR(VLOOKUP(K172,Eje_Pilar_Prop!$C$2:$E$104,3,FALSE)),\" \",VLOOKUP(K172,Eje_Pilar_Prop!$C$2:$E$104,3,FALSE))","v":"Pilar 1 Igualdad de Calidad de Vida"},1295,51865103,"BEATRIZ ALICIA GIL CORREA",19600000,0,0,1,6370000,25970000,21070000,"2020-07-17","2020-07-21","2020-12-24",120,1,34,null,null,null,null,null,null,"X",null,0.81132075471698117,null,null,{"$f":"IF(SUMPRODUCT((A$14:A172=A172)*(B$14:B172=B172)*(D$14:D172=D172))>1,0,1)","v":1},"Contratos de prestación de servicios profesionales y de apoyo a la gestión","Contratación directa",{"$f":"IF(ISBLANK(G172),1,IFERROR(VLOOKUP(G172,Tipo!$C$12:$C$27,1,FALSE),\"NO\"))","v":"Prestación de servicios profesionales y de apoyo a la gestión, o para la ejecución de trabajos artísticos que sólo puedan encomendarse a determinadas personas naturales;"},"Inversión",{"$f":"IF(ISBLANK(K172),1,IFERROR(VLOOKUP(K172,Eje_Pilar_Prop!$C$3:$C$104,1,FALSE),\"NO\"))","v":3},"SECOP II",1,"Bogotá Mejor para Todos"]
["FDLCH-CPS-163-2020",2020,"SECOP II","CPS-163-2020","Contratos de prestación de servicios profesionales y de apoyo a la gestión","Contratación directa","Prestación de servicios profesionales y de apoyo a la gestión, o para la ejecución de trabajos artísticos que sólo puedan encomendarse a determinadas personas naturales;"," PRESTAR LOS SERVICIOS PROFESIONALES EN DERECHO PARA APOYAR JURÍDICAMENTE LA EJECUCIÓN DE LAS ACCIONES REQUERIDAS PARA LA DEPURACIÓN DE LAS ACTUACIONES ADMINISTRATIVAS QUE CURSAN EN LA ALCALDÍA LOCAL.","Inversión","Bogotá Mejor para Todos",45,{"$f":"IF(ISERROR(VLOOKUP(K173,Eje_Pilar_Prop!$C$2:$E$104,2,FALSE)),\" \",VLOOKUP(K173,Eje_Pilar_Prop!$C$2:$E$104,2,FALSE))","v":"Gobernanza e influencia local, regional e internacional"},{"$f":"IF(ISERROR(VLOOKUP(K173,Eje_Pilar_Prop!$C$2:$E$104,3,FALSE)),\" \",VLOOKUP(K173,Eje_Pilar_Prop!$C$2:$E$104,3,FALSE))","v":"Eje Transversal 4 Gobierno Legitimo, Fortalecimiento Local y Eficiencia"},1304,53063351,"CLAUDIA MARCELA AYALA GUERRERO",16000000,0,0,1,4533333,20533333,17333333,"2020-08-10","2020-08-11","2020-12-30",120,1,20,5058039,"VIDAL ROBERTO MENDEZ LASPRIELLA","2020-10-28",4400000,null,null,"X",null,0.84415584162590651,null,null,{"$f":"IF(SUMPRODUCT((A$14:A173=A173)*(B$14:B173=B173)*(D$14:D173=D173))>1,0,1)","v":1},"Contratos de prestación de servicios profesionales y de apoyo a la gestión","Contratación directa",{"$f":"IF(ISBLANK(G173),1,IFERROR(VLOOKUP(G173,Tipo!$C$12:$C$27,1,FALSE),\"NO\"))","v":"Prestación de servicios profesionales y de apoyo a la gestión, o para la ejecución de trabajos artísticos que sólo puedan encomendarse a determinadas personas naturales;"},"Inversión",{"$f":"IF(ISBLANK(K173),1,IFERROR(VLOOKUP(K173,Eje_Pilar_Prop!$C$3:$C$104,1,FALSE),\"NO\"))","v":45},"SECOP II",1,"Bogotá Mejor para Todos"]
["FDLCH-CPS-164-2020",2020,"SECOP II","CPS-164-2020","Contratos de prestación de servicios profesionales y de apoyo a la gestión","Contratación directa","Prestación de servicios profesionales y de apoyo a la gestión, o para la ejecución de trabajos artísticos que sólo puedan encomendarse a determinadas personas naturales;","PRESTACIÓN DE SERVICIOS PROFESIONALES PARA APOYAR JURÍDICAMENTE LA EJECUCIÓN DE LAS ACCIONES REQUERIDAS PARA EL TRÁMITE E IMPULSO PROCESAL DE LAS ACTUACIONES CONTRAVENCIONALES Y/O QUERELLAS QUE CURSEN EN LAS INSPECCIONES DE POLICÍA DE LA LOCALIDAD.","Inversión","Bogotá Mejor para Todos",45,{"$f":"IF(ISERROR(VLOOKUP(K174,Eje_Pilar_Prop!$C$2:$E$104,2,FALSE)),\" \",VLOOKUP(K174,Eje_Pilar_Prop!$C$2:$E$104,2,FALSE))","v":"Gobernanza e influencia local, regional e internacional"},{"$f":"IF(ISERROR(VLOOKUP(K174,Eje_Pilar_Prop!$C$2:$E$104,3,FALSE)),\" \",VLOOKUP(K174,Eje_Pilar_Prop!$C$2:$E$104,3,FALSE))","v":"Eje Transversal 4 Gobierno Legitimo, Fortalecimiento Local y Eficiencia"},1304,10772968,"LUIS FERNANDO DELGADO JIMENEZ",16000000,0,0,1,2666666,18666666,14666667,"2020-08-10","2020-08-11","2020-12-30",120,1,20,null,null,null,null,null,null,"X",null,0.78571433163265469,null,null,{"$f":"IF(SUMPRODUCT((A$14:A174=A174)*(B$14:B174=B174)*(D$14:D174=D174))>1,0,1)","v":1},"Contratos de prestación de servicios profesionales y de apoyo a la gestión","Contratación directa",{"$f":"IF(ISBLANK(G174),1,IFERROR(VLOOKUP(G174,Tipo!$C$12:$C$27,1,FALSE),\"NO\"))","v":"Prestación de servicios profesionales y de apoyo a la gestión, o para la ejecución de trabajos artísticos que sólo puedan encomendarse a determinadas personas naturales;"},"Inversión",{"$f":"IF(ISBLANK(K174),1,IFERROR(VLOOKUP(K174,Eje_Pilar_Prop!$C$3:$C$104,1,FALSE),\"NO\"))","v":45},"SECOP II",1,"Bogotá Mejor para Todos"]
["FDLCH-CPS-165-2020",2020,"SECOP II","CPS-165-2020","Contratos de prestación de servicios profesionales y de apoyo a la gestión","Contratación directa","Prestación de servicios profesionales y de apoyo a la gestión, o para la ejecución de trabajos artísticos que sólo puedan encomendarse a determinadas personas naturales;","PRESTACIÓN DE SERVICIOS PROFESIONALES PARA APOYAR JURÍDICAMENTE LA EJECUCIÓN DE LAS ACCIONES REQUERIDAS PARA EL TRÁMITE E IMPULSO PROCESAL DE LAS ACTUACIONES CONTRAVENCIONALES Y/O QUERELLAS QUE CURSEN EN LAS INSPECCIONES DE POLICÍA DE LA LOCALIDAD.","Inversión","Bogotá Mejor para Todos",45,{"$f":"IF(ISERROR(VLOOKUP(K175,Eje_Pilar_Prop!$C$2:$E$104,2,FALSE)),\" \",VLOOKUP(K175,Eje_Pilar_Prop!$C$2:$E$104,2,FALSE))","v":"Gobernanza e influencia local, regional e internacional"},{"$f":"IF(ISERROR(VLOOKUP(K175,Eje_Pilar_Prop!$C$2:$E$104,3,FALSE)),\" \",VLOOKUP(K175,Eje_Pilar_Prop!$C$2:$E$104,3,FALSE))","v":"Eje Transversal 4 Gobierno Legitimo, Fortalecimiento Local y Eficiencia"},1304,38254256,"MARTHA LUCIA SUAREZ OSORIO",16000000,0,0,1,2666666,18666666,14666667,"2020-08-10","2020-08-11","2020-12-30",120,1,20,null,null,null,null,null,null,"X",null,0.78571433163265469,null,null,{"$f":"IF(SUMPRODUCT((A$14:A175=A175)*(B$14:B175=B175)*(D$14:D175=D175))>1,0,1)","v":1},"Contratos de prestación de servicios profesionales y de apoyo a la gestión","Contratación directa",{"$f":"IF(ISBLANK(G175),1,IFERROR(VLOOKUP(G175,Tipo!$C$12:$C$27,1,FALSE),\"NO\"))","v":"Prestación de servicios profesionales y de apoyo a la gestión, o para la ejecución de trabajos artísticos que sólo puedan encomendarse a determinadas personas naturales;"},"Inversión",{"$f":"IF(ISBLANK(K175),1,IFERROR(VLOOKUP(K175,Eje_Pilar_Prop!$C$3:$C$104,1,FALSE),\"NO\"))","v":45},"SECOP II",1,"Bogotá Mejor para Todos"]
["FDLCH-CPS-166-2020",2020,"SECOP II","CPS-166-2020","Contratos de prestación de servicios profesionales y de apoyo a la gestión","Contratación directa","Prestación de servicios profesionales y de apoyo a la gestión, o para la ejecución de trabajos artísticos que sólo puedan encomendarse a determinadas personas naturales;","PRESTACIÓN DE SERVICIOS PROFESIONALES PARA APOYAR JURÍDICAMENTE LA EJECUCIÓN DE LAS ACCIONES REQUERIDAS PARA EL TRÁMITE E IMPULSO PROCESAL DE LAS ACTUACIONES CONTRAVENCIONALES Y/O QUERELLAS QUE CURSEN EN LAS INSPECCIONES DE POLICÍA DE LA LOCALIDAD.","Inversión","Bogotá Mejor para Todos",45,{"$f":"IF(ISERROR(VLOOKUP(K176,Eje_Pilar_Prop!$C$2:$E$104,2,FALSE)),\" \",VLOOKUP(K176,Eje_Pilar_Prop!$C$2:$E$104,2,FALSE))","v":"Gobernanza e influencia local, regional e internacional"},{"$f":"IF(ISERROR(VLOOKUP(K176,Eje_Pilar_Prop!$C$2:$E$104,3,FALSE)),\" \",VLOOKUP(K176,Eje_Pilar_Prop!$C$2:$E$104,3,FALSE))","v":"Eje Transversal 4 Gobierno Legitimo, Fortalecimiento Local y Eficiencia"},1304,53139176,"DENNIS NATALIA BERNAL RAMIREZ",16000000,0,0,1,2666667,18666667,16666667,"2020-08-12","2020-08-13","2021-01-04",120,1,22,null,null,null,null,null,null,"X",null,0.89285714477040812,null,null,{"$f":"IF(SUMPRODUCT((A$14:A176=A176)*(B$14:B176=B176)*(D$14:D176=D176))>1,0,1)","v":1},"Contratos de prestación de servicios profesionales y de apoyo a la gestión","Contratación directa",{"$f":"IF(ISBLANK(G176),1,IFERROR(VLOOKUP(G176,Tipo!$C$12:$C$27,1,FALSE),\"NO\"))","v":"Prestación de servicios profesionales y de apoyo a la gestión, o para la ejecución de trabajos artísticos que sólo puedan encomendarse a determinadas personas naturales;"},"Inversión",{"$f":"IF(ISBLANK(K176),1,IFERROR(VLOOKUP(K176,Eje_Pilar_Prop!$C$3:$C$104,1,FALSE),\"NO\"))","v":45},"SECOP II",1,"Bogotá Mejor para Todos"]
["FDLCH-CPS-167-2020",2020,"SECOP II","CPS-167-2020","Contratos de prestación de servicios profesionales y de apoyo a la gestión","Contratación directa","Prestación de servicios profesionales y de apoyo a la gestión, o para la ejecución de trabajos artísticos que sólo puedan encomendarse a determinadas personas naturales;","PRESTAR LOS SERVICIOS PROFESIONALES EN DERECHO PARA APOYAR JURÍDICAMENTE LA EJECUCIÓN DE LAS ACCIONES REQUERIDAS PARA LA DEPURACIÓN DE LAS ACTUACIONES ADMINISTRATIVAS QUE CURSAN EN LA ALCALDÍA LOCAL DE CHAPINERO","Inversión","Bogotá Mejor para Todos",45,{"$f":"IF(ISERROR(VLOOKUP(K177,Eje_Pilar_Prop!$C$2:$E$104,2,FALSE)),\" \",VLOOKUP(K177,Eje_Pilar_Prop!$C$2:$E$104,2,FALSE))","v":"Gobernanza e influencia local, regional e internacional"},{"$f":"IF(ISERROR(VLOOKUP(K177,Eje_Pilar_Prop!$C$2:$E$104,3,FALSE)),\" \",VLOOKUP(K177,Eje_Pilar_Prop!$C$2:$E$104,3,FALSE))","v":"Eje Transversal 4 Gobierno Legitimo, Fortalecimiento Local y Eficiencia"},1304,1022327851," JUAN CAMILO RAMIREZ PINTO",16800000,0,0,1,3080000,19880000,18200000,"2020-07-21","2020-07-22","2021-02-04",120,2,60,1026568660,"CRISTIAN ANDRES MONROYCARANTON","2020-09-24",10463333,null,null,"X",null,0.91549295774647887,null,null,{"$f":"IF(SUMPRODUCT((A$14:A177=A177)*(B$14:B177=B177)*(D$14:D177=D177))>1,0,1)","v":1},"Contratos de prestación de servicios profesionales y de apoyo a la gestión","Contratación directa",{"$f":"IF(ISBLANK(G177),1,IFERROR(VLOOKUP(G177,Tipo!$C$12:$C$27,1,FALSE),\"NO\"))","v":"Prestación de servicios profesionales y de apoyo a la gestión, o para la ejecución de trabajos artísticos que sólo puedan encomendarse a determinadas personas naturales;"},"Inversión",{"$f":"IF(ISBLANK(K177),1,IFERROR(VLOOKUP(K177,Eje_Pilar_Prop!$C$3:$C$104,1,FALSE),\"NO\"))","v":45},"SECOP II",1,"Bogotá Mejor para Todos"]
["FDLCH-CPS-168-2020",2020,"SECOP II","CPS-168-2020","Contratos de prestación de servicios profesionales y de apoyo a la gestión","Contratación directa","Prestación de servicios profesionales y de apoyo a la gestión, o para la ejecución de trabajos artísticos que sólo puedan encomendarse a determinadas personas naturales;","PRESTAR APOYO PROFESIONAL A LA GESTIÓN LOCAL CON EL SEGUIMIENTO DE LOS PROYECTOS DE SEGURIDAD Y CONVIVENCIA Y LA INCLUSIÓN DEL ENFOQUE DE DERECHOS HUMANOS A LAS GESTIONES QUE DESARROLLA EL FONDO DE DESARROLLO LOCAL","Inversión","Bogotá Mejor para Todos",19,{"$f":"IF(ISERROR(VLOOKUP(K178,Eje_Pilar_Prop!$C$2:$E$104,2,FALSE)),\" \",VLOOKUP(K178,Eje_Pilar_Prop!$C$2:$E$104,2,FALSE))","v":"Seguridad y convivencia para todos"},{"$f":"IF(ISERROR(VLOOKUP(K178,Eje_Pilar_Prop!$C$2:$E$104,3,FALSE)),\" \",VLOOKUP(K178,Eje_Pilar_Prop!$C$2:$E$104,3,FALSE))","v":"Pilar 3 Construcción de Comunidad y Cultura Ciudadana"},1302,1085258627,"JHOANA KATERIN PORTILLA MENESES",17200000,0,0,1,{"$f":"3440000+5160000","v":8600000},25800000,19493333,"2020-07-31","2020-08-03","2021-02-01",120,2,60,null,null,null,null,null,"X",null,null,0.75555554263565894,null,null,{"$f":"IF(SUMPRODUCT((A$14:A178=A178)*(B$14:B178=B178)*(D$14:D178=D178))>1,0,1)","v":1},"Contratos de prestación de servicios profesionales y de apoyo a la gestión","Contratación directa",{"$f":"IF(ISBLANK(G178),1,IFERROR(VLOOKUP(G178,Tipo!$C$12:$C$27,1,FALSE),\"NO\"))","v":"Prestación de servicios profesionales y de apoyo a la gestión, o para la ejecución de trabajos artísticos que sólo puedan encomendarse a determinadas personas naturales;"},"Inversión",{"$f":"IF(ISBLANK(K178),1,IFERROR(VLOOKUP(K178,Eje_Pilar_Prop!$C$3:$C$104,1,FALSE),\"NO\"))","v":19},"SECOP II",1,"Bogotá Mejor para Todos"]
["FDLCH-CPS-170-2020",2020,"SECOP II","CPS-170-2020","Contratos de prestación de servicios profesionales y de apoyo a la gestión","Contratación directa","Prestación de servicios profesionales y de apoyo a la gestión, o para la ejecución de trabajos artísticos que sólo puedan encomendarse a determinadas personas naturales;","PRESTAR SERVICIOS DE APOYO PERSONALES A LA GESTIÓN LOCAL CON EL SEGUIMIENTO DE LOS PROYECTOS DE SEGURIDAD Y CONVIVENCIA QUE DESARROLLA EL FONDO DE DESARROLLO LOCAL.","Inversión","Bogotá Mejor para Todos",19,{"$f":"IF(ISERROR(VLOOKUP(K179,Eje_Pilar_Prop!$C$2:$E$104,2,FALSE)),\" \",VLOOKUP(K179,Eje_Pilar_Prop!$C$2:$E$104,2,FALSE))","v":"Seguridad y convivencia para todos"},{"$f":"IF(ISERROR(VLOOKUP(K179,Eje_Pilar_Prop!$C$2:$E$104,3,FALSE)),\" \",VLOOKUP(K179,Eje_Pilar_Prop!$C$2:$E$104,3,FALSE))","v":"Pilar 3 Construcción de Comunidad y Cultura Ciudadana"},1302,51646432,"MARTHA PATRICIA MUÑOZ RUIZ",15400000,0,0,2,{"$f":"5518333+2181667","v":7700000},23100000,15143333,"2020-08-03","2020-08-04","2021-02-03",120,1,60,null,null,null,null,null,"X",null,null,0.65555554112554115,null,null,{"$f":"IF(SUMPRODUCT((A$14:A179=A179)*(B$14:B179=B179)*(D$14:D179=D179))>1,0,1)","v":1},"Contratos de prestación de servicios profesionales y de apoyo a la gestión","Contratación directa",{"$f":"IF(ISBLANK(G179),1,IFERROR(VLOOKUP(G179,Tipo!$C$12:$C$27,1,FALSE),\"NO\"))","v":"Prestación de servicios profesionales y de apoyo a la gestión, o para la ejecución de trabajos artísticos que sólo puedan encomendarse a determinadas personas naturales;"},"Inversión",{"$f":"IF(ISBLANK(K179),1,IFERROR(VLOOKUP(K179,Eje_Pilar_Prop!$C$3:$C$104,1,FALSE),\"NO\"))","v":19},"SECOP II",1,"Bogotá Mejor para Todos"]
["FDLCH-CPS-171-2020",2020,"SECOP II","CPS-171-2020","Contratos de prestación de servicios profesionales y de apoyo a la gestión","Contratación directa","Prestación de servicios profesionales y de apoyo a la gestión, o para la ejecución de trabajos artísticos que sólo puedan encomendarse a determinadas personas naturales;"," PRESTACIÓN DE SERVICIOS PROFESIONALES PARA APOYAR AL ÁREA DE GESTIÓN DEL DESARROLLO LOCAL DE LA ALCALDÍA LOCAL DE CHAPINERO, EN LA FORMULACIÓN, GESTIÓN Y EJECUCIÓN DE LOS PROYECTOS RELACIONADOS CON LA PREVENCIÓN, ATENCIÓN DE LA VIOLENCIA INTRAFAMILIAR Y SEXUAL Y EL DESARROLLO INTEGRAL DE LA PRIMERA INFANCIA, INCLUIDO EL PROYECTO 1293 ¿CONTRIBUIR EN EL DESARROLLO DE LA PRIMERA INFANCIA Y LA ELIMINACIÓN DE LAS VIOLENCIAS' Y EN LA SUPERVISIÓN DE LOS CONTRATOS QUE LE SEAN ASIGNADOS.","Inversión","Bogotá Mejor para Todos",2,{"$f":"IF(ISERROR(VLOOKUP(K180,Eje_Pilar_Prop!$C$2:$E$104,2,FALSE)),\" \",VLOOKUP(K180,Eje_Pilar_Prop!$C$2:$E$104,2,FALSE))","v":"Desarrollo integral desde la gestación hasta la adolescencia"},{"$f":"IF(ISERROR(VLOOKUP(K180,Eje_Pilar_Prop!$C$2:$E$104,3,FALSE)),\" \",VLOOKUP(K180,Eje_Pilar_Prop!$C$2:$E$104,3,FALSE))","v":"Pilar 1 Igualdad de Calidad de Vida"},1293,52312234,"CLAUDIA MARCELA LOPEZ SERRATO",19600000,0,0,1,9800000,29400000,22703333,"2020-07-22","2020-07-23","2020-01-09",120,2,48,null,null,null,null,null,null,"X",null,0.77222221088435372,null,null,{"$f":"IF(SUMPRODUCT((A$14:A180=A180)*(B$14:B180=B180)*(D$14:D180=D180))>1,0,1)","v":1},"Contratos de prestación de servicios profesionales y de apoyo a la gestión","Contratación directa",{"$f":"IF(ISBLANK(G180),1,IFERROR(VLOOKUP(G180,Tipo!$C$12:$C$27,1,FALSE),\"NO\"))","v":"Prestación de servicios profesionales y de apoyo a la gestión, o para la ejecución de trabajos artísticos que sólo puedan encomendarse a determinadas personas naturales;"},"Inversión",{"$f":"IF(ISBLANK(K180),1,IFERROR(VLOOKUP(K180,Eje_Pilar_Prop!$C$3:$C$104,1,FALSE),\"NO\"))","v":2},"SECOP II",1,"Bogotá Mejor para Todos"]
["FDLCH-CPS-172-2020",2020,"SECOP II","CPS-172-2020","Contratos de prestación de servicios profesionales y de apoyo a la gestión","Contratación directa","Prestación de servicios profesionales y de apoyo a la gestión, o para la ejecución de trabajos artísticos que sólo puedan encomendarse a determinadas personas naturales;","PRESTACIÓN DE SERVICIOS PROFESIONALES PARA APOYAR LA PROYECCIÓN DE CONCEPTOS TÉCNICOS RELACIONADOS CON EL CUMPLIMIENTO DE LAS NORMAS DE URBANISMO, CONSTRUCCIÓN E INFRAESTRUCTURA LOCAL, QUE PERMITAN SOPORTAR EL CUMPLIMIENTO DE LOS PROCESOS QUE DEBE ATENDER LA ALCALDÍA LOCAL DE CHAPINERO EN ESTOS TEMAS, DE CONFORMIDAD CON LOS LINEAMIENTOS ESTABLECIDOS.","Inversión","Bogotá Mejor para Todos",45,{"$f":"IF(ISERROR(VLOOKUP(K181,Eje_Pilar_Prop!$C$2:$E$104,2,FALSE)),\" \",VLOOKUP(K181,Eje_Pilar_Prop!$C$2:$E$104,2,FALSE))","v":"Gobernanza e influencia local, regional e internacional"},{"$f":"IF(ISERROR(VLOOKUP(K181,Eje_Pilar_Prop!$C$2:$E$104,3,FALSE)),\" \",VLOOKUP(K181,Eje_Pilar_Prop!$C$2:$E$104,3,FALSE))","v":"Eje Transversal 4 Gobierno Legitimo, Fortalecimiento Local y Eficiencia"},1304,80799927,"SALOMON RODRÍGUEZ LAGUNA",18000000,0,0,2,7200000,25200000,22500000,"2020-07-17","2020-07-22","2020-11-21",120,0,0,null,null,null,null,null,null,"X",null,0.8928571428571429,null,null,{"$f":"IF(SUMPRODUCT((A$14:A181=A181)*(B$14:B181=B181)*(D$14:D181=D181))>1,0,1)","v":1},"Contratos de prestación de servicios profesionales y de apoyo a la gestión","Contratación directa",{"$f":"IF(ISBLANK(G181),1,IFERROR(VLOOKUP(G181,Tipo!$C$12:$C$27,1,FALSE),\"NO\"))","v":"Prestación de servicios profesionales y de apoyo a la gestión, o para la ejecución de trabajos artísticos que sólo puedan encomendarse a determinadas personas naturales;"},"Inversión",{"$f":"IF(ISBLANK(K181),1,IFERROR(VLOOKUP(K181,Eje_Pilar_Prop!$C$3:$C$104,1,FALSE),\"NO\"))","v":45},"SECOP II",1,"Bogotá Mejor para Todos"]
["FDLCH-CPS-173-2020",2020,"SECOP II","CPS-173-2020","Contratos de prestación de servicios profesionales y de apoyo a la gestión","Contratación directa","Prestación de servicios profesionales y de apoyo a la gestión, o para la ejecución de trabajos artísticos que sólo puedan encomendarse a determinadas personas naturales;","PRESTAR LOS SERVICIOS PROFESIONALES A LA ALCALDÍA LOCAL DE CHAPINERO APOYANDO LA EJECUCIÓN DEL PROYECTO 1299, EN EL COMPONENTE DEMANDAS DE TITULACIÓN, CONFORME A GARANTIZAR EL CUMPLIMIENTO DEL PLAN DE DESARROLLO LOCAL","Inversión","Bogotá Mejor para Todos",15,{"$f":"IF(ISERROR(VLOOKUP(K182,Eje_Pilar_Prop!$C$2:$E$104,2,FALSE)),\" \",VLOOKUP(K182,Eje_Pilar_Prop!$C$2:$E$104,2,FALSE))","v":"Recuperación, incorporación, vida urbana y control de la ilegalidad"},{"$f":"IF(ISERROR(VLOOKUP(K182,Eje_Pilar_Prop!$C$2:$E$104,3,FALSE)),\" \",VLOOKUP(K182,Eje_Pilar_Prop!$C$2:$E$104,3,FALSE))","v":"Pilar 2 Democracía Urbana"},1299,81720959,"SANTIAGO RONDEROS BURAGLIA",21200000,0,0,0,0,21200000,17490000,"2020-08-10","2020-08-11","2021-01-10",120,1,30,null,null,null,null,null,null,"X",null,0.82499999999999996,null,null,{"$f":"IF(SUMPRODUCT((A$14:A182=A182)*(B$14:B182=B182)*(D$14:D182=D182))>1,0,1)","v":1},"Contratos de prestación de servicios profesionales y de apoyo a la gestión","Contratación directa",{"$f":"IF(ISBLANK(G182),1,IFERROR(VLOOKUP(G182,Tipo!$C$12:$C$27,1,FALSE),\"NO\"))","v":"Prestación de servicios profesionales y de apoyo a la gestión, o para la ejecución de trabajos artísticos que sólo puedan encomendarse a determinadas personas naturales;"},"Inversión",{"$f":"IF(ISBLANK(K182),1,IFERROR(VLOOKUP(K182,Eje_Pilar_Prop!$C$3:$C$104,1,FALSE),\"NO\"))","v":15},"SECOP II",1,"Bogotá Mejor para Todos"]
["FDLCH-CPS-174-2020",2020,"SECOP II","CPS-174-2020","Contratos de prestación de servicios profesionales y de apoyo a la gestión","Contratación directa","Prestación de servicios profesionales y de apoyo a la gestión, o para la ejecución de trabajos artísticos que sólo puedan encomendarse a determinadas personas naturales;","PRESTACIÓN DE LOS SERVICIOS PROFESIONALES PARA APOYAR LA FORMULACIÓN, GESTIÓN Y SEGUIMIENTO DE ACTIVIDADES ENFOCADAS A LA GESTIÓN AMBIENTAL EXTERNA, ENCAMINADAS A LA MITIGACIÓN DE LOS DIFERENTES IMPACTOS AMBIENTALES Y LA CONSERVACIÓN DE LOS RECURSOS NATURALES DE LA LOCALIDAD DE CHAPINERO","Inversión","Bogotá Mejor para Todos",41,{"$f":"IF(ISERROR(VLOOKUP(K183,Eje_Pilar_Prop!$C$2:$E$104,2,FALSE)),\" \",VLOOKUP(K183,Eje_Pilar_Prop!$C$2:$E$104,2,FALSE))","v":"Desarrollo rural sostenible"},{"$f":"IF(ISERROR(VLOOKUP(K183,Eje_Pilar_Prop!$C$2:$E$104,3,FALSE)),\" \",VLOOKUP(K183,Eje_Pilar_Prop!$C$2:$E$104,3,FALSE))","v":"Eje Transversal 3 Sostenibilidad Ambiental basada en la eficiencia energética"},1303,1030542408,"JOHN ELKIN FEO DUITAMA",19200000,0,0,1,4800000,24000000,21120000,"2020-07-16","2020-07-16","2021-01-15",120,1,60,null,null,null,null,null,null,"X",null,0.88,null,null,{"$f":"IF(SUMPRODUCT((A$14:A183=A183)*(B$14:B183=B183)*(D$14:D183=D183))>1,0,1)","v":1},"Contratos de prestación de servicios profesionales y de apoyo a la gestión","Contratación directa",{"$f":"IF(ISBLANK(G183),1,IFERROR(VLOOKUP(G183,Tipo!$C$12:$C$27,1,FALSE),\"NO\"))","v":"Prestación de servicios profesionales y de apoyo a la gestión, o para la ejecución de trabajos artísticos que sólo puedan encomendarse a determinadas personas naturales;"},"Inversión",{"$f":"IF(ISBLANK(K183),1,IFERROR(VLOOKUP(K183,Eje_Pilar_Prop!$C$3:$C$104,1,FALSE),\"NO\"))","v":41},"SECOP II",1,"Bogotá Mejor para Todos"]
["FDLCH-CPS-175-2020",2020,"SECOP II","CPS-175-2020","Contratos de prestación de servicios profesionales y de apoyo a la gestión","Contratación directa","Prestación de servicios profesionales y de apoyo a la gestión, o para la ejecución de trabajos artísticos que sólo puedan encomendarse a determinadas personas naturales;","PRESTACIÓN DE SERVICIOS PROFESIONALES ESPECIALIZADOS PARA APOYAR EL ÁREA DE GESTIÓN DEL DESARROLLO LOCAL DE LA ALCALDÍA LOCAL DE CHAPINERO EN LA GESTIÓN CONTRACTUAL DEL PROYECTO 1301 MEJORAR LA CALIDAD DE LA MOVILIDAD","Inversión","Bogotá Mejor para Todos",18,{"$f":"IF(ISERROR(VLOOKUP(K184,Eje_Pilar_Prop!$C$2:$E$104,2,FALSE)),\" \",VLOOKUP(K184,Eje_Pilar_Prop!$C$2:$E$104,2,FALSE))","v":"Mejor movilidad para todos"},{"$f":"IF(ISERROR(VLOOKUP(K184,Eje_Pilar_Prop!$C$2:$E$104,3,FALSE)),\" \",VLOOKUP(K184,Eje_Pilar_Prop!$C$2:$E$104,3,FALSE))","v":"Pilar 2 Democracía Urbana"},1301,77193263,"RAFAEL EDUARDO VARGAS CASTRO",28800000,0,0,1,14400000,43200000,37680000,"2020-07-16","2020-07-18","2021-01-02",120,1,40,null,null,null,null,null,null,"X",null,0.87222222222222223,null,null,{"$f":"IF(SUMPRODUCT((A$14:A184=A184)*(B$14:B184=B184)*(D$14:D184=D184))>1,0,1)","v":1},"Contratos de prestación de servicios profesionales y de apoyo a la gestión","Contratación directa",{"$f":"IF(ISBLANK(G184),1,IFERROR(VLOOKUP(G184,Tipo!$C$12:$C$27,1,FALSE),\"NO\"))","v":"Prestación de servicios profesionales y de apoyo a la gestión, o para la ejecución de trabajos artísticos que sólo puedan encomendarse a determinadas personas naturales;"},"Inversión",{"$f":"IF(ISBLANK(K184),1,IFERROR(VLOOKUP(K184,Eje_Pilar_Prop!$C$3:$C$104,1,FALSE),\"NO\"))","v":18},"SECOP II",1,"Bogotá Mejor para Todos"]
["FDLCH-CPS-176-2020",2020,"SECOP II","CPS-176-2020","Contratos de prestación de servicios profesionales y de apoyo a la gestión","Contratación directa","Prestación de servicios profesionales y de apoyo a la gestión, o para la ejecución de trabajos artísticos que sólo puedan encomendarse a determinadas personas naturales;","PRESTAR LOS SERVICIOS PROFESIONALES EN DERECHO PARA APOYAR JURÍDICAMENTE LA EJECUCIÓN DE LAS ACCIONES REQUERIDAS PARA LA DEPURACIÓN DE LAS ACTUACIONES ADMINISTRATIVAS QUE CURSAN EN LA ALCALDÍA LOCAL DE CHAPINERO.","Inversión","Bogotá Mejor para Todos",45,{"$f":"IF(ISERROR(VLOOKUP(K185,Eje_Pilar_Prop!$C$2:$E$104,2,FALSE)),\" \",VLOOKUP(K185,Eje_Pilar_Prop!$C$2:$E$104,2,FALSE))","v":"Gobernanza e influencia local, regional e internacional"},{"$f":"IF(ISERROR(VLOOKUP(K185,Eje_Pilar_Prop!$C$2:$E$104,3,FALSE)),\" \",VLOOKUP(K185,Eje_Pilar_Prop!$C$2:$E$104,3,FALSE))","v":"Eje Transversal 4 Gobierno Legitimo, Fortalecimiento Local y Eficiencia"},1304,19271830,"MANUEL FALLA BUSTOS",16800000,0,0,1,5600000,22400000,17640000,"2020-07-16","2020-07-16","2021-01-14",120,3,60,1094248111,"YEINI RAQUEL BLANCO MENDOZA","2020-10-30",9150000,null,null,"X",null,0.78749999999999998,null,null,{"$f":"IF(SUMPRODUCT((A$14:A185=A185)*(B$14:B185=B185)*(D$14:D185=D185))>1,0,1)","v":1},"Contratos de prestación de servicios profesionales y de apoyo a la gestión","Contratación directa",{"$f":"IF(ISBLANK(G185),1,IFERROR(VLOOKUP(G185,Tipo!$C$12:$C$27,1,FALSE),\"NO\"))","v":"Prestación de servicios profesionales y de apoyo a la gestión, o para la ejecución de trabajos artísticos que sólo puedan encomendarse a determinadas personas naturales;"},"Inversión",{"$f":"IF(ISBLANK(K185),1,IFERROR(VLOOKUP(K185,Eje_Pilar_Prop!$C$3:$C$104,1,FALSE),\"NO\"))","v":45},"SECOP II",1,"Bogotá Mejor para Todos"]
["FDLCH-CPS-177-2020",2020,"SECOP II","CPS-177-2020","Contratos de prestación de servicios profesionales y de apoyo a la gestión","Contratación directa","Prestación de servicios profesionales y de apoyo a la gestión, o para la ejecución de trabajos artísticos que sólo puedan encomendarse a determinadas personas naturales;","PRESTACIÓN DE SERVICIOS PROFESIONALES PARA APOYAR LA GESTIÓN CONTRACTUAL A CARGO DEL ÁREA DE GESTIÓN DEL DESARROLLO LOCAL DE LA ALCALDÍA LOCAL DE CHAPINERO","Inversión","Bogotá Mejor para Todos",45,{"$f":"IF(ISERROR(VLOOKUP(K186,Eje_Pilar_Prop!$C$2:$E$104,2,FALSE)),\" \",VLOOKUP(K186,Eje_Pilar_Prop!$C$2:$E$104,2,FALSE))","v":"Gobernanza e influencia local, regional e internacional"},{"$f":"IF(ISERROR(VLOOKUP(K186,Eje_Pilar_Prop!$C$2:$E$104,3,FALSE)),\" \",VLOOKUP(K186,Eje_Pilar_Prop!$C$2:$E$104,3,FALSE))","v":"Eje Transversal 4 Gobierno Legitimo, Fortalecimiento Local y Eficiencia"},1304,51854194,"BONNY BIANEY AGUIRRE BEDOYA",18000000,0,0,3,9000000,27000000,23550000,"2020-07-16","2020-07-16","2021-01-14",120,2,60,null,null,null,null,null,null,"X",null,0.87222222222222223,null,null,{"$f":"IF(SUMPRODUCT((A$14:A186=A186)*(B$14:B186=B186)*(D$14:D186=D186))>1,0,1)","v":1},"Contratos de prestación de servicios profesionales y de apoyo a la gestión","Contratación directa",{"$f":"IF(ISBLANK(G186),1,IFERROR(VLOOKUP(G186,Tipo!$C$12:$C$27,1,FALSE),\"NO\"))","v":"Prestación de servicios profesionales y de apoyo a la gestión, o para la ejecución de trabajos artísticos que sólo puedan encomendarse a determinadas personas naturales;"},"Inversión",{"$f":"IF(ISBLANK(K186),1,IFERROR(VLOOKUP(K186,Eje_Pilar_Prop!$C$3:$C$104,1,FALSE),\"NO\"))","v":45},"SECOP II",1,"Bogotá Mejor para Todos"]
["FDLCH-CPS-178-2020",2020,"SECOP II","CPS-178-2020","Contratos de prestación de servicios profesionales y de apoyo a la gestión","Contratación directa","Prestación de servicios profesionales y de apoyo a la gestión, o para la ejecución de trabajos artísticos que sólo puedan encomendarse a determinadas personas naturales;"," PRESTACIÓN DE SERVICIOS PROFESIONALES PARA APOYAR LA GESTIÓN CONTRACTUAL A CARGO DEL ÁREA DE GESTIÓN DEL DESARROLLO LOCAL DE LA ALCALDIA LOCAL DE CHAPINERO","Inversión","Bogotá Mejor para Todos",45,{"$f":"IF(ISERROR(VLOOKUP(K187,Eje_Pilar_Prop!$C$2:$E$104,2,FALSE)),\" \",VLOOKUP(K187,Eje_Pilar_Prop!$C$2:$E$104,2,FALSE))","v":"Gobernanza e influencia local, regional e internacional"},{"$f":"IF(ISERROR(VLOOKUP(K187,Eje_Pilar_Prop!$C$2:$E$104,3,FALSE)),\" \",VLOOKUP(K187,Eje_Pilar_Prop!$C$2:$E$104,3,FALSE))","v":"Eje Transversal 4 Gobierno Legitimo, Fortalecimiento Local y Eficiencia"},1304,1078368894,"JENNYFER PAOLA GALVIS TORRES",18000000,0,0,2,9000000,27000000,23550000,"2020-07-17","2020-07-21","2021-01-14",120,2,55,null,null,null,null,null,null,"X",null,0.87222222222222223,null,null,{"$f":"IF(SUMPRODUCT((A$14:A187=A187)*(B$14:B187=B187)*(D$14:D187=D187))>1,0,1)","v":1},"Contratos de prestación de servicios profesionales y de apoyo a la gestión","Contratación directa",{"$f":"IF(ISBLANK(G187),1,IFERROR(VLOOKUP(G187,Tipo!$C$12:$C$27,1,FALSE),\"NO\"))","v":"Prestación de servicios profesionales y de apoyo a la gestión, o para la ejecución de trabajos artísticos que sólo puedan encomendarse a determinadas personas naturales;"},"Inversión",{"$f":"IF(ISBLANK(K187),1,IFERROR(VLOOKUP(K187,Eje_Pilar_Prop!$C$3:$C$104,1,FALSE),\"NO\"))","v":45},"SECOP II",1,"Bogotá Mejor para Todos"]
["FDLCH-CPS-179-2020",2020,"SECOP II","CPS-179-2020","Contratos de prestación de servicios profesionales y de apoyo a la gestión","Contratación directa","Prestación de servicios profesionales y de apoyo a la gestión, o para la ejecución de trabajos artísticos que sólo puedan encomendarse a determinadas personas naturales;","PRESTACIÓN DE LOS SERVICIOS PROFESIONALES PARA APOYAR LA FORMULACIÓN, EJECUCIÓN, SEGUIMIENTO Y MEJORA CONTINUA DE LAS HERRAMIENTAS QUE CONFORMAN LA GESTIÓN AMBIENTAL INSTITUCIONAL DE LA ALCALDÍA LOCAL DE CHAPINERO","Inversión","Bogotá Mejor para Todos",4,{"$f":"IF(ISERROR(VLOOKUP(K188,Eje_Pilar_Prop!$C$2:$E$104,2,FALSE)),\" \",VLOOKUP(K188,Eje_Pilar_Prop!$C$2:$E$104,2,FALSE))","v":"Familias protegidas y adaptadas al cambio climático"},{"$f":"IF(ISERROR(VLOOKUP(K188,Eje_Pilar_Prop!$C$2:$E$104,3,FALSE)),\" \",VLOOKUP(K188,Eje_Pilar_Prop!$C$2:$E$104,3,FALSE))","v":"Pilar 1 Igualdad de Calidad de Vida"},1296,1019031184,"RAYMOND ALEXANDER JIMENEZ ARTEAGA",19200000,0,0,2,{"$f":"8800000","v":8800000},28000000,24320000,"2020-07-21","2020-07-22","2020-12-31",120,1,40,null,null,null,null,null,null,"X",null,0.86857142857142855,null,null,{"$f":"IF(SUMPRODUCT((A$14:A188=A188)*(B$14:B188=B188)*(D$14:D188=D188))>1,0,1)","v":1},"Contratos de prestación de servicios profesionales y de apoyo a la gestión","Contratación directa",{"$f":"IF(ISBLANK(G188),1,IFERROR(VLOOKUP(G188,Tipo!$C$12:$C$27,1,FALSE),\"NO\"))","v":"Prestación de servicios profesionales y de apoyo a la gestión, o para la ejecución de trabajos artísticos que sólo puedan encomendarse a determinadas personas naturales;"},"Inversión",{"$f":"IF(ISBLANK(K188),1,IFERROR(VLOOKUP(K188,Eje_Pilar_Prop!$C$3:$C$104,1,FALSE),\"NO\"))","v":4},"SECOP II",1,"Bogotá Mejor para Todos"]
["FDLCH-CPS-180-2020",2020,"SECOP II","CPS-180-2020","Contratos de prestación de servicios profesionales y de apoyo a la gestión","Contratación directa","Prestación de servicios profesionales y de apoyo a la gestión, o para la ejecución de trabajos artísticos que sólo puedan encomendarse a determinadas personas naturales;"," PRESTACIÓN DE SERVICIOS PERSONALES NECESARIOS PARA EL APOYO A LA GESTIÓN Y EJECUCIÓN DE LAS ACTIVIDADES ADMINISTRATIVAS Y OPERATIVAS QUE SE ADELANTAN EN LA ALCALDÍA LOCAL DE CHAPINERO","Inversión","Bogotá Mejor para Todos",45,{"$f":"IF(ISERROR(VLOOKUP(K189,Eje_Pilar_Prop!$C$2:$E$104,2,FALSE)),\" \",VLOOKUP(K189,Eje_Pilar_Prop!$C$2:$E$104,2,FALSE))","v":"Gobernanza e influencia local, regional e internacional"},{"$f":"IF(ISERROR(VLOOKUP(K189,Eje_Pilar_Prop!$C$2:$E$104,3,FALSE)),\" \",VLOOKUP(K189,Eje_Pilar_Prop!$C$2:$E$104,3,FALSE))","v":"Eje Transversal 4 Gobierno Legitimo, Fortalecimiento Local y Eficiencia"},1304,1136880515,"DIEGO ALEJANDRO PORTILLA UBATE",8800000,0,0,1,2933333,11733333,11073333,"2020-07-17","2020-07-21","2021-01-20",120,1,60,null,null,null,null,null,null,"X",null,0.94374999840198859,null,null,{"$f":"IF(SUMPRODUCT((A$14:A189=A189)*(B$14:B189=B189)*(D$14:D189=D189))>1,0,1)","v":1},"Contratos de prestación de servicios profesionales y de apoyo a la gestión","Contratación directa",{"$f":"IF(ISBLANK(G189),1,IFERROR(VLOOKUP(G189,Tipo!$C$12:$C$27,1,FALSE),\"NO\"))","v":"Prestación de servicios profesionales y de apoyo a la gestión, o para la ejecución de trabajos artísticos que sólo puedan encomendarse a determinadas personas naturales;"},"Inversión",{"$f":"IF(ISBLANK(K189),1,IFERROR(VLOOKUP(K189,Eje_Pilar_Prop!$C$3:$C$104,1,FALSE),\"NO\"))","v":45},"SECOP II",1,"Bogotá Mejor para Todos"]
["FDLCH-CPS-181-2020",2020,"SECOP II","CPS-181-2020","Contratos de prestación de servicios profesionales y de apoyo a la gestión","Contratación directa","Prestación de servicios profesionales y de apoyo a la gestión, o para la ejecución de trabajos artísticos que sólo puedan encomendarse a determinadas personas naturales;","PRESTACIÓN DE SERVICIOS DE APOYO DE LOGÍSTICA Y ACTIVIDADES OPERATIVAS QUE SE REQUIERAN PARA LA RECOPILACIÓN DE INFORMACIÓN, DIAGNÓSTICO DE VÍAS Y DEMÁS ACTIVIDADES RELACIONADAS QUE TENGA A CARGO EL FONDO LOCAL DE DESARROLLO DE CHAPINERO","Inversión","Bogotá Mejor para Todos",18,{"$f":"IF(ISERROR(VLOOKUP(K190,Eje_Pilar_Prop!$C$2:$E$104,2,FALSE)),\" \",VLOOKUP(K190,Eje_Pilar_Prop!$C$2:$E$104,2,FALSE))","v":"Mejor movilidad para todos"},{"$f":"IF(ISERROR(VLOOKUP(K190,Eje_Pilar_Prop!$C$2:$E$104,3,FALSE)),\" \",VLOOKUP(K190,Eje_Pilar_Prop!$C$2:$E$104,3,FALSE))","v":"Pilar 2 Democracía Urbana"},1301,79153721,"JORGE ENRIQUE URQUIJO",7380000,0,0,1,3690000,11070000,9348000,"2020-07-22","2020-07-22","2021-01-15",120,2,55,null,null,null,null,null,null,"X",null,0.84444444444444444,null,null,{"$f":"IF(SUMPRODUCT((A$14:A190=A190)*(B$14:B190=B190)*(D$14:D190=D190))>1,0,1)","v":1},"Contratos de prestación de servicios profesionales y de apoyo a la gestión","Contratación directa",{"$f":"IF(ISBLANK(G190),1,IFERROR(VLOOKUP(G190,Tipo!$C$12:$C$27,1,FALSE),\"NO\"))","v":"Prestación de servicios profesionales y de apoyo a la gestión, o para la ejecución de trabajos artísticos que sólo puedan encomendarse a determinadas personas naturales;"},"Inversión",{"$f":"IF(ISBLANK(K190),1,IFERROR(VLOOKUP(K190,Eje_Pilar_Prop!$C$3:$C$104,1,FALSE),\"NO\"))","v":18},"SECOP II",1,"Bogotá Mejor para Todos"]
["FDLCH-CPS-182-2020",2020,"SECOP II","CPS-182-2020","Contratos de prestación de servicios profesionales y de apoyo a la gestión","Contratación directa","Prestación de servicios profesionales y de apoyo a la gestión, o para la ejecución de trabajos artísticos que sólo puedan encomendarse a determinadas personas naturales;","PRESTACIÓN DE SERVICIOS PROFESIONALES PARA APOYAR LA ELABORACIÓN Y ADMINISTRACIÓN DEL PRESUPUESTO DEL FONDO DE DESARROLLO LOCAL DE CHAPINERO DE ACUERDO A LA NORMATIVIDAD VIGENTE","Inversión","Bogotá Mejor para Todos",45,{"$f":"IF(ISERROR(VLOOKUP(K191,Eje_Pilar_Prop!$C$2:$E$104,2,FALSE)),\" \",VLOOKUP(K191,Eje_Pilar_Prop!$C$2:$E$104,2,FALSE))","v":"Gobernanza e influencia local, regional e internacional"},{"$f":"IF(ISERROR(VLOOKUP(K191,Eje_Pilar_Prop!$C$2:$E$104,3,FALSE)),\" \",VLOOKUP(K191,Eje_Pilar_Prop!$C$2:$E$104,3,FALSE))","v":"Eje Transversal 4 Gobierno Legitimo, Fortalecimiento Local y Eficiencia"},1304,52458892,"CLAUDIA MILENA DE LA CRUZ LADINO",18000000,0,0,2,8250000,26250000,22650000,"2020-07-17","2020-07-21","2021-01-20",120,1,60,null,null,null,null,null,null,"X",null,0.86285714285714288,null,null,{"$f":"IF(SUMPRODUCT((A$14:A191=A191)*(B$14:B191=B191)*(D$14:D191=D191))>1,0,1)","v":1},"Contratos de prestación de servicios profesionales y de apoyo a la gestión","Contratación directa",{"$f":"IF(ISBLANK(G191),1,IFERROR(VLOOKUP(G191,Tipo!$C$12:$C$27,1,FALSE),\"NO\"))","v":"Prestación de servicios profesionales y de apoyo a la gestión, o para la ejecución de trabajos artísticos que sólo puedan encomendarse a determinadas personas naturales;"},"Inversión",{"$f":"IF(ISBLANK(K191),1,IFERROR(VLOOKUP(K191,Eje_Pilar_Prop!$C$3:$C$104,1,FALSE),\"NO\"))","v":45},"SECOP II",1,"Bogotá Mejor para Todos"]
["FDLCH-CPS-183-2020",2020,"SECOP II","CPS-183-2020","Contratos de prestación de servicios profesionales y de apoyo a la gestión","Contratación directa","Prestación de servicios profesionales y de apoyo a la gestión, o para la ejecución de trabajos artísticos que sólo puedan encomendarse a determinadas personas naturales;"," PRESTACIÓN DE SERVICIOS DE APOYO DE LOGÍSTICA Y ACTIVIDADES OPERATIVAS QUE SE REQUIERAN PARA LA RECOPILACIÓN DE INFORMACIÓN, DIAGNÓSTICO DE VÍAS Y DEMÁS ACTIVIDADES RELACIONADAS QUE TENGA A CARGO EL FONDO LOCAL DE DESARROLLO DE CHAPINERO","Inversión","Bogotá Mejor para Todos",18,{"$f":"IF(ISERROR(VLOOKUP(K192,Eje_Pilar_Prop!$C$2:$E$104,2,FALSE)),\" \",VLOOKUP(K192,Eje_Pilar_Prop!$C$2:$E$104,2,FALSE))","v":"Mejor movilidad para todos"},{"$f":"IF(ISERROR(VLOOKUP(K192,Eje_Pilar_Prop!$C$2:$E$104,3,FALSE)),\" \",VLOOKUP(K192,Eje_Pilar_Prop!$C$2:$E$104,3,FALSE))","v":"Pilar 2 Democracía Urbana"},1301,1071166907,"WILSON FERNANDO ORJUELA CHAVEZ",7380000,0,0,1,3690000,11070000,9348000,"2020-07-17","2020-07-21","2021-01-20",120,1,60,null,null,null,null,null,null,"X",null,0.84444444444444444,null,null,{"$f":"IF(SUMPRODUCT((A$14:A192=A192)*(B$14:B192=B192)*(D$14:D192=D192))>1,0,1)","v":1},"Contratos de prestación de servicios profesionales y de apoyo a la gestión","Contratación directa",{"$f":"IF(ISBLANK(G192),1,IFERROR(VLOOKUP(G192,Tipo!$C$12:$C$27,1,FALSE),\"NO\"))","v":"Prestación de servicios profesionales y de apoyo a la gestión, o para la ejecución de trabajos artísticos que sólo puedan encomendarse a determinadas personas naturales;"},"Inversión",{"$f":"IF(ISBLANK(K192),1,IFERROR(VLOOKUP(K192,Eje_Pilar_Prop!$C$3:$C$104,1,FALSE),\"NO\"))","v":18},"SECOP II",1,"Bogotá Mejor para Todos"]
["FDLCH-CPS-184-2020",2020,"SECOP II","CPS-184-2020","Contratos de prestación de servicios profesionales y de apoyo a la gestión","Contratación directa","Prestación de servicios profesionales y de apoyo a la gestión, o para la ejecución de trabajos artísticos que sólo puedan encomendarse a determinadas personas naturales;"," PRESTACIÓN DE SERVICIOS DE APOYO DE LOGÍSTICA Y ACTIVIDADES OPERATIVAS QUE SE REQUIERAN PARA LA RECOPILACIÓN DE INFORMACIÓN, DIAGNÓSTICO DE VÍAS Y DEMÁS ACTIVIDADES RELACIONADAS QUE TENGA A CARGO EL FONDO LOCAL DE DESARROLLO DE CHAPINERO","Inversión","Bogotá Mejor para Todos",18,{"$f":"IF(ISERROR(VLOOKUP(K193,Eje_Pilar_Prop!$C$2:$E$104,2,FALSE)),\" \",VLOOKUP(K193,Eje_Pilar_Prop!$C$2:$E$104,2,FALSE))","v":"Mejor movilidad para todos"},{"$f":"IF(ISERROR(VLOOKUP(K193,Eje_Pilar_Prop!$C$2:$E$104,3,FALSE)),\" \",VLOOKUP(K193,Eje_Pilar_Prop!$C$2:$E$104,3,FALSE))","v":"Pilar 2 Democracía Urbana"},1301,80410411,"CARLOS JULIO MARTÍNEZ RIPE",7380000,0,0,1,3690000,11070000,9348000,"2020-07-17","2020-07-21","2021-01-15",120,2,55,null,null,null,null,null,null,"X",null,0.84444444444444444,null,null,{"$f":"IF(SUMPRODUCT((A$14:A193=A193)*(B$14:B193=B193)*(D$14:D193=D193))>1,0,1)","v":1},"Contratos de prestación de servicios profesionales y de apoyo a la gestión","Contratación directa",{"$f":"IF(ISBLANK(G193),1,IFERROR(VLOOKUP(G193,Tipo!$C$12:$C$27,1,FALSE),\"NO\"))","v":"Prestación de servicios profesionales y de apoyo a la gestión, o para la ejecución de trabajos artísticos que sólo puedan encomendarse a determinadas personas naturales;"},"Inversión",{"$f":"IF(ISBLANK(K193),1,IFERROR(VLOOKUP(K193,Eje_Pilar_Prop!$C$3:$C$104,1,FALSE),\"NO\"))","v":18},"SECOP II",1,"Bogotá Mejor para Todos"]
["FDLCH-CPS-185-2020",2020,"SECOP II","CPS-185-2020","Contratos de prestación de servicios profesionales y de apoyo a la gestión","Contratación directa","Prestación de servicios profesionales y de apoyo a la gestión, o para la ejecución de trabajos artísticos que sólo puedan encomendarse a determinadas personas naturales;"," PRESTAR LOS SERVICIOS PROFESIONALES EN DERECHO PARA APOYAR JURÍDICAMENTE LA EJECUCIÓN DE LAS ACCIONES REQUERIDAS PARA LA DEPURACIÓN DE LAS ACTUACIONES ADMINISTRATIVAS QUE CURSAN EN LA ALCALDÍA LOCAL","Inversión","Bogotá Mejor para Todos",45,{"$f":"IF(ISERROR(VLOOKUP(K194,Eje_Pilar_Prop!$C$2:$E$104,2,FALSE)),\" \",VLOOKUP(K194,Eje_Pilar_Prop!$C$2:$E$104,2,FALSE))","v":"Gobernanza e influencia local, regional e internacional"},{"$f":"IF(ISERROR(VLOOKUP(K194,Eje_Pilar_Prop!$C$2:$E$104,3,FALSE)),\" \",VLOOKUP(K194,Eje_Pilar_Prop!$C$2:$E$104,3,FALSE))","v":"Eje Transversal 4 Gobierno Legitimo, Fortalecimiento Local y Eficiencia"},1304,11796268,"ARIEL VALENCIA VALENCIA",16000000,0,0,2,7333333,23333333,17333333,"2020-07-23","2020-07-24","2020-12-30",120,1,37,null,null,null,null,null,null,"X",null,0.74285713918367346,null,null,{"$f":"IF(SUMPRODUCT((A$14:A194=A194)*(B$14:B194=B194)*(D$14:D194=D194))>1,0,1)","v":1},"Contratos de prestación de servicios profesionales y de apoyo a la gestión","Contratación directa",{"$f":"IF(ISBLANK(G194),1,IFERROR(VLOOKUP(G194,Tipo!$C$12:$C$27,1,FALSE),\"NO\"))","v":"Prestación de servicios profesionales y de apoyo a la gestión, o para la ejecución de trabajos artísticos que sólo puedan encomendarse a determinadas personas naturales;"},"Inversión",{"$f":"IF(ISBLANK(K194),1,IFERROR(VLOOKUP(K194,Eje_Pilar_Prop!$C$3:$C$104,1,FALSE),\"NO\"))","v":45},"SECOP II",1,"Bogotá Mejor para Todos"]
["FDLCH-CPS-186-2020",2020,"SECOP II","CPS-186-2020","Contratos de prestación de servicios profesionales y de apoyo a la gestión","Contratación directa","Prestación de servicios profesionales y de apoyo a la gestión, o para la ejecución de trabajos artísticos que sólo puedan encomendarse a determinadas personas naturales;","EL CONTRATO QUE SE PRETENDE CELEBRAR, TENDRÁ POR OBJETO APOYAR TÉCNICAMENTE AL ALCALDE LOCAL EN LA PROMOCIÓN, ARTICULACIÓN, ACOMPAÑAMIENTO Y SEGUIMIENTO DE ACTIVIDADES REQUERIDAS EN LA GESTIÓN TERRITORIAL Y LAS DIFERENTES INSTANCIAS DE PARTICIPACIÓN, DE ACUERDO CON LO CONTEMPLADO EN EL(LOS) PROYECTO(S) 1296 – REDUCCION Y MITIGACION DEL RIESGO FRENTE AL CAMBIO CLIMATICO","Inversión","Bogotá Mejor para Todos",4,{"$f":"IF(ISERROR(VLOOKUP(K195,Eje_Pilar_Prop!$C$2:$E$104,2,FALSE)),\" \",VLOOKUP(K195,Eje_Pilar_Prop!$C$2:$E$104,2,FALSE))","v":"Familias protegidas y adaptadas al cambio climático"},{"$f":"IF(ISERROR(VLOOKUP(K195,Eje_Pilar_Prop!$C$2:$E$104,3,FALSE)),\" \",VLOOKUP(K195,Eje_Pilar_Prop!$C$2:$E$104,3,FALSE))","v":"Pilar 1 Igualdad de Calidad de Vida"},1296,1022411110,"VERONICA SIMONA MARTÍNEZ AREVALO",10800000,0,0,1,3330000,14130000,13410000,"2020-07-22","2020-07-23","2020-11-22",120,0,0,null,null,null,null,null,null,"X",null,0.94904458598726116,null,null,{"$f":"IF(SUMPRODUCT((A$14:A195=A195)*(B$14:B195=B195)*(D$14:D195=D195))>1,0,1)","v":1},"Contratos de prestación de servicios profesionales y de apoyo a la gestión","Contratación directa",{"$f":"IF(ISBLANK(G195),1,IFERROR(VLOOKUP(G195,Tipo!$C$12:$C$27,1,FALSE),\"NO\"))","v":"Prestación de servicios profesionales y de apoyo a la gestión, o para la ejecución de trabajos artísticos que sólo puedan encomendarse a determinadas personas naturales;"},"Inversión",{"$f":"IF(ISBLANK(K195),1,IFERROR(VLOOKUP(K195,Eje_Pilar_Prop!$C$3:$C$104,1,FALSE),\"NO\"))","v":4},"SECOP II",1,"Bogotá Mejor para Todos"]
["FDLCH-CPS-187-2020",2020,"SECOP II","CPS-187-2020","Contratos de prestación de servicios profesionales y de apoyo a la gestión","Contratación directa","Prestación de servicios profesionales y de apoyo a la gestión, o para la ejecución de trabajos artísticos que sólo puedan encomendarse a determinadas personas naturales;"," PRESTAR LOS SERVICIOS PROFESIONALES PARA APOYAR EL ÁREA GESTIÓN DEL DESARROLLO LOCAL DE LA ALCALDÍA LOCAL DE CHAPINERO EN LAS ACTIVIDADES CONTABLES Y PRESUPUESTALES","Inversión","Bogotá Mejor para Todos",45,{"$f":"IF(ISERROR(VLOOKUP(K196,Eje_Pilar_Prop!$C$2:$E$104,2,FALSE)),\" \",VLOOKUP(K196,Eje_Pilar_Prop!$C$2:$E$104,2,FALSE))","v":"Gobernanza e influencia local, regional e internacional"},{"$f":"IF(ISERROR(VLOOKUP(K196,Eje_Pilar_Prop!$C$2:$E$104,3,FALSE)),\" \",VLOOKUP(K196,Eje_Pilar_Prop!$C$2:$E$104,3,FALSE))","v":"Eje Transversal 4 Gobierno Legitimo, Fortalecimiento Local y Eficiencia"},1304,11385286,"WILLIAM CLAVIJO MORALES",16000000,0,0,0,0,16000000,16000000,"2020-07-31","2020-08-03","2021-02-02",120,1,60,null,null,null,null,null,"X",null,null,1,null,null,{"$f":"IF(SUMPRODUCT((A$14:A196=A196)*(B$14:B196=B196)*(D$14:D196=D196))>1,0,1)","v":1},"Contratos de prestación de servicios profesionales y de apoyo a la gestión","Contratación directa",{"$f":"IF(ISBLANK(G196),1,IFERROR(VLOOKUP(G196,Tipo!$C$12:$C$27,1,FALSE),\"NO\"))","v":"Prestación de servicios profesionales y de apoyo a la gestión, o para la ejecución de trabajos artísticos que sólo puedan encomendarse a determinadas personas naturales;"},"Inversión",{"$f":"IF(ISBLANK(K196),1,IFERROR(VLOOKUP(K196,Eje_Pilar_Prop!$C$3:$C$104,1,FALSE),\"NO\"))","v":45},"SECOP II",1,"Bogotá Mejor para Todos"]
["FDLCH-CPS-188-2020",2020,"SECOP II","CPS-188-2020","Contratos de prestación de servicios profesionales y de apoyo a la gestión","Contratación directa","Prestación de servicios profesionales y de apoyo a la gestión, o para la ejecución de trabajos artísticos que sólo puedan encomendarse a determinadas personas naturales;","PRESTACIÓN DE LOS SERVICIOS PROFESIONALES PARA APOYAR AL DESPACHO LA EJECUCIÓN DE ACTIVIDADES DE PLANEACIÓN Y GESTIÓN DEL RIESGO Y CAMBIO CLIMÁTICO EN LA LOCALIDAD DE CHAPINERO","Inversión","Bogotá Mejor para Todos",4,{"$f":"IF(ISERROR(VLOOKUP(K197,Eje_Pilar_Prop!$C$2:$E$104,2,FALSE)),\" \",VLOOKUP(K197,Eje_Pilar_Prop!$C$2:$E$104,2,FALSE))","v":"Familias protegidas y adaptadas al cambio climático"},{"$f":"IF(ISERROR(VLOOKUP(K197,Eje_Pilar_Prop!$C$2:$E$104,3,FALSE)),\" \",VLOOKUP(K197,Eje_Pilar_Prop!$C$2:$E$104,3,FALSE))","v":"Pilar 1 Igualdad de Calidad de Vida"},1296,1022364075,"LISET JOHANNA GARAVITO BARRERA",19200000,0,0,1,9600000,28800000,22400000,"2020-08-10","2020-08-11","2021-01-30",120,1,50,null,null,null,null,null,"X",null,null,0.77777777777777779,null,null,{"$f":"IF(SUMPRODUCT((A$14:A197=A197)*(B$14:B197=B197)*(D$14:D197=D197))>1,0,1)","v":1},"Contratos de prestación de servicios profesionales y de apoyo a la gestión","Contratación directa",{"$f":"IF(ISBLANK(G197),1,IFERROR(VLOOKUP(G197,Tipo!$C$12:$C$27,1,FALSE),\"NO\"))","v":"Prestación de servicios profesionales y de apoyo a la gestión, o para la ejecución de trabajos artísticos que sólo puedan encomendarse a determinadas personas naturales;"},"Inversión",{"$f":"IF(ISBLANK(K197),1,IFERROR(VLOOKUP(K197,Eje_Pilar_Prop!$C$3:$C$104,1,FALSE),\"NO\"))","v":4},"SECOP II",1,"Bogotá Mejor para Todos"]
["FDLCH-CPS-189-2020",2020,"SECOP II","CPS-189-2020","Contratos de prestación de servicios profesionales y de apoyo a la gestión","Contratación directa","Prestación de servicios profesionales y de apoyo a la gestión, o para la ejecución de trabajos artísticos que sólo puedan encomendarse a determinadas personas naturales;"," PRESTACIÓN DE SERVICIOS PERSONALES NECESARIOS PARA EL APOYO AL ÁREA DE GESTIÓN DEL DESARROLLO LOCAL DE LA ALCALDÍA LOCAL DE CHAPINERO EN LAS ACTIVIDADES DE RADICACIÓN Y CORRESPONDENCIA","Inversión","Bogotá Mejor para Todos",45,{"$f":"IF(ISERROR(VLOOKUP(K198,Eje_Pilar_Prop!$C$2:$E$104,2,FALSE)),\" \",VLOOKUP(K198,Eje_Pilar_Prop!$C$2:$E$104,2,FALSE))","v":"Gobernanza e influencia local, regional e internacional"},{"$f":"IF(ISERROR(VLOOKUP(K198,Eje_Pilar_Prop!$C$2:$E$104,3,FALSE)),\" \",VLOOKUP(K198,Eje_Pilar_Prop!$C$2:$E$104,3,FALSE))","v":"Eje Transversal 4 Gobierno Legitimo, Fortalecimiento Local y Eficiencia"},1304,1031147236,"DEISY YINETH FRANCO PENAGOS",9360000,0,0,1,3900000,13260000,10296000,"2020-08-10","2020-08-12","2021-01-11",120,1,30,null,null,null,null,null,null,"X",null,0.77647058823529413,null,null,{"$f":"IF(SUMPRODUCT((A$14:A198=A198)*(B$14:B198=B198)*(D$14:D198=D198))>1,0,1)","v":1},"Contratos de prestación de servicios profesionales y de apoyo a la gestión","Contratación directa",{"$f":"IF(ISBLANK(G198),1,IFERROR(VLOOKUP(G198,Tipo!$C$12:$C$27,1,FALSE),\"NO\"))","v":"Prestación de servicios profesionales y de apoyo a la gestión, o para la ejecución de trabajos artísticos que sólo puedan encomendarse a determinadas personas naturales;"},"Inversión",{"$f":"IF(ISBLANK(K198),1,IFERROR(VLOOKUP(K198,Eje_Pilar_Prop!$C$3:$C$104,1,FALSE),\"NO\"))","v":45},"SECOP II",1,"Bogotá Mejor para Todos"]
["FDLCH-CPS-190-2020",2020,"SECOP II","CPS-190-2020","Contratos de prestación de servicios profesionales y de apoyo a la gestión","Contratación directa","Prestación de servicios profesionales y de apoyo a la gestión, o para la ejecución de trabajos artísticos que sólo puedan encomendarse a determinadas personas naturales;","PRESTACIÓN DE SERVICIOS PERSONALES NECESARIOS PARA EL APOYO A LA GESTIÓN Y EJECUCIÓN DE LAS ACTIVIDADES ADMINISTRATIVAS Y OPERATIVAS QUE SE ADELANTAN EN LA ALCALDÍA LOCAL DE CHAPINERO","Inversión","Bogotá Mejor para Todos",45,{"$f":"IF(ISERROR(VLOOKUP(K199,Eje_Pilar_Prop!$C$2:$E$104,2,FALSE)),\" \",VLOOKUP(K199,Eje_Pilar_Prop!$C$2:$E$104,2,FALSE))","v":"Gobernanza e influencia local, regional e internacional"},{"$f":"IF(ISERROR(VLOOKUP(K199,Eje_Pilar_Prop!$C$2:$E$104,3,FALSE)),\" \",VLOOKUP(K199,Eje_Pilar_Prop!$C$2:$E$104,3,FALSE))","v":"Eje Transversal 4 Gobierno Legitimo, Fortalecimiento Local y Eficiencia"},1304,79955421,"PAULO  CESAR RAMIREZ INFANTE",8800000,0,0,1,2200000,11000000,9606666,"2020-08-10","2020-08-11","2021-01-10",120,1,30,null,null,null,null,null,null,"X",null,0.87333327272727268,null,null,{"$f":"IF(SUMPRODUCT((A$14:A199=A199)*(B$14:B199=B199)*(D$14:D199=D199))>1,0,1)","v":1},"Contratos de prestación de servicios profesionales y de apoyo a la gestión","Contratación directa",{"$f":"IF(ISBLANK(G199),1,IFERROR(VLOOKUP(G199,Tipo!$C$12:$C$27,1,FALSE),\"NO\"))","v":"Prestación de servicios profesionales y de apoyo a la gestión, o para la ejecución de trabajos artísticos que sólo puedan encomendarse a determinadas personas naturales;"},"Inversión",{"$f":"IF(ISBLANK(K199),1,IFERROR(VLOOKUP(K199,Eje_Pilar_Prop!$C$3:$C$104,1,FALSE),\"NO\"))","v":45},"SECOP II",1,"Bogotá Mejor para Todos"]
["FDLCH-CPS-191-2020",2020,"SECOP II","CPS-191-2020","Contratos de prestación de servicios profesionales y de apoyo a la gestión","Contratación directa","Prestación de servicios profesionales y de apoyo a la gestión, o para la ejecución de trabajos artísticos que sólo puedan encomendarse a determinadas personas naturales;","PRESTACIÓN DE SERVICIOS PERSONALES NECESARIOS PARA EL APOYO A LA GESTIÓN Y EJECUCIÓN DE LAS ACTIVIDADES ADMINISTRATIVAS Y OPERATIVAS QUE SE ADELANTAN EN LA ALCALDÍA LOCAL DE CHAPINERO","Inversión","Bogotá Mejor para Todos",45,{"$f":"IF(ISERROR(VLOOKUP(K200,Eje_Pilar_Prop!$C$2:$E$104,2,FALSE)),\" \",VLOOKUP(K200,Eje_Pilar_Prop!$C$2:$E$104,2,FALSE))","v":"Gobernanza e influencia local, regional e internacional"},{"$f":"IF(ISERROR(VLOOKUP(K200,Eje_Pilar_Prop!$C$2:$E$104,3,FALSE)),\" \",VLOOKUP(K200,Eje_Pilar_Prop!$C$2:$E$104,3,FALSE))","v":"Eje Transversal 4 Gobierno Legitimo, Fortalecimiento Local y Eficiencia"},1304,52253361,"OLGA LUCIA OBANDO CHACA",8800000,0,0,1,2200000,11000000,8066667,"2020-08-11","2020-08-12","2021-03-20",120,1,60,79373304,"ANDERSON MEJIA","2020-09-23",14300000,null,"X",null,null,0.73333336363636359,null,null,{"$f":"IF(SUMPRODUCT((A$14:A200=A200)*(B$14:B200=B200)*(D$14:D200=D200))>1,0,1)","v":1},"Contratos de prestación de servicios profesionales y de apoyo a la gestión","Contratación directa",{"$f":"IF(ISBLANK(G200),1,IFERROR(VLOOKUP(G200,Tipo!$C$12:$C$27,1,FALSE),\"NO\"))","v":"Prestación de servicios profesionales y de apoyo a la gestión, o para la ejecución de trabajos artísticos que sólo puedan encomendarse a determinadas personas naturales;"},"Inversión",{"$f":"IF(ISBLANK(K200),1,IFERROR(VLOOKUP(K200,Eje_Pilar_Prop!$C$3:$C$104,1,FALSE),\"NO\"))","v":45},"SECOP II",1,"Bogotá Mejor para Todos"]
["FDLCH-CPS-192-2020",2020,"SECOP II","CPS-192-2020","Contratos de prestación de servicios profesionales y de apoyo a la gestión","Contratación directa","Prestación de servicios profesionales y de apoyo a la gestión, o para la ejecución de trabajos artísticos que sólo puedan encomendarse a determinadas personas naturales;","PRESTACIÓN DE SERVICIOS PROFESIONALES PARA APOYAR EL ÁREA DE GESTIÓN DEL DESARROLLO LOCAL DE LA ALCALDÍA LOCAL DE CHAPINERO EN LA GESTIÓN CONTRACTUAL DEL PROYECTO 1301 MEJORAR LA CALIDAD DE LA MOVILIDAD","Inversión","Bogotá Mejor para Todos",18,{"$f":"IF(ISERROR(VLOOKUP(K201,Eje_Pilar_Prop!$C$2:$E$104,2,FALSE)),\" \",VLOOKUP(K201,Eje_Pilar_Prop!$C$2:$E$104,2,FALSE))","v":"Mejor movilidad para todos"},{"$f":"IF(ISERROR(VLOOKUP(K201,Eje_Pilar_Prop!$C$2:$E$104,3,FALSE)),\" \",VLOOKUP(K201,Eje_Pilar_Prop!$C$2:$E$104,3,FALSE))","v":"Pilar 2 Democracía Urbana"},1301,1110546258,"ANGELA MARIA TORRES RAMIREZ",15600000,0,0,1,7800000,23400000,11700000,"2020-08-10","2020-08-11","2021-01-10",120,2,30,null,null,null,null,null,null,"X",null,0.5,null,null,{"$f":"IF(SUMPRODUCT((A$14:A201=A201)*(B$14:B201=B201)*(D$14:D201=D201))>1,0,1)","v":1},"Contratos de prestación de servicios profesionales y de apoyo a la gestión","Contratación directa",{"$f":"IF(ISBLANK(G201),1,IFERROR(VLOOKUP(G201,Tipo!$C$12:$C$27,1,FALSE),\"NO\"))","v":"Prestación de servicios profesionales y de apoyo a la gestión, o para la ejecución de trabajos artísticos que sólo puedan encomendarse a determinadas personas naturales;"},"Inversión",{"$f":"IF(ISBLANK(K201),1,IFERROR(VLOOKUP(K201,Eje_Pilar_Prop!$C$3:$C$104,1,FALSE),\"NO\"))","v":18},"SECOP II",1,"Bogotá Mejor para Todos"]
["FDLCH-CPS-193-2020",2020,"SECOP II","CPS-193-2020","Contratos de prestación de servicios profesionales y de apoyo a la gestión","Contratación directa","Prestación de servicios profesionales y de apoyo a la gestión, o para la ejecución de trabajos artísticos que sólo puedan encomendarse a determinadas personas naturales;","APOYAR TÉCNICAMENTE A LOS RESPONSABLES E INTEGRANTES DE LOS PROCESOS EN LA IMPLEMENTACIÓN DE HERRAMIENTAS DE GESTIÓN, SIGUIENDO LOS LINEAMIENTOS METODOLÓGICOS ESTABLECIDOS POR LA OFICINA ASESORA DE PLANEACIÓN DE LA SECRETARÍA DISTRITAL DE GOBIERNO","Inversión","Bogotá Mejor para Todos",45,{"$f":"IF(ISERROR(VLOOKUP(K202,Eje_Pilar_Prop!$C$2:$E$104,2,FALSE)),\" \",VLOOKUP(K202,Eje_Pilar_Prop!$C$2:$E$104,2,FALSE))","v":"Gobernanza e influencia local, regional e internacional"},{"$f":"IF(ISERROR(VLOOKUP(K202,Eje_Pilar_Prop!$C$2:$E$104,3,FALSE)),\" \",VLOOKUP(K202,Eje_Pilar_Prop!$C$2:$E$104,3,FALSE))","v":"Eje Transversal 4 Gobierno Legitimo, Fortalecimiento Local y Eficiencia"},1304,52048570,"DEISY RUTH CONTRERAS RAMOS",19320000,0,0,2,4830000,24150000,21252000,"2020-08-11","2020-08-12","2021-01-15",120,1,34,null,null,null,null,null,null,"X",null,0.88,null,null,{"$f":"IF(SUMPRODUCT((A$14:A202=A202)*(B$14:B202=B202)*(D$14:D202=D202))>1,0,1)","v":1},"Contratos de prestación de servicios profesionales y de apoyo a la gestión","Contratación directa",{"$f":"IF(ISBLANK(G202),1,IFERROR(VLOOKUP(G202,Tipo!$C$12:$C$27,1,FALSE),\"NO\"))","v":"Prestación de servicios profesionales y de apoyo a la gestión, o para la ejecución de trabajos artísticos que sólo puedan encomendarse a determinadas personas naturales;"},"Inversión",{"$f":"IF(ISBLANK(K202),1,IFERROR(VLOOKUP(K202,Eje_Pilar_Prop!$C$3:$C$104,1,FALSE),\"NO\"))","v":45},"SECOP II",1,"Bogotá Mejor para Todos"]
["FDLCH-CPS-194-2020",2020,"SECOP II","CPS-194-2020","Contratos de prestación de servicios profesionales y de apoyo a la gestión","Contratación directa","Prestación de servicios profesionales y de apoyo a la gestión, o para la ejecución de trabajos artísticos que sólo puedan encomendarse a determinadas personas naturales;","PRESTACIÓN DE SERVICIOS PERSONALES NECESARIOS PARA APOYAR ADMINISTRATIVA Y ASISTENCIALMENTE A LAS INSPECCIONES DE POLICÍA DE LA LOCALIDAD","Inversión","Bogotá Mejor para Todos",45,{"$f":"IF(ISERROR(VLOOKUP(K203,Eje_Pilar_Prop!$C$2:$E$104,2,FALSE)),\" \",VLOOKUP(K203,Eje_Pilar_Prop!$C$2:$E$104,2,FALSE))","v":"Gobernanza e influencia local, regional e internacional"},{"$f":"IF(ISERROR(VLOOKUP(K203,Eje_Pilar_Prop!$C$2:$E$104,3,FALSE)),\" \",VLOOKUP(K203,Eje_Pilar_Prop!$C$2:$E$104,3,FALSE))","v":"Eje Transversal 4 Gobierno Legitimo, Fortalecimiento Local y Eficiencia"},1304,1063134906,"VANESA ALEXANDRA JIMENEZ ARTEAGA",9360000,0,0,1,2650000,12010000,10216000,"2020-08-19","2020-08-20","2021-01-19",120,1,30,null,null,null,null,null,null,"X",null,0.85062447960033305,null,null,{"$f":"IF(SUMPRODUCT((A$14:A203=A203)*(B$14:B203=B203)*(D$14:D203=D203))>1,0,1)","v":1},"Contratos de prestación de servicios profesionales y de apoyo a la gestión","Contratación directa",{"$f":"IF(ISBLANK(G203),1,IFERROR(VLOOKUP(G203,Tipo!$C$12:$C$27,1,FALSE),\"NO\"))","v":"Prestación de servicios profesionales y de apoyo a la gestión, o para la ejecución de trabajos artísticos que sólo puedan encomendarse a determinadas personas naturales;"},"Inversión",{"$f":"IF(ISBLANK(K203),1,IFERROR(VLOOKUP(K203,Eje_Pilar_Prop!$C$3:$C$104,1,FALSE),\"NO\"))","v":45},"SECOP II",1,"Bogotá Mejor para Todos"]
["FDLCH-CPS-195-2020",2020,"SECOP II","CPS-195-2020","Contratos de prestación de servicios profesionales y de apoyo a la gestión","Contratación directa","Prestación de servicios profesionales y de apoyo a la gestión, o para la ejecución de trabajos artísticos que sólo puedan encomendarse a determinadas personas naturales;","PRESTACIÓN DE SERVICIOS PROFESIONALES PARA APOYAR LA PROYECCIÓN DE CONCEPTOS TÉCNICOS RELACIONADOS CON EL CUMPLIMIENTO DE LAS NORMAS DE URBANISMO, CONSTRUCCIÓN E INFRAESTRUCTURA LOCAL, QUE PERMITAN SOPORTAR EL CUMPLIMIENTO DE LOS PROCESOS QUE DEBE ATENDER LA ALCALDÍA LOCAL DE CHAPINERO EN ESTOS TEMAS, DE CONFORMIDAD CON LOS LINEAMIENTOS ESTABLECIDOS.","Inversión","Bogotá Mejor para Todos",45,{"$f":"IF(ISERROR(VLOOKUP(K204,Eje_Pilar_Prop!$C$2:$E$104,2,FALSE)),\" \",VLOOKUP(K204,Eje_Pilar_Prop!$C$2:$E$104,2,FALSE))","v":"Gobernanza e influencia local, regional e internacional"},{"$f":"IF(ISERROR(VLOOKUP(K204,Eje_Pilar_Prop!$C$2:$E$104,3,FALSE)),\" \",VLOOKUP(K204,Eje_Pilar_Prop!$C$2:$E$104,3,FALSE))","v":"Eje Transversal 4 Gobierno Legitimo, Fortalecimiento Local y Eficiencia"},1304,1030625256,"ANDRES FELIPE RAMOS ARENAS",18000000,0,0,1,4500000,22500000,18450000,"2020-08-19","2020-08-20","2020-12-31",120,1,12,null,null,null,null,null,null,"X",null,0.82,null,null,{"$f":"IF(SUMPRODUCT((A$14:A204=A204)*(B$14:B204=B204)*(D$14:D204=D204))>1,0,1)","v":1},"Contratos de prestación de servicios profesionales y de apoyo a la gestión","Contratación directa",{"$f":"IF(ISBLANK(G204),1,IFERROR(VLOOKUP(G204,Tipo!$C$12:$C$27,1,FALSE),\"NO\"))","v":"Prestación de servicios profesionales y de apoyo a la gestión, o para la ejecución de trabajos artísticos que sólo puedan encomendarse a determinadas personas naturales;"},"Inversión",{"$f":"IF(ISBLANK(K204),1,IFERROR(VLOOKUP(K204,Eje_Pilar_Prop!$C$3:$C$104,1,FALSE),\"NO\"))","v":45},"SECOP II",1,"Bogotá Mejor para Todos"]
["FDLCH-CPS-196-2020",2020,"SECOP II","CPS-196-2020","Contratos de prestación de servicios profesionales y de apoyo a la gestión","Contratación directa","Prestación de servicios profesionales y de apoyo a la gestión, o para la ejecución de trabajos artísticos que sólo puedan encomendarse a determinadas personas naturales;","PRESTACIÓN DE SERVICIOS PROFESIONALES PARA APOYAR AL ALCALDE LOCAL (SA) EN EL ACOMPAÑAMIENTO, ATENCIÓN, PROMOCIÓN Y FORTALECIMIENTO DE LOS PROCESOS LOCALES DE PARTICIPACIÓN CIUDADANA, LOS ESPACIOS E INSTANCIAS INTERINSTITUCIONALES DE PARTICIPACIÓN CIUDADANA, ASÍ COMO LOS PROCESOS COMUNITARIOS EN LA LOCALIDAD","Inversión","Bogotá Mejor para Todos",45,{"$f":"IF(ISERROR(VLOOKUP(K205,Eje_Pilar_Prop!$C$2:$E$104,2,FALSE)),\" \",VLOOKUP(K205,Eje_Pilar_Prop!$C$2:$E$104,2,FALSE))","v":"Gobernanza e influencia local, regional e internacional"},{"$f":"IF(ISERROR(VLOOKUP(K205,Eje_Pilar_Prop!$C$2:$E$104,3,FALSE)),\" \",VLOOKUP(K205,Eje_Pilar_Prop!$C$2:$E$104,3,FALSE))","v":"Eje Transversal 4 Gobierno Legitimo, Fortalecimiento Local y Eficiencia"},1305,1090489409,"CARLOS ARTURO BARBOSA PEREZ",16400000,0,0,1,1680000,18080000,16810000,"2020-08-21","2020-08-24","2020-12-30",120,1,7,null,null,null,null,null,null,"X",null,0.92975663716814161,null,null,{"$f":"IF(SUMPRODUCT((A$14:A205=A205)*(B$14:B205=B205)*(D$14:D205=D205))>1,0,1)","v":1},"Contratos de prestación de servicios profesionales y de apoyo a la gestión","Contratación directa",{"$f":"IF(ISBLANK(G205),1,IFERROR(VLOOKUP(G205,Tipo!$C$12:$C$27,1,FALSE),\"NO\"))","v":"Prestación de servicios profesionales y de apoyo a la gestión, o para la ejecución de trabajos artísticos que sólo puedan encomendarse a determinadas personas naturales;"},"Inversión",{"$f":"IF(ISBLANK(K205),1,IFERROR(VLOOKUP(K205,Eje_Pilar_Prop!$C$3:$C$104,1,FALSE),\"NO\"))","v":45},"SECOP II",1,"Bogotá Mejor para Todos"]
["FDLCH-CPS-197-2020",2020,"SECOP II","CPS-197-2020","Contratos de prestación de servicios profesionales y de apoyo a la gestión","Contratación directa","Prestación de servicios profesionales y de apoyo a la gestión, o para la ejecución de trabajos artísticos que sólo puedan encomendarse a determinadas personas naturales;"," PRESTACIÓN DE SERVICIOS PROFESIONALES PARA APOYAR JURÍDICAMENTE LA EJECUCIÓN DE LAS ACCIONES REQUERIDAS PARA EL TRÁMITE E IMPULSO PROCESAL DE LAS ACTUACIONES CONTRAVENCIONALES Y/O QUERELLAS QUE CURSEN EN LAS INSPECCIONES DE POLICÍA DE LA LOCALIDAD.","Inversión","Bogotá Mejor para Todos",45,{"$f":"IF(ISERROR(VLOOKUP(K206,Eje_Pilar_Prop!$C$2:$E$104,2,FALSE)),\" \",VLOOKUP(K206,Eje_Pilar_Prop!$C$2:$E$104,2,FALSE))","v":"Gobernanza e influencia local, regional e internacional"},{"$f":"IF(ISERROR(VLOOKUP(K206,Eje_Pilar_Prop!$C$2:$E$104,3,FALSE)),\" \",VLOOKUP(K206,Eje_Pilar_Prop!$C$2:$E$104,3,FALSE))","v":"Eje Transversal 4 Gobierno Legitimo, Fortalecimiento Local y Eficiencia"},1304,79297494,"WILLIAM JAVIER RIVERA MENDOZA",16000000,0,0,1,933333,16933333,12933333,"2020-08-21","2020-08-24","2020-12-30",120,1,7,null,null,null,null,null,null,"X",null,{"$f":"IF(ISERROR(W206/V206),\"-\",(W206/V206))","v":0.76377952290904572},null,null,{"$f":"IF(SUMPRODUCT((A$14:A206=A206)*(B$14:B206=B206)*(D$14:D206=D206))>1,0,1)","v":1},"Contratos de prestación de servicios profesionales y de apoyo a la gestión","Contratación directa",{"$f":"IF(ISBLANK(G206),1,IFERROR(VLOOKUP(G206,Tipo!$C$12:$C$27,1,FALSE),\"NO\"))","v":"Prestación de servicios profesionales y de apoyo a la gestión, o para la ejecución de trabajos artísticos que sólo puedan encomendarse a determinadas personas naturales;"},"Inversión",{"$f":"IF(ISBLANK(K206),1,IFERROR(VLOOKUP(K206,Eje_Pilar_Prop!$C$3:$C$104,1,FALSE),\"NO\"))","v":45},"SECOP II",1,"Bogotá Mejor para Todos"]
["FDLCH-CPS-198-2020",2020,"SECOP I","20-22-18155","Contratos de prestación de servicios","Contratación directa","Urgencia manifiesta","PRESTAR LOS SERVICIOS REQUERIDOS PARA OPERAR EL PROGRAMA DE INCENTIVOS PARA EL EMPLEO CON EL CUAL SE BUSCA APOYAR AL TEJIDO PRODUCTIVO DE LAS LOCALIDADES DE BOGOTÁ D.C., CON ESPECIAL ÉNFASIS EN LOS EMPRESARIOS, E INCLUIR Y/O MANTENER LABORALMENTE A TRABAJADORES MAYORES DE 50 AÑOS, MUJERES Y JÓVENES (18-28 AÑOS) PRINCIPALMENTE, A TRAVÉS DE LA TRANSFERENCIA DE INCENTIVOS A LA NÓMINA, EN EL MARCO DE LA CONTENCIÓN Y MITIGACIÓN DE LOS EFECTOS DEL COVID-19, LA DECLARATORIA DE EMERGENCIA SANITARIA EN TODO EL TERRITORIO NACIONAL Y LA CALAMIDAD PÚBLICA DECLARADA EN LA CIUDAD DE BOGOTÁ D.C.","Inversión","Bogotá Mejor para Todos",45,{"$f":"IF(ISERROR(VLOOKUP(K207,Eje_Pilar_Prop!$C$2:$E$104,2,FALSE)),\" \",VLOOKUP(K207,Eje_Pilar_Prop!$C$2:$E$104,2,FALSE))","v":"Gobernanza e influencia local, regional e internacional"},{"$f":"IF(ISERROR(VLOOKUP(K207,Eje_Pilar_Prop!$C$2:$E$104,3,FALSE)),\" \",VLOOKUP(K207,Eje_Pilar_Prop!$C$2:$E$104,3,FALSE))","v":"Eje Transversal 4 Gobierno Legitimo, Fortalecimiento Local y Eficiencia"},1305,860066942,"CAJA DE COMPENSACIÓN FAMILIAR COMPENSAR",4475115607,0,0,0,0,4475115607,1342546682,"2020-08-27","2020-09-14","2021-07-13",300,0,0,null,null,null,null,null,"X",null,null,0.30000268147262638,null,null,{"$f":"IF(SUMPRODUCT((A$14:A207=A207)*(B$14:B207=B207)*(D$14:D207=D207))>1,0,1)","v":1},"Contratos de prestación de servicios","Contratación directa",{"$f":"IF(ISBLANK(G207),1,IFERROR(VLOOKUP(G207,Tipo!$C$12:$C$27,1,FALSE),\"NO\"))","v":"Urgencia manifiesta"},"Inversión",{"$f":"IF(ISBLANK(K207),1,IFERROR(VLOOKUP(K207,Eje_Pilar_Prop!$C$3:$C$104,1,FALSE),\"NO\"))","v":45},"SECOP I",1,"Bogotá Mejor para Todos"]
["FDLCH-CIA-199-2020",2020,"SECOP I","20-22-18160","Convenios de apoyo y/o convenios de asociación ","Contratación directa","Contratos interadministrativos","AUNAR ESFUERZOS TÉCNICOS, ADMINISTRATIVOS Y FINANCIEROS, PARA IMPULSAR LA REACTIVACION ECONÓMICA DE, LOS AGENTES DE LA INDUSTRIA CULTURAL Y CREATIVA DEL SECTOR CULTURA, RECREACIÓN Y DEPORTE EN LA LOCALIDAD DE CHAPINERO DE BOGOTA. QUE SE PRIORICE EN EL EJE DE ADAPTACIÓN Y TRANSFORMACIÓN PRODUCTIVA DE LA ESTRATEGÍA DE REACTIVACIÓN ECONÓMICA LOCAL - EMRE LOCAL, PROGRAMA APOYO Y FORTALECIMINETO DE LAS INDUSTRIAS CREATIVAS Y CULTURALES PARA LA ADAPTACIÓN Y TRANSFORMACIÓN PRODUCTIVA, EN EL MARCO DE UN PROCESO DE FOMENTO","Inversión","Bogotá Mejor para Todos",45,{"$f":"IF(ISERROR(VLOOKUP(K208,Eje_Pilar_Prop!$C$2:$E$104,2,FALSE)),\" \",VLOOKUP(K208,Eje_Pilar_Prop!$C$2:$E$104,2,FALSE))","v":"Gobernanza e influencia local, regional e internacional"},{"$f":"IF(ISERROR(VLOOKUP(K208,Eje_Pilar_Prop!$C$2:$E$104,3,FALSE)),\" \",VLOOKUP(K208,Eje_Pilar_Prop!$C$2:$E$104,3,FALSE))","v":"Eje Transversal 4 Gobierno Legitimo, Fortalecimiento Local y Eficiencia"},1305,900413030,"SECRETARÍA CULTURA E IDARTES",1250000000,0,0,1,414000000,1664000000,1165217391,"2020-08-24","2020-08-28","2021-11-30",452,0,0,null,null,null,null,null,"X",null,null,0.70025083593750004,null,null,{"$f":"IF(SUMPRODUCT((A$14:A208=A208)*(B$14:B208=B208)*(D$14:D208=D208))>1,0,1)","v":1},"Convenios de apoyo y/o convenios de asociación ","Contratación directa",{"$f":"IF(ISBLANK(G208),1,IFERROR(VLOOKUP(G208,Tipo!$C$12:$C$27,1,FALSE),\"NO\"))","v":"Contratos interadministrativos"},"Inversión",{"$f":"IF(ISBLANK(K208),1,IFERROR(VLOOKUP(K208,Eje_Pilar_Prop!$C$3:$C$104,1,FALSE),\"NO\"))","v":45},"SECOP I",1,"Bogotá Mejor para Todos"]
["FDLCH-CI-200-2020",2020,"SECOP I","20-22-18172","Contratos interadministrativos","Contratación directa","Contratos interadministrativos","IMPLEMENTAR Y EJECUTAR EL PROGRAMA “CUMPLIMENTO DE PROTOCOLOS DE BIOSEGURIDAD PARA LA ADAPTACIÓN Y REACTIVACIÓN ECONÓMICA EN LAS LOCALIDADES DE USAQUÉN, CHAPINERO, ENGATIVÁ, SUBA, BARRIOS UNIDOS Y TEUSAQUILLO. ALCANCE DEL OBJETO.- EL PRESENTE CONTRATO INCLUYE LA ENTREGA DE ELEMENTOS DE BIOSEGURIDAD RELACIONADOS EN LA “GUÍA OPERATIVA PROGRAMA CUMPLIMIENTO DE PROTOCOLOS DE BIOSEGURIDAD PARA LA ADAPTACIÓN Y REACTIVACIÓN ECONÓMICA” QUE SE ADOPTE, CON EL PROPÓSITO DE CONTRIBUIR AL CUMPLIMIENTO DE LOS PROTOCOLOS DE BIOSEGURIDAD PARA LA REACTIVACIÓN ECONÓMICA DE 6 LOCALIDADES DE BOGOTÁ, EN ESTE CASO USAQUÉN, CHAPINERO, ENGATIVÁ, SUBA, BARRIOS UNIDOS Y TEUSAQUILLO, A TRAVÉS DE ACCIONES DE INFORMACIÓN, EDUCACIÓN Y COMUNICACIÓN EN SALUD – IEC, ENFOCADAS A ORIENTAR A LOS TRABAJADORES RESPECTO AL USO ADECUADO DE LOS ELEMENTOS DE BIOSEGURIDAD CONTENIDOS EN LOS KITS, ACTIVIDADES QUE SERÁN DESARROLLADAS POR PERFILES IDÓNEOS EN SEGURIDAD Y SALUD EN EL TRABAJO, ASÍ COMO LA ENTREGA DE LOS KITS DE ELEMENTOS DE BIOSEGURIDAD A MICROEMPRESAS, ESTABLECIMIENTOS, LOCALES COMERCIALES Y VENDEDORES INFORMALES; EN EL MARCO DEL PROGRAMA CUMPLIMIENTO DE PROTOCOLOS DE BIOSEGURIDAD PARA LA ADAPTACIÓN Y REACTIVACIÓN ECONÓMICA DEL EJE ADAPTACIÓN Y TRANSFORMACIÓN PRODUCTIVA DE LA ESTRATEGIA DE REACTIVACIÓN ECONÓMICA LOCAL","Inversión","Bogotá Mejor para Todos",19,{"$f":"IF(ISERROR(VLOOKUP(K209,Eje_Pilar_Prop!$C$2:$E$104,2,FALSE)),\" \",VLOOKUP(K209,Eje_Pilar_Prop!$C$2:$E$104,2,FALSE))","v":"Seguridad y convivencia para todos"},{"$f":"IF(ISERROR(VLOOKUP(K209,Eje_Pilar_Prop!$C$2:$E$104,3,FALSE)),\" \",VLOOKUP(K209,Eje_Pilar_Prop!$C$2:$E$104,3,FALSE))","v":"Pilar 3 Construcción de Comunidad y Cultura Ciudadana"},1302,900971006,"SUBRED INTEGRADA DE SERVICIOS DE SALUD NORTE ESE",420288087,0,0,0,0,{"$f":"+Q209+S209+U209","v":420288087},210144044,"2020-08-26","2020-10-14","2021-02-28",138,0,0,null,null,null,null,null,"X",null,null,{"$f":"IF(ISERROR(W209/V209),\"-\",(W209/V209))","v":0.50000000118966015},null,null,{"$f":"IF(SUMPRODUCT((A$14:A209=A209)*(B$14:B209=B209)*(D$14:D209=D209))>1,0,1)","v":1},"Contratos interadministrativos",{"$f":"IF(ISBLANK(F209),1,IFERROR(VLOOKUP(F209,modal,1,FALSE),\"NO\"))","v":"Contratación directa"},{"$f":"IF(ISBLANK(G209),1,IFERROR(VLOOKUP(G209,Tipo!$C$12:$C$27,1,FALSE),\"NO\"))","v":"Contratos interadministrativos"},{"$f":"IF(ISBLANK(I209),1,IFERROR(VLOOKUP(I209,afectacion,1,FALSE),\"NO\"))","v":"Inversión"},{"$f":"IF(ISBLANK(K209),1,IFERROR(VLOOKUP(K209,Eje_Pilar_Prop!$C$3:$C$104,1,FALSE),\"NO\"))","v":19},{"$f":"IF(ISBLANK(C209),1,IFERROR(VLOOKUP(C209,SECOP,1,FALSE),\"NO\"))","v":"SECOP I"},1,{"$f":"IF(ISBLANK(J209),1,IFERROR(VLOOKUP(J209,pdd,1,FALSE),\"NO\"))","v":"Bogotá Mejor para Todos"}]
["FDLCH-CPS-201-2020",2020,"SECOP II","PMINC-004-2020","Contratos de prestación de servicios","Contratación mínima cuantia","No aplica"," REALIZAR EL MANTENIMIENTO Y RECARGA O ADQUISICIÓN DE LOS EXTINTORES CONTRA INCENDIO UBICADOS EN LAS INSTALACIONES DE LA ALCALDÍA LOCAL DE CHAPINERO Y LOS VEHÍCULOS DEL FONDO DE DESARROLLO LOCAL DE CHAPINERO","Funcionamiento","Bogotá Mejor para Todos",null,{"$f":"IF(ISERROR(VLOOKUP(K210,Eje_Pilar_Prop!$C$2:$E$104,2,FALSE)),\" \",VLOOKUP(K210,Eje_Pilar_Prop!$C$2:$E$104,2,FALSE))","v":" "},{"$f":"IF(ISERROR(VLOOKUP(K210,Eje_Pilar_Prop!$C$2:$E$104,3,FALSE)),\" \",VLOOKUP(K210,Eje_Pilar_Prop!$C$2:$E$104,3,FALSE))","v":" "},13102020203060,900303789,"EXTPROSECOL S.A.S.",426000,0,0,0,0,426000,417000,"2020-09-21","2020-09-28","2020-10-27",30,0,0,null,null,null,null,null,null,"X",null,0.97887323943661975,null,null,{"$f":"IF(SUMPRODUCT((A$14:A210=A210)*(B$14:B210=B210)*(D$14:D210=D210))>1,0,1)","v":1},"Contratos de prestación de servicios","Contratación mínima cuantia",{"$f":"IF(ISBLANK(G210),1,IFERROR(VLOOKUP(G210,Tipo!$C$12:$C$27,1,FALSE),\"NO\"))","v":"NO"},"Funcionamiento",{"$f":"IF(ISBLANK(K210),1,IFERROR(VLOOKUP(K210,Eje_Pilar_Prop!$C$3:$C$104,1,FALSE),\"NO\"))","v":1},"SECOP II",1,"Bogotá Mejor para Todos"]
["FDLCH-CPS-202-2020",2020,"SECOP II","PMINC-003-2020-","Contratos de prestación de servicios","Contratación mínima cuantia","No aplica","PRESTAR EL SERVICIO DE MANTENIMIENTO PREVENTIVO Y CORRECTIVO DE LOS ASCENSORES ELÉCTRICOS DE LAS MARCAS MP&L Y OTIS DE LAS TORRES A Y B DE LA PLANTA FÍSICA DE LA ALCALDÍA LOCAL DE CHAPINERO","Funcionamiento","Bogotá Mejor para Todos",null,{"$f":"IF(ISERROR(VLOOKUP(K211,Eje_Pilar_Prop!$C$2:$E$104,2,FALSE)),\" \",VLOOKUP(K211,Eje_Pilar_Prop!$C$2:$E$104,2,FALSE))","v":" "},{"$f":"IF(ISERROR(VLOOKUP(K211,Eje_Pilar_Prop!$C$2:$E$104,3,FALSE)),\" \",VLOOKUP(K211,Eje_Pilar_Prop!$C$2:$E$104,3,FALSE))","v":" "},131020202030611,901147649,"INGYEMEL PROFESIONALES J&H S.A.S",11588000,0,0,0,0,11588000,448000,"2020-09-21","2020-09-22","2021-09-21",365,0,0,null,null,null,null,null,"X",null,null,3.8660683465654128E-2,null,null,{"$f":"IF(SUMPRODUCT((A$14:A211=A211)*(B$14:B211=B211)*(D$14:D211=D211))>1,0,1)","v":1},"Contratos de prestación de servicios","Contratación mínima cuantia",{"$f":"IF(ISBLANK(G211),1,IFERROR(VLOOKUP(G211,Tipo!$C$12:$C$27,1,FALSE),\"NO\"))","v":"NO"},"Funcionamiento",{"$f":"IF(ISBLANK(K211),1,IFERROR(VLOOKUP(K211,Eje_Pilar_Prop!$C$3:$C$104,1,FALSE),\"NO\"))","v":1},"SECOP II",1,"Bogotá Mejor para Todos"]
["FDLCH-CPS-203-2020-",2020,"SECOP II","CPS203-2020","Contratos de prestación de servicios profesionales y de apoyo a la gestión","Contratación directa","Prestación de servicios profesionales y de apoyo a la gestión, o para la ejecución de trabajos artísticos que sólo puedan encomendarse a determinadas personas naturales;","PRESTAR LOS SERVICIOS TÉCNICOS PARA APOYAR LA GESTIÓN Y EJECUCIÓN DE ACTIVIDADES ADMINISTRATIVAS QUE SE ADELANTAN EN EL DESPACHO DE LA ALCALDÍA LOCAL DE CHAPINERO, DE ACUERDO CON LAS CONDICIONES Y ESPECIFICACIONES TÉCNICAS DESCRITAS EN LOS ESTUDIOS PREVIOS.","Inversión","Bogotá Mejor para Todos",45,{"$f":"IF(ISERROR(VLOOKUP(K212,Eje_Pilar_Prop!$C$2:$E$104,2,FALSE)),\" \",VLOOKUP(K212,Eje_Pilar_Prop!$C$2:$E$104,2,FALSE))","v":"Gobernanza e influencia local, regional e internacional"},{"$f":"IF(ISERROR(VLOOKUP(K212,Eje_Pilar_Prop!$C$2:$E$104,3,FALSE)),\" \",VLOOKUP(K212,Eje_Pilar_Prop!$C$2:$E$104,3,FALSE))","v":"Eje Transversal 4 Gobierno Legitimo, Fortalecimiento Local y Eficiencia"},1304,1091663411,"JUAN PABLO SANJUAN ARIAS",7800000,0,0,1,1993318,9793318,7713334,"2020-09-23","2020-09-24","2021-01-15",90,1,23,null,null,null,null,null,null,"X",null,0.78761192069939934,null,null,{"$f":"IF(SUMPRODUCT((A$14:A212=A212)*(B$14:B212=B212)*(D$14:D212=D212))>1,0,1)","v":1},"Contratos de prestación de servicios profesionales y de apoyo a la gestión","Contratación directa",{"$f":"IF(ISBLANK(G212),1,IFERROR(VLOOKUP(G212,Tipo!$C$12:$C$27,1,FALSE),\"NO\"))","v":"Prestación de servicios profesionales y de apoyo a la gestión, o para la ejecución de trabajos artísticos que sólo puedan encomendarse a determinadas personas naturales;"},"Inversión",{"$f":"IF(ISBLANK(K212),1,IFERROR(VLOOKUP(K212,Eje_Pilar_Prop!$C$3:$C$104,1,FALSE),\"NO\"))","v":45},"SECOP II",1,"Bogotá Mejor para Todos"]
["FDLCH-CPS-204-2020",2020,"SECOP II","CPS-204-2020","Contratos de prestación de servicios profesionales y de apoyo a la gestión","Contratación directa","Prestación de servicios profesionales y de apoyo a la gestión, o para la ejecución de trabajos artísticos que sólo puedan encomendarse a determinadas personas naturales;","PRESTAR LOS SERVICIOS DE APOYO A LA GESTIÓN PARA ASISTIR LOGÍSTICAMENTE AL DESPACHO DE LA ALCALDÍA LOCAL DE CHAPINERO DE ACUERDO CON LAS CONDICIONES Y ESPECIFICACIONES TÉCNICAS DESCRITAS EN LOS ESTUDIOS PREVIOS","Inversión","Bogotá Mejor para Todos",45,{"$f":"IF(ISERROR(VLOOKUP(K213,Eje_Pilar_Prop!$C$2:$E$104,2,FALSE)),\" \",VLOOKUP(K213,Eje_Pilar_Prop!$C$2:$E$104,2,FALSE))","v":"Gobernanza e influencia local, regional e internacional"},{"$f":"IF(ISERROR(VLOOKUP(K213,Eje_Pilar_Prop!$C$2:$E$104,3,FALSE)),\" \",VLOOKUP(K213,Eje_Pilar_Prop!$C$2:$E$104,3,FALSE))","v":"Eje Transversal 4 Gobierno Legitimo, Fortalecimiento Local y Eficiencia"},1304,73159185,"GERMAN ENRIQUE CASTILLO CORREA",6000000,0,0,1,1466652,7466652,5866667,"2020-09-24","2020-09-25","2021-01-15",90,1,22,null,null,null,null,null,null,"X",null,0.78571587372760909,null,null,{"$f":"IF(SUMPRODUCT((A$14:A213=A213)*(B$14:B213=B213)*(D$14:D213=D213))>1,0,1)","v":1},"Contratos de prestación de servicios profesionales y de apoyo a la gestión","Contratación directa",{"$f":"IF(ISBLANK(G213),1,IFERROR(VLOOKUP(G213,Tipo!$C$12:$C$27,1,FALSE),\"NO\"))","v":"Prestación de servicios profesionales y de apoyo a la gestión, o para la ejecución de trabajos artísticos que sólo puedan encomendarse a determinadas personas naturales;"},"Inversión",{"$f":"IF(ISBLANK(K213),1,IFERROR(VLOOKUP(K213,Eje_Pilar_Prop!$C$3:$C$104,1,FALSE),\"NO\"))","v":45},"SECOP II",1,"Bogotá Mejor para Todos"]
["FDLCH-CCV-205-2020",2020,"SECOP II","PMINC-005-2020","Compraventa de bienes muebles","Contratación mínima cuantia","No aplica","ADQUIRIR ELEMENTOS DE BIOSEGURIDAD PARA LA PROTECCIÓN DE LOS FUNCIONARIOS Y CONTRATISTAS DE LA ALCALDÍA LOCAL DE CHAPINERO, DEL CONTAGIO DEL CORONAVIRUS (COVID-19)","Inversión","Bogotá Mejor para Todos",45,{"$f":"IF(ISERROR(VLOOKUP(K214,Eje_Pilar_Prop!$C$2:$E$104,2,FALSE)),\" \",VLOOKUP(K214,Eje_Pilar_Prop!$C$2:$E$104,2,FALSE))","v":"Gobernanza e influencia local, regional e internacional"},{"$f":"IF(ISERROR(VLOOKUP(K214,Eje_Pilar_Prop!$C$2:$E$104,3,FALSE)),\" \",VLOOKUP(K214,Eje_Pilar_Prop!$C$2:$E$104,3,FALSE))","v":"Eje Transversal 4 Gobierno Legitimo, Fortalecimiento Local y Eficiencia"},1304,900240177,"LIFE SUMINISTROS MEDICOS SAS",13620900,0,0,0,0,13620900,0,"2020-09-23","2020-09-23","2020-10-22",30,0,0,null,null,null,null,null,null,"X",null,0,null,null,{"$f":"IF(SUMPRODUCT((A$14:A214=A214)*(B$14:B214=B214)*(D$14:D214=D214))>1,0,1)","v":1},"Compraventa de bienes muebles","Contratación mínima cuantia",{"$f":"IF(ISBLANK(G214),1,IFERROR(VLOOKUP(G214,Tipo!$C$12:$C$27,1,FALSE),\"NO\"))","v":"NO"},"Inversión",{"$f":"IF(ISBLANK(K214),1,IFERROR(VLOOKUP(K214,Eje_Pilar_Prop!$C$3:$C$104,1,FALSE),\"NO\"))","v":45},"SECOP II",1,"Bogotá Mejor para Todos"]
["FDLCH-CPS-206-2020",2020,"SECOP II","CPS-206-2020","Contratos de prestación de servicios profesionales y de apoyo a la gestión","Contratación directa","Prestación de servicios profesionales y de apoyo a la gestión, o para la ejecución de trabajos artísticos que sólo puedan encomendarse a determinadas personas naturales;","PRESTAR LOS SERVICIOS PROFESIONALES PARA APOYAR EL ÁREA GESTIÓN DEL DESARROLLO LOCAL DE LA ALCALDÍA LOCAL DE CHAPINERO EN LAS ACTIVIDADES CONTABLES Y PRESUPUESTALES.","Inversión","Bogotá Mejor para Todos",41,{"$f":"IF(ISERROR(VLOOKUP(K215,Eje_Pilar_Prop!$C$2:$E$104,2,FALSE)),\" \",VLOOKUP(K215,Eje_Pilar_Prop!$C$2:$E$104,2,FALSE))","v":"Desarrollo rural sostenible"},{"$f":"IF(ISERROR(VLOOKUP(K215,Eje_Pilar_Prop!$C$2:$E$104,3,FALSE)),\" \",VLOOKUP(K215,Eje_Pilar_Prop!$C$2:$E$104,3,FALSE))","v":"Eje Transversal 3 Sostenibilidad Ambiental basada en la eficiencia energética"},1304,7141790,"LEONARDO OROZCO MARTINEZ ",12000000,0,0,1,2133333,14133333,10933333,"2020-09-25","2020-10-01","2021-01-16",90,1,16,null,null,null,null,null,null,"X",null,0.77358490032039862,null,null,{"$f":"IF(SUMPRODUCT((A$14:A215=A215)*(B$14:B215=B215)*(D$14:D215=D215))>1,0,1)","v":1},"Contratos de prestación de servicios profesionales y de apoyo a la gestión","Contratación directa",{"$f":"IF(ISBLANK(G215),1,IFERROR(VLOOKUP(G215,Tipo!$C$12:$C$27,1,FALSE),\"NO\"))","v":"Prestación de servicios profesionales y de apoyo a la gestión, o para la ejecución de trabajos artísticos que sólo puedan encomendarse a determinadas personas naturales;"},"Inversión",{"$f":"IF(ISBLANK(K215),1,IFERROR(VLOOKUP(K215,Eje_Pilar_Prop!$C$3:$C$104,1,FALSE),\"NO\"))","v":41},"SECOP II",1,"Bogotá Mejor para Todos"]
["FDLCH-CPS-207-2020",2020,"SECOP II","CPS-207-2020","Contratos de prestación de servicios profesionales y de apoyo a la gestión","Contratación directa","Prestación de servicios profesionales y de apoyo a la gestión, o para la ejecución de trabajos artísticos que sólo puedan encomendarse a determinadas personas naturales;","PRESTAR LOS SERVICIOS PROFESIONALES ESPECIALIZADOS PARA APOYAR LA GESTIÓN JURÍDICA DEL DESPACHO DE LA ALCALDÍA LOCAL DE CHAPINERO Y LA DE LAS DEPENDENCIAS QUE LA CONFORMAN","Inversión","Bogotá Mejor para Todos",45,{"$f":"IF(ISERROR(VLOOKUP(K216,Eje_Pilar_Prop!$C$2:$E$104,2,FALSE)),\" \",VLOOKUP(K216,Eje_Pilar_Prop!$C$2:$E$104,2,FALSE))","v":"Gobernanza e influencia local, regional e internacional"},{"$f":"IF(ISERROR(VLOOKUP(K216,Eje_Pilar_Prop!$C$2:$E$104,3,FALSE)),\" \",VLOOKUP(K216,Eje_Pilar_Prop!$C$2:$E$104,3,FALSE))","v":"Eje Transversal 4 Gobierno Legitimo, Fortalecimiento Local y Eficiencia"},1304,1085933782,"KAREN DANIELA NARVAEZ ROSERO",21000000,0,0,1,5133333,26133333,19933333,"2020-09-24","2020-09-25","2021-01-15",90,1,22,null,null,null,null,null,null,"X",null,0.76275509901473337,null,null,{"$f":"IF(SUMPRODUCT((A$14:A216=A216)*(B$14:B216=B216)*(D$14:D216=D216))>1,0,1)","v":1},"Contratos de prestación de servicios profesionales y de apoyo a la gestión","Contratación directa",{"$f":"IF(ISBLANK(G216),1,IFERROR(VLOOKUP(G216,Tipo!$C$12:$C$27,1,FALSE),\"NO\"))","v":"Prestación de servicios profesionales y de apoyo a la gestión, o para la ejecución de trabajos artísticos que sólo puedan encomendarse a determinadas personas naturales;"},"Inversión",{"$f":"IF(ISBLANK(K216),1,IFERROR(VLOOKUP(K216,Eje_Pilar_Prop!$C$3:$C$104,1,FALSE),\"NO\"))","v":45},"SECOP II",1,"Bogotá Mejor para Todos"]
["FDLCH-CPS-208-2020",2020,"SECOP II","20-22-19213","Contratos de prestación de servicios","Contratación directa","Urgencia manifiesta","CORPORACIÓN COLOMBIA INTERNACIONAL - CCI, SE OBLIGA A PRESTAR SUS SERVICIOS PARA LLEVAR A CABO LA IMPLEMENTACIÓN A TRAVÉS DE UNA INTERVENCIÓN INTEGRAL PARA LLEVAR A CABO LA REACTIVACIÓN ECONÓMICA RURAL, A TRAVÉS DE LAS ACCIONES DE FORTALECIMIENTO PRODUCTIVO, COMERCIAL Y GESTIÓN DE LOS PLANES DE EXTENSIÓN AGROPECUARIA, DENTRO DEL PROGRAMA DE FORTALECIMIENTO DEL CORAZÓN RURAL","Inversión","Bogotá Mejor para Todos",41,{"$f":"IF(ISERROR(VLOOKUP(K217,Eje_Pilar_Prop!$C$2:$E$104,2,FALSE)),\" \",VLOOKUP(K217,Eje_Pilar_Prop!$C$2:$E$104,2,FALSE))","v":"Desarrollo rural sostenible"},{"$f":"IF(ISERROR(VLOOKUP(K217,Eje_Pilar_Prop!$C$2:$E$104,3,FALSE)),\" \",VLOOKUP(K217,Eje_Pilar_Prop!$C$2:$E$104,3,FALSE))","v":"Eje Transversal 3 Sostenibilidad Ambiental basada en la eficiencia energética"},1303,800186585,"Corporacion Colombia Internacional-CCI",180727454,0,0,0,0,180727454,63254609,"2020-10-25","2020-10-01","2021-03-30",180,0,0,null,null,null,null,null,"X",null,null,0.35000000055331937,null,null,{"$f":"IF(SUMPRODUCT((A$14:A217=A217)*(B$14:B217=B217)*(D$14:D217=D217))>1,0,1)","v":1},"Contratos de prestación de servicios","Contratación directa",{"$f":"IF(ISBLANK(G217),1,IFERROR(VLOOKUP(G217,Tipo!$C$12:$C$27,1,FALSE),\"NO\"))","v":"Urgencia manifiesta"},"Inversión",{"$f":"IF(ISBLANK(K217),1,IFERROR(VLOOKUP(K217,Eje_Pilar_Prop!$C$3:$C$104,1,FALSE),\"NO\"))","v":41},"SECOP II",1,"Bogotá Mejor para Todos"]
["FDLCH-CPS-209-2020",2020,"SECOP II","CPS-209-2020","Contratos de prestación de servicios profesionales y de apoyo a la gestión","Contratación directa","Prestación de servicios profesionales y de apoyo a la gestión, o para la ejecución de trabajos artísticos que sólo puedan encomendarse a determinadas personas naturales;","PRESTACIÓN DE LOS SERVICIOS PERSONALES NECESARIOS PARA LA CONDUCCIÓN DE LOS VEHÍCULOS QUE CONFORMAN EL PARQUE AUTOMOTOR EN PROPIEDAD O CUSTODIA DEL FONDO DE DESARROLLO LOCAL DE CHAPINERO, Y EL TRANSPORTE DE SERVIDORES PÚBLICOS PARA LA REALIZACIÓN DE LAS ACTIVIDADES MISIONALES DE LA ALCALDÍA LOCAL DE CHAPINERO.","Inversión","Bogotá Mejor para Todos",45,{"$f":"IF(ISERROR(VLOOKUP(K218,Eje_Pilar_Prop!$C$2:$E$104,2,FALSE)),\" \",VLOOKUP(K218,Eje_Pilar_Prop!$C$2:$E$104,2,FALSE))","v":"Gobernanza e influencia local, regional e internacional"},{"$f":"IF(ISERROR(VLOOKUP(K218,Eje_Pilar_Prop!$C$2:$E$104,3,FALSE)),\" \",VLOOKUP(K218,Eje_Pilar_Prop!$C$2:$E$104,3,FALSE))","v":"Eje Transversal 4 Gobierno Legitimo, Fortalecimiento Local y Eficiencia"},1304,1070704250,"WILMER ANDRES MALDONADO RAMIREZ",7020000,0,0,0,0,7020000,4914000,"2020-10-20","2020-10-20","2021-01-19",90,0,0,null,null,null,null,null,null,"X",null,0.7,null,null,{"$f":"IF(SUMPRODUCT((A$14:A218=A218)*(B$14:B218=B218)*(D$14:D218=D218))>1,0,1)","v":1},"Contratos de prestación de servicios profesionales y de apoyo a la gestión","Contratación directa",{"$f":"IF(ISBLANK(G218),1,IFERROR(VLOOKUP(G218,Tipo!$C$12:$C$27,1,FALSE),\"NO\"))","v":"Prestación de servicios profesionales y de apoyo a la gestión, o para la ejecución de trabajos artísticos que sólo puedan encomendarse a determinadas personas naturales;"},"Inversión",{"$f":"IF(ISBLANK(K218),1,IFERROR(VLOOKUP(K218,Eje_Pilar_Prop!$C$3:$C$104,1,FALSE),\"NO\"))","v":45},"SECOP II",1,"Bogotá Mejor para Todos"]
["FDLCH-CS-210-2020",2020,"SECOP II","PMINC-006-2020","Seguros","Contratación mínima cuantia","No aplica","CONTRATAR EL SEGURO DE VIDA GRUPO QUE AMPARE LOS EDILES DEL FONDO DE DESARROLLO LOCAL DE CHAPINERO","Funcionamiento","Bogotá Mejor para Todos",null,{"$f":"IF(ISERROR(VLOOKUP(K219,Eje_Pilar_Prop!$C$2:$E$104,2,FALSE)),\" \",VLOOKUP(K219,Eje_Pilar_Prop!$C$2:$E$104,2,FALSE))","v":" "},{"$f":"IF(ISERROR(VLOOKUP(K219,Eje_Pilar_Prop!$C$2:$E$104,3,FALSE)),\" \",VLOOKUP(K219,Eje_Pilar_Prop!$C$2:$E$104,3,FALSE))","v":" "},131020202020105,860067013,"COMPAÑÍA MUNDIAL DE SEGUROS S.A.",4811238,0,0,0,0,4811238,{"$f":"+R219+T219+V219","v":4811238},"2020-10-16","2020-10-19","2021-10-19",365,0,0,null,null,null,null,null,"X",null,null,1,null,null,{"$f":"IF(SUMPRODUCT((A$14:A219=A219)*(B$14:B219=B219)*(D$14:D219=D219))>1,0,1)","v":1},"Seguros","Contratación mínima cuantia",{"$f":"IF(ISBLANK(G219),1,IFERROR(VLOOKUP(G219,Tipo!$C$12:$C$27,1,FALSE),\"NO\"))","v":"NO"},"Funcionamiento",{"$f":"IF(ISBLANK(K219),1,IFERROR(VLOOKUP(K219,Eje_Pilar_Prop!$C$3:$C$104,1,FALSE),\"NO\"))","v":1},"SECOP II",1,"Bogotá Mejor para Todos"]
["FDLCH-CPS-211-2020",2020,"SECOP II","CPS-211-2020","Contratos de prestación de servicios profesionales y de apoyo a la gestión","Contratación directa","Prestación de servicios profesionales y de apoyo a la gestión, o para la ejecución de trabajos artísticos que sólo puedan encomendarse a determinadas personas naturales;"," PRESTAR LOS SERVICIOS PROFESIONALES DE APOYO AL ÁREA DE GESTIÓN DEL DESARROLLO LOCAL, EN TEMAS ESPECÍFICOS DE PLANEACIÓN, PARA LAS ACTIVIDADES RELACIONADAS CON LA FORMULACIÓN, SEGUIMIENTO Y CIERRE DE PROYECTOS Y ESTRUCTURACIÓN Y CIERRE DE LOS PLANES DE DESARROLLO LOCAL, ASÍ COMO EL SEGUIMIENTO PRESUPUESTAL DE LA VIGENCIA","Inversión","Bogotá Mejor para Todos",45,{"$f":"IF(ISERROR(VLOOKUP(K220,Eje_Pilar_Prop!$C$2:$E$104,2,FALSE)),\" \",VLOOKUP(K220,Eje_Pilar_Prop!$C$2:$E$104,2,FALSE))","v":"Gobernanza e influencia local, regional e internacional"},{"$f":"IF(ISERROR(VLOOKUP(K220,Eje_Pilar_Prop!$C$2:$E$104,3,FALSE)),\" \",VLOOKUP(K220,Eje_Pilar_Prop!$C$2:$E$104,3,FALSE))","v":"Eje Transversal 4 Gobierno Legitimo, Fortalecimiento Local y Eficiencia"},1304,1032381420,"JENNIFER TORRES TORRES",15900000,0,0,0,0,15900000,11836667,"2020-10-15","2020-10-16","2021-01-15",90,0,0,null,null,null,null,null,null,"X",null,0.74444446540880505,null,null,{"$f":"IF(SUMPRODUCT((A$14:A220=A220)*(B$14:B220=B220)*(D$14:D220=D220))>1,0,1)","v":1},"Contratos de prestación de servicios profesionales y de apoyo a la gestión","Contratación directa",{"$f":"IF(ISBLANK(G220),1,IFERROR(VLOOKUP(G220,Tipo!$C$12:$C$27,1,FALSE),\"NO\"))","v":"Prestación de servicios profesionales y de apoyo a la gestión, o para la ejecución de trabajos artísticos que sólo puedan encomendarse a determinadas personas naturales;"},"Inversión",{"$f":"IF(ISBLANK(K220),1,IFERROR(VLOOKUP(K220,Eje_Pilar_Prop!$C$3:$C$104,1,FALSE),\"NO\"))","v":45},"SECOP II",1,"Bogotá Mejor para Todos"]
["FDLCH-CPS-212-2020",2020,"SECOP II","CPS-212-2020","Contratos de prestación de servicios profesionales y de apoyo a la gestión","Contratación directa","Prestación de servicios profesionales y de apoyo a la gestión, o para la ejecución de trabajos artísticos que sólo puedan encomendarse a determinadas personas naturales;"," PRESTAR LOS SERVICIOS DE APOYO A LA GESTIÓN A ALCALDÍA LOCAL DE CHAPINERO PARA EL DESARROLLO DE ACCIONES DE PREVENCIÓN, COMUNICACIÓN, MONITOREO Y MEDIACIÓN EN LOS PROCESOS DE MOVILIZACIÓN CIUDADANA Y EN LA IMPLEMENTACIÓN DE ACCIONES DEL PLAN LOCAL DE SEGURIDAD, CONVIVENCIA Y JUSTICIA PARA MEJORAR LAS CONDICIONES DE SEGURIDAD EN EL DISTRITO CAPITAL.","Inversión","Bogotá Mejor para Todos",19,{"$f":"IF(ISERROR(VLOOKUP(K221,Eje_Pilar_Prop!$C$2:$E$104,2,FALSE)),\" \",VLOOKUP(K221,Eje_Pilar_Prop!$C$2:$E$104,2,FALSE))","v":"Seguridad y convivencia para todos"},{"$f":"IF(ISERROR(VLOOKUP(K221,Eje_Pilar_Prop!$C$2:$E$104,3,FALSE)),\" \",VLOOKUP(K221,Eje_Pilar_Prop!$C$2:$E$104,3,FALSE))","v":"Pilar 3 Construcción de Comunidad y Cultura Ciudadana"},1302,1022364268,"LUIS ALEJANDRO MARTINEZ MARTINEZ",7350000,0,0,1,3675000,11025000,5226667,"2020-10-16","2020-10-19","2021-03-05",90,1,45,null,null,null,null,null,"X",null,null,0.47407410430839003,null,null,{"$f":"IF(SUMPRODUCT((A$14:A221=A221)*(B$14:B221=B221)*(D$14:D221=D221))>1,0,1)","v":1},{"$f":"IF(ISBLANK(E221),1,IFERROR(VLOOKUP(E221,tipo,1,FALSE),\"NO\"))","v":"Contratos de prestación de servicios profesionales y de apoyo a la gestión"},"Contratación directa",{"$f":"IF(ISBLANK(G221),1,IFERROR(VLOOKUP(G221,Tipo!$C$12:$C$27,1,FALSE),\"NO\"))","v":"Prestación de servicios profesionales y de apoyo a la gestión, o para la ejecución de trabajos artísticos que sólo puedan encomendarse a determinadas personas naturales;"},"Inversión",{"$f":"IF(ISBLANK(K221),1,IFERROR(VLOOKUP(K221,Eje_Pilar_Prop!$C$3:$C$104,1,FALSE),\"NO\"))","v":19},"SECOP II",1,"Bogotá Mejor para Todos"]
["FDLCH-CPS-213-2020",2020,"SECOP II","CPS-213-2020","Contratos de prestación de servicios profesionales y de apoyo a la gestión","Contratación directa","Prestación de servicios profesionales y de apoyo a la gestión, o para la ejecución de trabajos artísticos que sólo puedan encomendarse a determinadas personas naturales;"," PRESTAR LOS SERVICIOS DE APOYO A LA GESTIÓN A ALCALDÍA LOCAL DE CHAPINERO PARA EL DESARROLLO DE ACCIONES DE PREVENCIÓN, COMUNICACIÓN, MONITOREO Y MEDIACIÓN EN LOS PROCESOS DE MOVILIZACIÓN CIUDADANA Y EN LA IMPLEMENTACIÓN DE ACCIONES DEL PLAN LOCAL DE SEGURIDAD, CONVIVENCIA Y JUSTICIA PARA MEJORAR LAS CONDICIONES DE SEGURIDAD EN EL DISTRITO CAPITAL.","Inversión","Bogotá Mejor para Todos",19,{"$f":"IF(ISERROR(VLOOKUP(K222,Eje_Pilar_Prop!$C$2:$E$104,2,FALSE)),\" \",VLOOKUP(K222,Eje_Pilar_Prop!$C$2:$E$104,2,FALSE))","v":"Seguridad y convivencia para todos"},{"$f":"IF(ISERROR(VLOOKUP(K222,Eje_Pilar_Prop!$C$2:$E$104,3,FALSE)),\" \",VLOOKUP(K222,Eje_Pilar_Prop!$C$2:$E$104,3,FALSE))","v":"Pilar 3 Construcción de Comunidad y Cultura Ciudadana"},1302,1015996478,"JEAN MICHEL ALBARRACIN MERCADO",7350000,0,0,1,3675000,11025000,5226667,"2020-10-16","2020-10-19","2021-03-05",90,1,45,null,null,null,null,null,"X",null,null,0.47407410430839003,null,null,{"$f":"IF(SUMPRODUCT((A$14:A222=A222)*(B$14:B222=B222)*(D$14:D222=D222))>1,0,1)","v":1},"Contratos de prestación de servicios profesionales y de apoyo a la gestión","Contratación directa",{"$f":"IF(ISBLANK(G222),1,IFERROR(VLOOKUP(G222,Tipo!$C$12:$C$27,1,FALSE),\"NO\"))","v":"Prestación de servicios profesionales y de apoyo a la gestión, o para la ejecución de trabajos artísticos que sólo puedan encomendarse a determinadas personas naturales;"},"Inversión",{"$f":"IF(ISBLANK(K222),1,IFERROR(VLOOKUP(K222,Eje_Pilar_Prop!$C$3:$C$104,1,FALSE),\"NO\"))","v":19},"SECOP II",1,"Bogotá Mejor para Todos"]
["FDLCH-CPS-214-2020",2020,"SECOP II","CPS-214-2020","Contratos de prestación de servicios profesionales y de apoyo a la gestión","Contratación directa","Prestación de servicios profesionales y de apoyo a la gestión, o para la ejecución de trabajos artísticos que sólo puedan encomendarse a determinadas personas naturales;"," PRESTAR LOS SERVICIOS PROFESIONALES ESPECIALIZADOS PARA APOYAR LA PLANEACIÓN, GESTIÓN Y SEGUIMIENTO A LAS NECESIDADES DE ÍNDOLE SOCIAL, EN ATENCIÓN AL DESARROLLO DE LA LOCALIDAD DE CHAPINERO","Inversión","Bogotá Mejor para Todos",45,{"$f":"IF(ISERROR(VLOOKUP(K223,Eje_Pilar_Prop!$C$2:$E$104,2,FALSE)),\" \",VLOOKUP(K223,Eje_Pilar_Prop!$C$2:$E$104,2,FALSE))","v":"Gobernanza e influencia local, regional e internacional"},{"$f":"IF(ISERROR(VLOOKUP(K223,Eje_Pilar_Prop!$C$2:$E$104,3,FALSE)),\" \",VLOOKUP(K223,Eje_Pilar_Prop!$C$2:$E$104,3,FALSE))","v":"Eje Transversal 4 Gobierno Legitimo, Fortalecimiento Local y Eficiencia"},1304,51736917,"OLGA LUCIA BRICEÑO GARCIA",18875000,0,0,0,0,18875000,15855000,"2020-10-19","2020-10-20","2021-01-03",75,0,0,null,null,null,null,null,null,"X",null,0.84,null,null,{"$f":"IF(SUMPRODUCT((A$14:A223=A223)*(B$14:B223=B223)*(D$14:D223=D223))>1,0,1)","v":1},"Contratos de prestación de servicios profesionales y de apoyo a la gestión","Contratación directa",{"$f":"IF(ISBLANK(G223),1,IFERROR(VLOOKUP(G223,Tipo!$C$12:$C$27,1,FALSE),\"NO\"))","v":"Prestación de servicios profesionales y de apoyo a la gestión, o para la ejecución de trabajos artísticos que sólo puedan encomendarse a determinadas personas naturales;"},"Inversión",{"$f":"IF(ISBLANK(K223),1,IFERROR(VLOOKUP(K223,Eje_Pilar_Prop!$C$3:$C$104,1,FALSE),\"NO\"))","v":45},"SECOP II",1,"Bogotá Mejor para Todos"]
["FDLCH-CPS-215i-2020",2020,"SECOP II","CPS-215-2020","Contratos de prestación de servicios profesionales y de apoyo a la gestión","Contratación directa","Prestación de servicios profesionales y de apoyo a la gestión, o para la ejecución de trabajos artísticos que sólo puedan encomendarse a determinadas personas naturales;"," PRESTAR LOS SERVICIOS PROFESIONALES ESPECIALIZADOS PARA APOYAR LA COORDINACIÓN Y LA ARTICULACIÓN DE LA INTERVENCIÓN DEL EJERCICIO POLICIVO EN LA ALCALDÍA LOCAL DE CHAPINERO EN EL MARCO DE LA NORMATIVIDAD VIGENTE.","Inversión","Bogotá Mejor para Todos",45,{"$f":"IF(ISERROR(VLOOKUP(K224,Eje_Pilar_Prop!$C$2:$E$104,2,FALSE)),\" \",VLOOKUP(K224,Eje_Pilar_Prop!$C$2:$E$104,2,FALSE))","v":"Gobernanza e influencia local, regional e internacional"},{"$f":"IF(ISERROR(VLOOKUP(K224,Eje_Pilar_Prop!$C$2:$E$104,3,FALSE)),\" \",VLOOKUP(K224,Eje_Pilar_Prop!$C$2:$E$104,3,FALSE))","v":"Eje Transversal 4 Gobierno Legitimo, Fortalecimiento Local y Eficiencia"},1304,79696907,"JUAN CARLOS GÓMEZ MELGAREJO ",21000000,0,0,0,0,21000000,14233333,"2020-10-20","2020-10-20","2021-01-19",90,0,0,null,null,null,null,null,null,"X",null,0.67777776190476191,null,null,{"$f":"IF(SUMPRODUCT((A$14:A224=A224)*(B$14:B224=B224)*(D$14:D224=D224))>1,0,1)","v":1},"Contratos de prestación de servicios profesionales y de apoyo a la gestión","Contratación directa",{"$f":"IF(ISBLANK(G224),1,IFERROR(VLOOKUP(G224,Tipo!$C$12:$C$27,1,FALSE),\"NO\"))","v":"Prestación de servicios profesionales y de apoyo a la gestión, o para la ejecución de trabajos artísticos que sólo puedan encomendarse a determinadas personas naturales;"},"Inversión",{"$f":"IF(ISBLANK(K224),1,IFERROR(VLOOKUP(K224,Eje_Pilar_Prop!$C$3:$C$104,1,FALSE),\"NO\"))","v":45},"SECOP II",1,"Bogotá Mejor para Todos"]
["FDLCH-CPS-216-2020",2020,"SECOP II","CPS-216-2020","Contratos de prestación de servicios profesionales y de apoyo a la gestión","Contratación directa","Prestación de servicios profesionales y de apoyo a la gestión, o para la ejecución de trabajos artísticos que sólo puedan encomendarse a determinadas personas naturales;","PRESTAR LOS SERVICIOS PROFESIONALES EN DERECHO PARA APOYAR JURÍDICAMENTE LA EJECUCIÓN DE LAS ACCIONES REQUERIDAS PARA LA DEPURACIÓN DE LAS ACTUACIONES ADMINISTRATIVAS QUE CURSAN EN LA ALCALDÍA LOCAL DE CHAPINERO.","Inversión","Bogotá Mejor para Todos",45,{"$f":"IF(ISERROR(VLOOKUP(K225,Eje_Pilar_Prop!$C$2:$E$104,2,FALSE)),\" \",VLOOKUP(K225,Eje_Pilar_Prop!$C$2:$E$104,2,FALSE))","v":"Gobernanza e influencia local, regional e internacional"},{"$f":"IF(ISERROR(VLOOKUP(K225,Eje_Pilar_Prop!$C$2:$E$104,3,FALSE)),\" \",VLOOKUP(K225,Eje_Pilar_Prop!$C$2:$E$104,3,FALSE))","v":"Eje Transversal 4 Gobierno Legitimo, Fortalecimiento Local y Eficiencia"},1304,1012402720,"NATHALY TORRES TORRES",9800000,0,0,1,2380000,12180000,8820000,"2020-10-20","2020-10-20","2021-01-15",70,1,17,null,null,null,null,null,null,"X",null,0.72413793103448276,null,null,{"$f":"IF(SUMPRODUCT((A$14:A225=A225)*(B$14:B225=B225)*(D$14:D225=D225))>1,0,1)","v":1},"Contratos de prestación de servicios profesionales y de apoyo a la gestión","Contratación directa",{"$f":"IF(ISBLANK(G225),1,IFERROR(VLOOKUP(G225,Tipo!$C$12:$C$27,1,FALSE),\"NO\"))","v":"Prestación de servicios profesionales y de apoyo a la gestión, o para la ejecución de trabajos artísticos que sólo puedan encomendarse a determinadas personas naturales;"},"Inversión",{"$f":"IF(ISBLANK(K225),1,IFERROR(VLOOKUP(K225,Eje_Pilar_Prop!$C$3:$C$104,1,FALSE),\"NO\"))","v":45},"SECOP II",1,"Bogotá Mejor para Todos"]
["FDLCH-CPS-217-2020",2020,"SECOP II","CPS-217-2020","Contratos de prestación de servicios profesionales y de apoyo a la gestión","Contratación directa","Prestación de servicios profesionales y de apoyo a la gestión, o para la ejecución de trabajos artísticos que sólo puedan encomendarse a determinadas personas naturales;","PRESTAR SERVICIOS PROFESIONALES PARA APOYAR LA GESTIÓN PRECONTRACTUAL Y CONTRACTUAL QUE ADELANTE EL FONDO DE DESARROLLO LOCAL DE CHAPINERO.","Inversión","Bogotá Mejor para Todos",45,{"$f":"IF(ISERROR(VLOOKUP(K226,Eje_Pilar_Prop!$C$2:$E$104,2,FALSE)),\" \",VLOOKUP(K226,Eje_Pilar_Prop!$C$2:$E$104,2,FALSE))","v":"Gobernanza e influencia local, regional e internacional"},{"$f":"IF(ISERROR(VLOOKUP(K226,Eje_Pilar_Prop!$C$2:$E$104,3,FALSE)),\" \",VLOOKUP(K226,Eje_Pilar_Prop!$C$2:$E$104,3,FALSE))","v":"Eje Transversal 4 Gobierno Legitimo, Fortalecimiento Local y Eficiencia"},1304,79580307,"CESAR FRUTO CORREDOR GÓMEZ",19500000,0,0,0,0,19500000,8883333,"2020-10-20","2020-10-20","2021-01-19",90,0,0,null,null,null,null,null,null,"X",null,0.45555553846153846,null,null,{"$f":"IF(SUMPRODUCT((A$14:A226=A226)*(B$14:B226=B226)*(D$14:D226=D226))>1,0,1)","v":1},"Contratos de prestación de servicios profesionales y de apoyo a la gestión","Contratación directa",{"$f":"IF(ISBLANK(G226),1,IFERROR(VLOOKUP(G226,Tipo!$C$12:$C$27,1,FALSE),\"NO\"))","v":"Prestación de servicios profesionales y de apoyo a la gestión, o para la ejecución de trabajos artísticos que sólo puedan encomendarse a determinadas personas naturales;"},"Inversión",{"$f":"IF(ISBLANK(K226),1,IFERROR(VLOOKUP(K226,Eje_Pilar_Prop!$C$3:$C$104,1,FALSE),\"NO\"))","v":45},"SECOP II",1,"Bogotá Mejor para Todos"]
["FDLCH-CPS-218-2020",2020,"SECOP II","CPS-218-2020","Contratos de prestación de servicios profesionales y de apoyo a la gestión","Contratación directa","Prestación de servicios profesionales y de apoyo a la gestión, o para la ejecución de trabajos artísticos que sólo puedan encomendarse a determinadas personas naturales;","PRESTAR LOS SERVICIOS PROFESIONALES PARA APOYAR COORDINAR, LIDERAR Y ASESORAR LOS PLANES Y ESTRATEGIAS DE COMUNICACIÓN INTERNA Y EXTERNA PARA LA DIVULGACIÓN DE LOS PROGRAMAS, PROYECTOS Y ACTIVIDADES DE LA ALCALDÍA LOCAL.","Inversión","Bogotá Mejor para Todos",45,{"$f":"IF(ISERROR(VLOOKUP(K227,Eje_Pilar_Prop!$C$2:$E$104,2,FALSE)),\" \",VLOOKUP(K227,Eje_Pilar_Prop!$C$2:$E$104,2,FALSE))","v":"Gobernanza e influencia local, regional e internacional"},{"$f":"IF(ISERROR(VLOOKUP(K227,Eje_Pilar_Prop!$C$2:$E$104,3,FALSE)),\" \",VLOOKUP(K227,Eje_Pilar_Prop!$C$2:$E$104,3,FALSE))","v":"Eje Transversal 4 Gobierno Legitimo, Fortalecimiento Local y Eficiencia"},1304,1026283792,"ESTEFANIA AYALA QUICENO",13750000,0,0,0,0,13750000,11183333,"2020-10-22","2020-10-22","2021-01-05",75,0,0,null,null,null,null,null,null,"X",null,0.81333330909090906,null,null,{"$f":"IF(SUMPRODUCT((A$14:A227=A227)*(B$14:B227=B227)*(D$14:D227=D227))>1,0,1)","v":1},"Contratos de prestación de servicios profesionales y de apoyo a la gestión","Contratación directa",{"$f":"IF(ISBLANK(G227),1,IFERROR(VLOOKUP(G227,Tipo!$C$12:$C$27,1,FALSE),\"NO\"))","v":"Prestación de servicios profesionales y de apoyo a la gestión, o para la ejecución de trabajos artísticos que sólo puedan encomendarse a determinadas personas naturales;"},"Inversión",{"$f":"IF(ISBLANK(K227),1,IFERROR(VLOOKUP(K227,Eje_Pilar_Prop!$C$3:$C$104,1,FALSE),\"NO\"))","v":45},"SECOP II",1,"Bogotá Mejor para Todos"]
["FDLCH-CPS-219-2020",2020,"SECOP II","CPS-219-2020","Contratos de prestación de servicios profesionales y de apoyo a la gestión","Contratación directa","Prestación de servicios profesionales y de apoyo a la gestión, o para la ejecución de trabajos artísticos que sólo puedan encomendarse a determinadas personas naturales;","PRESTAR LOS SERVICIOS DE APOYO A LA GESTIÓN EN LA EJECUCIÓN DE LAS ACTIVIDADES ADMINISTRATIVAS QUE SE ADELANTAN POR EL PERSONAL JURÍDICO DEL DESPACHO DE LA ALCALDÍA LOCAL DE CHAPINERO.","Inversión","Bogotá Mejor para Todos",45,{"$f":"IF(ISERROR(VLOOKUP(K228,Eje_Pilar_Prop!$C$2:$E$104,2,FALSE)),\" \",VLOOKUP(K228,Eje_Pilar_Prop!$C$2:$E$104,2,FALSE))","v":"Gobernanza e influencia local, regional e internacional"},{"$f":"IF(ISERROR(VLOOKUP(K228,Eje_Pilar_Prop!$C$2:$E$104,3,FALSE)),\" \",VLOOKUP(K228,Eje_Pilar_Prop!$C$2:$E$104,3,FALSE))","v":"Eje Transversal 4 Gobierno Legitimo, Fortalecimiento Local y Eficiencia"},1304,51765934,"MARIA DIACLIN RODRIGUEZ PULECIO",4610000,0,0,1,922000,5532000,3688000,"2020-10-22","2020-10-23","2021-01-21",75,1,15,null,null,null,null,null,null,"X",null,0.66666666666666663,null,null,{"$f":"IF(SUMPRODUCT((A$14:A228=A228)*(B$14:B228=B228)*(D$14:D228=D228))>1,0,1)","v":1},"Contratos de prestación de servicios profesionales y de apoyo a la gestión","Contratación directa",{"$f":"IF(ISBLANK(G228),1,IFERROR(VLOOKUP(G228,Tipo!$C$12:$C$27,1,FALSE),\"NO\"))","v":"Prestación de servicios profesionales y de apoyo a la gestión, o para la ejecución de trabajos artísticos que sólo puedan encomendarse a determinadas personas naturales;"},"Inversión",{"$f":"IF(ISBLANK(K228),1,IFERROR(VLOOKUP(K228,Eje_Pilar_Prop!$C$3:$C$104,1,FALSE),\"NO\"))","v":45},"SECOP II",{"$f":"IF(OR(YEAR(X228)=2020,ISBLANK(X228)),1,\"NO\")","v":1},"Bogotá Mejor para Todos"]
["FDLCH-CPS-221-2020",2020,"SECOP II","CPS-221-2020","Contratos de prestación de servicios profesionales y de apoyo a la gestión","Contratación directa","Prestación de servicios profesionales y de apoyo a la gestión, o para la ejecución de trabajos artísticos que sólo puedan encomendarse a determinadas personas naturales;","RESTAR LOS SERVICIOS DE APOYO A LA GESTIÓN A ALCALDÍA LOCAL DE CHAPINERO PARA EL DESARROLLO DE ACCIONES DE PREVENCIÓN, COMUNICACIÓN, MONITOREO Y MEDIACIÓN EN LOS PROCESOS DE MOVILIZACIÓN CIUDADANA Y EN LA IMPLEMENTACIÓN DE ACCIONES DEL PLAN LOCAL DE SEGURIDAD, CONVIVENCIA Y JUSTICIA PARA MEJORAR LAS CONDICIONES DE SEGURIDAD EN EL DISTRITO CAPITAL","Inversión","Bogotá Mejor para Todos",19,{"$f":"IF(ISERROR(VLOOKUP(K229,Eje_Pilar_Prop!$C$2:$E$104,2,FALSE)),\" \",VLOOKUP(K229,Eje_Pilar_Prop!$C$2:$E$104,2,FALSE))","v":"Seguridad y convivencia para todos"},{"$f":"IF(ISERROR(VLOOKUP(K229,Eje_Pilar_Prop!$C$2:$E$104,3,FALSE)),\" \",VLOOKUP(K229,Eje_Pilar_Prop!$C$2:$E$104,3,FALSE))","v":"Pilar 3 Construcción de Comunidad y Cultura Ciudadana"},1302,1000251989,"PAULA ANDREA BERNAL SALDAÑA",6125000,0,0,1,3021667,9146667,4410000,"2020-10-28","2020-10-29","2021-02-19",75,1,37,null,null,null,null,null,"X",null,null,0.48214283957205395,null,null,{"$f":"IF(SUMPRODUCT((A$14:A229=A229)*(B$14:B229=B229)*(D$14:D229=D229))>1,0,1)","v":1},"Contratos de prestación de servicios profesionales y de apoyo a la gestión","Contratación directa",{"$f":"IF(ISBLANK(G229),1,IFERROR(VLOOKUP(G229,Tipo!$C$12:$C$27,1,FALSE),\"NO\"))","v":"Prestación de servicios profesionales y de apoyo a la gestión, o para la ejecución de trabajos artísticos que sólo puedan encomendarse a determinadas personas naturales;"},"Inversión",{"$f":"IF(ISBLANK(K229),1,IFERROR(VLOOKUP(K229,Eje_Pilar_Prop!$C$3:$C$104,1,FALSE),\"NO\"))","v":19},"SECOP II",1,"Bogotá Mejor para Todos"]
["FDLCH-CCV-222-2020",2020,"SECOP II","PMINC-007-2020","Compraventa de bienes inmuebles","Contratación mínima cuantia","No aplica","COMPRAVENTA DE CONSUMIBLES DE IMPRESIÓN ORIGINALES PARA LOS EQUIPOS DE IMPRESIÓN DE MARCA HEWLETT PACKARD Y LEXMARK DE PROPIEDAD O EN CUSTODIA DEL FONDO DE DESARROLLO LOCAL DE CHAPINERO","Funcionamiento","Bogotá Mejor para Todos",null,{"$f":"IF(ISERROR(VLOOKUP(K230,Eje_Pilar_Prop!$C$2:$E$104,2,FALSE)),\" \",VLOOKUP(K230,Eje_Pilar_Prop!$C$2:$E$104,2,FALSE))","v":" "},{"$f":"IF(ISERROR(VLOOKUP(K230,Eje_Pilar_Prop!$C$2:$E$104,3,FALSE)),\" \",VLOOKUP(K230,Eje_Pilar_Prop!$C$2:$E$104,3,FALSE))","v":" "},1310202010203,830089925,"PC PRONTO SAS",9992430,0,0,0,0,9992430,0,"2020-11-09","2020-11-11","2020-12-10",30,0,0,null,null,null,null,null,null,"X",null,0,null,null,{"$f":"IF(SUMPRODUCT((A$14:A230=A230)*(B$14:B230=B230)*(D$14:D230=D230))>1,0,1)","v":1},"Compraventa de bienes inmuebles","Contratación mínima cuantia",{"$f":"IF(ISBLANK(G230),1,IFERROR(VLOOKUP(G230,Tipo!$C$12:$C$27,1,FALSE),\"NO\"))","v":"NO"},"Funcionamiento",{"$f":"IF(ISBLANK(K230),1,IFERROR(VLOOKUP(K230,Eje_Pilar_Prop!$C$3:$C$104,1,FALSE),\"NO\"))","v":1},"SECOP II",1,"Bogotá Mejor para Todos"]
["FDLCH-CPS-223-2020",2020,"SECOP II","CPS-223-2020","Contratos de prestación de servicios profesionales y de apoyo a la gestión","Contratación directa","Prestación de servicios profesionales y de apoyo a la gestión, o para la ejecución de trabajos artísticos que sólo puedan encomendarse a determinadas personas naturales;"," PRESTACIÓN DE SERVICIOS PROFESIONALES PARA EL APOYO AL ÁREA DE GESTIÓN DEL DESARROLLO LOCAL DE LA ALCALDÍA LOCAL DE CHAPINERO EN LA FORMULACIÓN, GESTIÓN, EJECUCIÓN Y SEGUIMIENTO DEL PROYECTO 1301 “MEJORA LA CALIDAD DE LA MOVILIDAD” Y LA SUPERVISIÓN DE CONTRATOS QUE LE SEAN ASIGNADOS.","Inversión","Bogotá Mejor para Todos",18,{"$f":"IF(ISERROR(VLOOKUP(K231,Eje_Pilar_Prop!$C$2:$E$104,2,FALSE)),\" \",VLOOKUP(K231,Eje_Pilar_Prop!$C$2:$E$104,2,FALSE))","v":"Mejor movilidad para todos"},{"$f":"IF(ISERROR(VLOOKUP(K231,Eje_Pilar_Prop!$C$2:$E$104,3,FALSE)),\" \",VLOOKUP(K231,Eje_Pilar_Prop!$C$2:$E$104,3,FALSE))","v":"Pilar 2 Democracía Urbana"},1301,1070604249,"BRIAN ROBERTO RAMOS CARRILLO",9750000,0,0,1,4810000,14560000,5330000,"2020-11-11","2020-11-12","2021-03-04",75,1,37,null,null,null,null,null,"X",null,null,0.36607142857142855,null,null,{"$f":"IF(SUMPRODUCT((A$14:A231=A231)*(B$14:B231=B231)*(D$14:D231=D231))>1,0,1)","v":1},"Contratos de prestación de servicios profesionales y de apoyo a la gestión","Contratación directa",{"$f":"IF(ISBLANK(G231),1,IFERROR(VLOOKUP(G231,Tipo!$C$12:$C$27,1,FALSE),\"NO\"))","v":"Prestación de servicios profesionales y de apoyo a la gestión, o para la ejecución de trabajos artísticos que sólo puedan encomendarse a determinadas personas naturales;"},"Inversión",{"$f":"IF(ISBLANK(K231),1,IFERROR(VLOOKUP(K231,Eje_Pilar_Prop!$C$3:$C$104,1,FALSE),\"NO\"))","v":18},"SECOP II",1,"Bogotá Mejor para Todos"]
["FDLCH-CPS-224-2020",2020,"SECOP II","CPS-224-2020","Contratos de prestación de servicios profesionales y de apoyo a la gestión","Contratación directa","Prestación de servicios profesionales y de apoyo a la gestión, o para la ejecución de trabajos artísticos que sólo puedan encomendarse a determinadas personas naturales;"," PRESTACIÓN DE SERVICIOS PROFESIONALES PARA APOYAR TÉCNICAMENTE LAS DISTINTAS ETAPAS DE LOS PROCESOS DE COMPETENCIA DE LA ALCALDÍA LOCAL DE CHAPINERO, PARA LA DEPURACIÓN DE ACTUACIONES ADMINISTRATIVAS","Inversión","Bogotá Mejor para Todos",45,{"$f":"IF(ISERROR(VLOOKUP(K232,Eje_Pilar_Prop!$C$2:$E$104,2,FALSE)),\" \",VLOOKUP(K232,Eje_Pilar_Prop!$C$2:$E$104,2,FALSE))","v":"Gobernanza e influencia local, regional e internacional"},{"$f":"IF(ISERROR(VLOOKUP(K232,Eje_Pilar_Prop!$C$2:$E$104,3,FALSE)),\" \",VLOOKUP(K232,Eje_Pilar_Prop!$C$2:$E$104,3,FALSE))","v":"Eje Transversal 4 Gobierno Legitimo, Fortalecimiento Local y Eficiencia"},1304,52533394,"MARICELA PALACIO RODRIGUEZ",10000000,0,0,0,0,10000000,5733333,"2020-11-09","2020-11-10","2021-01-24",75,0,0,null,null,null,null,null,null,"X",null,0.57333330000000005,null,null,{"$f":"IF(SUMPRODUCT((A$14:A232=A232)*(B$14:B232=B232)*(D$14:D232=D232))>1,0,1)","v":1},"Contratos de prestación de servicios profesionales y de apoyo a la gestión","Contratación directa",{"$f":"IF(ISBLANK(G232),1,IFERROR(VLOOKUP(G232,Tipo!$C$12:$C$27,1,FALSE),\"NO\"))","v":"Prestación de servicios profesionales y de apoyo a la gestión, o para la ejecución de trabajos artísticos que sólo puedan encomendarse a determinadas personas naturales;"},"Inversión",{"$f":"IF(ISBLANK(K232),1,IFERROR(VLOOKUP(K232,Eje_Pilar_Prop!$C$3:$C$104,1,FALSE),\"NO\"))","v":45},"SECOP II",1,"Bogotá Mejor para Todos"]
["FDLCH-CPS-225-2020",2020,"SECOP II","SAMC-002-2020","Contratos de prestación de servicios","Selección abreviada","Selección abreviada por menor cuantía "," REALIZAR LA TOMA FÍSICA DE BIENES Y EL AVALÚO TÉCNICO DE LOS BIENES DE PROPIEDAD Y/O A CARGO DEL FONDO DE DESARROLLO LOCAL DE CHAPINERO DE CONFORMIDAD CON LAS DISPOSICIONES LEGALES VIGENTES QUE LE SEAN APLICABLES.","Funcionamiento","Bogotá Mejor para Todos",null,{"$f":"IF(ISERROR(VLOOKUP(K233,Eje_Pilar_Prop!$C$2:$E$104,2,FALSE)),\" \",VLOOKUP(K233,Eje_Pilar_Prop!$C$2:$E$104,2,FALSE))","v":" "},{"$f":"IF(ISERROR(VLOOKUP(K233,Eje_Pilar_Prop!$C$2:$E$104,3,FALSE)),\" \",VLOOKUP(K233,Eje_Pilar_Prop!$C$2:$E$104,3,FALSE))","v":" "},131020202030301,10022018,"GUSTAVO ADOLFO FORERO GONZÁLEZ",22497500,0,0,0,0,22497500,0,"2020-11-18","2020-11-19","2021-02-18",60,1,30,null,null,null,null,null,"X",null,null,0,null,null,{"$f":"IF(SUMPRODUCT((A$14:A233=A233)*(B$14:B233=B233)*(D$14:D233=D233))>1,0,1)","v":1},"Contratos de prestación de servicios","Selección abreviada",{"$f":"IF(ISBLANK(G233),1,IFERROR(VLOOKUP(G233,Tipo!$C$12:$C$27,1,FALSE),\"NO\"))","v":"Selección abreviada por menor cuantía "},"Funcionamiento",{"$f":"IF(ISBLANK(K233),1,IFERROR(VLOOKUP(K233,Eje_Pilar_Prop!$C$3:$C$104,1,FALSE),\"NO\"))","v":1},"SECOP II",1,"Bogotá Mejor para Todos"]
["FDLCH-CPS-226-2020",2020,"SECOP II","CPS-226-2020","Contratos de prestación de servicios profesionales y de apoyo a la gestión","Contratación directa","Prestación de servicios profesionales y de apoyo a la gestión, o para la ejecución de trabajos artísticos que sólo puedan encomendarse a determinadas personas naturales;","PRESTACIÓN DE SERVICIOS PROFESIONALES PARA EL APOYO AL ÁREA DE GESTIÓN DEL DESARROLLO LOCAL DE LA ALCALDÍA LOCAL DE CHAPINERO EN LA FORMULACIÓN, GESTIÓN, EJECUCIÓN Y SEGUIMIENTO DEL PROYECTO 1301 \"MEJORAR LA CALIDAD DE LA MOVILIDAD\" Y LA SUPERVISIÓN DE CONTRATOS QUE LE SEAN ASIGNADOS.","Inversión","Bogotá Mejor para Todos",18,{"$f":"IF(ISERROR(VLOOKUP(K234,Eje_Pilar_Prop!$C$2:$E$104,2,FALSE)),\" \",VLOOKUP(K234,Eje_Pilar_Prop!$C$2:$E$104,2,FALSE))","v":"Mejor movilidad para todos"},{"$f":"IF(ISERROR(VLOOKUP(K234,Eje_Pilar_Prop!$C$2:$E$104,3,FALSE)),\" \",VLOOKUP(K234,Eje_Pilar_Prop!$C$2:$E$104,3,FALSE))","v":"Pilar 2 Democracía Urbana"},1301,1090435721,"JORGE ENRIQUE ABREO REYES",12000000,0,0,1,6000000,18000000,5800000,"2020-11-23","2020-11-23","2021-02-23",60,1,30,null,null,null,null,null,"X",null,null,0.32222222222222224,null,null,{"$f":"IF(SUMPRODUCT((A$14:A234=A234)*(B$14:B234=B234)*(D$14:D234=D234))>1,0,1)","v":1},"Contratos de prestación de servicios profesionales y de apoyo a la gestión","Contratación directa",{"$f":"IF(ISBLANK(G234),1,IFERROR(VLOOKUP(G234,Tipo!$C$12:$C$27,1,FALSE),\"NO\"))","v":"Prestación de servicios profesionales y de apoyo a la gestión, o para la ejecución de trabajos artísticos que sólo puedan encomendarse a determinadas personas naturales;"},"Inversión",{"$f":"IF(ISBLANK(K234),1,IFERROR(VLOOKUP(K234,Eje_Pilar_Prop!$C$3:$C$104,1,FALSE),\"NO\"))","v":18},"SECOP II",1,"Bogotá Mejor para Todos"]
["FDLCH-CPS-227-2020",2020,"SECOP II","CPS-227-2020","Contratos de prestación de servicios profesionales y de apoyo a la gestión","Contratación directa","Prestación de servicios profesionales y de apoyo a la gestión, o para la ejecución de trabajos artísticos que sólo puedan encomendarse a determinadas personas naturales;","PRESTACIÓN DE SERVICIOS PROFESIONALES PARA EL APOYO AL ÁREA DE GESTIÓN DEL DESARROLLO LOCAL DE LA ALCALDÍA LOCAL DE CHAPINERO EN LA FORMULACIÓN, GESTIÓN, EJECUCIÓN Y SEGUIMIENTO DEL PROYECTO 1301 'MEJORAR LA CALIDAD DE LA MOVILIDAD' Y LA SUPERVISIÓN DE CONTRATOS QUE LE SEAN ASIGNADOS","Inversión","Bogotá Mejor para Todos",18,{"$f":"IF(ISERROR(VLOOKUP(K235,Eje_Pilar_Prop!$C$2:$E$104,2,FALSE)),\" \",VLOOKUP(K235,Eje_Pilar_Prop!$C$2:$E$104,2,FALSE))","v":"Mejor movilidad para todos"},{"$f":"IF(ISERROR(VLOOKUP(K235,Eje_Pilar_Prop!$C$2:$E$104,3,FALSE)),\" \",VLOOKUP(K235,Eje_Pilar_Prop!$C$2:$E$104,3,FALSE))","v":"Pilar 2 Democracía Urbana"},1301,1077862072,"OSCAR MAURICIO ALMARIO FERNANDEZ",5850000,0,0,1,2860000,8710000,3380000,"2020-11-26","2020-11-26","2021-02-01",45,1,22,null,null,null,null,null,"X",null,null,0.38805970149253732,null,null,{"$f":"IF(SUMPRODUCT((A$14:A235=A235)*(B$14:B235=B235)*(D$14:D235=D235))>1,0,1)","v":1},"Contratos de prestación de servicios profesionales y de apoyo a la gestión","Contratación directa",{"$f":"IF(ISBLANK(G235),1,IFERROR(VLOOKUP(G235,Tipo!$C$12:$C$27,1,FALSE),\"NO\"))","v":"Prestación de servicios profesionales y de apoyo a la gestión, o para la ejecución de trabajos artísticos que sólo puedan encomendarse a determinadas personas naturales;"},"Inversión",{"$f":"IF(ISBLANK(K235),1,IFERROR(VLOOKUP(K235,Eje_Pilar_Prop!$C$3:$C$104,1,FALSE),\"NO\"))","v":18},"SECOP II",1,"Bogotá Mejor para Todos"]
["FDLCH-CPS-228-2020",2020,"SECOP II","CPS-228-2020","Contratos de prestación de servicios profesionales y de apoyo a la gestión","Contratación directa","Prestación de servicios profesionales y de apoyo a la gestión, o para la ejecución de trabajos artísticos que sólo puedan encomendarse a determinadas personas naturales;"," APOYAR AL EQUIPO DE PRENSA Y COMUNICACIONES DE LA ALCALDÍA LOCAL EN LA REALIZACIÓN Y PUBLICACIÓN DE CONTENIDOS DE REDES SOCIALES Y CANALES DE DIVULGACIÓN DIGITAL (SITIO WEB) DE LA ALCALDÍA LOCAL.","Inversión","Bogotá Mejor para Todos",45,{"$f":"IF(ISERROR(VLOOKUP(K236,Eje_Pilar_Prop!$C$2:$E$104,2,FALSE)),\" \",VLOOKUP(K236,Eje_Pilar_Prop!$C$2:$E$104,2,FALSE))","v":"Gobernanza e influencia local, regional e internacional"},{"$f":"IF(ISERROR(VLOOKUP(K236,Eje_Pilar_Prop!$C$2:$E$104,3,FALSE)),\" \",VLOOKUP(K236,Eje_Pilar_Prop!$C$2:$E$104,3,FALSE))","v":"Eje Transversal 4 Gobierno Legitimo, Fortalecimiento Local y Eficiencia"},1304,1026576669,"FABIAN ESTIVEN HIGUERA ROMERO",4500000,0,0,1,2250000,6750000,3450000,"2020-11-30","2020-11-30","2021-01-13",30,1,15,null,null,null,null,null,null,"X",null,0.51111111111111107,null,null,{"$f":"IF(SUMPRODUCT((A$14:A236=A236)*(B$14:B236=B236)*(D$14:D236=D236))>1,0,1)","v":1},"Contratos de prestación de servicios profesionales y de apoyo a la gestión","Contratación directa",{"$f":"IF(ISBLANK(G236),1,IFERROR(VLOOKUP(G236,Tipo!$C$12:$C$27,1,FALSE),\"NO\"))","v":"Prestación de servicios profesionales y de apoyo a la gestión, o para la ejecución de trabajos artísticos que sólo puedan encomendarse a determinadas personas naturales;"},"Inversión",{"$f":"IF(ISBLANK(K236),1,IFERROR(VLOOKUP(K236,Eje_Pilar_Prop!$C$3:$C$104,1,FALSE),\"NO\"))","v":45},"SECOP II",1,"Bogotá Mejor para Todos"]
["FDLCH-CPS-229-2020",2020,"SECOP II","CPS-229-2020","Contratos de prestación de servicios profesionales y de apoyo a la gestión","Contratación directa","Prestación de servicios profesionales y de apoyo a la gestión, o para la ejecución de trabajos artísticos que sólo puedan encomendarse a determinadas personas naturales;","PRESTAR LOS SERVICIOS PROFESIONALES DE APOYO AL ÁREA DE GESTIÓN DEL DESARROLLO LOCAL, EN TEMAS DE PLANEACIÓN Y PRESUPUESTACIÓN DEL FONDO DE DESARROLLO LOCAL.","Inversión","Bogotá Mejor para Todos",45,{"$f":"IF(ISERROR(VLOOKUP(K237,Eje_Pilar_Prop!$C$2:$E$104,2,FALSE)),\" \",VLOOKUP(K237,Eje_Pilar_Prop!$C$2:$E$104,2,FALSE))","v":"Gobernanza e influencia local, regional e internacional"},{"$f":"IF(ISERROR(VLOOKUP(K237,Eje_Pilar_Prop!$C$2:$E$104,3,FALSE)),\" \",VLOOKUP(K237,Eje_Pilar_Prop!$C$2:$E$104,3,FALSE))","v":"Eje Transversal 4 Gobierno Legitimo, Fortalecimiento Local y Eficiencia"},1304,60256522,"NUBIA CONSTANZA MOGOLLON ACEVEDO",4200000,0,0,1,2100000,6300000,3640000,"2020-11-26","2020-11-27","2021-01-28",30,1,15,null,null,null,null,null,"X",null,null,0.57777777777777772,null,null,{"$f":"IF(SUMPRODUCT((A$14:A237=A237)*(B$14:B237=B237)*(D$14:D237=D237))>1,0,1)","v":1},"Contratos de prestación de servicios profesionales y de apoyo a la gestión","Contratación directa",{"$f":"IF(ISBLANK(G237),1,IFERROR(VLOOKUP(G237,Tipo!$C$12:$C$27,1,FALSE),\"NO\"))","v":"Prestación de servicios profesionales y de apoyo a la gestión, o para la ejecución de trabajos artísticos que sólo puedan encomendarse a determinadas personas naturales;"},"Inversión",{"$f":"IF(ISBLANK(K237),1,IFERROR(VLOOKUP(K237,Eje_Pilar_Prop!$C$3:$C$104,1,FALSE),\"NO\"))","v":45},"SECOP II",1,"Bogotá Mejor para Todos"]
["FDLCH-CPS-230-2020",2020,"SECOP II","CPS-230-2020","Contratos de prestación de servicios profesionales y de apoyo a la gestión","Contratación directa","Prestación de servicios profesionales y de apoyo a la gestión, o para la ejecución de trabajos artísticos que sólo puedan encomendarse a determinadas personas naturales;"," PRESTACIÓN DE SERVICIOS PROFESIONALES PARA APOYAR AL ÁREA DE GESTIÓN DEL DESARROLLO LOCAL DE LA ALCALDÍA LOCAL DE CHAPINERO EN LOS PROYECTOS QUE LE SEAN ASIGNADOS Y LA SUPERVISIÓN DE LOS CONTRATOS.","Inversión","Bogotá Mejor para Todos",17,{"$f":"IF(ISERROR(VLOOKUP(K238,Eje_Pilar_Prop!$C$2:$E$104,2,FALSE)),\" \",VLOOKUP(K238,Eje_Pilar_Prop!$C$2:$E$104,2,FALSE))","v":"Espacio público, derecho de todos"},{"$f":"IF(ISERROR(VLOOKUP(K238,Eje_Pilar_Prop!$C$2:$E$104,3,FALSE)),\" \",VLOOKUP(K238,Eje_Pilar_Prop!$C$2:$E$104,3,FALSE))","v":"Pilar 2 Democracía Urbana"},1300,79268761,"MAURICIO  BOHORQUEZ ESCOBAR",6550000,0,0,1,3275000,9825000,5021667,"2020-11-27","2020-11-30","2021-01-14",30,1,15,null,null,null,null,null,null,"X",null,0.5111111450381679,null,null,{"$f":"IF(SUMPRODUCT((A$14:A238=A238)*(B$14:B238=B238)*(D$14:D238=D238))>1,0,1)","v":1},"Contratos de prestación de servicios profesionales y de apoyo a la gestión","Contratación directa",{"$f":"IF(ISBLANK(G238),1,IFERROR(VLOOKUP(G238,Tipo!$C$12:$C$27,1,FALSE),\"NO\"))","v":"Prestación de servicios profesionales y de apoyo a la gestión, o para la ejecución de trabajos artísticos que sólo puedan encomendarse a determinadas personas naturales;"},"Inversión",{"$f":"IF(ISBLANK(K238),1,IFERROR(VLOOKUP(K238,Eje_Pilar_Prop!$C$3:$C$104,1,FALSE),\"NO\"))","v":17},"SECOP II",1,"Bogotá Mejor para Todos"]
["FDLCH.CIA-231-2020",2020,"SECOP II","CIA-231-2020","Convenios de apoyo y/o convenios de asociación ","Contratación directa","Contratos interadministrativos"," AUNAR ESFUERZOS ENTRE LA SUBRED INTEGRADA DE SERVICIOS DE SALUD NORTE Y EL FDL CHAPINERO PARA EL OTORGAMIENTO DE DISPOSITIVOS DE ASISTENCIA PERSONAL, NO INCLUIDAS O NO CUBIERTAS EN EL PLAN OBLIGATORIO DE SALUD – POS, COMO ACCIÓN QUE FACILITA EL MEJORAMIENTO DE LA CALIDAD DE VIDA Y LA PROMOCIÓN DEL BIENESTAR PARA LAS PERSONAS CON DISCAPACIDAD, RESIDENTES EN LA LOCALIDAD DE CHAPINERO, EN DESARROLLO DE LA POLÍTICA PÚBLICA DISTRITAL Y DEMÁS NORMAS AFINES”","Inversión","Bogotá Mejor para Todos",3,{"$f":"IF(ISERROR(VLOOKUP(K239,Eje_Pilar_Prop!$C$2:$E$104,2,FALSE)),\" \",VLOOKUP(K239,Eje_Pilar_Prop!$C$2:$E$104,2,FALSE))","v":"Igualdad y autonomía para una Bogotá incluyente"},{"$f":"IF(ISERROR(VLOOKUP(K239,Eje_Pilar_Prop!$C$2:$E$104,3,FALSE)),\" \",VLOOKUP(K239,Eje_Pilar_Prop!$C$2:$E$104,3,FALSE))","v":"Pilar 1 Igualdad de Calidad de Vida"},1295,900971006,"SUBRED INTEGRADA DE SERVICIOS DE SALUD NORTE ESE",137195000,0,0,0,0,137195000,0,"2020-12-09","2021-02-04","2021-08-03",180,0,0,null,null,null,null,"X",null,null,null,0,null,null,{"$f":"IF(SUMPRODUCT((A$14:A239=A239)*(B$14:B239=B239)*(D$14:D239=D239))>1,0,1)","v":1},"Convenios de apoyo y/o convenios de asociación ","Contratación directa",{"$f":"IF(ISBLANK(G239),1,IFERROR(VLOOKUP(G239,Tipo!$C$12:$C$27,1,FALSE),\"NO\"))","v":"Contratos interadministrativos"},"Inversión",{"$f":"IF(ISBLANK(K239),1,IFERROR(VLOOKUP(K239,Eje_Pilar_Prop!$C$3:$C$104,1,FALSE),\"NO\"))","v":3},"SECOP II",1,"Bogotá Mejor para Todos"]
["FDLCH-CPS-232-2020",2020,"SECOP II","SAMC-003-2020","Contratos de prestación de servicios","Selección abreviada","Selección abreviada por menor cuantía "," PRESTACION DE SERVICIOS PARA DESARROLLAR ESTRATEGIAS DE SENSIBILIZACION Y FORMACION FRENTE A LA PREVENCION DE VIOLENCIAS Y LA PROMOCION DEL BUEN TRATO EN LA LOCALIDAD DE CHAPINERO","Inversión","Bogotá Mejor para Todos",2,{"$f":"IF(ISERROR(VLOOKUP(K240,Eje_Pilar_Prop!$C$2:$E$104,2,FALSE)),\" \",VLOOKUP(K240,Eje_Pilar_Prop!$C$2:$E$104,2,FALSE))","v":"Desarrollo integral desde la gestación hasta la adolescencia"},{"$f":"IF(ISERROR(VLOOKUP(K240,Eje_Pilar_Prop!$C$2:$E$104,3,FALSE)),\" \",VLOOKUP(K240,Eje_Pilar_Prop!$C$2:$E$104,3,FALSE))","v":"Pilar 1 Igualdad de Calidad de Vida"},1293,900175862,"CORPORACIÓN ESTRATEGICA EN GESTIÓN E INTEGRACIÓN COLOMBIA - EGESCO",110292539,0,0,0,0,110292539,0,"2020-12-07","2020-12-11","2021-04-10",120,0,0,null,null,null,null,null,"X",null,null,0,null,null,{"$f":"IF(SUMPRODUCT((A$14:A240=A240)*(B$14:B240=B240)*(D$14:D240=D240))>1,0,1)","v":1},"Contratos de prestación de servicios","Selección abreviada",{"$f":"IF(ISBLANK(G240),1,IFERROR(VLOOKUP(G240,Tipo!$C$12:$C$27,1,FALSE),\"NO\"))","v":"Selección abreviada por menor cuantía "},"Inversión",{"$f":"IF(ISBLANK(K240),1,IFERROR(VLOOKUP(K240,Eje_Pilar_Prop!$C$3:$C$104,1,FALSE),\"NO\"))","v":2},"SECOP II",1,"Bogotá Mejor para Todos"]
["FDLCH-CPS-233-2020",2020,"SECOP II","CPS-233-2020","Contratos de prestación de servicios profesionales y de apoyo a la gestión","Contratación directa","Prestación de servicios profesionales y de apoyo a la gestión, o para la ejecución de trabajos artísticos que sólo puedan encomendarse a determinadas personas naturales;"," PRESTACIÓN DE SERVICIOS PROFESIONALES PARA EL APOYO AL ÁREA DE GESTIÓN DEL DESARROLLO LOCAL DE LA ALCALDÍA LOCAL DE CHAPINERO EN LA FORMULACIÓN, GESTIÓN, EJECUCIÓN Y SEGUIMIENTO DEL PROYECTO 1301 'MEJORAR LA CALIDAD DE LA MOVILIDAD' Y LA SUPERVISIÓN DE CONTRATOS QUE LE SEAN ASIGNADOS","Inversión","Bogotá Mejor para Todos",18,{"$f":"IF(ISERROR(VLOOKUP(K241,Eje_Pilar_Prop!$C$2:$E$104,2,FALSE)),\" \",VLOOKUP(K241,Eje_Pilar_Prop!$C$2:$E$104,2,FALSE))","v":"Mejor movilidad para todos"},{"$f":"IF(ISERROR(VLOOKUP(K241,Eje_Pilar_Prop!$C$2:$E$104,3,FALSE)),\" \",VLOOKUP(K241,Eje_Pilar_Prop!$C$2:$E$104,3,FALSE))","v":"Pilar 2 Democracía Urbana"},1301,1015470441,"RICARDO ANDRÉS SÁNCHEZ VARGAS",5850000,0,0,1,2860000,8710000,2860000,"2020-11-30","2020-12-01","2021-02-06",45,1,22,null,null,null,null,null,"X",null,null,0.32835820895522388,null,null,{"$f":"IF(SUMPRODUCT((A$14:A241=A241)*(B$14:B241=B241)*(D$14:D241=D241))>1,0,1)","v":1},"Contratos de prestación de servicios profesionales y de apoyo a la gestión","Contratación directa",{"$f":"IF(ISBLANK(G241),1,IFERROR(VLOOKUP(G241,Tipo!$C$12:$C$27,1,FALSE),\"NO\"))","v":"Prestación de servicios profesionales y de apoyo a la gestión, o para la ejecución de trabajos artísticos que sólo puedan encomendarse a determinadas personas naturales;"},"Inversión",{"$f":"IF(ISBLANK(K241),1,IFERROR(VLOOKUP(K241,Eje_Pilar_Prop!$C$3:$C$104,1,FALSE),\"NO\"))","v":18},"SECOP II",1,"Bogotá Mejor para Todos"]
["FDLCH-CPS-234-2020",2020,"SECOP II","CPS-234-2020","Contratos de prestación de servicios profesionales y de apoyo a la gestión","Contratación directa","Prestación de servicios profesionales y de apoyo a la gestión, o para la ejecución de trabajos artísticos que sólo puedan encomendarse a determinadas personas naturales;"," PRESTACIÓN DE SERVICIOS PROFESIONALES PARA EL APOYO AL ÁREA DE GESTIÓN DEL DESARROLLO LOCAL DE LA ALCALDÍA LOCAL DE CHAPINERO EN LA FORMULACIÓN, GESTIÓN, EJECUCIÓN Y SEGUIMIENTO DEL PROYECTO 1301 'MEJORAR LA CALIDAD DE LA MOVILIDAD' Y LA SUPERVISIÓN DE CONTRATOS QUE LE SEAN ASIGNADOS.","Inversión","Bogotá Mejor para Todos",18,{"$f":"IF(ISERROR(VLOOKUP(K242,Eje_Pilar_Prop!$C$2:$E$104,2,FALSE)),\" \",VLOOKUP(K242,Eje_Pilar_Prop!$C$2:$E$104,2,FALSE))","v":"Mejor movilidad para todos"},{"$f":"IF(ISERROR(VLOOKUP(K242,Eje_Pilar_Prop!$C$2:$E$104,3,FALSE)),\" \",VLOOKUP(K242,Eje_Pilar_Prop!$C$2:$E$104,3,FALSE))","v":"Pilar 2 Democracía Urbana"},1301,1070011854,"SANDRA PAOLA SALAMANCA RIAÑO",5850000,0,0,1,2860000,8710000,2600000,"2020-12-02","2020-12-03","2021-02-08",45,1,22,null,null,null,null,null,"X",null,null,0.29850746268656714,null,null,{"$f":"IF(SUMPRODUCT((A$14:A242=A242)*(B$14:B242=B242)*(D$14:D242=D242))>1,0,1)","v":1},"Contratos de prestación de servicios profesionales y de apoyo a la gestión","Contratación directa",{"$f":"IF(ISBLANK(G242),1,IFERROR(VLOOKUP(G242,Tipo!$C$12:$C$27,1,FALSE),\"NO\"))","v":"Prestación de servicios profesionales y de apoyo a la gestión, o para la ejecución de trabajos artísticos que sólo puedan encomendarse a determinadas personas naturales;"},"Inversión",{"$f":"IF(ISBLANK(K242),1,IFERROR(VLOOKUP(K242,Eje_Pilar_Prop!$C$3:$C$104,1,FALSE),\"NO\"))","v":18},"SECOP II",1,"Bogotá Mejor para Todos"]
["FDLCH-CPS-235-2020",2020,"SECOP II","CPS-235-2020","Contratos de prestación de servicios profesionales y de apoyo a la gestión","Contratación directa","Prestación de servicios profesionales y de apoyo a la gestión, o para la ejecución de trabajos artísticos que sólo puedan encomendarse a determinadas personas naturales;","PRESTACIÓN DE SERVICIOS PROFESIONALES PARA APOYAR AL EQUIPO DE PRENSA Y COMUNICACIONES DE LA ALCALDÍA LOCAL EN LA REALIZACIÓN DE PRODUCTOS Y PIEZAS DIGITALES, IMPRESAS Y PUBLICITARIAS DE GRAN FORMATO Y DE ANIMACIÓN GRÁFICA, ASÍ COMO APOYAR LA PRODUCCIÓN Y MONTAJE DE EVENTOS","Inversión","Bogotá Mejor para Todos",45,{"$f":"IF(ISERROR(VLOOKUP(K243,Eje_Pilar_Prop!$C$2:$E$104,2,FALSE)),\" \",VLOOKUP(K243,Eje_Pilar_Prop!$C$2:$E$104,2,FALSE))","v":"Gobernanza e influencia local, regional e internacional"},{"$f":"IF(ISERROR(VLOOKUP(K243,Eje_Pilar_Prop!$C$2:$E$104,3,FALSE)),\" \",VLOOKUP(K243,Eje_Pilar_Prop!$C$2:$E$104,3,FALSE))","v":"Eje Transversal 4 Gobierno Legitimo, Fortalecimiento Local y Eficiencia"},1304,1031150168,"OLGA LUCIA ANGARITA LOPEZ",3900000,0,0,0,0,3900000,0,"2020-12-07","2020-12-07","2021-01-06",30,0,0,null,null,null,null,null,null,"X",null,0,null,null,{"$f":"IF(SUMPRODUCT((A$14:A243=A243)*(B$14:B243=B243)*(D$14:D243=D243))>1,0,1)","v":1},"Contratos de prestación de servicios profesionales y de apoyo a la gestión","Contratación directa",{"$f":"IF(ISBLANK(G243),1,IFERROR(VLOOKUP(G243,Tipo!$C$12:$C$27,1,FALSE),\"NO\"))","v":"Prestación de servicios profesionales y de apoyo a la gestión, o para la ejecución de trabajos artísticos que sólo puedan encomendarse a determinadas personas naturales;"},"Inversión",{"$f":"IF(ISBLANK(K243),1,IFERROR(VLOOKUP(K243,Eje_Pilar_Prop!$C$3:$C$104,1,FALSE),\"NO\"))","v":45},"SECOP II",1,"Bogotá Mejor para Todos"]
["FDLCH-CCV-236-2020",2020,"SECOP II","SAMC-004-2020","Compraventa de bienes muebles","Selección abreviada","Selección abreviada por menor cuantía "," COMPRAVENTA DE EQUIPOS, ACCESORIOS, INSTALACIÓN Y PUESTA EN FUNCIONAMIENTO DEL SISTEMA DE DETECCIÓN DE INCENDIOS PARA EL JARDÍN INFANTIL JUAN XXIII","Inversión","Bogotá Mejor para Todos",2,{"$f":"IF(ISERROR(VLOOKUP(K244,Eje_Pilar_Prop!$C$2:$E$104,2,FALSE)),\" \",VLOOKUP(K244,Eje_Pilar_Prop!$C$2:$E$104,2,FALSE))","v":"Desarrollo integral desde la gestación hasta la adolescencia"},{"$f":"IF(ISERROR(VLOOKUP(K244,Eje_Pilar_Prop!$C$2:$E$104,3,FALSE)),\" \",VLOOKUP(K244,Eje_Pilar_Prop!$C$2:$E$104,3,FALSE))","v":"Pilar 1 Igualdad de Calidad de Vida"},1293,900034347,"PROXEL COLOMBIA SAS",33237900,0,0,0,0,33237900,0,"2020-12-07","2020-12-11","2021-02-10",60,0,0,null,null,null,null,null,"X",null,null,0,null,null,{"$f":"IF(SUMPRODUCT((A$14:A244=A244)*(B$14:B244=B244)*(D$14:D244=D244))>1,0,1)","v":1},"Compraventa de bienes muebles","Selección abreviada",{"$f":"IF(ISBLANK(G244),1,IFERROR(VLOOKUP(G244,Tipo!$C$12:$C$27,1,FALSE),\"NO\"))","v":"Selección abreviada por menor cuantía "},"Inversión",{"$f":"IF(ISBLANK(K244),1,IFERROR(VLOOKUP(K244,Eje_Pilar_Prop!$C$3:$C$104,1,FALSE),\"NO\"))","v":2},"SECOP II",1,"Bogotá Mejor para Todos"]
["FDLCH-CPS-237-2020",2020,"SECOP II","CPS-237-2020","Contratos de prestación de servicios profesionales y de apoyo a la gestión","Contratación directa","Prestación de servicios profesionales y de apoyo a la gestión, o para la ejecución de trabajos artísticos que sólo puedan encomendarse a determinadas personas naturales;","PRESTACIÓN DE SERVICIOS PROFESIONALES PARA EL APOYO AL ÁREA DE GESTIÓN DEL DESARROLLO LOCAL DE LA ALCALDÍA LOCAL DE CHAPINERO EN LA FORMULACIÓN, GESTIÓN, EJECUCIÓN Y SEGUIMIENTO DERIVADOS DEL PROYECTO 1301 'MEJORAR LA CALIDAD DE LA MOVILIDAD' Y LA SUPERVISIÓN DE CONTRATOS QUE LE SEAN ASIGNADOS","Inversión","Bogotá Mejor para Todos",18,{"$f":"IF(ISERROR(VLOOKUP(K245,Eje_Pilar_Prop!$C$2:$E$104,2,FALSE)),\" \",VLOOKUP(K245,Eje_Pilar_Prop!$C$2:$E$104,2,FALSE))","v":"Mejor movilidad para todos"},{"$f":"IF(ISERROR(VLOOKUP(K245,Eje_Pilar_Prop!$C$2:$E$104,3,FALSE)),\" \",VLOOKUP(K245,Eje_Pilar_Prop!$C$2:$E$104,3,FALSE))","v":"Pilar 2 Democracía Urbana"},1301,1073533479,"JAIME HERNANDO PRIETO ÁLVAREZ",8550000,0,0,1,4180000,12730000,2280000,"2020-12-10","2020-12-11","2021-02-16",45,1,22,null,null,null,null,null,"X",null,null,0.17910447761194029,null,null,{"$f":"IF(SUMPRODUCT((A$14:A245=A245)*(B$14:B245=B245)*(D$14:D245=D245))>1,0,1)","v":1},"Contratos de prestación de servicios profesionales y de apoyo a la gestión","Contratación directa",{"$f":"IF(ISBLANK(G245),1,IFERROR(VLOOKUP(G245,Tipo!$C$12:$C$27,1,FALSE),\"NO\"))","v":"Prestación de servicios profesionales y de apoyo a la gestión, o para la ejecución de trabajos artísticos que sólo puedan encomendarse a determinadas personas naturales;"},"Inversión",{"$f":"IF(ISBLANK(K245),1,IFERROR(VLOOKUP(K245,Eje_Pilar_Prop!$C$3:$C$104,1,FALSE),\"NO\"))","v":18},"SECOP II",1,"Bogotá Mejor para Todos"]
["FDLCH-CPS-238-2020",2020,"SECOP II","SAMC-005-2020","Contratos de prestación de servicios","Selección abreviada","Selección abreviada por menor cuantía "," PRESTAR LOS SERVICIOS PARA LA EJECUCIÓN DE LAS ESCUELAS DE FORMACIÓN ARTÍSTICA DE LA LOCALIDAD DE CHAPINERO","Inversión","Bogotá Mejor para Todos",11,{"$f":"IF(ISERROR(VLOOKUP(K246,Eje_Pilar_Prop!$C$2:$E$104,2,FALSE)),\" \",VLOOKUP(K246,Eje_Pilar_Prop!$C$2:$E$104,2,FALSE))","v":"Mejores oportunidades para el desarrollo a través de la cultura, la recreación y el deporte"},{"$f":"IF(ISERROR(VLOOKUP(K246,Eje_Pilar_Prop!$C$2:$E$104,3,FALSE)),\" \",VLOOKUP(K246,Eje_Pilar_Prop!$C$2:$E$104,3,FALSE))","v":"Pilar 1 Igualdad de Calidad de Vida"},1298,900094963,"Fundacion para el desarrollo sociocultural  deportivo y comunitario Fundesco",138536616,0,0,0,0,138536616,0,"2020-12-11","2021-03-01","2021-07-31",150,0,0,null,null,null,null,"X",null,null,null,0,null,null,{"$f":"IF(SUMPRODUCT((A$14:A246=A246)*(B$14:B246=B246)*(D$14:D246=D246))>1,0,1)","v":1},"Contratos de prestación de servicios","Selección abreviada",{"$f":"IF(ISBLANK(G246),1,IFERROR(VLOOKUP(G246,Tipo!$C$12:$C$27,1,FALSE),\"NO\"))","v":"Selección abreviada por menor cuantía "},"Inversión",{"$f":"IF(ISBLANK(K246),1,IFERROR(VLOOKUP(K246,Eje_Pilar_Prop!$C$3:$C$104,1,FALSE),\"NO\"))","v":11},"SECOP II",1,"Bogotá Mejor para Todos"]
["FDLCH-CPS-239-2020",2020,"SECOP II","SAMC-006-2020","Contratos de prestación de servicios","Selección abreviada","Selección abreviada por menor cuantía "," PRESTAR SERVICIOS PARA REALIZAR LA EJECUCIÓN DE LAS ESCUELAS DE FORMACIÓN DEPORTIVA DE LA LOCALIDAD DE CHAPINERO","Inversión","Bogotá Mejor para Todos",11,{"$f":"IF(ISERROR(VLOOKUP(K247,Eje_Pilar_Prop!$C$2:$E$104,2,FALSE)),\" \",VLOOKUP(K247,Eje_Pilar_Prop!$C$2:$E$104,2,FALSE))","v":"Mejores oportunidades para el desarrollo a través de la cultura, la recreación y el deporte"},{"$f":"IF(ISERROR(VLOOKUP(K247,Eje_Pilar_Prop!$C$2:$E$104,3,FALSE)),\" \",VLOOKUP(K247,Eje_Pilar_Prop!$C$2:$E$104,3,FALSE))","v":"Pilar 1 Igualdad de Calidad de Vida"},1298,900094963,"FUNDACION PARA EL DESARROLLO INFANTIL, SOCIAL Y CULTURAL IWOKE",181497200,0,0,0,0,181497200,0,"2020-12-14","2021-03-01","2021-09-30",210,0,0,null,null,null,null,"X",null,null,null,0,null,null,{"$f":"IF(SUMPRODUCT((A$14:A247=A247)*(B$14:B247=B247)*(D$14:D247=D247))>1,0,1)","v":1},"Contratos de prestación de servicios","Selección abreviada",{"$f":"IF(ISBLANK(G247),1,IFERROR(VLOOKUP(G247,Tipo!$C$12:$C$27,1,FALSE),\"NO\"))","v":"Selección abreviada por menor cuantía "},"Inversión",{"$f":"IF(ISBLANK(K247),1,IFERROR(VLOOKUP(K247,Eje_Pilar_Prop!$C$3:$C$104,1,FALSE),\"NO\"))","v":11},"SECOP II",1,"Bogotá Mejor para Todos"]
["FDLCH-CPS-240-2020",2020,"SECOP II","CS-240-2020","Contratos de prestación de servicios profesionales y de apoyo a la gestión","Contratación directa","Prestación de servicios profesionales y de apoyo a la gestión, o para la ejecución de trabajos artísticos que sólo puedan encomendarse a determinadas personas naturales;"," prestar los servicios profesionales a la Alcaldía Local de Chapinero apoyando la ejecución del PROYECTO 1299 en el componente Demandas de Titulación conforme a garantizar el cumplimiento del Plan de Desarrollo Local ","Inversión","Bogotá Mejor para Todos",15,{"$f":"IF(ISERROR(VLOOKUP(K248,Eje_Pilar_Prop!$C$2:$E$104,2,FALSE)),\" \",VLOOKUP(K248,Eje_Pilar_Prop!$C$2:$E$104,2,FALSE))","v":"Recuperación, incorporación, vida urbana y control de la ilegalidad"},{"$f":"IF(ISERROR(VLOOKUP(K248,Eje_Pilar_Prop!$C$2:$E$104,3,FALSE)),\" \",VLOOKUP(K248,Eje_Pilar_Prop!$C$2:$E$104,3,FALSE))","v":"Pilar 2 Democracía Urbana"},1299,19257179,"JOSE JOAQUIN CASTAÑEDA CANTOR",4200000,0,0,0,0,4200000,0,"2020-12-21","2020-12-22","2021-01-21",30,0,0,null,null,null,null,null,null,"X",null,0,null,null,{"$f":"IF(SUMPRODUCT((A$14:A248=A248)*(B$14:B248=B248)*(D$14:D248=D248))>1,0,1)","v":1},"Contratos de prestación de servicios profesionales y de apoyo a la gestión","Contratación directa",{"$f":"IF(ISBLANK(G248),1,IFERROR(VLOOKUP(G248,Tipo!$C$12:$C$27,1,FALSE),\"NO\"))","v":"Prestación de servicios profesionales y de apoyo a la gestión, o para la ejecución de trabajos artísticos que sólo puedan encomendarse a determinadas personas naturales;"},"Inversión",{"$f":"IF(ISBLANK(K248),1,IFERROR(VLOOKUP(K248,Eje_Pilar_Prop!$C$3:$C$104,1,FALSE),\"NO\"))","v":15},"SECOP II",1,"Bogotá Mejor para Todos"]
["FDLCH-CPS-242-2020",2020,"SECOP II","CPS-242-2020","Contratos de prestación de servicios profesionales y de apoyo a la gestión","Contratación directa","Prestación de servicios profesionales y de apoyo a la gestión, o para la ejecución de trabajos artísticos que sólo puedan encomendarse a determinadas personas naturales;"," PRESTAR LOS SERVICIOS PROFESIONALES A LA ALCALDÍA LOCAL EN EL RELACIONAMIENTO Y GESTIÓN DE LAS ACCIONES DE DIALOGO, CONCERTACIÓN, ORGANIZACIÓN Y SEGUIMIENTO QUE SE ADELANTAN ENTRE LOS DISTINTOS ACTORES QUE OCUPAN EL ESPACIO PÚBLICO DE MANERA INDEBIDA, ASÍ COMO EL DIALOGO INTERINSTITUCIONAL PARA MEJORAR LA CONVIVENCIA CIUDADANA EN EL ESPACIO PÚBLICO","Inversión","Bogotá Mejor para Todos",19,{"$f":"IF(ISERROR(VLOOKUP(K249,Eje_Pilar_Prop!$C$2:$E$104,2,FALSE)),\" \",VLOOKUP(K249,Eje_Pilar_Prop!$C$2:$E$104,2,FALSE))","v":"Seguridad y convivencia para todos"},{"$f":"IF(ISERROR(VLOOKUP(K249,Eje_Pilar_Prop!$C$2:$E$104,3,FALSE)),\" \",VLOOKUP(K249,Eje_Pilar_Prop!$C$2:$E$104,3,FALSE))","v":"Pilar 3 Construcción de Comunidad y Cultura Ciudadana"},1302,1010219432,"Santiago Alejandro Cardenas Caballero",4100000,0,0,0,0,4100000,0,"2020-12-14","2020-12-15","2021-01-14",30,0,0,null,null,null,null,null,null,"X",null,0,null,null,{"$f":"IF(SUMPRODUCT((A$14:A249=A249)*(B$14:B249=B249)*(D$14:D249=D249))>1,0,1)","v":1},"Contratos de prestación de servicios profesionales y de apoyo a la gestión","Contratación directa",{"$f":"IF(ISBLANK(G249),1,IFERROR(VLOOKUP(G249,Tipo!$C$12:$C$27,1,FALSE),\"NO\"))","v":"Prestación de servicios profesionales y de apoyo a la gestión, o para la ejecución de trabajos artísticos que sólo puedan encomendarse a determinadas personas naturales;"},"Inversión",{"$f":"IF(ISBLANK(K249),1,IFERROR(VLOOKUP(K249,Eje_Pilar_Prop!$C$3:$C$104,1,FALSE),\"NO\"))","v":19},"SECOP II",1,"Bogotá Mejor para Todos"]
["FDLCH-CPS-243-2020",2020,"SECOP II","CPS-243-2020","Contratos de prestación de servicios profesionales y de apoyo a la gestión","Contratación directa","Prestación de servicios profesionales y de apoyo a la gestión, o para la ejecución de trabajos artísticos que sólo puedan encomendarse a determinadas personas naturales;","Prestación de servicios para el apoyo en la ejecución de actividades administrativas y operativas transversales al área de gestión del desarrollo local relacionadas con la gestión contractual de la Alcaldía Local de Chapinero.","Inversión","Bogotá Mejor para Todos",45,{"$f":"IF(ISERROR(VLOOKUP(K250,Eje_Pilar_Prop!$C$2:$E$104,2,FALSE)),\" \",VLOOKUP(K250,Eje_Pilar_Prop!$C$2:$E$104,2,FALSE))","v":"Gobernanza e influencia local, regional e internacional"},{"$f":"IF(ISERROR(VLOOKUP(K250,Eje_Pilar_Prop!$C$2:$E$104,3,FALSE)),\" \",VLOOKUP(K250,Eje_Pilar_Prop!$C$2:$E$104,3,FALSE))","v":"Eje Transversal 4 Gobierno Legitimo, Fortalecimiento Local y Eficiencia"},1304,52119337,"MARTHA YANETH VASQUEZ FIGUEROA",2454165,0,0,0,0,2454165,0,"2020-12-22","2020-12-22","2021-01-21",30,0,0,null,null,null,null,null,null,"X",null,0,null,null,{"$f":"IF(SUMPRODUCT((A$14:A250=A250)*(B$14:B250=B250)*(D$14:D250=D250))>1,0,1)","v":1},"Contratos de prestación de servicios profesionales y de apoyo a la gestión","Contratación directa",{"$f":"IF(ISBLANK(G250),1,IFERROR(VLOOKUP(G250,Tipo!$C$12:$C$27,1,FALSE),\"NO\"))","v":"Prestación de servicios profesionales y de apoyo a la gestión, o para la ejecución de trabajos artísticos que sólo puedan encomendarse a determinadas personas naturales;"},"Inversión",{"$f":"IF(ISBLANK(K250),1,IFERROR(VLOOKUP(K250,Eje_Pilar_Prop!$C$3:$C$104,1,FALSE),\"NO\"))","v":45},"SECOP II",1,"Bogotá Mejor para Todos"]
["FDLCH-CPS-244-2020",2020,"SECOP II","CPS-244-2020","Contratos de prestación de servicios profesionales y de apoyo a la gestión","Contratación directa","Prestación de servicios profesionales y de apoyo a la gestión, o para la ejecución de trabajos artísticos que sólo puedan encomendarse a determinadas personas naturales;","prestar los servicios técnicos para apoyar la gestión documental de la Alcaldía Local para la implementación del proceso de verificación, soporte y acompañamiento en el desarrollo de las actividades propias de los procesos y actuaciones administrativas existentes del área de Gestión Policiva","Inversión","Bogotá Mejor para Todos",45,{"$f":"IF(ISERROR(VLOOKUP(K251,Eje_Pilar_Prop!$C$2:$E$104,2,FALSE)),\" \",VLOOKUP(K251,Eje_Pilar_Prop!$C$2:$E$104,2,FALSE))","v":"Gobernanza e influencia local, regional e internacional"},{"$f":"IF(ISERROR(VLOOKUP(K251,Eje_Pilar_Prop!$C$2:$E$104,3,FALSE)),\" \",VLOOKUP(K251,Eje_Pilar_Prop!$C$2:$E$104,3,FALSE))","v":"Eje Transversal 4 Gobierno Legitimo, Fortalecimiento Local y Eficiencia"},1304,17357591,"MOISES OLIVO ROJAS VEGA",2166666,0,0,0,0,2166666,0,"2020-12-17","2020-12-17","2021-01-10",25,0,0,null,null,null,null,null,null,"X",null,0,null,null,{"$f":"IF(SUMPRODUCT((A$14:A251=A251)*(B$14:B251=B251)*(D$14:D251=D251))>1,0,1)","v":1},"Contratos de prestación de servicios profesionales y de apoyo a la gestión","Contratación directa",{"$f":"IF(ISBLANK(G251),1,IFERROR(VLOOKUP(G251,Tipo!$C$12:$C$27,1,FALSE),\"NO\"))","v":"Prestación de servicios profesionales y de apoyo a la gestión, o para la ejecución de trabajos artísticos que sólo puedan encomendarse a determinadas personas naturales;"},"Inversión",{"$f":"IF(ISBLANK(K251),1,IFERROR(VLOOKUP(K251,Eje_Pilar_Prop!$C$3:$C$104,1,FALSE),\"NO\"))","v":45},"SECOP II",1,"Bogotá Mejor para Todos"]
["FDLCH-CPS-245-2020",2020,"SECOP II","CPS-245-2020","Contratos de prestación de servicios profesionales y de apoyo a la gestión","Contratación directa","Prestación de servicios profesionales y de apoyo a la gestión, o para la ejecución de trabajos artísticos que sólo puedan encomendarse a determinadas personas naturales;","prestar los servicios técnicos para apoyar la gestión documental de la Alcaldía Local para la implementación del proceso de verificación, soporte y acompañamiento en el desarrollo de las actividades propias de los procesos y actuaciones administrativas existentes del área de Gestión Policiva","Inversión","Bogotá Mejor para Todos",45,{"$f":"IF(ISERROR(VLOOKUP(K252,Eje_Pilar_Prop!$C$2:$E$104,2,FALSE)),\" \",VLOOKUP(K252,Eje_Pilar_Prop!$C$2:$E$104,2,FALSE))","v":"Gobernanza e influencia local, regional e internacional"},{"$f":"IF(ISERROR(VLOOKUP(K252,Eje_Pilar_Prop!$C$2:$E$104,3,FALSE)),\" \",VLOOKUP(K252,Eje_Pilar_Prop!$C$2:$E$104,3,FALSE))","v":"Eje Transversal 4 Gobierno Legitimo, Fortalecimiento Local y Eficiencia"},1304,79840425,"JUAN ESTEBAN RODRIGUEZ GONZALEZ",2166666,0,0,1,1040000,3206666,0,"2020-12-17","2020-12-18","2021-01-23",25,1,12,null,null,null,null,null,"X",null,null,0,null,null,{"$f":"IF(SUMPRODUCT((A$14:A252=A252)*(B$14:B252=B252)*(D$14:D252=D252))>1,0,1)","v":1},"Contratos de prestación de servicios profesionales y de apoyo a la gestión","Contratación directa",{"$f":"IF(ISBLANK(G252),1,IFERROR(VLOOKUP(G252,Tipo!$C$12:$C$27,1,FALSE),\"NO\"))","v":"Prestación de servicios profesionales y de apoyo a la gestión, o para la ejecución de trabajos artísticos que sólo puedan encomendarse a determinadas personas naturales;"},"Inversión",{"$f":"IF(ISBLANK(K252),1,IFERROR(VLOOKUP(K252,Eje_Pilar_Prop!$C$3:$C$104,1,FALSE),\"NO\"))","v":45},"SECOP II",1,"Bogotá Mejor para Todos"]
["FDLCH-CPS-247-2020",2020,"SECOP II","LP-002-2020","Obra pública","Licitación pública","No aplica"," CONSTRUCCIÓN DE LAS OBRAS DE RECONFORMACIÓN DE RECUPERACIÓN Y/O LA IMPLEMENTACIÓN DE MEDIDAS PARA EL CONTROL DE EROSIÓN LA MITIGACIÓN DE RIESGO EN UN SITIO CRÍTICO DE LA LOCALIDAD DE CHAPINERO EN LA CIUDAD DE BOGOTÁ D.C.","Inversión","Bogotá Mejor para Todos",4,{"$f":"IF(ISERROR(VLOOKUP(K253,Eje_Pilar_Prop!$C$2:$E$104,2,FALSE)),\" \",VLOOKUP(K253,Eje_Pilar_Prop!$C$2:$E$104,2,FALSE))","v":"Familias protegidas y adaptadas al cambio climático"},{"$f":"IF(ISERROR(VLOOKUP(K253,Eje_Pilar_Prop!$C$2:$E$104,3,FALSE)),\" \",VLOOKUP(K253,Eje_Pilar_Prop!$C$2:$E$104,3,FALSE))","v":"Pilar 1 Igualdad de Calidad de Vida"},1296,901154678,"BB INGENIEROS S.A.S",314788867,0,0,0,0,314788867,0,"2020-12-23",null,null,75,0,0,null,null,null,null,"X",null,null,null,0,null,null,{"$f":"IF(SUMPRODUCT((A$14:A253=A253)*(B$14:B253=B253)*(D$14:D253=D253))>1,0,1)","v":1},"Obra pública","Licitación pública",{"$f":"IF(ISBLANK(G253),1,IFERROR(VLOOKUP(G253,Tipo!$C$12:$C$27,1,FALSE),\"NO\"))","v":"NO"},"Inversión",{"$f":"IF(ISBLANK(K253),1,IFERROR(VLOOKUP(K253,Eje_Pilar_Prop!$C$3:$C$104,1,FALSE),\"NO\"))","v":4},"SECOP II",1,"Bogotá Mejor para Todos"]
["FDLCH-CPS-248-2020",2020,"SECOP II","CM-001-2020","Interventoría","Concurso de méritos","No aplica","CONTRATAR LA INTERVENTORIA TÉCNICA, ADMINISTRATIVA, LEGAL, FINANCIERA,SOCIAL Y AMBIENTAL DE LA CONSTRUCCIÓN DE OBRAS PARA LA MITIGACIÓN DERIESGO EN LA LOCALIDAD DE CHAPINERO.","Inversión","Bogotá Mejor para Todos",4,{"$f":"IF(ISERROR(VLOOKUP(K254,Eje_Pilar_Prop!$C$2:$E$104,2,FALSE)),\" \",VLOOKUP(K254,Eje_Pilar_Prop!$C$2:$E$104,2,FALSE))","v":"Familias protegidas y adaptadas al cambio climático"},{"$f":"IF(ISERROR(VLOOKUP(K254,Eje_Pilar_Prop!$C$2:$E$104,3,FALSE)),\" \",VLOOKUP(K254,Eje_Pilar_Prop!$C$2:$E$104,3,FALSE))","v":"Pilar 1 Igualdad de Calidad de Vida"},1296,901154678,"2L PROYECTOS S.A.S.",57868287,0,0,0,0,57868287,0,"2020-12-23",null,null,75,0,0,null,null,null,null,"X",null,null,null,0,null,null,{"$f":"IF(SUMPRODUCT((A$14:A254=A254)*(B$14:B254=B254)*(D$14:D254=D254))>1,0,1)","v":1},"Interventoría","Concurso de méritos",{"$f":"IF(ISBLANK(G254),1,IFERROR(VLOOKUP(G254,Tipo!$C$12:$C$27,1,FALSE),\"NO\"))","v":"NO"},"Inversión",{"$f":"IF(ISBLANK(K254),1,IFERROR(VLOOKUP(K254,Eje_Pilar_Prop!$C$3:$C$104,1,FALSE),\"NO\"))","v":4},"SECOP II",1,"Bogotá Mejor para Todos"]
["FDLCH-CSE-249-2020",2020,"SECOP II","PMINC-009-2020","Seguros","Contratación mínima cuantia","No aplica","CONTRATAR LOS SEGUROS DE DAÑOS CORPORALES CAUSADOS A LAS PERSONAS EN ACCIDENTES DE TRÁNSITO – SOAT, PARA LOS VEHÍCULOS DEL PARQUE AUTOMOTOR DEL FONDO DE DESARROLLO LOCAL DE CHAPINERO.","Funcionamiento","Bogotá Mejor para Todos",null,{"$f":"IF(ISERROR(VLOOKUP(K255,Eje_Pilar_Prop!$C$2:$E$104,2,FALSE)),\" \",VLOOKUP(K255,Eje_Pilar_Prop!$C$2:$E$104,2,FALSE))","v":" "},{"$f":"IF(ISERROR(VLOOKUP(K255,Eje_Pilar_Prop!$C$2:$E$104,3,FALSE)),\" \",VLOOKUP(K255,Eje_Pilar_Prop!$C$2:$E$104,3,FALSE))","v":" "},131020202020110,860002400,"LA PREVISORA S.A  COMPAÑÍA DE SEGUROS",4513950,0,0,0,0,4513950,0,"2020-12-23","2021-01-06","2022-01-05",365,0,0,null,null,null,null,null,"X",null,null,0,null,null,{"$f":"IF(SUMPRODUCT((A$14:A255=A255)*(B$14:B255=B255)*(D$14:D255=D255))>1,0,1)","v":1},"Seguros","Contratación mínima cuantia",{"$f":"IF(ISBLANK(G255),1,IFERROR(VLOOKUP(G255,Tipo!$C$12:$C$27,1,FALSE),\"NO\"))","v":"NO"},"Funcionamiento",{"$f":"IF(ISBLANK(K255),1,IFERROR(VLOOKUP(K255,Eje_Pilar_Prop!$C$3:$C$104,1,FALSE),\"NO\"))","v":1},"SECOP II",1,"Bogotá Mejor para Todos"]
["FDLCH-CPS-250-2020",2020,"SECOP II","SAMC-007-2020","Contratos de prestación de servicios","Selección abreviada","Selección abreviada por menor cuantía "," Contratar la prestación de servicios para promover el acceso a la justicia, el acceso a espacios seguros y la convivencia ciudadana en la Localidad de Chapinero","Inversión","Bogotá Mejor para Todos",19,{"$f":"IF(ISERROR(VLOOKUP(K256,Eje_Pilar_Prop!$C$2:$E$104,2,FALSE)),\" \",VLOOKUP(K256,Eje_Pilar_Prop!$C$2:$E$104,2,FALSE))","v":"Seguridad y convivencia para todos"},{"$f":"IF(ISERROR(VLOOKUP(K256,Eje_Pilar_Prop!$C$2:$E$104,3,FALSE)),\" \",VLOOKUP(K256,Eje_Pilar_Prop!$C$2:$E$104,3,FALSE))","v":"Pilar 3 Construcción de Comunidad y Cultura Ciudadana"},1302,800131690,"Avance Organizacional Consultores SAS",149686900,0,0,0,0,149686900,0,"2020-12-28",null,null,180,0,0,null,null,null,null,"X",null,null,null,0,null,null,{"$f":"IF(SUMPRODUCT((A$14:A256=A256)*(B$14:B256=B256)*(D$14:D256=D256))>1,0,1)","v":1},"Contratos de prestación de servicios","Selección abreviada",{"$f":"IF(ISBLANK(G256),1,IFERROR(VLOOKUP(G256,Tipo!$C$12:$C$27,1,FALSE),\"NO\"))","v":"Selección abreviada por menor cuantía "},"Inversión",{"$f":"IF(ISBLANK(K256),1,IFERROR(VLOOKUP(K256,Eje_Pilar_Prop!$C$3:$C$104,1,FALSE),\"NO\"))","v":19},"SECOP II",1,"Bogotá Mejor para Todos"]
["FDLCH-CPS-251-2020",2020,"SECOP II","CPS-251-2020","Contratos de prestación de servicios profesionales y de apoyo a la gestión","Contratación directa","Prestación de servicios profesionales y de apoyo a la gestión, o para la ejecución de trabajos artísticos que sólo puedan encomendarse a determinadas personas naturales;"," Prestación de servicios profesionales para apoyar al área de Gestión del Desarrollo Local de la Alcaldía Local de Chapinero, en la formulación, gestión, ejecución y liquidación de los proyectos desarrollados en el marco del proyecto 1293.","Inversión","Bogotá Mejor para Todos",2,{"$f":"IF(ISERROR(VLOOKUP(K257,Eje_Pilar_Prop!$C$2:$E$104,2,FALSE)),\" \",VLOOKUP(K257,Eje_Pilar_Prop!$C$2:$E$104,2,FALSE))","v":"Desarrollo integral desde la gestación hasta la adolescencia"},{"$f":"IF(ISERROR(VLOOKUP(K257,Eje_Pilar_Prop!$C$2:$E$104,3,FALSE)),\" \",VLOOKUP(K257,Eje_Pilar_Prop!$C$2:$E$104,3,FALSE))","v":"Pilar 1 Igualdad de Calidad de Vida"},1293,80192226,"Oscar Fabian Maestre Olaya",6900000,0,0,0,0,6900000,0,"2020-12-23","2020-12-24","2021-01-17",25,0,0,null,null,null,null,null,null,"X",null,0,null,null,{"$f":"IF(SUMPRODUCT((A$14:A257=A257)*(B$14:B257=B257)*(D$14:D257=D257))>1,0,1)","v":1},"Contratos de prestación de servicios profesionales y de apoyo a la gestión","Contratación directa",{"$f":"IF(ISBLANK(G257),1,IFERROR(VLOOKUP(G257,Tipo!$C$12:$C$27,1,FALSE),\"NO\"))","v":"Prestación de servicios profesionales y de apoyo a la gestión, o para la ejecución de trabajos artísticos que sólo puedan encomendarse a determinadas personas naturales;"},"Inversión",{"$f":"IF(ISBLANK(K257),1,IFERROR(VLOOKUP(K257,Eje_Pilar_Prop!$C$3:$C$104,1,FALSE),\"NO\"))","v":2},"SECOP II",1,"Bogotá Mejor para Todos"]
["FDLCH-CPS-252-2020",2020,"SECOP II","CPS-252-2020","Contratos de prestación de servicios profesionales y de apoyo a la gestión","Contratación directa","Prestación de servicios profesionales y de apoyo a la gestión, o para la ejecución de trabajos artísticos que sólo puedan encomendarse a determinadas personas naturales;","Apoyar al Alcalde Local en la promoción, acompañamiento, coordinación y atención de las instancias de coordinación interinstitucionales y las instancias de participación locales, así como los procesos comunitarios en la localidad","Inversión","Bogotá Mejor para Todos",45,{"$f":"IF(ISERROR(VLOOKUP(K258,Eje_Pilar_Prop!$C$2:$E$104,2,FALSE)),\" \",VLOOKUP(K258,Eje_Pilar_Prop!$C$2:$E$104,2,FALSE))","v":"Gobernanza e influencia local, regional e internacional"},{"$f":"IF(ISERROR(VLOOKUP(K258,Eje_Pilar_Prop!$C$2:$E$104,3,FALSE)),\" \",VLOOKUP(K258,Eje_Pilar_Prop!$C$2:$E$104,3,FALSE))","v":"Eje Transversal 4 Gobierno Legitimo, Fortalecimiento Local y Eficiencia"},1305,1022331685,"NELSON MAURICIO REY PEÑA",5000000,0,0,0,0,5000000,0,"2020-12-23","2020-12-24","2021-01-17",25,0,0,null,null,null,null,null,null,"X",null,0,null,null,{"$f":"IF(SUMPRODUCT((A$14:A258=A258)*(B$14:B258=B258)*(D$14:D258=D258))>1,0,1)","v":1},"Contratos de prestación de servicios profesionales y de apoyo a la gestión","Contratación directa",{"$f":"IF(ISBLANK(G258),1,IFERROR(VLOOKUP(G258,Tipo!$C$12:$C$27,1,FALSE),\"NO\"))","v":"Prestación de servicios profesionales y de apoyo a la gestión, o para la ejecución de trabajos artísticos que sólo puedan encomendarse a determinadas personas naturales;"},"Inversión",{"$f":"IF(ISBLANK(K258),1,IFERROR(VLOOKUP(K258,Eje_Pilar_Prop!$C$3:$C$104,1,FALSE),\"NO\"))","v":45},"SECOP II",1,"Bogotá Mejor para Todos"]
["FDLCH-CPS-253-2020",2020,"SECOP II","PMINC-010-2020","Compraventa de bienes muebles","Contratación mínima cuantia","No aplica","REALIZAR LA COMPRAVENTA DE UNA URNA QUE PERMITA CUSTODIAR LAS ARMAS ENTREGADAS EN EL MARCO DE LA CAMPAÑA DESARME POR LA VIDA.","Inversión","Bogotá Mejor para Todos",19,{"$f":"IF(ISERROR(VLOOKUP(K259,Eje_Pilar_Prop!$C$2:$E$104,2,FALSE)),\" \",VLOOKUP(K259,Eje_Pilar_Prop!$C$2:$E$104,2,FALSE))","v":"Seguridad y convivencia para todos"},{"$f":"IF(ISERROR(VLOOKUP(K259,Eje_Pilar_Prop!$C$2:$E$104,3,FALSE)),\" \",VLOOKUP(K259,Eje_Pilar_Prop!$C$2:$E$104,3,FALSE))","v":"Pilar 3 Construcción de Comunidad y Cultura Ciudadana"},1302,901397972," MULTIDOMINO SAS",1360000,0,0,0,0,1360000,0,"2020-12-24","2021-01-13","2021-01-22",10,0,0,null,null,null,null,null,null,"X",null,0,null,null,{"$f":"IF(SUMPRODUCT((A$14:A259=A259)*(B$14:B259=B259)*(D$14:D259=D259))>1,0,1)","v":1},"Compraventa de bienes muebles","Contratación mínima cuantia",{"$f":"IF(ISBLANK(G259),1,IFERROR(VLOOKUP(G259,Tipo!$C$12:$C$27,1,FALSE),\"NO\"))","v":"NO"},"Inversión",{"$f":"IF(ISBLANK(K259),1,IFERROR(VLOOKUP(K259,Eje_Pilar_Prop!$C$3:$C$104,1,FALSE),\"NO\"))","v":19},"SECOP II",1,"Bogotá Mejor para Todos"]
["FDLCH-CPS-254-2020",2020,"SECOP II","SAMC-010-2020","Contratos de prestación de servicios","Selección abreviada","Selección abreviada por menor cuantía ","Prestar servicios para realizar la ejecución de Eventos Recreativos y Deportivos, que se desarrollarán en la Localidad de Chapinero","Inversión","Bogotá Mejor para Todos",11,{"$f":"IF(ISERROR(VLOOKUP(K260,Eje_Pilar_Prop!$C$2:$E$104,2,FALSE)),\" \",VLOOKUP(K260,Eje_Pilar_Prop!$C$2:$E$104,2,FALSE))","v":"Mejores oportunidades para el desarrollo a través de la cultura, la recreación y el deporte"},{"$f":"IF(ISERROR(VLOOKUP(K260,Eje_Pilar_Prop!$C$2:$E$104,3,FALSE)),\" \",VLOOKUP(K260,Eje_Pilar_Prop!$C$2:$E$104,3,FALSE))","v":"Pilar 1 Igualdad de Calidad de Vida"},1298,830133329,"FUNDACIÓ PARA EL DESAROOLLO SOCIOCULTURAL DEPORTIVO Y COMUNITARIO FUNDESCO",71470640,0,0,0,0,71470640,0,"2020-12-29","2021-03-04","2021-07-03",120,0,0,null,null,null,null,"X",null,null,null,0,null,null,{"$f":"IF(SUMPRODUCT((A$14:A260=A260)*(B$14:B260=B260)*(D$14:D260=D260))>1,0,1)","v":1},"Contratos de prestación de servicios","Selección abreviada",{"$f":"IF(ISBLANK(G260),1,IFERROR(VLOOKUP(G260,Tipo!$C$12:$C$27,1,FALSE),\"NO\"))","v":"Selección abreviada por menor cuantía "},"Inversión",{"$f":"IF(ISBLANK(K260),1,IFERROR(VLOOKUP(K260,Eje_Pilar_Prop!$C$3:$C$104,1,FALSE),\"NO\"))","v":11},"SECOP II",1,"Bogotá Mejor para Todos"]
["FDLCH-CPS-255-2020",2020,"SECOP II","SAMC-009-2020","Contratos de prestación de servicios","Selección abreviada","Selección abreviada por menor cuantía "," PRESTACION DE SERVICIOS PARA DESARROLLAR EL CIRCUITO DE CIRCULACION ARTISTICA CULTURAL Y PATRIMONIAL DE LA LOCALIDAD DE CHAPINERO","Inversión","Bogotá Mejor para Todos",45,{"$f":"IF(ISERROR(VLOOKUP(K261,Eje_Pilar_Prop!$C$2:$E$104,2,FALSE)),\" \",VLOOKUP(K261,Eje_Pilar_Prop!$C$2:$E$104,2,FALSE))","v":"Gobernanza e influencia local, regional e internacional"},{"$f":"IF(ISERROR(VLOOKUP(K261,Eje_Pilar_Prop!$C$2:$E$104,3,FALSE)),\" \",VLOOKUP(K261,Eje_Pilar_Prop!$C$2:$E$104,3,FALSE))","v":"Eje Transversal 4 Gobierno Legitimo, Fortalecimiento Local y Eficiencia"},1298,830133329,"Fundacion para el desarrollo sociocultural deportivo y comunitario Fundesco",153930000,0,0,0,0,153930000,0,"2020-12-29",null,null,180,0,0,null,null,null,null,"X",null,null,null,0,null,null,{"$f":"IF(SUMPRODUCT((A$14:A261=A261)*(B$14:B261=B261)*(D$14:D261=D261))>1,0,1)","v":1},"Contratos de prestación de servicios","Selección abreviada",{"$f":"IF(ISBLANK(G261),1,IFERROR(VLOOKUP(G261,Tipo!$C$12:$C$27,1,FALSE),\"NO\"))","v":"Selección abreviada por menor cuantía "},"Inversión",{"$f":"IF(ISBLANK(K261),1,IFERROR(VLOOKUP(K261,Eje_Pilar_Prop!$C$3:$C$104,1,FALSE),\"NO\"))","v":45},"SECOP II",1,"Bogotá Mejor para Todos"]
["FDLCH-CPS-256-2020",2020,"SECOP II","LP-003-2020","Contratos de prestación de servicios","Licitación pública","No aplica","Prestación de servicios para la vinculación de diferentes actores locales a los procesos de participación ciudadana el fortalecimiento de las organizaciones sociales y comunales locales en el marco de los procesos de gobernabilidad y gobernanza en la localidad, teniendo en cuenta una perspectiva diferencial, poblacional y de género en el marco del proyecto 1305 en chapinero participamos todos","Inversión","Bogotá Mejor para Todos",45,{"$f":"IF(ISERROR(VLOOKUP(K262,Eje_Pilar_Prop!$C$2:$E$104,2,FALSE)),\" \",VLOOKUP(K262,Eje_Pilar_Prop!$C$2:$E$104,2,FALSE))","v":"Gobernanza e influencia local, regional e internacional"},{"$f":"IF(ISERROR(VLOOKUP(K262,Eje_Pilar_Prop!$C$2:$E$104,3,FALSE)),\" \",VLOOKUP(K262,Eje_Pilar_Prop!$C$2:$E$104,3,FALSE))","v":"Eje Transversal 4 Gobierno Legitimo, Fortalecimiento Local y Eficiencia"},1305,900216251,"ASOCIACION PARA EL DESARROLLO INTEGRAL DE LA FAMILIA COLOMBIANA",304450334,0,0,0,0,304450334,0,"2020-12-29","2021-03-01","2021-08-31",150,0,0,null,null,null,null,null,"X",null,null,0,null,null,{"$f":"IF(SUMPRODUCT((A$14:A262=A262)*(B$14:B262=B262)*(D$14:D262=D262))>1,0,1)","v":1},"Contratos de prestación de servicios","Licitación pública",{"$f":"IF(ISBLANK(G262),1,IFERROR(VLOOKUP(G262,Tipo!$C$12:$C$27,1,FALSE),\"NO\"))","v":"NO"},"Inversión",{"$f":"IF(ISBLANK(K262),1,IFERROR(VLOOKUP(K262,Eje_Pilar_Prop!$C$3:$C$104,1,FALSE),\"NO\"))","v":45},"SECOP II",1,"Bogotá Mejor para Todos"]
["FDLCH-CPS-257-2020",2020,"SECOP II","SAMC-011-2020","Contratos de prestación de servicios","Selección abreviada","Selección abreviada por menor cuantía ","IMPLEMENTAR ACCIONES DE ASISTENCIA TÉCNICA AGROPECUARIA MEDIANTE PRÁCTICAS SOSTENIBLES Y EMPRENDIMIENTO RURAL EN LA VEREDA EL VERJÓN BAJO DE CHAPINERO, CON UN ENFOQUE DIFERENCIAL Y DE DERECHOS","Inversión","Bogotá Mejor para Todos",41,{"$f":"IF(ISERROR(VLOOKUP(K263,Eje_Pilar_Prop!$C$2:$E$104,2,FALSE)),\" \",VLOOKUP(K263,Eje_Pilar_Prop!$C$2:$E$104,2,FALSE))","v":"Desarrollo rural sostenible"},{"$f":"IF(ISERROR(VLOOKUP(K263,Eje_Pilar_Prop!$C$2:$E$104,3,FALSE)),\" \",VLOOKUP(K263,Eje_Pilar_Prop!$C$2:$E$104,3,FALSE))","v":"Eje Transversal 3 Sostenibilidad Ambiental basada en la eficiencia energética"},1303,900099414,"Union temporal desarrollo rural",145681540,0,0,0,0,145681540,0,"2020-12-29","2021-03-03","2021-08-02",150,0,0,null,null,null,null,null,"X",null,null,0,null,null,{"$f":"IF(SUMPRODUCT((A$14:A263=A263)*(B$14:B263=B263)*(D$14:D263=D263))>1,0,1)","v":1},"Contratos de prestación de servicios","Selección abreviada",{"$f":"IF(ISBLANK(G263),1,IFERROR(VLOOKUP(G263,Tipo!$C$12:$C$27,1,FALSE),\"NO\"))","v":"Selección abreviada por menor cuantía "},"Inversión",{"$f":"IF(ISBLANK(K263),1,IFERROR(VLOOKUP(K263,Eje_Pilar_Prop!$C$3:$C$104,1,FALSE),\"NO\"))","v":41},"SECOP II",1,"Bogotá Mejor para Todos"]
["FDLCH-CPS-258-2020",2020,"SECOP II","SAMC-013-2020","Contratos de prestación de servicios","Selección abreviada","Selección abreviada por menor cuantía ","Realizar el mantenimiento preventivo y correctivo de equipos de cómputo, escáner, impresoras, dispositivos de red e infraestructura tecnológica de propiedad del Fondo de Desarrollo local de Chapinero y puesta en funcionamiento de una UPS","Funcionamiento","Bogotá Mejor para Todos",null,{"$f":"IF(ISERROR(VLOOKUP(K264,Eje_Pilar_Prop!$C$2:$E$104,2,FALSE)),\" \",VLOOKUP(K264,Eje_Pilar_Prop!$C$2:$E$104,2,FALSE))","v":" "},{"$f":"IF(ISERROR(VLOOKUP(K264,Eje_Pilar_Prop!$C$2:$E$104,3,FALSE)),\" \",VLOOKUP(K264,Eje_Pilar_Prop!$C$2:$E$104,3,FALSE))","v":" "},131020202030603,901040640,"IIS TECHNOLOGY SOLUTIONS SAS",60767810,0,0,0,0,60767810,0,"2020-12-29",null,null,180,0,0,null,null,null,null,"X",null,null,null,0,null,null,{"$f":"IF(SUMPRODUCT((A$14:A264=A264)*(B$14:B264=B264)*(D$14:D264=D264))>1,0,1)","v":1},"Contratos de prestación de servicios","Selección abreviada",{"$f":"IF(ISBLANK(G264),1,IFERROR(VLOOKUP(G264,Tipo!$C$12:$C$27,1,FALSE),\"NO\"))","v":"Selección abreviada por menor cuantía "},"Funcionamiento",{"$f":"IF(ISBLANK(K264),1,IFERROR(VLOOKUP(K264,Eje_Pilar_Prop!$C$3:$C$104,1,FALSE),\"NO\"))","v":1},"SECOP II",1,"Bogotá Mejor para Todos"]
["FDLCH-CPS-259-2020",2020,"SECOP II","SAMC-008-2020","Contratos de prestación de servicios","Selección abreviada","Selección abreviada por menor cuantía "," REALIZAR EL MANTENIMIENTO PREVENTIVO Y CORRECTIVO, ASÍ COMO LAS REPARACIONES LOCATIVAS Y ACTIVIDADES EMERGENTES NECESARIAS, A LAS INSTALACIONES A CARGO DE LA ALCALDÍA LOCAL DE CHAPINERO","Funcionamiento","Bogotá Mejor para Todos",null,{"$f":"IF(ISERROR(VLOOKUP(K265,Eje_Pilar_Prop!$C$2:$E$104,2,FALSE)),\" \",VLOOKUP(K265,Eje_Pilar_Prop!$C$2:$E$104,2,FALSE))","v":" "},{"$f":"IF(ISERROR(VLOOKUP(K265,Eje_Pilar_Prop!$C$2:$E$104,3,FALSE)),\" \",VLOOKUP(K265,Eje_Pilar_Prop!$C$2:$E$104,3,FALSE))","v":" "},131020202030612,830005282,"BB INGENIEROS SAS",125746639,0,0,0,0,125746639,0,"2020-12-29",null,null,360,0,0,null,null,null,null,"X",null,null,null,0,null,null,{"$f":"IF(SUMPRODUCT((A$14:A265=A265)*(B$14:B265=B265)*(D$14:D265=D265))>1,0,1)","v":1},"Contratos de prestación de servicios","Selección abreviada",{"$f":"IF(ISBLANK(G265),1,IFERROR(VLOOKUP(G265,Tipo!$C$12:$C$27,1,FALSE),\"NO\"))","v":"Selección abreviada por menor cuantía "},"Funcionamiento",{"$f":"IF(ISBLANK(K265),1,IFERROR(VLOOKUP(K265,Eje_Pilar_Prop!$C$3:$C$104,1,FALSE),\"NO\"))","v":1},"SECOP II",1,"Bogotá Mejor para Todos"]
["FDLCH-CPS-260-2020",2020,"SECOP II","SAMC-012-2020","Contratos de prestación de servicios","Selección abreviada","Selección abreviada por menor cuantía "," REALIZAR EL MANTENIMIENTO, LA INSTALACIÓN, REUBICACIÓN Y RECERTIFICACIÓN DEL CABLEADO ESTRUCTURADO, EN LA ALCALDÍA LOCAL, JUNTA ADMINISTRADORA LOCAL E INSPECCIONES DE POLICÍA DE CHAPINERO","Funcionamiento","Bogotá Mejor para Todos",null,{"$f":"IF(ISERROR(VLOOKUP(K266,Eje_Pilar_Prop!$C$2:$E$104,2,FALSE)),\" \",VLOOKUP(K266,Eje_Pilar_Prop!$C$2:$E$104,2,FALSE))","v":" "},{"$f":"IF(ISERROR(VLOOKUP(K266,Eje_Pilar_Prop!$C$2:$E$104,3,FALSE)),\" \",VLOOKUP(K266,Eje_Pilar_Prop!$C$2:$E$104,3,FALSE))","v":" "},1310202010302,901040640,"IIS TECHNOLOGY SOLUTIONS SAS",147095729,0,0,0,0,147095729,0,"2020-12-29",null,null,90,0,0,null,null,null,null,"X",null,null,null,0,null,null,{"$f":"IF(SUMPRODUCT((A$14:A266=A266)*(B$14:B266=B266)*(D$14:D266=D266))>1,0,1)","v":1},"Contratos de prestación de servicios","Selección abreviada",{"$f":"IF(ISBLANK(G266),1,IFERROR(VLOOKUP(G266,Tipo!$C$12:$C$27,1,FALSE),\"NO\"))","v":"Selección abreviada por menor cuantía "},"Funcionamiento",{"$f":"IF(ISBLANK(K266),1,IFERROR(VLOOKUP(K266,Eje_Pilar_Prop!$C$3:$C$104,1,FALSE),\"NO\"))","v":1},"SECOP II",1,"Bogotá Mejor para Todos"]
["FDLCH-CPS-261-2020",2020,"SECOP II","PMINC-012-2020","Compraventa de bienes muebles","Contratación mínima cuantia","No aplica"," Realizar el mantenimiento preventivo y correctivo del sistema telefónico, incluida bolsa de repuestos, del Fondo de Desarrollo Local de Chapinero, Junta Administradora Local e Inspecciones de Policía.","Funcionamiento","Bogotá Mejor para Todos",null,{"$f":"IF(ISERROR(VLOOKUP(K267,Eje_Pilar_Prop!$C$2:$E$104,2,FALSE)),\" \",VLOOKUP(K267,Eje_Pilar_Prop!$C$2:$E$104,2,FALSE))","v":" "},{"$f":"IF(ISERROR(VLOOKUP(K267,Eje_Pilar_Prop!$C$2:$E$104,3,FALSE)),\" \",VLOOKUP(K267,Eje_Pilar_Prop!$C$2:$E$104,3,FALSE))","v":" "},131020202030608,90101271,"GAMA.COMPAÑIA.S.A.S",4875000,0,0,0,0,4875000,0,"2020-12-29",null,null,150,0,0,null,null,null,null,"X",null,null,null,0,null,null,{"$f":"IF(SUMPRODUCT((A$14:A267=A267)*(B$14:B267=B267)*(D$14:D267=D267))>1,0,1)","v":1},"Compraventa de bienes muebles","Contratación mínima cuantia",{"$f":"IF(ISBLANK(G267),1,IFERROR(VLOOKUP(G267,Tipo!$C$12:$C$27,1,FALSE),\"NO\"))","v":"NO"},"Funcionamiento",{"$f":"IF(ISBLANK(K267),1,IFERROR(VLOOKUP(K267,Eje_Pilar_Prop!$C$3:$C$104,1,FALSE),\"NO\"))","v":1},"SECOP II",1,"Bogotá Mejor para Todos"]
["FDLCH-CPS-262-2020",2020,"SECOP II","OC-262-2020 \n63001","Compraventa de bienes muebles","Selección abreviada","Acuerdo marco de precios ","ADQUISICIÓN DE VEHICULOS PARA EL FONDO DE DESARROLLO LOCAL DE CHAPINEROEN VIRTUD DEL ACUERDO MARCO DE PRECIOS ACUERDO MARCO MOTOCICLETAS YMOTOCARROS II \"CCE-971-AMP-2019\" Y PARA LA ADQUISICIÓN DE VEHÍCULOS,VEHICULOS ELÉCTRICOS Y VEHÍCULOS HÍBRIDOS PARA TRANSPORTE TERRESTRECCE-163-III-AMP-2020, PARA FORTALECER LAS ACCIONES DE SEGURIDAD EN LASLOCALIDADES DE BOGOTA DISTRITO CAPITAL. ORDEN DE COMPRA 63001.","Inversión","Bogotá Mejor para Todos",19,{"$f":"IF(ISERROR(VLOOKUP(K268,Eje_Pilar_Prop!$C$2:$E$104,2,FALSE)),\" \",VLOOKUP(K268,Eje_Pilar_Prop!$C$2:$E$104,2,FALSE))","v":"Seguridad y convivencia para todos"},{"$f":"IF(ISERROR(VLOOKUP(K268,Eje_Pilar_Prop!$C$2:$E$104,3,FALSE)),\" \",VLOOKUP(K268,Eje_Pilar_Prop!$C$2:$E$104,3,FALSE))","v":"Pilar 3 Construcción de Comunidad y Cultura Ciudadana"},1302,890301886,"FABRICA NACIONAL DE AUTOPARTES S.A. FANALCA SA",203822197,0,0,0,0,203822197,0,"2020-12-29","2021-01-21","2021-04-20",90,0,0,null,null,null,null,null,"X",null,null,0,null,null,{"$f":"IF(SUMPRODUCT((A$14:A268=A268)*(B$14:B268=B268)*(D$14:D268=D268))>1,0,1)","v":1},"Compraventa de bienes muebles","Selección abreviada",{"$f":"IF(ISBLANK(G268),1,IFERROR(VLOOKUP(G268,Tipo!$C$12:$C$27,1,FALSE),\"NO\"))","v":"Acuerdo marco de precios "},"Inversión",{"$f":"IF(ISBLANK(K268),1,IFERROR(VLOOKUP(K268,Eje_Pilar_Prop!$C$3:$C$104,1,FALSE),\"NO\"))","v":19},"SECOP II",1,"Bogotá Mejor para Todos"]
["FDLCH-CPS-263-2020",2020,"SECOP II","SASI-001-2020","Contratos de prestación de servicios","Selección abreviada","Subasta inversa ","REALIZAR LA COMPRAVENTA DE COMPUTADORES PARA DOTAR LOS COLEGIOSDISTRITALES DE LA LOCALIDAD DE CHAPINERO.","Inversión","Bogotá Mejor para Todos",7,{"$f":"IF(ISERROR(VLOOKUP(K269,Eje_Pilar_Prop!$C$2:$E$104,2,FALSE)),\" \",VLOOKUP(K269,Eje_Pilar_Prop!$C$2:$E$104,2,FALSE))","v":"Inclusión educativa para la equidad"},{"$f":"IF(ISERROR(VLOOKUP(K269,Eje_Pilar_Prop!$C$2:$E$104,3,FALSE)),\" \",VLOOKUP(K269,Eje_Pilar_Prop!$C$2:$E$104,3,FALSE))","v":"Pilar 1 Igualdad de Calidad de Vida"},1297,900171311,"TECHNOLOGY WORLD GROUP SAS",64900000,0,0,0,0,64900000,0,"2020-12-29",null,null,120,0,0,null,null,null,null,"X",null,null,null,0,null,null,{"$f":"IF(SUMPRODUCT((A$14:A269=A269)*(B$14:B269=B269)*(D$14:D269=D269))>1,0,1)","v":1},"Contratos de prestación de servicios","Selección abreviada",{"$f":"IF(ISBLANK(G269),1,IFERROR(VLOOKUP(G269,Tipo!$C$12:$C$27,1,FALSE),\"NO\"))","v":"Subasta inversa "},"Inversión",{"$f":"IF(ISBLANK(K269),1,IFERROR(VLOOKUP(K269,Eje_Pilar_Prop!$C$3:$C$104,1,FALSE),\"NO\"))","v":7},"SECOP II",1,"Bogotá Mejor para Todos"]
["FDLCH-CPS-264-2020",2020,"SECOP II","PMINC-013-2020","Compraventa de bienes muebles","Selección abreviada","No aplica"," Prestar el servicio y suministro de material impreso para el fortalecimiento de los procesos de divulgación y promoción que se generen de acuerdo a las necesidades en la Alcaldía Local de Chapinero","Funcionamiento","Bogotá Mejor para Todos",null,{"$f":"IF(ISERROR(VLOOKUP(K270,Eje_Pilar_Prop!$C$2:$E$104,2,FALSE)),\" \",VLOOKUP(K270,Eje_Pilar_Prop!$C$2:$E$104,2,FALSE))","v":" "},{"$f":"IF(ISERROR(VLOOKUP(K270,Eje_Pilar_Prop!$C$2:$E$104,3,FALSE)),\" \",VLOOKUP(K270,Eje_Pilar_Prop!$C$2:$E$104,3,FALSE))","v":" "},1310202010202,900975944,"FEC SUMINISTROS Y SERVICIOS SAS",7300000,0,0,0,0,7300000,0,"2020-12-29",null,null,150,0,0,null,null,null,null,"X",null,null,null,0,null,null,{"$f":"IF(SUMPRODUCT((A$14:A270=A270)*(B$14:B270=B270)*(D$14:D270=D270))>1,0,1)","v":1},"Compraventa de bienes muebles","Selección abreviada",{"$f":"IF(ISBLANK(G270),1,IFERROR(VLOOKUP(G270,Tipo!$C$12:$C$27,1,FALSE),\"NO\"))","v":"NO"},"Funcionamiento",{"$f":"IF(ISBLANK(K270),1,IFERROR(VLOOKUP(K270,Eje_Pilar_Prop!$C$3:$C$104,1,FALSE),\"NO\"))","v":1},"SECOP II",1,"Bogotá Mejor para Todos"]
["FDLCH-CPS-265-2020",2020,"SECOP II","PMINC -Grandes Superficies-OC \n63084","Compraventa de bienes muebles","Selección abreviada","No aplica","ADQUIRIR TODOS LOS INSUMOS DE PAPELERIA Y ELEMENTOS DE OFICINA,NECESARIOS PARA SUPLIR LAS NECESIDADES DEL FONDO DE DESARROLLO LOCAL DECHAPINERO, JUNTA ADMINISTRADORA LOCAL E INSPECCIONES DE POLICIA. ORDENDE COMPRA 63084","Funcionamiento","Bogotá Mejor para Todos",null,{"$f":"IF(ISERROR(VLOOKUP(K271,Eje_Pilar_Prop!$C$2:$E$104,2,FALSE)),\" \",VLOOKUP(K271,Eje_Pilar_Prop!$C$2:$E$104,2,FALSE))","v":" "},{"$f":"IF(ISERROR(VLOOKUP(K271,Eje_Pilar_Prop!$C$2:$E$104,3,FALSE)),\" \",VLOOKUP(K271,Eje_Pilar_Prop!$C$2:$E$104,3,FALSE))","v":" "},1310202010202,900059238,"MAKRO MAYORISTAS SAS",6525000,0,0,0,0,6525000,0,"2020-12-29",null,null,30,0,0,null,null,null,null,"X",null,null,null,0,null,null,{"$f":"IF(SUMPRODUCT((A$14:A271=A271)*(B$14:B271=B271)*(D$14:D271=D271))>1,0,1)","v":1},"Compraventa de bienes muebles","Selección abreviada",{"$f":"IF(ISBLANK(G271),1,IFERROR(VLOOKUP(G271,Tipo!$C$12:$C$27,1,FALSE),\"NO\"))","v":"NO"},"Funcionamiento",{"$f":"IF(ISBLANK(K271),1,IFERROR(VLOOKUP(K271,Eje_Pilar_Prop!$C$3:$C$104,1,FALSE),\"NO\"))","v":1},"SECOP II",1,"Bogotá Mejor para Todos"]
["FDLCH-CPS-266-2020",2020,"SECOP II","PMINC -Grandes Superficies-OC \n63083","Compraventa de bienes muebles","Selección abreviada","No aplica","ADQUIRIR TODOS LOS INSUMOS DE PAPELERIA Y ELEMENTOS DE OFICINA,NECESARIOS PARA SUPLIR LAS NECESIDADES DEL FONDO DE DESARROLLO LOCAL DECHAPINERO, JUNTA ADMINISTRADORA LOCAL E INSPECCIONES DE POLICIA.ORDEN DECOMPRA 63083","Funcionamiento","Bogotá Mejor para Todos",null,{"$f":"IF(ISERROR(VLOOKUP(K272,Eje_Pilar_Prop!$C$2:$E$104,2,FALSE)),\" \",VLOOKUP(K272,Eje_Pilar_Prop!$C$2:$E$104,2,FALSE))","v":" "},{"$f":"IF(ISERROR(VLOOKUP(K272,Eje_Pilar_Prop!$C$2:$E$104,3,FALSE)),\" \",VLOOKUP(K272,Eje_Pilar_Prop!$C$2:$E$104,3,FALSE))","v":" "},1310202010202,900155107,"CENCOSUD COLOMBIA S.A.",287000,0,0,0,0,287000,0,"2020-12-29",null,null,30,0,0,null,null,null,null,"X",null,null,null,0,null,null,{"$f":"IF(SUMPRODUCT((A$14:A272=A272)*(B$14:B272=B272)*(D$14:D272=D272))>1,0,1)","v":1},"Compraventa de bienes muebles","Selección abreviada",{"$f":"IF(ISBLANK(G272),1,IFERROR(VLOOKUP(G272,Tipo!$C$12:$C$27,1,FALSE),\"NO\"))","v":"NO"},"Funcionamiento",{"$f":"IF(ISBLANK(K272),1,IFERROR(VLOOKUP(K272,Eje_Pilar_Prop!$C$3:$C$104,1,FALSE),\"NO\"))","v":1},"SECOP II",1,"Bogotá Mejor para Todos"]
["FDLCH-CPS-267-2020",2020,"SECOP II","PMINC -Grandes Superficies-OC \n63082","Compraventa de bienes muebles","Selección abreviada","No aplica","ADQUIRIR TODOS LOS INSUMOS DE PAPELERIA Y ELEMENTOS DE OFICINA,NECESARIOS PARA SUPLIR LAS NECESIDADES DEL FONDO DE DESARROLLO LOCAL DECHAPINERO, JUNTA ADMINISTRADORA LOCAL E INSPECCIONES DE POLICIA. ORDENDE COMPRA 63082","Funcionamiento","Bogotá Mejor para Todos",null,{"$f":"IF(ISERROR(VLOOKUP(K273,Eje_Pilar_Prop!$C$2:$E$104,2,FALSE)),\" \",VLOOKUP(K273,Eje_Pilar_Prop!$C$2:$E$104,2,FALSE))","v":" "},{"$f":"IF(ISERROR(VLOOKUP(K273,Eje_Pilar_Prop!$C$2:$E$104,3,FALSE)),\" \",VLOOKUP(K273,Eje_Pilar_Prop!$C$2:$E$104,3,FALSE))","v":" "},1310202010202,800237412,"FERRICENTROS S.A.S.",374850,0,0,0,0,{"$f":"+Q273+S273+U273","v":374850},0,"2020-12-29","2021-01-14","2021-02-13",30,0,0,null,null,null,null,null,"X",null,null,{"$f":"IF(ISERROR(W273/V273),\"-\",(W273/V273))","v":0},null,null,{"$f":"IF(SUMPRODUCT((A$14:A273=A273)*(B$14:B273=B273)*(D$14:D273=D273))>1,0,1)","v":1},"Compraventa de bienes muebles",{"$f":"IF(ISBLANK(F273),1,IFERROR(VLOOKUP(F273,modal,1,FALSE),\"NO\"))","v":"Selección abreviada"},{"$f":"IF(ISBLANK(G273),1,IFERROR(VLOOKUP(G273,Tipo!$C$12:$C$27,1,FALSE),\"NO\"))","v":"NO"},{"$f":"IF(ISBLANK(I273),1,IFERROR(VLOOKUP(I273,afectacion,1,FALSE),\"NO\"))","v":"Funcionamiento"},{"$f":"IF(ISBLANK(K273),1,IFERROR(VLOOKUP(K273,Eje_Pilar_Prop!$C$3:$C$104,1,FALSE),\"NO\"))","v":1},{"$f":"IF(ISBLANK(C273),1,IFERROR(VLOOKUP(C273,SECOP,1,FALSE),\"NO\"))","v":"SECOP II"},1,{"$f":"IF(ISBLANK(J273),1,IFERROR(VLOOKUP(J273,pdd,1,FALSE),\"NO\"))","v":"Bogotá Mejor para Todos"}]
["FDLCH-CPS-268-2020",2020,"SECOP II","SAMC-AMP \n63086","Compraventa de bienes muebles","Selección abreviada","No aplica","ADQUIRIR TODOS LOS INSUMOS DE PAPELERIA Y ELEMENTOS DE OFICINA,NECESARIOS PARA SUPLIR LAS NECESIDADES DEL FONDO DE DESARROLLO LOCAL DECHAPINERO, JUNTA ADMINISTRADORA LOCAL E INSPECCIONES DE POLICIA. ORDENDE COMPRA 63086","Funcionamiento","Bogotá Mejor para Todos",null,{"$f":"IF(ISERROR(VLOOKUP(K274,Eje_Pilar_Prop!$C$2:$E$104,2,FALSE)),\" \",VLOOKUP(K274,Eje_Pilar_Prop!$C$2:$E$104,2,FALSE))","v":" "},{"$f":"IF(ISERROR(VLOOKUP(K274,Eje_Pilar_Prop!$C$2:$E$104,3,FALSE)),\" \",VLOOKUP(K274,Eje_Pilar_Prop!$C$2:$E$104,3,FALSE))","v":" "},1310202010202,830037946,"PANAMERICANA LIBRERÍA Y PAPELERÍA S.A.",4788072,0,0,0,0,4788072,0,"2020-12-29","2021-01-14","2021-02-13",30,0,0,null,null,null,null,null,"X",null,null,0,null,null,{"$f":"IF(SUMPRODUCT((A$14:A274=A274)*(B$14:B274=B274)*(D$14:D274=D274))>1,0,1)","v":1},"Compraventa de bienes muebles","Selección abreviada",{"$f":"IF(ISBLANK(G274),1,IFERROR(VLOOKUP(G274,Tipo!$C$12:$C$27,1,FALSE),\"NO\"))","v":"NO"},"Funcionamiento",{"$f":"IF(ISBLANK(K274),1,IFERROR(VLOOKUP(K274,Eje_Pilar_Prop!$C$3:$C$104,1,FALSE),\"NO\"))","v":1},"SECOP II",1,"Bogotá Mejor para Todos"]
["FDLCH-CPS-269-2020",2020,"SECOP II","SAMC-AMP \n63116","Compraventa de bienes muebles","Selección abreviada","Acuerdo marco de precios ","ADQUIRIR COMPUTADORES DE ESCRITORIO, PORTATILES Y ESCANER PARA EL FONDODE DESARROLLO LOCAL DE CHAPINERO. ORDEN DE COMPRA 63116.","Funcionamiento","Bogotá Mejor para Todos",null,{"$f":"IF(ISERROR(VLOOKUP(K275,Eje_Pilar_Prop!$C$2:$E$104,2,FALSE)),\" \",VLOOKUP(K275,Eje_Pilar_Prop!$C$2:$E$104,2,FALSE))","v":" "},{"$f":"IF(ISERROR(VLOOKUP(K275,Eje_Pilar_Prop!$C$2:$E$104,3,FALSE)),\" \",VLOOKUP(K275,Eje_Pilar_Prop!$C$2:$E$104,3,FALSE))","v":" "},1310201010102,900564459,"GRUPO EMPRESARIAL CREAR DE COLOMBIA S A S",2975259,0,0,0,0,2975259,0,"2020-12-29","2021-01-14","2021-02-13",30,0,0,null,null,null,null,null,"X",null,null,0,null,null,{"$f":"IF(SUMPRODUCT((A$14:A275=A275)*(B$14:B275=B275)*(D$14:D275=D275))>1,0,1)","v":1},"Compraventa de bienes muebles","Selección abreviada",{"$f":"IF(ISBLANK(G275),1,IFERROR(VLOOKUP(G275,Tipo!$C$12:$C$27,1,FALSE),\"NO\"))","v":"Acuerdo marco de precios "},"Funcionamiento",{"$f":"IF(ISBLANK(K275),1,IFERROR(VLOOKUP(K275,Eje_Pilar_Prop!$C$3:$C$104,1,FALSE),\"NO\"))","v":1},"SECOP II",1,"Bogotá Mejor para Todos"]
["FDLCH-CPS-270-2020",2020,"SECOP II","SAMC-AMP \n63115","Compraventa de bienes muebles","Selección abreviada","Acuerdo marco de precios ","ADQUIRIR COMPUTADORES DE ESCRITORIO, PORTATILES Y ESCANER PARA EL FONDODE DESARROLLO LOCAL DE CHAPINERO. ORDEN DE COMPRA 63117.","Funcionamiento","Bogotá Mejor para Todos",null,{"$f":"IF(ISERROR(VLOOKUP(K276,Eje_Pilar_Prop!$C$2:$E$104,2,FALSE)),\" \",VLOOKUP(K276,Eje_Pilar_Prop!$C$2:$E$104,2,FALSE))","v":" "},{"$f":"IF(ISERROR(VLOOKUP(K276,Eje_Pilar_Prop!$C$2:$E$104,3,FALSE)),\" \",VLOOKUP(K276,Eje_Pilar_Prop!$C$2:$E$104,3,FALSE))","v":" "},1310201010102,830001338,"SUMIMAS S A S",6971132,0,0,0,0,6971132,0,"2020-12-29",null,null,30,0,0,null,null,null,null,"X",null,null,null,0,null,null,{"$f":"IF(SUMPRODUCT((A$14:A276=A276)*(B$14:B276=B276)*(D$14:D276=D276))>1,0,1)","v":1},"Compraventa de bienes muebles","Selección abreviada",{"$f":"IF(ISBLANK(G276),1,IFERROR(VLOOKUP(G276,Tipo!$C$12:$C$27,1,FALSE),\"NO\"))","v":"Acuerdo marco de precios "},"Funcionamiento",{"$f":"IF(ISBLANK(K276),1,IFERROR(VLOOKUP(K276,Eje_Pilar_Prop!$C$3:$C$104,1,FALSE),\"NO\"))","v":1},"SECOP II",1,"Bogotá Mejor para Todos"]
["FDLCH-CPS-271-2020",2020,"SECOP II","OC-271-2020 \n63115","Compraventa de bienes muebles","Selección abreviada","Acuerdo marco de precios ","ADQUIRIR COMPUTADORES DE ESCRITORIO, PORTATILES Y ESCANER PARA EL FONDODE DESARROLLO LOCAL DE CHAPINERO. ORDEN DE COMPRA 63115.","Funcionamiento","Bogotá Mejor para Todos",null,{"$f":"IF(ISERROR(VLOOKUP(K277,Eje_Pilar_Prop!$C$2:$E$104,2,FALSE)),\" \",VLOOKUP(K277,Eje_Pilar_Prop!$C$2:$E$104,2,FALSE))","v":" "},{"$f":"IF(ISERROR(VLOOKUP(K277,Eje_Pilar_Prop!$C$2:$E$104,3,FALSE)),\" \",VLOOKUP(K277,Eje_Pilar_Prop!$C$2:$E$104,3,FALSE))","v":" "},1310201010102,830034195,"CASTOR DATA SAS",21380801,0,0,0,0,21380801,0,"2020-12-29","2021-01-14","2021-02-13",30,0,0,null,null,null,null,null,"X",null,null,0,null,null,{"$f":"IF(SUMPRODUCT((A$14:A277=A277)*(B$14:B277=B277)*(D$14:D277=D277))>1,0,1)","v":1},"Compraventa de bienes muebles","Selección abreviada",{"$f":"IF(ISBLANK(G277),1,IFERROR(VLOOKUP(G277,Tipo!$C$12:$C$27,1,FALSE),\"NO\"))","v":"Acuerdo marco de precios "},"Funcionamiento",{"$f":"IF(ISBLANK(K277),1,IFERROR(VLOOKUP(K277,Eje_Pilar_Prop!$C$3:$C$104,1,FALSE),\"NO\"))","v":1},"SECOP II",1,"Bogotá Mejor para Todos"]
["CIN-143-2018",2018,"SECOP II","FDLCH-CM-005-2018","Interventoría","Concurso de méritos","No aplica","ADICON Y PRORROGA  NÂ° 1 AL CONTRATO DE INTERVENTORIA NÂ° 143 DE 2018 INTERVENTORÃ\u008dA TÃ\u0089CNICA, ADMINISTRATIVA, LEGAL, FINANCIERA, SOCIAL, AMBIENTAL Y SISTEMA DE SEGURIDAD Y SALUD EN EL TRABAJO - SG-SST, DEL CONTRATO DE OBRA QUE SE DERIVE DE LA LICITACIÃ\u0093N PUBLICAO LA QUE HAGA SUS VECES, QUE REFIERE A Â¿CONTRATAR POR PRECIOS UNITARIOS FIJOS Y A MONTO AGOTABLE, SIN FORMULA DE REAJUSTE, LA CONSERVACION DE LA INFRAESTRUCTURA VIAL URBANA Y RURAL Y EL ESPACIO PÃ\u009aBLICO DE LA LOCALIDAD DE CHAPINERO, EN BOGOTÃ\u0081, D.C","Inversión","Bogotá Mejor para Todos",18,{"$f":"IF(ISERROR(VLOOKUP(K278,Eje_Pilar_Prop!$C$2:$E$104,2,FALSE)),\" \",VLOOKUP(K278,Eje_Pilar_Prop!$C$2:$E$104,2,FALSE))","v":"Mejor movilidad para todos"},{"$f":"IF(ISERROR(VLOOKUP(K278,Eje_Pilar_Prop!$C$2:$E$104,3,FALSE)),\" \",VLOOKUP(K278,Eje_Pilar_Prop!$C$2:$E$104,3,FALSE))","v":"Pilar 2 Democracía Urbana"},1301,901241521,"CONSORCIO M&A 05 ",0,0,0,3,651316441,651316784,0,"2020-12-10","2020-12-10","2021-02-26",0,2,235,null,null,null,null,null,"X",null,null,0,null,null,{"$f":"IF(SUMPRODUCT((A$14:A278=A278)*(B$14:B278=B278)*(D$14:D278=D278))>1,0,1)","v":1},"Interventoría","Concurso de méritos",{"$f":"IF(ISBLANK(G278),1,IFERROR(VLOOKUP(G278,Tipo!$C$12:$C$27,1,FALSE),\"NO\"))","v":"NO"},"Inversión",{"$f":"IF(ISBLANK(K278),1,IFERROR(VLOOKUP(K278,Eje_Pilar_Prop!$C$3:$C$104,1,FALSE),\"NO\"))","v":18},"SECOP II",1,"Bogotá Mejor para Todos"]
["FDLCH-CO-146-2018",2018,"SECOP II","FDLCH-LP-004-2018","Obra pública","Licitación pública","No aplica","ADICIÓN Y PRÓRROGA CONTRATO No 146 DE 2018 CUYO OBJETO ES: CONTRATAR PORPRECIOS UNITARIOS FIJOS, SIN FORMULA DE REAJUSTE, LA CONSTRUCCIÓN DE DOSPUENTES VEHICULARES LOCALIZADOS EN LA VEREDA EL VERJÓN SOBRE LA QUEBRADAEL CORAL Y EN EL BARRIO BOSQUE CALDERON SOBRE LA QUEBRADA LAS DELICIASEN LA LOCALIDAD DE CHAPINERO, EN BOGOTÁ D.C.","Inversión","Bogotá Mejor para Todos",18,{"$f":"IF(ISERROR(VLOOKUP(K279,Eje_Pilar_Prop!$C$2:$E$104,2,FALSE)),\" \",VLOOKUP(K279,Eje_Pilar_Prop!$C$2:$E$104,2,FALSE))","v":"Mejor movilidad para todos"},{"$f":"IF(ISERROR(VLOOKUP(K279,Eje_Pilar_Prop!$C$2:$E$104,3,FALSE)),\" \",VLOOKUP(K279,Eje_Pilar_Prop!$C$2:$E$104,3,FALSE))","v":"Pilar 2 Democracía Urbana"},1301,830079101,"MAVING S A S",0,0,0,2,190254008,{"$f":"+Q279+S279+U279","v":190254008},0,"2020-11-09","2020-11-09","2020-12-25",0,2,135,null,null,null,null,null,null,"X",null,0,null,null,{"$f":"IF(SUMPRODUCT((A$14:A295=A279)*(B$14:B295=B279)*(D$14:D295=D279))>1,0,1)","v":1},"Obra pública","Licitación pública",{"$f":"IF(ISBLANK(G279),1,IFERROR(VLOOKUP(G279,Tipo!$C$12:$C$27,1,FALSE),\"NO\"))","v":"NO"},"Inversión",{"$f":"IF(ISBLANK(K279),1,IFERROR(VLOOKUP(K279,Eje_Pilar_Prop!$C$3:$C$104,1,FALSE),\"NO\"))","v":18},"SECOP II",1,"Bogotá Mejor para Todos"]
["CIN-148-2018",2018,"SECOP II","FDLCH-CM-004-2018","Interventoría","Concurso de méritos","No aplica","ADICIÓN Y PRÓRROGA CONTRATO No 148 DE 2018 CUYO OBJETO ES: INTERVENTORÍATÉCNICA, ADMINISTRATIVA, LEGAL, FINANCIERA, SOCIAL, AMBIENTAL Y SISTEMADE SEGURIDAD Y SALUD EN EL TRABAJO - SG-SST, DE LA CONSTRUCCIÓN DE DOSPUENTES VEHICULARES LOCALIZADOS EN LA VEREDA EL VERJÓN SOBRE LA QUEBADAEL CORAL Y EN EL BARRIO BOSQUE CALDERON SOBRE LA QUEBRADA LAS DELICIASENLA LOCALIDAD DE CHAPINERO, EN BOGOTÁ D.C.","Inversión","Bogotá Mejor para Todos",18,{"$f":"IF(ISERROR(VLOOKUP(K280,Eje_Pilar_Prop!$C$2:$E$104,2,FALSE)),\" \",VLOOKUP(K280,Eje_Pilar_Prop!$C$2:$E$104,2,FALSE))","v":"Mejor movilidad para todos"},{"$f":"IF(ISERROR(VLOOKUP(K280,Eje_Pilar_Prop!$C$2:$E$104,3,FALSE)),\" \",VLOOKUP(K280,Eje_Pilar_Prop!$C$2:$E$104,3,FALSE))","v":"Pilar 2 Democracía Urbana"},1301,901241891,"CONSORCIO VIAL CHAPINERO",0,0,0,1,44800511,44800511,0,"2020-11-09","2020-11-09","2020-12-25",0,2,135,null,null,null,null,null,null,"X",null,0,null,null,{"$f":"IF(SUMPRODUCT((A$14:A280=A280)*(B$14:B280=B280)*(D$14:D280=D280))>1,0,1)","v":1},"Interventoría","Concurso de méritos",{"$f":"IF(ISBLANK(G280),1,IFERROR(VLOOKUP(G280,Tipo!$C$12:$C$27,1,FALSE),\"NO\"))","v":"NO"},"Inversión",{"$f":"IF(ISBLANK(K280),1,IFERROR(VLOOKUP(K280,Eje_Pilar_Prop!$C$3:$C$104,1,FALSE),\"NO\"))","v":18},"SECOP II",1,"Bogotá Mejor para Todos"]
["FDLCH-CA-090-2019",2019,"SECOP II","CA-090-2019","Arrendamiento de bienes inmuebles","Contratación directa","El arrendamiento o adquisición de inmuebles","ARRENDAMIENTO DEL INMUEBLE TIPO BODEGA UBICADO EN LA CALLE 74 B NÚM. 69 26 DE LA LOCALIDAD DE ENGATIVÁ, BODEGA QUE CUENTA CON UNA CAPACIDAD DE 250 M² DE ÁREA OPERATIVA, BUENA SEGURIDAD, CON PUERTA DE INGRESO AMPLIA, UBICADA EN CALLE ABIERTA, SIN HUMEDAD Y CON ILUMINACIÓN NATURAL Y ARTIFICIAL, CON EL PROPÓSITO DE GUARDAR LOS ELEMENTOS DECOMISADOS DURANTE LOS OPERATIVOS DE CONTROL DE ESPACIO PÚBLICO ADELANTADOS POR LA ALCALDÍA LOCAL DE CHAPINERO","Funcionamiento","Bogotá Mejor para Todos",null,null,{"$f":"IF(ISERROR(VLOOKUP(K281,Eje_Pilar_Prop!$C$2:$E$104,3,FALSE)),\" \",VLOOKUP(K281,Eje_Pilar_Prop!$C$2:$E$104,3,FALSE))","v":" "},131020202020201,20185010,"ANA GRACIELA GALAN DE ALVAREZ",0,0,0,2,20000000,20000000,20000000,"2020-04-03","2020-04-03","2020-07-05",0,2,150,null,null,null,null,null,null,"X",null,1,null,null,{"$f":"IF(SUMPRODUCT((A$14:A281=A281)*(B$14:B281=B281)*(D$14:D281=D281))>1,0,1)","v":1},"Arrendamiento de bienes inmuebles","Contratación directa",{"$f":"IF(ISBLANK(G281),1,IFERROR(VLOOKUP(G281,Tipo!$C$12:$C$27,1,FALSE),\"NO\"))","v":"El arrendamiento o adquisición de inmuebles"},"Funcionamiento",{"$f":"IF(ISBLANK(K281),1,IFERROR(VLOOKUP(K281,Eje_Pilar_Prop!$C$3:$C$104,1,FALSE),\"NO\"))","v":1},"SECOP II",1,"Bogotá Mejor para Todos"]
["FDLCH-CPS-093-2019",2019,"SECOP II","FDLCH – PMINC – 002-2019 (37009)","Contratos de prestación de servicios","Contratación mínima cuantia","No aplica","Adición contrato 093-2019, cuto objeto es: Prestación de servicios de fotocopiado y reproducción de documentos para la Alcaldía Local de Chapinero","Funcionamiento","Bogotá Mejor para Todos",null,null,{"$f":"IF(ISERROR(VLOOKUP(K282,Eje_Pilar_Prop!$C$2:$E$104,3,FALSE)),\" \",VLOOKUP(K282,Eje_Pilar_Prop!$C$2:$E$104,3,FALSE))","v":" "},13102020203050,900144990,"IMPORMAQUINAS OUTSOURCING S.A.S",0,0,0,1,4450098,4450098,0,"2020-02-03","2020-02-03","2020-05-21",0,1,60,null,null,null,null,null,null,"X",null,0]
["CPS 104-2019",2019,"SECOP II","FDLCH-LP-001-2019","Contratos de prestación de servicios","Licitación pública","No aplica","PRESTACIÓN DE LOS SERVICIOS DE VIGILANCIA Y SEGURIDAD PRIVADA INTEGRAL PERMANENTE EN LA MODALIDAD FIJA PARA LA PROTECCIÓN Y CUIDADO DE LOS FUNCIONARIOS, USUARIOS Y TODOS LOS BIENES MUEBLES E INMUEBLES DE PROPIEDAD O EN CUSTODIA DEL FONDO DE DESARROLLO LOCAL DE CHAPINERO Y DE TODOS AQUELLOS DE LOS QUE LLEGARE A ADQUIRIR","Funcionamiento","Bogotá Mejor para Todos",null,null,{"$f":"IF(ISERROR(VLOOKUP(K283,Eje_Pilar_Prop!$C$2:$E$104,3,FALSE)),\" \",VLOOKUP(K283,Eje_Pilar_Prop!$C$2:$E$104,3,FALSE))","v":" "},13102020203050,860072115,"MEGASEGURIDAD LA PROVEEDORA LTDA",0,1,-22956877,1,134832522,111875645,111875645,"2020-02-06","2020-02-06","2020-05-09",0,1,90,null,null,null,null,null,null,null,null,1,null,null,{"$f":"IF(SUMPRODUCT((A$14:A295=A283)*(B$14:B295=B283)*(D$14:D295=D283))>1,0,1)","v":1},{"$f":"IF(ISBLANK(E283),1,IFERROR(VLOOKUP(E283,tipo,1,FALSE),\"NO\"))","v":"Contratos de prestación de servicios"},{"$f":"IF(ISBLANK(F283),1,IFERROR(VLOOKUP(F283,modal,1,FALSE),\"NO\"))","v":"Licitación pública"},{"$f":"IF(ISBLANK(G283),1,IFERROR(VLOOKUP(G283,Tipo!$C$12:$C$27,1,FALSE),\"NO\"))","v":"NO"},{"$f":"IF(ISBLANK(I283),1,IFERROR(VLOOKUP(I283,afectacion,1,FALSE),\"NO\"))","v":"Funcionamiento"},{"$f":"IF(ISBLANK(K283),1,IFERROR(VLOOKUP(K283,Eje_Pilar_Prop!$C$3:$C$104,1,FALSE),\"NO\"))","v":1},{"$f":"IF(ISBLANK(C283),1,IFERROR(VLOOKUP(C283,SECOP,1,FALSE),\"NO\"))","v":"SECOP II"},{"$f":"IF(OR(YEAR(X283)=2020,ISBLANK(X283)),1,\"NO\")","v":1},{"$f":"IF(ISBLANK(J283),1,IFERROR(VLOOKUP(J283,pdd,1,FALSE),\"NO\"))","v":"Bogotá Mejor para Todos"}]
["FDLCH-CPS-115-2019",2019,"SECOP II","FDLCH-PMINC-005-2019","Contratos de prestación de servicios","Contratación mínima cuantia","No aplica","PRESTAR EL SERVICIO DE MANTENIMIENTO PREVENTIVO Y CORRECTIVO INCLUYENDO REPUESTOS DE LOS ASCENSORES ELÉCTRICOS DE LAS MARCAS MP&L Y OTIS DE LAS TORRES A Y B DE LA PLANTA FÍSICA DE LA ALCALDÍA LOCAL DE CHAPINERO Y CERTIFICACIÓN NTC 5926-1 2012","Funcionamiento","Bogotá Mejor para Todos",null,null,{"$f":"IF(ISERROR(VLOOKUP(K284,Eje_Pilar_Prop!$C$2:$E$104,3,FALSE)),\" \",VLOOKUP(K284,Eje_Pilar_Prop!$C$2:$E$104,3,FALSE))","v":" "},131020202030611,901147649,"INGYEMEL PROFESIONALES J&H S.A.S",0,0,0,1,1597031,1597031,1597031,"2020-02-05","2020-02-05","2020-04-09",0,1,60,null,null,null,null,null,null,"X",null,1,null,null,{"$f":"IF(SUMPRODUCT((A$14:A284=A284)*(B$14:B284=B284)*(D$14:D284=D284))>1,0,1)","v":1},"Contratos de prestación de servicios","Contratación mínima cuantia",{"$f":"IF(ISBLANK(G284),1,IFERROR(VLOOKUP(G284,Tipo!$C$12:$C$27,1,FALSE),\"NO\"))","v":"NO"},"Funcionamiento",{"$f":"IF(ISBLANK(K284),1,IFERROR(VLOOKUP(K284,Eje_Pilar_Prop!$C$3:$C$104,1,FALSE),\"NO\"))","v":1},"SECOP II",1,"Bogotá Mejor para Todos"]
["FDLCH-CPS-141-2019",2019,"SECOP II","FDLCH-PMINC-008-2019","Contratos de prestación de servicios","Contratación mínima cuantia","No aplica","PRESTACIÓN DE SERVICIOS DE MANTENIMIENTO PREVENTIVO, MANTENIMIENTO CORRECTIVO CON SUMINISTRO DE REPUESTOS PARA SISTEMA TELEFÓNICO DE PROPIEDAD DEL FONDO DE DESARROLLO LOCAL DE CHAPINERO","Funcionamiento","Bogotá Mejor para Todos",null,null,{"$f":"IF(ISERROR(VLOOKUP(K285,Eje_Pilar_Prop!$C$2:$E$104,3,FALSE)),\" \",VLOOKUP(K285,Eje_Pilar_Prop!$C$2:$E$104,3,FALSE))","v":" "},131020202030608,830079122,"COLOMBIANA DE TELEFONOS Y SISTEMAS LTDA",0,0,0,1,595050,595050,0,"2020-05-28","2020-05-28","2020-06-28",0,1,30,null,null,null,null,null,null,"X",null,0,null,null,{"$f":"IF(SUMPRODUCT((A$14:A285=A285)*(B$14:B285=B285)*(D$14:D285=D285))>1,0,1)","v":1},"Contratos de prestación de servicios","Contratación mínima cuantia",{"$f":"IF(ISBLANK(G285),1,IFERROR(VLOOKUP(G285,Tipo!$C$12:$C$27,1,FALSE),\"NO\"))","v":"NO"},"Funcionamiento",{"$f":"IF(ISBLANK(K285),1,IFERROR(VLOOKUP(K285,Eje_Pilar_Prop!$C$3:$C$104,1,FALSE),\"NO\"))","v":1},"SECOP II",1,"Bogotá Mejor para Todos"]
["FDLCH-CO-145-2019",2019,"SECOP II","FDLCH-LP-002-2019 ","Obra pública","Licitación pública","No aplica","ADICION Y PRORROGA NO 2 AL CONTRATO 145 DE 2019  EJECUTAR EL MONTO AGOTABLE POR PRECIOS UNITARIOS FIJOS SIN FORMULA DE REAJUSTE OBRAS Y ACTIVIDADES PARA LA CONSERVACION DE LA INFRAESTRUCTURA VIAL URBANA Y RURAL DE LA LOCALIDAD DE CHAPINERO EN BOGOTA D.C.","Inversión","Bogotá Mejor para Todos",18,{"$f":"IF(ISERROR(VLOOKUP(K286,Eje_Pilar_Prop!$C$2:$E$104,2,FALSE)),\" \",VLOOKUP(K286,Eje_Pilar_Prop!$C$2:$E$104,2,FALSE))","v":"Mejor movilidad para todos"},{"$f":"IF(ISERROR(VLOOKUP(K286,Eje_Pilar_Prop!$C$2:$E$104,3,FALSE)),\" \",VLOOKUP(K286,Eje_Pilar_Prop!$C$2:$E$104,3,FALSE))","v":"Pilar 2 Democracía Urbana"},1301,890111275,"DONADO ARCE & COMPAÑIA S.A.S.",0,0,0,1,1069502673,1069502673,0,"2020-12-16","2020-12-16","2021-01-07",0,3,132,null,null,null,null,null,"X",null,null,0,null,null,{"$f":"IF(SUMPRODUCT((A$14:A286=A286)*(B$14:B286=B286)*(D$14:D286=D286))>1,0,1)","v":1},"Obra pública","Licitación pública",{"$f":"IF(ISBLANK(G286),1,IFERROR(VLOOKUP(G286,Tipo!$C$12:$C$27,1,FALSE),\"NO\"))","v":"NO"},"Inversión",{"$f":"IF(ISBLANK(K286),1,IFERROR(VLOOKUP(K286,Eje_Pilar_Prop!$C$3:$C$104,1,FALSE),\"NO\"))","v":18},"SECOP II",1,"Bogotá Mejor para Todos"]
["FDLCH-CIN-146-2019",2019,"SECOP II","FDLCH-CM-001-2019","Interventoría","Concurso de méritos","No aplica","ADICION Y PRORROGA AL CONTRATO 146 DE 2019  INTERVENTORIA TÃ\u0089CNICA, ADMINISTRATIVA, LEGAL, FINANCIERA, SOCIAL, AMBIENTAL Y SISTEMA DE SEGURIDAD Y SALUD EN EL TRABAJO  - SG-SST, DEL CONTRATO DE OBRA QUE SE DERIVE DE LA LICITACIÃ\u0093N PÃ\u009aBLICA O LA QUE HAGA SUS VECES QUE REFIERE A  EJECUTAR MONTO AGOTABLE POR PRECIOS UNITARIOS FIJOS SIN FORMULA DE REAJUSTE, OBRAS Y ACTIVIDADES PARA LA CONSERVACIONDE LA INFRAESTRUCTURA VIAL URBANA Y RURAL DE LA LOCALIDAD DE CHAPINERO, EN BOGOTA, D.C.","Inversión","Bogotá Mejor para Todos",18,{"$f":"IF(ISERROR(VLOOKUP(K287,Eje_Pilar_Prop!$C$2:$E$104,2,FALSE)),\" \",VLOOKUP(K287,Eje_Pilar_Prop!$C$2:$E$104,2,FALSE))","v":"Mejor movilidad para todos"},{"$f":"IF(ISERROR(VLOOKUP(K287,Eje_Pilar_Prop!$C$2:$E$104,3,FALSE)),\" \",VLOOKUP(K287,Eje_Pilar_Prop!$C$2:$E$104,3,FALSE))","v":"Pilar 2 Democracía Urbana"},1301,901329000,"CONSORCIO BOGOTA  ",0,0,0,1,234272459,234272459,20953738,"2020-12-16","2020-12-16","2021-01-07",0,3,132,null,null,null,null,null,"X",null,null,8.9441746970351302E-2,null,null,{"$f":"IF(SUMPRODUCT((A$14:A287=A287)*(B$14:B287=B287)*(D$14:D287=D287))>1,0,1)","v":1},"Interventoría","Concurso de méritos",{"$f":"IF(ISBLANK(G287),1,IFERROR(VLOOKUP(G287,Tipo!$C$12:$C$27,1,FALSE),\"NO\"))","v":"NO"},"Inversión",{"$f":"IF(ISBLANK(K287),1,IFERROR(VLOOKUP(K287,Eje_Pilar_Prop!$C$3:$C$104,1,FALSE),\"NO\"))","v":18},"SECOP II",1,"Bogotá Mejor para Todos"]
["FDLCH-CPS-148-2019",2019,"SECOP II","FDLCH-PMINC-005-2019","Contratos de prestación de servicios","Contratación mínima cuantia","No aplica","ADICIÃ\u0093NAR CONTRATO FDLCH-CPS-148-2019 PRESTACIÃ\u0093N DE SERVICIOS PARA LA VINCULACIÃ\u0093N DE DIFERENTES ACTORES LOCALES A LOS PROCESOS DE PARTICIPACIÃ\u0093N CIUDADANA, EL FORTALECIMIENTO DE LA ORGANIZACIONES SOCIALES Y COMUNALES LOCALES, Y EL APOYO LOGÃ\u008dSTICO DE LA ESCUELA A DE FORMACIÃ\u0093N ARTÃ\u008dSTICA CON PERFIL SINFÃ\u0093NICO EN EL MARCO DE LOS PROCESOS DE GOBERNABILIDAD Y GOBERNANZA EN LA LOCALIDAD, TENIENDO EN CUENTA UNA PERSPECTIVA DIFERENCIAL , POBLACIONAL Y DE GÃ\u0089NERO EN EL MARCO DE LOS PROYECTOS 1305 EN CHAPINERO PARTICIPAMOS TODOS Y 1298 CULTURA Y DEPORTE: TRANSFORMANDO VIDAS Y HACIENDO CIUDADANOS FELICES. LP-004-2019","Inversión","Bogotá Mejor para Todos",45,{"$f":"IF(ISERROR(VLOOKUP(K288,Eje_Pilar_Prop!$C$2:$E$104,2,FALSE)),\" \",VLOOKUP(K288,Eje_Pilar_Prop!$C$2:$E$104,2,FALSE))","v":"Gobernanza e influencia local, regional e internacional"},{"$f":"IF(ISERROR(VLOOKUP(K288,Eje_Pilar_Prop!$C$2:$E$104,3,FALSE)),\" \",VLOOKUP(K288,Eje_Pilar_Prop!$C$2:$E$104,3,FALSE))","v":"Eje Transversal 4 Gobierno Legitimo, Fortalecimiento Local y Eficiencia"},1305,900094963,"FUNDACION PARA EL DESARROLLO INFANTIL SOCIAL Y CULTURAL IWOKE",0,0,0,1,47758385,47758385,0,"2020-09-11","2020-09-11","2020-11-26",0,1,75,null,null,null,null,null,null,"X",null,0,null,null,{"$f":"IF(SUMPRODUCT((A$14:A295=A288)*(B$14:B295=B288)*(D$14:D295=D288))>1,0,1)","v":1},"Contratos de prestación de servicios","Contratación mínima cuantia",{"$f":"IF(ISBLANK(G288),1,IFERROR(VLOOKUP(G288,Tipo!$C$12:$C$27,1,FALSE),\"NO\"))","v":"NO"},"Inversión",{"$f":"IF(ISBLANK(K288),1,IFERROR(VLOOKUP(K288,Eje_Pilar_Prop!$C$3:$C$104,1,FALSE),\"NO\"))","v":45},"SECOP II",1,"Bogotá Mejor para Todos"]
["FDLCH-CPS-166-2019",2019,"SECOP II","CPS-166-2019","Contratos de prestación de servicios profesionales y de apoyo a la gestión","Contratación directa","Prestación de servicios profesionales y de apoyo a la gestión, o para la ejecución de trabajos artísticos que sólo puedan encomendarse a determinadas personas naturales;","ADICIÓN CONTRATO 166-2019. PRESTACIÓN DE SERVICIOS PROFESIONALES PARA APOYAR AL DESPACHO EN LA FORMULACIÓN Y EJECUCIÓN DE ACTIVIDADES DE PLANEACIÓN, SUPERVISIÓN, SEGUIMIENTO  Y GESTIÓN DEL RIESGO Y CAMBIO CLIMÁTICO EN LA LOCALIDAD DE CHAPINERO","Inversión","Bogotá Mejor para Todos",4,{"$f":"IF(ISERROR(VLOOKUP(K289,Eje_Pilar_Prop!$C$2:$E$104,2,FALSE)),\" \",VLOOKUP(K289,Eje_Pilar_Prop!$C$2:$E$104,2,FALSE))","v":"Familias protegidas y adaptadas al cambio climático"},{"$f":"IF(ISERROR(VLOOKUP(K289,Eje_Pilar_Prop!$C$2:$E$104,3,FALSE)),\" \",VLOOKUP(K289,Eje_Pilar_Prop!$C$2:$E$104,3,FALSE))","v":"Pilar 1 Igualdad de Calidad de Vida"},1296,1019031184,"RAYMON ALEXANDER JIMÉNEZ ARTEAGA",0,0,0,1,2625000,2625000,2625000,"2020-01-23","2020-01-23","2020-02-07",0,1,15,null,null,null,null,null,null,"X",null,1,null,null,{"$f":"IF(SUMPRODUCT((A$14:A289=A289)*(B$14:B289=B289)*(D$14:D289=D289))>1,0,1)","v":1},"Contratos de prestación de servicios profesionales y de apoyo a la gestión","Contratación directa",{"$f":"IF(ISBLANK(G289),1,IFERROR(VLOOKUP(G289,Tipo!$C$12:$C$27,1,FALSE),\"NO\"))","v":"Prestación de servicios profesionales y de apoyo a la gestión, o para la ejecución de trabajos artísticos que sólo puedan encomendarse a determinadas personas naturales;"},"Inversión",{"$f":"IF(ISBLANK(K289),1,IFERROR(VLOOKUP(K289,Eje_Pilar_Prop!$C$3:$C$104,1,FALSE),\"NO\"))","v":4},"SECOP II",1,"Bogotá Mejor para Todos"]
["FDLCH-CO-167-2019",2019,"SECOP II","FDLCH-LP-006-2019","Obra pública","Licitación pública","No aplica","ADICIÓN Y PRÓRROGA CONTRATO DE OBRA No 167 DE 2019 CUYO OBJETO ES\"EJECUTAR A MONTO AGOTABLE, POR PRECIOS UNITARIOS FIJOS OBRAS YACTIVIDADES PARA LA CONSTRUCCIÓN DE ESPACIO PÚBLICO DE LA LOCALIDAD DECHAPINERO, EN BOGOTA, D.C.","Inversión","Bogotá Mejor para Todos",18,{"$f":"IF(ISERROR(VLOOKUP(K290,Eje_Pilar_Prop!$C$2:$E$104,2,FALSE)),\" \",VLOOKUP(K290,Eje_Pilar_Prop!$C$2:$E$104,2,FALSE))","v":"Mejor movilidad para todos"},{"$f":"IF(ISERROR(VLOOKUP(K290,Eje_Pilar_Prop!$C$2:$E$104,3,FALSE)),\" \",VLOOKUP(K290,Eje_Pilar_Prop!$C$2:$E$104,3,FALSE))","v":"Pilar 2 Democracía Urbana"},1301,900844354,"INGASIC SAS",0,0,0,1,831814793,831814793,0,"2020-11-25","2020-11-25","2021-04-15",0,1,121,null,null,null,null,null,"X",null,null,0,null,null,{"$f":"IF(SUMPRODUCT((A$14:A290=A290)*(B$14:B290=B290)*(D$14:D290=D290))>1,0,1)","v":1},"Obra pública","Licitación pública",{"$f":"IF(ISBLANK(G290),1,IFERROR(VLOOKUP(G290,Tipo!$C$12:$C$27,1,FALSE),\"NO\"))","v":"NO"},"Inversión",{"$f":"IF(ISBLANK(K290),1,IFERROR(VLOOKUP(K290,Eje_Pilar_Prop!$C$3:$C$104,1,FALSE),\"NO\"))","v":18},"SECOP II",1,"Bogotá Mejor para Todos"]
[" FDLCH-CIN-169-2019",2019,"SECOP II"," FDLCH-CM-007-2019","Interventoría","Concurso de méritos","No aplica","ADICIÓN Y PRÓRROGA CONTRATO 169 DE 2019 \"INTERVENTORÍA TÉCNICA,ADMINISTRATIVA, FINANCIERA, CONTABLE, SOCIAL, AMBIENTAL Y SISTEMA DESEGURIDAD Y SALUD EN EL TRABAJO - SG -SST, DEL CONRATO DE OBRA QUE SEDERIVE DE LA LICITACIÓN PÚBLICA O LA QUE HAGA SUS VECES, QUE REFIERE A\"EJECUTAR POR PRECIOS UNITARIOS OBRAS Y ACTIVIDADES PARA LA CONSTRUCCIÓNDEL ESPACIO PÚBLICO DE LA LOCALIDAD DE CHAPINERO, EN BOGOTÁ D.C.\"","Inversión","Bogotá Mejor para Todos",18,{"$f":"IF(ISERROR(VLOOKUP(K291,Eje_Pilar_Prop!$C$2:$E$104,2,FALSE)),\" \",VLOOKUP(K291,Eje_Pilar_Prop!$C$2:$E$104,2,FALSE))","v":"Mejor movilidad para todos"},{"$f":"IF(ISERROR(VLOOKUP(K291,Eje_Pilar_Prop!$C$2:$E$104,3,FALSE)),\" \",VLOOKUP(K291,Eje_Pilar_Prop!$C$2:$E$104,3,FALSE))","v":"Pilar 2 Democracía Urbana"},1301,901350769,"CONSORCIO CHAPINERO 2020",0,0,0,1,243389567,243389567,0,"2020-11-25","2020-11-25","2021-04-15",0,1,121,null,null,null,null,null,"X",null,null,0,null,null,{"$f":"IF(SUMPRODUCT((A$14:A291=A291)*(B$14:B291=B291)*(D$14:D291=D291))>1,0,1)","v":1},"Interventoría","Concurso de méritos",{"$f":"IF(ISBLANK(G291),1,IFERROR(VLOOKUP(G291,Tipo!$C$12:$C$27,1,FALSE),\"NO\"))","v":"NO"},"Inversión",{"$f":"IF(ISBLANK(K291),1,IFERROR(VLOOKUP(K291,Eje_Pilar_Prop!$C$3:$C$104,1,FALSE),\"NO\"))","v":18},"SECOP II",1,"Bogotá Mejor para Todos"]
["FDLCH-CO-172-2019",2019,"SECOP II","FDLCH-LP-005-2019","Obra pública","Licitación pública","No aplica","ADICIÓN CONTRATO No 172 DE 2019. CONTRATAR POR EL SISTEMA DE PRECIOSUNTARIOS FIJOS A MONTO AGOTABLE SIN FORMULA DE REAJUSTE, LA CONSTRUCCIÓNDE UNA OBRA DE RECONFORMACIÓN, DE RECUPERACIÓN Y LA IMPLEMENTACIÓN DEMEDIDAS PARA EL CONTROL DE EROSIÓN, LA MITIGACIÓN DEL RIESGO EN UN SITIOCRÍTICO DE LA LOCALIDAD DE CHAPINERO EN LA CIUDAD DE BOGOTA, DC. DEACUERDO CON LA DESCRIPCIÓN, ESPECIFICACIONES Y DEMÁS CONDICIONESESTABLECIDAS EN EL PLIEGO DE CONDICIONES Y EN ESPECIAL LAS ESTABLECIDASEN EL ANEXO TÉCNICO.","Inversión","Bogotá Mejor para Todos",4,{"$f":"IF(ISERROR(VLOOKUP(K292,Eje_Pilar_Prop!$C$2:$E$104,2,FALSE)),\" \",VLOOKUP(K292,Eje_Pilar_Prop!$C$2:$E$104,2,FALSE))","v":"Familias protegidas y adaptadas al cambio climático"},{"$f":"IF(ISERROR(VLOOKUP(K292,Eje_Pilar_Prop!$C$2:$E$104,3,FALSE)),\" \",VLOOKUP(K292,Eje_Pilar_Prop!$C$2:$E$104,3,FALSE))","v":"Pilar 1 Igualdad de Calidad de Vida"},1296,901350680,"CONSORCIO MONSERRATE",0,0,0,1,3893579,3893579,0,"2020-12-28","2020-12-28","2021-02-13",0,1,30,null,null,null,null,null,"X",null,null,0,null,null,{"$f":"IF(SUMPRODUCT((A$14:A292=A292)*(B$14:B292=B292)*(D$14:D292=D292))>1,0,1)","v":1},"Obra pública","Licitación pública",{"$f":"IF(ISBLANK(G292),1,IFERROR(VLOOKUP(G292,Tipo!$C$12:$C$27,1,FALSE),\"NO\"))","v":"NO"},"Inversión",{"$f":"IF(ISBLANK(K292),1,IFERROR(VLOOKUP(K292,Eje_Pilar_Prop!$C$3:$C$104,1,FALSE),\"NO\"))","v":4},"SECOP II",1,"Bogotá Mejor para Todos"]
["FDLCH-CIN-174-2019",2019,"SECOP II","FDLCH-CM-005-2019","Interventoría","Concurso de méritos","No aplica","ADICIÓN CONTRATO No 174 DE 2019. CONTRATAR LA INTERVENTORÍA TÉCNICA,ADMINISTRATIVA, LEGAL, FINANCIERA, SOCIAL Y AMBIENTAL DE LA CONSTRUCCIÓNDE UNA OBRA PARA LA MITIGACIÓN DE RIESGO EN LA LOCALIDAD DE CHAPINERO.","Inversión","Bogotá Mejor para Todos",4,{"$f":"IF(ISERROR(VLOOKUP(K293,Eje_Pilar_Prop!$C$2:$E$104,2,FALSE)),\" \",VLOOKUP(K293,Eje_Pilar_Prop!$C$2:$E$104,2,FALSE))","v":"Familias protegidas y adaptadas al cambio climático"},{"$f":"IF(ISERROR(VLOOKUP(K293,Eje_Pilar_Prop!$C$2:$E$104,3,FALSE)),\" \",VLOOKUP(K293,Eje_Pilar_Prop!$C$2:$E$104,3,FALSE))","v":"Pilar 1 Igualdad de Calidad de Vida"},1296,901351544,"CONSORCIO SAN LUCAS LJ",0,0,0,2,5102952,5102952,0,"2020-12-28","2020-12-28","2021-02-13",0,1,30,null,null,null,null,null,"X",null,null,0,null,null,{"$f":"IF(SUMPRODUCT((A$14:A293=A293)*(B$14:B293=B293)*(D$14:D293=D293))>1,0,1)","v":1},"Interventoría","Concurso de méritos",{"$f":"IF(ISBLANK(G293),1,IFERROR(VLOOKUP(G293,Tipo!$C$12:$C$27,1,FALSE),\"NO\"))","v":"NO"},"Inversión",{"$f":"IF(ISBLANK(K293),1,IFERROR(VLOOKUP(K293,Eje_Pilar_Prop!$C$3:$C$104,1,FALSE),\"NO\"))","v":4},"SECOP II",1,"Bogotá Mejor para Todos"]
["CONTRATO 177 DE 2019 ",2019,"SECOP II","N/A","Otros","Contratación directa","Cuando no exista pluralidad de oferentes en el mercado","PRESTAR ELSERVICIO DE INTERNET DEDICADO PARA LA ALCALDIA LOCAL DE CHAPINERO ","Funcionamiento",null,null,null,null,131020202030304,899999115,"EMPRESA DE TELECOMUNICACIONES DE BOGOTÁ S.A. E.S.P. - ETB S.A. ESP",0,null,0,0,2450448,2450448,0,"00:00:00","00:00:00","00:00:00",0,null,0,null,null,null,null,null,"X"]
["FDLCH-CPS-178-2019",2019,"SECOP II","FDLCH-SAMC-012-2019","Contratos de prestación de servicios profesionales y de apoyo a la gestión","Selección abreviada","Selección abreviada por menor cuantía ","ADICIÃ\u0093N 178 DE 2019: PRESTACIÃ\u0093N DE SERVICIOS PARA IMPLEMENTAR ACCIONES DE ASISTENCIA  TÃ\u0089CNICA AGROPECUARIA,  CUIDADO,  ASESORÃ\u008dA AMBIENTAL Y CULTURA DEL AGUA COMO TECNOLOGÃ\u008dA AMBIENTALMENTE SOSTENIBLE CON ENFOQUE DIFERENCIAL  Y DE  DERECHOS   EN  EL MARCO  DEL PLAN DE DESARROLLO LOCAL   CHAPINERO  MEJOR  PARA TODOS  Y EN CONCORDANCIA  CON LA DECLARATORIA DE RESERVA FORESTAL PROTECTORA BOSQUE ORIENTAL DE BOGOTÃ\u0081  EN LA COMUNIDAD DEL VERJÃ\u0093N BAJO DE LA LOCALIDAD DE CHAPINERO.","Inversión","Bogotá Mejor para Todos",41,"Desarrollo rural sostenible","Eje Transversal 3 Sostenibilidad Ambiental basada en la eficiencia energética",1303,901231658,"ASOCIACION DE PROFESIONALES PARA EL DESARROLLO DE PROYECTOS DE INVERSION PUBLICA Y PRIVADA S&A",0,0,0,1,1400003,1400003,0,"2020-12-28","2020-12-28","2021-01-07",0,1,91,null,null,null,null,null,null,"X",null,{"$f":"IF(ISERROR(W295/V295),\"-\",(W295/V295))","v":0},null,null,{"$f":"IF(SUMPRODUCT((A$14:A306=A295)*(B$14:B306=B295)*(D$14:D306=D295))>1,0,1)","v":1},"Contratos de prestación de servicios profesionales y de apoyo a la gestión","Selección abreviada",{"$f":"IF(ISBLANK(G295),1,IFERROR(VLOOKUP(G295,Tipo!$C$12:$C$27,1,FALSE),\"NO\"))","v":"Selección abreviada por menor cuantía "},"Inversión",{"$f":"IF(ISBLANK(K295),1,IFERROR(VLOOKUP(K295,Eje_Pilar_Prop!$C$3:$C$104,1,FALSE),\"NO\"))","v":41},"SECOP II",1,"Bogotá Mejor para Todos"]
["CAJA MENOR",2020,"SECOP II","N/A","Otros","Contratación directa",null,"CAJA MENOR VIGENCIA 2020 PARA LA ALCALDÍA LOCAL DE CHAPINERO.","Funcionamiento","Bogotá Mejor para Todos",null,null,{"$f":"IF(ISERROR(VLOOKUP(K296,Eje_Pilar_Prop!$C$2:$E$104,3,FALSE)),\" \",VLOOKUP(K296,Eje_Pilar_Prop!$C$2:$E$104,3,FALSE))","v":" "},1310202010302,0,"CAJA MENOR VIGENCIA 2020 PARA LA ALCALDÍA LOCAL DE CHAPINERO.",975000,0,0,0,0,975000,975000,"00:00:00","00:00:00","00:00:00",0,0,0,null,null,null,null,null,"X",null,null,{"$f":"IF(ISERROR(W296/V296),\"-\",(W296/V296))","v":1},null,null,{"$f":"IF(SUMPRODUCT((A$14:A296=A296)*(B$14:B296=B296)*(D$14:D296=D296))>1,0,1)","v":1},"Otros","Contratación directa",{"$f":"IF(ISBLANK(G296),1,IFERROR(VLOOKUP(G296,Tipo!$C$12:$C$27,1,FALSE),\"NO\"))","v":1},"Funcionamiento",{"$f":"IF(ISBLANK(K296),1,IFERROR(VLOOKUP(K296,Eje_Pilar_Prop!$C$3:$C$104,1,FALSE),\"NO\"))","v":1},"SECOP II","NO","Bogotá Mejor para Todos"]
["FDLCH",2019,"SECOP II","N/A","Contratos de prestación de servicios profesionales y de apoyo a la gestión","Contratación directa",null,"CONTRATOS 2019","Inversión","Bogotá Mejor para Todos",45,{"$f":"IF(ISERROR(VLOOKUP(K297,Eje_Pilar_Prop!$C$2:$E$104,2,FALSE)),\" \",VLOOKUP(K297,Eje_Pilar_Prop!$C$2:$E$104,2,FALSE))","v":"Gobernanza e influencia local, regional e internacional"},{"$f":"IF(ISERROR(VLOOKUP(K297,Eje_Pilar_Prop!$C$2:$E$104,3,FALSE)),\" \",VLOOKUP(K297,Eje_Pilar_Prop!$C$2:$E$104,3,FALSE))","v":"Eje Transversal 4 Gobierno Legitimo, Fortalecimiento Local y Eficiencia"},1304,0,"CONTRATOS 2019",0,0,0,1,15280051,15280051,15346850,"00:00:00","00:00:00","00:00:00",0,0,0,null,null,null,null,null,null,"X",null,1.0043716477124325,null,null,null,null,null,null,null,null,null,"NO"]
["Servicios de seguros de Salud ediles",2020,"SECOP II","N/A","Otros","Contratación directa",null,"Servicios de seguros de Salud ediles","Funcionamiento","Bogotá Mejor para Todos",null,null,{"$f":"IF(ISERROR(VLOOKUP(K298,Eje_Pilar_Prop!$C$2:$E$104,3,FALSE)),\" \",VLOOKUP(K298,Eje_Pilar_Prop!$C$2:$E$104,3,FALSE))","v":" "},131020202020106,0,"Servicios de seguros de Salud ediles",78626800,0,0,0,0,78626800,78626800,"00:00:00","00:00:00","00:00:00",0,0,0,null,null,null,null,null,"X",null,null,1,null,null,{"$f":"IF(SUMPRODUCT((A$14:A298=A298)*(B$14:B298=B298)*(D$14:D298=D298))>1,0,1)","v":1},{"$f":"IF(ISBLANK(E298),1,IFERROR(VLOOKUP(E298,tipo,1,FALSE),\"NO\"))","v":"Otros"},{"$f":"IF(ISBLANK(F298),1,IFERROR(VLOOKUP(F298,modal,1,FALSE),\"NO\"))","v":"Contratación directa"},{"$f":"IF(ISBLANK(G298),1,IFERROR(VLOOKUP(G298,Tipo!$C$12:$C$27,1,FALSE),\"NO\"))","v":1},{"$f":"IF(ISBLANK(I298),1,IFERROR(VLOOKUP(I298,afectacion,1,FALSE),\"NO\"))","v":"Funcionamiento"},{"$f":"IF(ISBLANK(K298),1,IFERROR(VLOOKUP(K298,Eje_Pilar_Prop!$C$3:$C$104,1,FALSE),\"NO\"))","v":1},{"$f":"IF(ISBLANK(C298),1,IFERROR(VLOOKUP(C298,SECOP,1,FALSE),\"NO\"))","v":"SECOP II"},"NO",{"$f":"IF(ISBLANK(J298),1,IFERROR(VLOOKUP(J298,pdd,1,FALSE),\"NO\"))","v":"Bogotá Mejor para Todos"}]
["Servicios de telefonía fija",2020,"SECOP II","N/A","Otros","Contratación directa",null,"Servicios de telefonía fija","Funcionamiento","Bogotá Mejor para Todos",null,null,{"$f":"IF(ISERROR(VLOOKUP(K299,Eje_Pilar_Prop!$C$2:$E$104,3,FALSE)),\" \",VLOOKUP(K299,Eje_Pilar_Prop!$C$2:$E$104,3,FALSE))","v":" "},131020202030401,0,"Servicios de telefonía fija",18384140,0,0,0,0,18384140,18384140,"00:00:00","00:00:00","00:00:00",0,0,0,null,null,null,null,null,"X",null,null,1,null,null,{"$f":"IF(SUMPRODUCT((A$14:A299=A299)*(B$14:B299=B299)*(D$14:D299=D299))>1,0,1)","v":1},"Otros","Contratación directa",{"$f":"IF(ISBLANK(G299),1,IFERROR(VLOOKUP(G299,Tipo!$C$12:$C$27,1,FALSE),\"NO\"))","v":1},"Funcionamiento",{"$f":"IF(ISBLANK(K299),1,IFERROR(VLOOKUP(K299,Eje_Pilar_Prop!$C$3:$C$104,1,FALSE),\"NO\"))","v":1},"SECOP II","NO","Bogotá Mejor para Todos"]
["Energía",2020,"SECOP II","N/A","Otros","Contratación directa",null,"Energía","Funcionamiento","Bogotá Mejor para Todos",null,null,{"$f":"IF(ISERROR(VLOOKUP(K300,Eje_Pilar_Prop!$C$2:$E$104,3,FALSE)),\" \",VLOOKUP(K300,Eje_Pilar_Prop!$C$2:$E$104,3,FALSE))","v":" "},131020202040101,0,"Energía",52406900,0,0,0,0,52406900,52406900,"00:00:00","00:00:00","00:00:00",0,0,0,null,null,null,null,null,"X",null,null,1,null,null,{"$f":"IF(SUMPRODUCT((A$14:A300=A300)*(B$14:B300=B300)*(D$14:D300=D300))>1,0,1)","v":1},"Otros","Contratación directa",{"$f":"IF(ISBLANK(G300),1,IFERROR(VLOOKUP(G300,Tipo!$C$12:$C$27,1,FALSE),\"NO\"))","v":1},"Funcionamiento",{"$f":"IF(ISBLANK(K300),1,IFERROR(VLOOKUP(K300,Eje_Pilar_Prop!$C$3:$C$104,1,FALSE),\"NO\"))","v":1},"SECOP II","NO","Bogotá Mejor para Todos"]
["Acueducto y alcantarillado",2020,"SECOP II","N/A","Otros","Contratación directa",null,"Acueducto y alcantarillado","Funcionamiento","Bogotá Mejor para Todos",null,null,{"$f":"IF(ISERROR(VLOOKUP(K301,Eje_Pilar_Prop!$C$2:$E$104,3,FALSE)),\" \",VLOOKUP(K301,Eje_Pilar_Prop!$C$2:$E$104,3,FALSE))","v":" "},131020202040102,0,"Acueducto y alcantarillado",5970110,0,0,0,0,5970110,5970110,"00:00:00","00:00:00","00:00:00",0,0,0,null,null,null,null,null,"X",null,null,1,null,null,{"$f":"IF(SUMPRODUCT((A$14:A301=A301)*(B$14:B301=B301)*(D$14:D301=D301))>1,0,1)","v":1},"Otros","Contratación directa",{"$f":"IF(ISBLANK(G301),1,IFERROR(VLOOKUP(G301,Tipo!$C$12:$C$27,1,FALSE),\"NO\"))","v":1},"Funcionamiento",{"$f":"IF(ISBLANK(K301),1,IFERROR(VLOOKUP(K301,Eje_Pilar_Prop!$C$3:$C$104,1,FALSE),\"NO\"))","v":1},"SECOP II","NO","Bogotá Mejor para Todos"]
["Aseo",2020,"SECOP II","N/A","Otros","Contratación directa",null,"Aseo","Funcionamiento","Bogotá Mejor para Todos",null,null,{"$f":"IF(ISERROR(VLOOKUP(K302,Eje_Pilar_Prop!$C$2:$E$104,3,FALSE)),\" \",VLOOKUP(K302,Eje_Pilar_Prop!$C$2:$E$104,3,FALSE))","v":" "},131020202040103,0,"Aseo",7440840,0,0,0,0,7440840,7271600,"00:00:00","00:00:00","00:00:00",0,0,0,null,null,null,null,null,"X",null,null,0.97725525612699637,null,null,{"$f":"IF(SUMPRODUCT((A$14:A302=A302)*(B$14:B302=B302)*(D$14:D302=D302))>1,0,1)","v":1},"Otros","Contratación directa",{"$f":"IF(ISBLANK(G302),1,IFERROR(VLOOKUP(G302,Tipo!$C$12:$C$27,1,FALSE),\"NO\"))","v":1},"Funcionamiento",{"$f":"IF(ISBLANK(K302),1,IFERROR(VLOOKUP(K302,Eje_Pilar_Prop!$C$3:$C$104,1,FALSE),\"NO\"))","v":1},"SECOP II","NO","Bogotá Mejor para Todos"]
["Obligaciones por Pagar Vigencia Anterior",2020,"SECOP II","N/A","Otros","Contratación directa",null,"Obligaciones por Pagar Vigencia Anterior","Inversión","Bogotá Mejor para Todos",null,null,{"$f":"IF(ISERROR(VLOOKUP(K303,Eje_Pilar_Prop!$C$2:$E$104,3,FALSE)),\" \",VLOOKUP(K303,Eje_Pilar_Prop!$C$2:$E$104,3,FALSE))","v":" "},131089001,0,"Obligaciones por Pagar Vigencia Anterior",386340565,0,0,0,0,386340565,375654604,"00:00:00","00:00:00","00:00:00",0,0,0,null,null,null,null,null,"X",null,null,0.97234056692959492,null,null,{"$f":"IF(SUMPRODUCT((A$14:A303=A303)*(B$14:B303=B303)*(D$14:D303=D303))>1,0,1)","v":1},"Otros","Contratación directa",{"$f":"IF(ISBLANK(G303),1,IFERROR(VLOOKUP(G303,Tipo!$C$12:$C$27,1,FALSE),\"NO\"))","v":1},"Inversión",{"$f":"IF(ISBLANK(K303),1,IFERROR(VLOOKUP(K303,Eje_Pilar_Prop!$C$3:$C$104,1,FALSE),\"NO\"))","v":1},"SECOP II","NO","Bogotá Mejor para Todos"]
["HONORARIOS EDILES",2020,"SECOP II","N/A","Otros","Contratación directa",null,"HONORARIOS EDILES","Inversión","Bogotá Mejor para Todos",null,null,{"$f":"IF(ISERROR(VLOOKUP(K304,Eje_Pilar_Prop!$C$2:$E$104,3,FALSE)),\" \",VLOOKUP(K304,Eje_Pilar_Prop!$C$2:$E$104,3,FALSE))","v":" "},13101040102,0,"HONORARIOS EDILES",628959612,0,0,0,0,628959612,628959612,"00:00:00","00:00:00","00:00:00",0,0,0,null,null,null,null,null,"X",null,null,1,null,null,{"$f":"IF(SUMPRODUCT((A$14:A304=A304)*(B$14:B304=B304)*(D$14:D304=D304))>1,0,1)","v":1},"Otros","Contratación directa",{"$f":"IF(ISBLANK(G304),1,IFERROR(VLOOKUP(G304,Tipo!$C$12:$C$27,1,FALSE),\"NO\"))","v":1},"Inversión",{"$f":"IF(ISBLANK(K304),1,IFERROR(VLOOKUP(K304,Eje_Pilar_Prop!$C$3:$C$104,1,FALSE),\"NO\"))","v":1},"SECOP II","NO","Bogotá Mejor para Todos"]
["COMPENSAR",2020,"SECOP II","N/A","Contratos de prestación de servicios profesionales y de apoyo a la gestión","Contratación directa",null,"RESOLUCIONES SUBSIDIO TIPO C","Inversión","Bogotá Mejor para Todos",4,{"$f":"IF(ISERROR(VLOOKUP(K305,Eje_Pilar_Prop!$C$2:$E$104,2,FALSE)),\" \",VLOOKUP(K305,Eje_Pilar_Prop!$C$2:$E$104,2,FALSE))","v":"Familias protegidas y adaptadas al cambio climático"},{"$f":"IF(ISERROR(VLOOKUP(K305,Eje_Pilar_Prop!$C$2:$E$104,3,FALSE)),\" \",VLOOKUP(K305,Eje_Pilar_Prop!$C$2:$E$104,3,FALSE))","v":"Pilar 1 Igualdad de Calidad de Vida"},1294,860066942,"CAJA DE COMPENSACION FAMILIAR COMPENSAR",655467125,1,-9031636,0,0,646435489,{"$f":"422458082+2134343+161500000+727407","v":586819832},"00:00:00","00:00:00","00:00:00",0,0,0,null,null,null,null,null,"X",null,null,0.90777787108776753,null,null,{"$f":"IF(SUMPRODUCT((A$14:A305=A305)*(B$14:B305=B305)*(D$14:D305=D305))>1,0,1)","v":1},"Contratos de prestación de servicios profesionales y de apoyo a la gestión","Contratación directa",{"$f":"IF(ISBLANK(G305),1,IFERROR(VLOOKUP(G305,Tipo!$C$12:$C$27,1,FALSE),\"NO\"))","v":1},"Inversión",{"$f":"IF(ISBLANK(K305),1,IFERROR(VLOOKUP(K305,Eje_Pilar_Prop!$C$3:$C$104,1,FALSE),\"NO\"))","v":4},"SECOP II","NO","Bogotá Mejor para Todos"]
["FDLCH",2020,"SECOP II","N/A","Contratos de prestación de servicios profesionales y de apoyo a la gestión","Contratación directa",null,"RESOLUCIONES TRANSERENCIA MONETARIA","Inversión","Bogotá Mejor para Todos",4,{"$f":"IF(ISERROR(VLOOKUP(K306,Eje_Pilar_Prop!$C$2:$E$104,2,FALSE)),\" \",VLOOKUP(K306,Eje_Pilar_Prop!$C$2:$E$104,2,FALSE))","v":"Familias protegidas y adaptadas al cambio climático"},{"$f":"IF(ISERROR(VLOOKUP(K306,Eje_Pilar_Prop!$C$2:$E$104,3,FALSE)),\" \",VLOOKUP(K306,Eje_Pilar_Prop!$C$2:$E$104,3,FALSE))","v":"Pilar 1 Igualdad de Calidad de Vida"},1294,2,"FONDO DE DESARROLLO LOCAL DE CHAPINERO",993300120,0,0,0,0,993300120,{"$f":"+R306+T306+V306","v":993300120},"00:00:00","00:00:00","00:00:00",0,0,0,null,null,null,null,null,"X",null,null,1,null,null,{"$f":"IF(SUMPRODUCT((A$14:A306=A306)*(B$14:B306=B306)*(D$14:D306=D306))>1,0,1)","v":1},"Contratos de prestación de servicios profesionales y de apoyo a la gestión","Contratación directa",{"$f":"IF(ISBLANK(G306),1,IFERROR(VLOOKUP(G306,Tipo!$C$12:$C$27,1,FALSE),\"NO\"))","v":1},"Inversión",{"$f":"IF(ISBLANK(K306),1,IFERROR(VLOOKUP(K306,Eje_Pilar_Prop!$C$3:$C$104,1,FALSE),\"NO\"))","v":4},"SECOP II","NO","Bogotá Mejor para Todos"]
["seguros positiva",2020,"SECOP II","N/A","Contratos de prestación de servicios profesionales y de apoyo a la gestión","Contratación directa",null,"POSITIVA COMPAÑIA DE SEGUROS SA","Inversión","Bogotá Mejor para Todos",45,{"$f":"IF(ISERROR(VLOOKUP(K307,Eje_Pilar_Prop!$C$2:$E$104,2,FALSE)),\" \",VLOOKUP(K307,Eje_Pilar_Prop!$C$2:$E$104,2,FALSE))","v":"Gobernanza e influencia local, regional e internacional"},{"$f":"IF(ISERROR(VLOOKUP(K307,Eje_Pilar_Prop!$C$2:$E$104,3,FALSE)),\" \",VLOOKUP(K307,Eje_Pilar_Prop!$C$2:$E$104,3,FALSE))","v":"Eje Transversal 4 Gobierno Legitimo, Fortalecimiento Local y Eficiencia"},1304,0,"POSITIVA COMPAÑIA DE SEGUROS SA",6824900,0,0,0,0,6824900,6824900,"00:00:00","00:00:00","00:00:00",0,0,0,null,null,null,null,null,null,"X",null,1,null,null,{"$f":"IF(SUMPRODUCT((A$14:A307=A307)*(B$14:B307=B307)*(D$14:D307=D307))>1,0,1)","v":1},"Contratos de prestación de servicios profesionales y de apoyo a la gestión","Contratación directa",{"$f":"IF(ISBLANK(G307),1,IFERROR(VLOOKUP(G307,Tipo!$C$12:$C$27,1,FALSE),\"NO\"))","v":1},"Inversión",{"$f":"IF(ISBLANK(K307),1,IFERROR(VLOOKUP(K307,Eje_Pilar_Prop!$C$3:$C$104,1,FALSE),\"NO\"))","v":45},"SECOP II","NO","Bogotá Mejor para Todos"]
["TOTALES",null,null,null,null,null,null,null,null,null,null,null,null,null,null,null,{"$f":"SUM(Q14:Q277)","v":13286964655},14,-54483288,169,1324155612,14556636979,7463967227]
[null,null,null,null,null,null,null,null,null,null,null,null,null,null,null,null,{"$f":"SUBTOTAL(9,Q14:Q308)","v":29408625422},null,null,null,{"$f":"SUBTOTAL(9,U14:U308)","v":6153646795},{"$f":"SUBTOTAL(9,V14:V308)","v":35421317471},{"$f":"SUBTOTAL(9,W14:W293)","v":7621018641}]

{"sheet":"Instructivo","index":2,"n_rows":103,"n_cols":4,"rows_kept":103,"cut":false,"hidden":true,"merged":[[101,1,101,3],[77,1,80,1],[77,2,80,2],[83,1,83,3],[84,1,85,1],[84,2,85,2],[98,1,98,3],[92,1,92,3],[68,1,70,1],[68,2,70,2],[71,1,72,1],[71,2,72,2],[74,1,75,1],[74,2,75,2],[67,1,67,3],[26,1,27,1],[26,2,27,2],[31,1,32,1],[31,2,32,2],[33,1,53,1],[35,2,36,2],[54,1,56,1],[54,2,56,2],[59,1,62,1],[61,2,62,2],[64,1,65,1],[29,1,30,1],[25,1,25,3],[1,1,1,3],[2,1,2,3],[3,1,3,3],[4,1,4,3],[5,1,5,3],[6,1,6,3],[7,1,7,3],[10,1,10,3],[11,1,11,3],[12,1,12,3],[14,1,14,3],[8,1,8,3],[9,1,9,3]]}
[]
[null,"INSTRUCTIVO"]
[null,"Recomendamos leer cuidadosamente y poner en práctica las instrucciones que se explican en este instructivo. De la calidad de la información que se registre, depende en gran medida la calidad del informe de rendición de cuentas de la Gestión Contractual que presenta el Alcalde Mayor, consolidado por la Veeduría Distrital."]
[null,"La base en Excel a diligenciar es inmodificable, debe utilizar versión Excel 2010 o posteriores, la versión 2007 no habilita los macros.  La base no permite que se incluyan columnas con otro tipo de información que la Veeduría Distrital no está solicitando o que se cambie el formato de celda establecido. Tenga en cuenta que algunas celdas están bloqueadas y/o solo permiten el registro de una información determinada."]
[null,"La información que se registre en la base, debe coincidir con los reportes realizados en PREDIS y en el SECOP"]
[null,"Diligencie la totalidad de celdas."]
[null,"Para insertar una o varias filas, haga click  en el opción Insertar Filas y digite el número de filas a insertar. Si usted no sigue este procedimiento las filas que inserte no tomaran el formato de las filas anteriores. Se recomienda que antes de iniciar el registro de información inserte las filas que requiere, sin embargo en cualquier momento que necesite puede hacer este paso."]
[null,"Si requiere inserte una o varias filas realícelo después de la fila A14 y antes de la fila de Totales para que tomen el formato de las filas anteriores."]
[null,"Si necesita pegar información debe hacerlo por secciones debido a que hay columnas formuladas que están protegidas (como la columna J, K, T y AK) que no permiten realizar esta opción. Utilice la opción de pegado especial valores para no borrar las listas desplegables ni los formatos de las columnas."]
[null,"Si al pegar quedan textos en rojo,  verifique y ajuste la información, el dato que adiciono no se encuentra en la lista desplegable o no corresponde con el criterio definido en el columna."]
[null,"En primer lugar diligencie toda la información correspondiente a los contratos suscritos con cargo a la vigencia 2020."]
[null,"Una vez incluidos todos los contratos de la vigencia 2020, a continuación diligencie el formato completo con la información correspondiente a las adiciones efectuadas con cargo a la vigencia 2020 de contratos suscritos en vigencias anteriores. La información general del contrato como: modalidad de selección, tipología contractual, objeto, entre otros, debe corresponder a la información del contrato adicionado o modificado. Respecto al valor solo se diligencia el valor en la columna adición, es decir la columna de valor inicial debe quedar en blanco. No olvide registrar el número de adiciones realizadas, en la columna correspondiente."]
[null,"En caso de haber realizado apropiaciones presupuestales en la vigencia a través de resoluciones, caja menor, honorarios ediles, servicios públicos, debe relacionar dicha información en una sola fila al final de la base, indicando de que se trata la apropiación y número de proyecto si hay lugar a ello. En el tipo de contrato se registra Otros gastos."]
[]
[null,"ENCABEZADO DEL FORMATO"]
[null,1,"Entidad","Indique el nombre completo de la Entidad."]
[null,2,"Sector","Seleccione el sector al cual pertenece la Entidad."]
[null,3,"Presupuesto Disponible Inversión Directa","Indique el valor total del presupuesto disponible de inversión directa, de acuerdo con el PREDIS, a 31 de diciembre de 2020."]
[null,4,"Presupuesto Comprometido de Inversión Directa ","Escriba el valor total del presupuesto comprometido de inversión directa, de acuerdo con el PREDIS a 31 de diciembre de 2020."]
[null,5,"Presupuesto Disponible Funcionamiento","Indique el valor total del presupuesto de funcionamiento disponible, de acuerdo con el PREDIS a 31 de diciembre de 2020."]
[null,6,"Presupuesto Comprometido funcionamiento ","Escriba el monto del presupuesto de funcionamiento, comprometido mediante contratos, de acuerdo con el PREDIS a 31 de diciembre de 2020."]
[null,7,"Presupuesto Disponible Operación","Coloque el monto del presupuesto de operación disponible, de acuerdo con el PREDIS, a 31 de diciembre de 2020. Los gastos de operación corresponden solamente a aquellas entidades de régimen de contratación  privado."]
[null,8,"Presupuesto Comprometido operación mediante contratos","Escriba el monto del presupuesto de operación comprometido mediante contratos a 31 de diciembre de 2020."]
[null,9,"Nombre de quien diligencia el formato:","Indique el nombre completo, cargo, número de teléfono con extensión y correo electrónico del profesional que diligencia el formato y que posteriormente realizará los ajustes y aclaraciones a que haya lugar por solicitud de la Veeduría Distrital."]
[]
[null,"1- INFORMACIÓN GENERAL"]
[null,1,"Número de Contrato","En estricto orden consecutivo registre el número del contrato, sin incluir los contratos que fueron anulados ni comodatos."]
[null,null,null,"Una vez terminado el registro de los contratos con cargo a la vigencia 2020, en las siguientes filas registre la información correspondiente a las adiciones efectuadas con cargo a la vigencia 2020 de contratos suscritos en vigencias anteriores, especificando el año de suscripción en la columna dos."]
[null,2,"Año","Registre el año de celebración del contrato."]
[null,3,"Proceso Publicado","Seleccione el aplicativo donde se publicó el proceso (SECOP I / SECOP II)"]
[null,null,"Número de proceso en el SECOP","Relacione el número de proceso con el cual se encuentra publicado el contrato en el SECOP. Ejemplo IDU-CMA-DTDP-240-2020"]
[null,4,"Tipo de Contrato","En esta columna seleccione de la lista el tipo de contrato que corresponde al contrato suscrito. El formato no permite incluir tipo de contratos diferentes a los señaladas en la lista desplegable.  "]
[null,null,null,"Para las adiciones a contratos de años anteriores se debe diligenciar el tipo del contrato adicionado o modificado."]
[null,4,"Obra ","Son contratos de obra los que celebren las entidades estatales para la construcción, mantenimiento, instalación y, en general, para la realización de cualquier otro trabajo material sobre bienes inmuebles, cualquiera que sea la modalidad de ejecución y pago. Numeral 1 del Artículo 32 de la Ley 80 de 1993. "]
[null,null,"Consultoría","Aquellos que celebran las entidades estatales, referidos a los estudios necesarios para la ejecución de proyectos de inversión, de diagnósticos, prefactibilidad o factibilidad para programas o proyectos específicos, así como a las asesorías técnicas de coordinación, control y supervisión. Numeral 2 del Artículo 32 de la Ley 80 de 1993. "]
[null,null,"Interventoría","Son también  contratos de consultoría los que tienen por objeto la Interventoría, asesoría, gerencia de obras o de proyectos, dirección, programación y la ejecución de diseños, planos, anteproyectos y proyectos. Numeral 2 del Artículo 32 de la Ley 80 de 1993."]
[null,null,null,"El contrato de Interventoría tiene por objeto la  supervisión, seguimiento y vigilancia a la ejecución material de un contrato principal."]
[null,null,"Contrato de Prestación de servicios","Son contratos de prestación de servicios los que celebren las entidades estatales para desarrollar actividades relacionadas con la administración o funcionamiento de la entidad. Numeral 3 del Artículo 32 de la Ley 80 de 1993."]
[null,null,"Contrato de Prestación de servicios profesionales y de apoyo a la gestión","Corresponden a aquellos de naturaleza intelectual diferentes a los de consultoría que se derivan del cumplimiento de las funciones de la entidad estatal; así como los relacionados con actividades operativas, logísticas, o asistenciales. Art. 2.2.1.2.1.4.9, Decreto 1082 de 2015"]
[null,null,"Compraventa de bienes muebles","Son aquellos contratos donde se transfiere el dominio de un bien mueble (aquellos susceptibles de ser trasladadas de un lugar a otro sin alterar ni su forma ni su esencia, tal es el caso del mobiliario y equipo de oficina, maquinaria, automóviles, etc.), cuya ejecución se agota de manera instantánea. Artículo 660, Código Civil."]
[null,null,"Compraventa de bienes inmuebles","Son aquellos contratos donde se transfiere el dominio de un bien inmueble (todos aquellos bienes considerados bienes raíces, por tener de común la circunstancia de estar íntimamente ligados al suelo, unidos de modo inseparable, física o jurídicamente, al terreno). Artículo 656, Código Civil."]
[null,null,"Arrendamiento de bienes muebles","Es un contrato que tiene por objeto, conceder el uso y goce de un bien mueble a cambio de un precio determinado.  Artículo 1974 Código Civil."]
[null,null,"Arrendamiento de bienes inmuebles","Es un contrato que tiene por objeto, conceder el uso y goce de un bien inmueble a cambio de un precio determinado.  Artículo 2.2.1.2.1.4.11 Decreto 1082 de 2015"]
[null,null,"Seguros","El seguro es un contrato, en virtud del cual una persona jurídica llamada asegurador, asume, a cambio de una prima, un riesgo que le es trasladado por una persona natural o jurídica llamado tomador y en el cual éste tiene un interés asegurable, con el fin de indemnizarlo, en el evento de que ocurra la realización del riesgo amparado. de conformidad con el Título V, del Libro Cuarto del Código de Comercio "]
[null,null,"Suministro","El suministro es el contrato por el cual una parte se obliga, a cambio de una contraprestación, a cumplir en favor de otra, en forma independiente, prestaciones periódicas o continuadas de cosas o servicios. Artículo 968, Código de Comercio"]
[null,null,"Empréstitos","Son contratos de empréstito los que tienen por objeto proveer a la entidad estatal contratante de recursos en moneda nacional o extranjera con plazo para su pago. Artículo 7,  Decreto 2681 de 1996. "]
[null,null,"Fiducia mercantil o encargo fiduciario","Son contratos que tienen por objeto la administración o el manejo de los recursos vinculados a los contratos que tales entidades celebren. Numeral 5 de Articulo 32 de la Ley 80 de 1993."]
[null,null,"Concesión","Este contrato tiene por objeto otorgar a una persona llamada CONCESIONARIO  la prestación, operación, explotación, organización o gestión, total o parcial, de un servicio público, o la construcción, explotación o conservación total o parcial, de una obra o bien destinados al servicio o uso público, así como todas aquellas actividades necesarias para la adecuada prestación o funcionamiento de la obra o servicio por cuenta y riesgo del CONCESIONARIO, y bajo la vigilancia y control de la entidad concedente, a cambio de una remuneración que puede consistir en derechos, tarifas, tasas, valorización, o en la participación que se le otorgue en la explotación del bien, obra o servicio, o en una suma periódica, única o porcentual, y en general, en cualquier otra modalidad de contraprestación que las partes acuerden. Numeral 4 del Artículo 32 de la Ley 80 de 1993 "]
[null,null,"Convenios de cooperación","Son aquellos mediante los cuales se formaliza la asistencia, ayuda, auxilio, soporte o colaboración entre entidades de una misma nación, de distintos países o por parte de organizaciones internacionales de naturaleza pública o privada a favor de entidades públicas. Artículo 20 de la ley 1150"]
[null,null,"Convenios/Contratos interadministrativos","El convenio interadministrativo es el negocio jurídico en el cual están presentes dos entidades públicas en desarrollo de relaciones interadministrativas cuyo objeto es coordinar, cooperar, colaborar o distribuir competencias en la realización de funciones administrativas de interés común a los sujetos negóciales. Artículo 95 de la ley 489 de 1998."]
[null,null,"Convenios de Apoyo y/o Convenios de Asociación","Los contratos que en desarrollo de lo dispuesto en el segundo inciso del artículo 355 de la Constitución Política celebren la Nación, los Departamentos, Distritos y Municipios con entidades privadas sin ánimo de lucro y de reconocida idoneidad, con el propósito de impulsar programas y actividades de interés público.  Reglamentado mediante Decreto 92 de 2017"]
[null,null,"Asociaciones Público Privadas","Los contratos con personas naturales o jurídicas que se celebran en desarrollo de lo dispuesto en el Decreto 1508 de 2012."]
[null,null,"Otros","Los demás tipos de contratos que no se encuentren definidos en las anteriores tipologías."]
[null,null,"Otros gastos","Incluye los gastos no contractuales, estos se registran al final de la base, no cuentan con número de contrato, tipo, proceso o modalidad.  Estos gastos en los que no media un acuerdo de voluntades, en caso de ser del rubro de inversiòn, se deben discriminar por programa y proyecto. En el caso de ser del rubro de funcionamiento no requieren ser discriminados."]
[null,5,"Modalidad de Selección","Al ubicarse en la celda, se despliega una lista de modalidades de selección, de las cuales debe seleccionar la indicada. El formato no permite incluir modalidades diferentes a las señaladas en la lista desplegable.  "]
[null,null,null,"Para las adiciones a contratos de años anteriores se debe diligenciar la modalidad de selección del contrato adicionado o modificado"]
[null,null,null,"La modalidad régimen especial se refiere a todos los contratos realizados en cumplimiento del Decreto 092 de 2017, convenios de asociaciòn con ESAL. Regimen Privado es para todas aquellas entidades, que no se rigen por el Estatuto General de Contrataciòn, para el caso, en estas entidades todos sus contratos deben ser identificados con esta modalidad."]
[null,6,"Procedimiento o causal","Esta columna solo se habilita y debe ser diligenciada, para las modalidades de selección abreviada y contratación directa. Al ubicarse en la celda, se despliega una lista de procedimientos o causales, de las cuales debe seleccionar la indicada. El formato no permite incluir procedimientos o causales diferentes a las señaladas en la lista desplegable.  "]
[null,7,"Objeto","Registre el objeto del contrato."]
[null,8,"Afectación ","Registre la afectación según la clasificación de cuentas del presupuesto de gastos. Funcionamiento, Inversión y Operación, esta última aplica únicamente para entidades de régimen privado. La celda solamente permite registrar estas tres opciones."]
[null,null,"Planes de Desarrollo Distrital","Seleccionar el PDD de acuerdo con los diferentes contratos suscritos, automáticamente en la columna K se activan  los números de programa de acuerdo al PDD escogido."]
[null,null,"Número Programa","Si en la columna anterior “Afectación”,  indicó funcionamiento u operación deje en blanco el número de programa, es decir esta columna solamente aplica para gastos de Inversión."]
[null,null,null,"Identifíquelo de acuerdo con el código presupuestal de los Planes de Desarrollo \"Bogotá Mejor Para Todos\" o  \"Un Nuevo Contrato Social y Ambiental para la Bogotá del Siglo XXI\". Si un mismo contrato afecta más de un código presupuestal discrimine el contrato por cada código que afecte en filas separadas. Si se registra el número del programa, automáticamente en la columna L y M se despliega el nombre del programa y el eje, pilar o propósito según corresponda. "]
[null,9,"Número Proyecto","Indique el código presupuestal con el que se identifica el proyecto. Si un mismo contrato afecta más de un proyecto, discriminar el contrato por cada proyecto que afecte en filas separadas."]
[null,10,"Número de Identificación del contratista","Indicar el número de identificación del contratista persona natural o jurídica con quien se suscribió el contrato, con digito de verificación (DV), el formato de celda no permite guiones, comas, solo números. "]
[null,null,"Nombre del Contratista","Indicar el nombre del contratista, persona natural o jurídica."]
[]
[null,"2- INFORMACIÓN FINANCIERA"]
[null,11,"Valor Inicial ","Registre el valor inicial del contrato con cargo a la vigencia 2020, el formato de celda no permite guiones, comas o texto. Esta columna solo debe contener información numérica."]
[null,null,null,"En el caso de adiciones a contratos de años anteriores,  no diligencie esta columna, solamente la columna 15 \"Valor Total Adiciones\" "]
[null,null,null,"Excluya las reservas de apropiación y cuentas por pagar."]
[null,12,"Número de reducciones ","Diligencie esta columna solo en el caso de reducciones, reintegros, liberaciones, saldos a favor o cualquier factor que disminuya el valor de los contratos con cargo a la vigencia."]
[null,null,null,"Registre en esta celda la cantidad de reducciones que se realizaron al contrato."]
[null,13,"Valor total reducciones (En valor negativo)","Registre el valor total de las reducciones que se realizaron al contrato, el formato de celda no permite comas o texto. Esta columna solo debe contener información numérica."]
[null,14,"Número de adiciones ","Diligencie esta columna solo en el caso de adiciones al valor inicial que aumenten el valor del contrato con cargo a la vigencia."]
[null,null,null,"Registre en esta celda el número de adiciones que se realizaron al contrato."]
[null,15,"Valor total de adiciones","Registre el valor total de las adiciones que se realizaron al contrato,  el formato de celda no permite guiones, , comas o texto. Esta columna solo debe contener información numérica."]
[null,16,"Valor Final","Esta columna se encuentra formulada y bloqueada, sí el valor final no coincide, es porque están mal diligenciadas las columnas valor inicial, valor de reducciones y/o valor de adiciones. En tal caso se debe verificar dicha información."]
[null,null,null,"La sumatoria de la columna 16 (valor final) para los contratos de Inversión Directa, de funcionamiento y/o operación, cuando aplique, deberán coincidir con el valor del rubro registrado en el encabezado 4, Presupuesto comprometido de inversión según PREDIS, con el encabezado 6, Presupuesto Comprometido Funcionamiento según PREDIS y con el encabezado 8, Presupuesto Comprometido Operación mediante contratos, respectivamente. A la vez, estos valores deben coincidir con los informes de ejecución presupuestal del PREDIS.  "]
[null,null,null,"Si los valores no coinciden debe especificarse al final del formato en qué está representada la diferencia Otros gastos(discriminando los conceptos por Programa y Proyecto de inversión, si es el caso), con sus respectivos valores."]
[null,null,null,"Las bases donde dichos valores no coincidan serán devueltas por la Veeduría Distrital a cada entidad para los respectivos ajustes."]
[null,17,"Giros","Registre el valor total de los giros que se realizaron al contrato,  el formato de celda no permite guiones, comas o texto. Esta columna solo debe contener información numérica."]
[]
[null,"3- PLAZOS"]
[null,18,"Fecha de Suscripción","Relacionar la fecha en que se suscribió el contrato original. La celda solo admite el formato Día/Mes/Año así  17/02/2020."]
[null,null,null,"Para las adiciones a contratos de años anteriores se debe registrar en esta columna la fecha de suscripción de la adición en la vigencia 2020."]
[null,19,"Fecha de inicio","Indicar la fecha de inicio del contrato. Para las adiciones a contratos de años anteriores se debe diligenciar la fecha de inicio de la adición en la vigencia 2020. La celda solo admite el formato Día/Mes/Año así  13/03/2020."]
[null,20,"Fecha de terminación","Indicar la fecha efectiva de terminación del contrato. La celda solo admite el formato Día/Mes/Año así  15/02/2020."]
[null,21,"Plazo en días","Esta columna contiene el plazo inicial del contrato con el número total de días a ejecutar (sólo número de días, no mes, no texto)."]
[null,22,"Número de prórrogas","Registre en esta celda el número de prórrogas que se realizaron al contrato en la vigencia 2020."]
[null,23,"Prórroga en días","En caso de presentarse este evento, indicar en días, el tiempo por el cual se prorrogó el contrato a partir de la fecha inicial de terminación (sólo número de días, no mes, no texto)."]
[]
[null,"4- CESIÓN"]
[null,24,"Número  de Identificación del cesionario\n(NIT con digito de verificación)","Indicar el número de identificación del cesionario persona natural o jurídica con quien se suscribió la cesión, con digito de verificación (DV), el formato de celda no permite guiones o comas, solo números. Si hay más de una cesión adicione una fila y registre número de contrato, año, número proceso contractual SECOP y demás información que corresponda."]
[null,25,"Nombre cesionario","Indicar el nombre del cesionario, persona natural o jurídica."]
[null,26,"Fecha cesión","Relacionar la fecha en que se suscribió la cesión del contrato. La celda solo admite el formato Día/Mes/Año así  17/02/2020."]
[null,27,"Valor cesión","Registre el valor correspondiente a la cesión con cargo a la vigencia 2020, el formato de celda no permite guiones, comas o texto. Esta columna solo debe contener información numérica."]
[]
[null,"5- ESTADO A 31 DE DICIEMBRE DE 2020"]
[null,28,"Estado","Marque con una X en la respectiva columna si el contrato se encuentra Celebrado o por Iniciar, En Ejecución, Terminado o Liquidado."]
[]
[null,"5- PORCENTAJE DE AVANCE Y/O CUMPLIMIENTO"]
[null,29,"% Avance y/o cumplimiento","Indica el porcentaje de avance o de cumplimiento en términos presupuestales, es decir lo efectivamente pagado al contratista. Si no se ha iniciado la ejecución, el % de avance es 0%. La celda se encuentra formulada y protegida. Es la relación entre el valor de los giros y el valor final del contrato. Si el porcentaje de avance no coincide, se debe revisar los valores que se registraron en estas columnas.  Este porcentaje no debe ser superior al 100%"]

{"sheet":"Tipo","index":3,"n_rows":40,"n_cols":4,"rows_kept":40,"cut":false,"hidden":true,"merged":[]}
[null,"Tipo","Modalidad de Selección","afectacion"]
[1,"Obra pública","Concurso de méritos","Funcionamiento"]
[2,"Consultoría","Contratación directa","Inversión"]
[3,"Interventoría","Contratación mínima cuantia","Operación"]
[4,"Contratos de prestación de servicios","Selección abreviada"]
[5,"Contratos de prestación de servicios profesionales y de apoyo a la gestión","Licitación pública"]
[6,"Compraventa de bienes muebles","Régimen privado"]
[7,"Compraventa de bienes inmuebles","Régimen especial"]
[8,"Arrendamiento de bienes muebles"]
[9,"Arrendamiento de bienes inmuebles"]
[10,"Seguros","Selección abreviada"]
[11,"Suministro","Subasta inversa "]
[12,"Empréstitos","Bolsas de productos"]
[13,"Fiducia mercantil o encargo fiduciario","Acuerdo marco de precios "]
[14,"Concesión ","Selección abreviada por menor cuantía "]
[15,"Convenios de cooperacion"]
[16,"Contratos interadministrativos","contratacion directa"]
[17,"Convenios de apoyo y/o convenios de asociación ","Urgencia manifiesta"]
[18,"Asociaciones público privadas","Contratación de empréstitos"]
[19,"Otros","Contratos interadministrativos"]
[20,"Otros gastos","Contratación de bienes y servicios en el sector Defensa y en el Departamento Administrativo de Seguridad, DAS"]
[null,"SECTOR","Contratos para el desarrollo de actividades científicas y tecnológicas"]
[1,"Gestión Pública","Contratos de encargo fiduciario que celebren las entidades territoriales cuando inician el Acuerdo de Reestructuración de Pasivos"]
[{"$f":"+A23+1","v":2},"Gobierno","Cuando no exista pluralidad de oferentes en el mercado"]
[{"$f":"+A24+1","v":3},"Hacienda","Prestación de servicios profesionales y de apoyo a la gestión, o para la ejecución de trabajos artísticos que sólo puedan encomendarse a determinadas personas naturales;"]
[4,"Planeación","El arrendamiento o adquisición de inmuebles"]
[5,"Desarrollo Económico, Industria y Turismo","Contratación de bienes y servicios de la Dirección Nacional de Inteligencia (DNI)"]
[6,"Educación"]
[7,"Salud"]
[8,"Integración Social","Decreto 92 de 2017"]
[9,"Cultura, Recreación y Deporte","No aplica"]
[10,"Ambiente"]
[11,"Movilidad","SECOP I"]
[12,"Hábitat","SECOP II"]
[13,"Mujeres"]
[14,"Seguridad, Convivencia y Justicia","Bogotá Mejor para Todos"]
[15,"Gestión Juridíca","Un Nuevo Contrato Social y Ambiental para la Bogotá del Siglo XXI"]
[16,"descentralizado territorialmente"]
[]
[null,"16 - AL"]

{"sheet":"Eje_Pilar_Prop","index":4,"n_rows":104,"n_cols":5,"rows_kept":104,"cut":false,"hidden":true,"merged":[]}
[]
[null,"PDD","No. Programa","Programa","Pilar /Eje / propósito"]
[null,"Bogotá Mejor para Todos",1,"Prevención y atención de la maternidad y la paternidad tempranas","Pilar 1 Igualdad de Calidad de Vida"]
[null,"Bogotá Mejor para Todos",2,"Desarrollo integral desde la gestación hasta la adolescencia","Pilar 1 Igualdad de Calidad de Vida"]
[null,"Bogotá Mejor para Todos",3,"Igualdad y autonomía para una Bogotá incluyente","Pilar 1 Igualdad de Calidad de Vida"]
[null,"Bogotá Mejor para Todos",4,"Familias protegidas y adaptadas al cambio climático","Pilar 1 Igualdad de Calidad de Vida"]
[null,"Bogotá Mejor para Todos",5,"Desarrollo integral para la felicidad y el ejercicio de la ciudadanía","Pilar 1 Igualdad de Calidad de Vida"]
[null,"Bogotá Mejor para Todos",6,"Calidad educativa para todos","Pilar 1 Igualdad de Calidad de Vida"]
[null,"Bogotá Mejor para Todos",7,"Inclusión educativa para la equidad","Pilar 1 Igualdad de Calidad de Vida"]
[null,"Bogotá Mejor para Todos",8,"Acceso con calidad a la educación superior","Pilar 1 Igualdad de Calidad de Vida"]
[null,"Bogotá Mejor para Todos",9,"Atención integral y eficiente en salud","Pilar 1 Igualdad de Calidad de Vida"]
[null,"Bogotá Mejor para Todos",10,"Modernización de la infraestructura física y tecnológica en salud","Pilar 1 Igualdad de Calidad de Vida"]
[null,"Bogotá Mejor para Todos",11,"Mejores oportunidades para el desarrollo a través de la cultura, la recreación y el deporte","Pilar 1 Igualdad de Calidad de Vida"]
[null,"Bogotá Mejor para Todos",12,"Mujeres protagonistas, activas y empoderadas en el cierre de brechas de género","Pilar 1 Igualdad de Calidad de Vida"]
[null,"Bogotá Mejor para Todos",13,"Infraestructura para el desarrollo del hábitat","Pilar 2 Democracía Urbana"]
[null,"Bogotá Mejor para Todos",14,"Intervenciones integrales del hábitat","Pilar 2 Democracía Urbana"]
[null,"Bogotá Mejor para Todos",15,"Recuperación, incorporación, vida urbana y control de la ilegalidad","Pilar 2 Democracía Urbana"]
[null,"Bogotá Mejor para Todos",16,"Integración social para una ciudad de oportunidades","Pilar 2 Democracía Urbana"]
[null,"Bogotá Mejor para Todos",17,"Espacio público, derecho de todos","Pilar 2 Democracía Urbana"]
[null,"Bogotá Mejor para Todos",18,"Mejor movilidad para todos","Pilar 2 Democracía Urbana"]
[null,"Bogotá Mejor para Todos",19,"Seguridad y convivencia para todos","Pilar 3 Construcción de Comunidad y Cultura Ciudadana"]
[null,"Bogotá Mejor para Todos",20,"Fortalecimiento del Sistema de Protección Integral a Mujeres Víctimas de Violencia - SOFIA","Pilar 3 Construcción de Comunidad y Cultura Ciudadana"]
[null,"Bogotá Mejor para Todos",21,"Justicia para todos: consolidación del Sistema Distrital de Justicia","Pilar 3 Construcción de Comunidad y Cultura Ciudadana"]
[null,"Bogotá Mejor para Todos",22,"Bogotá vive los derechos humanos","Pilar 3 Construcción de Comunidad y Cultura Ciudadana"]
[null,"Bogotá Mejor para Todos",23,"Bogotá mejor para las víctimas, la paz y la reconciliación","Pilar 3 Construcción de Comunidad y Cultura Ciudadana"]
[null,"Bogotá Mejor para Todos",24,"Equipo por la educación para el reencuentro, la reconciliación y la paz","Pilar 3 Construcción de Comunidad y Cultura Ciudadana"]
[null,"Bogotá Mejor para Todos",25,"Cambio cultural y construcción del tejido social para la vida","Pilar 3 Construcción de Comunidad y Cultura Ciudadana"]
[null,"Bogotá Mejor para Todos",26,"Información relevante e integral para la planeación territorial","Eje Transversal 1 Nuevo Ordenamiento Territorial"]
[null,"Bogotá Mejor para Todos",27,"Proyectos urbanos integrales con visión de ciudad","Eje Transversal 1 Nuevo Ordenamiento Territorial"]
[null,"Bogotá Mejor para Todos",28,"Suelo para reducir el déficit habitacional de suelo urbanizable, vivienda y soportes urbanos","Eje Transversal 1 Nuevo Ordenamiento Territorial"]
[null,"Bogotá Mejor para Todos",29,"Articulación regional y planeación integral del transporte","Eje Transversal 1 Nuevo Ordenamiento Territorial"]
[null,"Bogotá Mejor para Todos",30,"Financiación para el Desarrollo Territorial","Eje Transversal 1 Nuevo Ordenamiento Territorial"]
[null,"Bogotá Mejor para Todos",31,"Fundamentar el desarrollo económico en la generación y uso del conocimiento para mejorar la competitividad de la Ciudad Región","Eje Transversal 2 Desarrollo Económico basado en el conocimiento"]
[null,"Bogotá Mejor para Todos",32,"Generar alternativas de ingreso y empleo de mejor calidad","Eje Transversal 2 Desarrollo Económico basado en el conocimiento"]
[null,"Bogotá Mejor para Todos",33,"Elevar la eficiencia de los mercados de la ciudad","Eje Transversal 2 Desarrollo Económico basado en el conocimiento"]
[null,"Bogotá Mejor para Todos",34,"Mejorar y fortalecer el recaudo tributario de la ciudad e impulsar el uso de mecanismos de vinculación de capital privado","Eje Transversal 2 Desarrollo Económico basado en el conocimiento"]
[null,"Bogotá Mejor para Todos",35,"Bogotá, ciudad inteligente","Eje Transversal 2 Desarrollo Económico basado en el conocimiento"]
[null,"Bogotá Mejor para Todos",36,"Bogotá, una ciudad digital","Eje Transversal 2 Desarrollo Económico basado en el conocimiento"]
[null,"Bogotá Mejor para Todos",37,"Consolidar el turismo como factor de desarrollo, confianza y felicidad para Bogotá Región","Eje Transversal 2 Desarrollo Económico basado en el conocimiento"]
[null,"Bogotá Mejor para Todos",38,"Recuperación y manejo de la Estructura Ecológica Principal","Eje Transversal 3 Sostenibilidad Ambiental basada en la eficiencia energética"]
[null,"Bogotá Mejor para Todos",39,"Ambiente sano para la equidad y disfrute del ciudadano","Eje Transversal 3 Sostenibilidad Ambiental basada en la eficiencia energética"]
[null,"Bogotá Mejor para Todos",40,"Gestión de la huella ambiental urbana","Eje Transversal 3 Sostenibilidad Ambiental basada en la eficiencia energética"]
[null,"Bogotá Mejor para Todos",41,"Desarrollo rural sostenible","Eje Transversal 3 Sostenibilidad Ambiental basada en la eficiencia energética"]
[null,"Bogotá Mejor para Todos",42,"Transparencia, gestión pública y servicio a la ciudadanía","Eje Transversal 4 Gobierno Legitimo, Fortalecimiento Local y Eficiencia"]
[null,"Bogotá Mejor para Todos",43,"Modernización institucional","Eje Transversal 4 Gobierno Legitimo, Fortalecimiento Local y Eficiencia"]
[null,"Bogotá Mejor para Todos",44,"Gobierno y ciudadanía digital","Eje Transversal 4 Gobierno Legitimo, Fortalecimiento Local y Eficiencia"]
[null,"Bogotá Mejor para Todos",45,"Gobernanza e influencia local, regional e internacional","Eje Transversal 4 Gobierno Legitimo, Fortalecimiento Local y Eficiencia"]
["Acuerdo 761 2020","Un Nuevo Contrato Social y Ambiental para la Bogotá del Siglo XXI","1.","Subsidios y transferencias para la equidad","Propósito 1: Hacer un nuevo contrato social para incrementar la inclusión social, productiva y política"]
["Pag. 51","Un Nuevo Contrato Social y Ambiental para la Bogotá del Siglo XXI","2.","Igualdad de oportunidades y desarrollo de capacidades para las mujeres","Propósito 1: Hacer un nuevo contrato social para incrementar la inclusión social, productiva y política"]
[null,"Un Nuevo Contrato Social y Ambiental para la Bogotá del Siglo XXI","3.","Movilidad social integral","Propósito 1: Hacer un nuevo contrato social para incrementar la inclusión social, productiva y política"]
[null,"Un Nuevo Contrato Social y Ambiental para la Bogotá del Siglo XXI","4.","Prevención de la exclusión por razones étnicas, religiosas, sociales, políticas y de orientación sexual","Propósito 1: Hacer un nuevo contrato social para incrementar la inclusión social, productiva y política"]
[null,"Un Nuevo Contrato Social y Ambiental para la Bogotá del Siglo XXI","5.","Promoción de la igualdad, el desarrollo de capacidades y el reconocimiento de las mujeres","Propósito 1: Hacer un nuevo contrato social para incrementar la inclusión social, productiva y política"]
[null,"Un Nuevo Contrato Social y Ambiental para la Bogotá del Siglo XXI","6.","Sistema Distrital de Cuidado","Propósito 1: Hacer un nuevo contrato social para incrementar la inclusión social, productiva y política"]
[null,"Un Nuevo Contrato Social y Ambiental para la Bogotá del Siglo XXI","7.","Mejora de la gestión de instituciones de salud","Propósito 1: Hacer un nuevo contrato social para incrementar la inclusión social, productiva y política"]
[null,"Un Nuevo Contrato Social y Ambiental para la Bogotá del Siglo XXI","8.","Prevención y atención de maternidad temprana","Propósito 1: Hacer un nuevo contrato social para incrementar la inclusión social, productiva y política"]
[null,"Un Nuevo Contrato Social y Ambiental para la Bogotá del Siglo XXI","9.","Prevención y cambios para mejorar la salud de la población","Propósito 1: Hacer un nuevo contrato social para incrementar la inclusión social, productiva y política"]
[null,"Un Nuevo Contrato Social y Ambiental para la Bogotá del Siglo XXI","10.","Salud para la vida y el bienestar","Propósito 1: Hacer un nuevo contrato social para incrementar la inclusión social, productiva y política"]
[null,"Un Nuevo Contrato Social y Ambiental para la Bogotá del Siglo XXI","11.","Salud y bienestar para niñas y niños","Propósito 1: Hacer un nuevo contrato social para incrementar la inclusión social, productiva y política"]
[null,"Un Nuevo Contrato Social y Ambiental para la Bogotá del Siglo XXI","12.","Educación inicial: Bases sólidas para la vida.","Propósito 1: Hacer un nuevo contrato social para incrementar la inclusión social, productiva y política"]
[null,"Un Nuevo Contrato Social y Ambiental para la Bogotá del Siglo XXI","13.","Educación para todos y todas: acceso y permanencia con equidad y énfasis en educación rural","Propósito 1: Hacer un nuevo contrato social para incrementar la inclusión social, productiva y política"]
[null,"Un Nuevo Contrato Social y Ambiental para la Bogotá del Siglo XXI","14.","Formación integral: más y mejor tiempo en los colegios","Propósito 1: Hacer un nuevo contrato social para incrementar la inclusión social, productiva y política"]
[null,"Un Nuevo Contrato Social y Ambiental para la Bogotá del Siglo XXI","15.","Plan Distrital de Lectura, Escritura y Oralidad: \"Leer para la vida\"","Propósito 1: Hacer un nuevo contrato social para incrementar la inclusión social, productiva y política"]
[null,"Un Nuevo Contrato Social y Ambiental para la Bogotá del Siglo XXI","16.","Transformación pedagógica y mejoramiento de la gestión educativa. Es con los maestros y maestras.","Propósito 1: Hacer un nuevo contrato social para incrementar la inclusión social, productiva y política"]
[null,"Un Nuevo Contrato Social y Ambiental para la Bogotá del Siglo XXI","17.","Jóvenes con capacidades: Proyecto de vida para la ciudadanía, la innovación y el trabajo del siglo XXI","Propósito 1: Hacer un nuevo contrato social para incrementar la inclusión social, productiva y política"]
[null,"Un Nuevo Contrato Social y Ambiental para la Bogotá del Siglo XXI","18.","Cierre de brechas para la inclusión productiva urbano rural","Propósito 1: Hacer un nuevo contrato social para incrementar la inclusión social, productiva y política"]
[null,"Un Nuevo Contrato Social y Ambiental para la Bogotá del Siglo XXI","19.","Vivienda y entornos dignos en el territorio urbano y rural","Propósito 1: Hacer un nuevo contrato social para incrementar la inclusión social, productiva y política"]
[null,"Un Nuevo Contrato Social y Ambiental para la Bogotá del Siglo XXI","20.","Bogotá, referente en cultura, deporte, recreación y actividad física, con parques para el desarrollo y la salud","Propósito 1: Hacer un nuevo contrato social para incrementar la inclusión social, productiva y política"]
[null,"Un Nuevo Contrato Social y Ambiental para la Bogotá del Siglo XXI","21.","Creación y vida cotidiana: Apropiación ciudadana del arte, la cultura y el patrimonio, para la democracia cultural","Propósito 1: Hacer un nuevo contrato social para incrementar la inclusión social, productiva y política"]
[null,"Un Nuevo Contrato Social y Ambiental para la Bogotá del Siglo XXI","22.","Transformación cultural para la conciencia ambiental y el cuidado de la fauna doméstica","Propósito 1: Hacer un nuevo contrato social para incrementar la inclusión social, productiva y política"]
[null,"Un Nuevo Contrato Social y Ambiental para la Bogotá del Siglo XXI","23.","Bogotá rural","Propósito 1: Hacer un nuevo contrato social para incrementar la inclusión social, productiva y política"]
[null,"Un Nuevo Contrato Social y Ambiental para la Bogotá del Siglo XXI","24.","Bogotá región emprendedora e innovadora","Propósito 1: Hacer un nuevo contrato social para incrementar la inclusión social, productiva y política"]
[null,"Un Nuevo Contrato Social y Ambiental para la Bogotá del Siglo XXI","25.","Bogotá región productiva y competitiva","Propósito 1: Hacer un nuevo contrato social para incrementar la inclusión social, productiva y política"]
[null,"Un Nuevo Contrato Social y Ambiental para la Bogotá del Siglo XXI","26.","Bogotá - región, el mejor destino para visitar","Propósito 1: Hacer un nuevo contrato social para incrementar la inclusión social, productiva y política"]
[null,"Un Nuevo Contrato Social y Ambiental para la Bogotá del Siglo XXI","27.","Cambio cultural para la gestión de la crisis climática","Propósito 2 : Cambiar Nuestros Hábitos de Vida para Reverdecer a Bogotá y Adaptarnos y Mitigar la Crisis Climática"]
[null,"Un Nuevo Contrato Social y Ambiental para la Bogotá del Siglo XXI","28.","Bogotá protectora de sus recursos naturales","Propósito 2 : Cambiar Nuestros Hábitos de Vida para Reverdecer a Bogotá y Adaptarnos y Mitigar la Crisis Climática"]
[null,"Un Nuevo Contrato Social y Ambiental para la Bogotá del Siglo XXI","29.","Asentamientos y entornos protectores","Propósito 2 : Cambiar Nuestros Hábitos de Vida para Reverdecer a Bogotá y Adaptarnos y Mitigar la Crisis Climática"]
[null,"Un Nuevo Contrato Social y Ambiental para la Bogotá del Siglo XXI","30.","Eficiencia en la atención de emergencias","Propósito 2 : Cambiar Nuestros Hábitos de Vida para Reverdecer a Bogotá y Adaptarnos y Mitigar la Crisis Climática"]
[null,"Un Nuevo Contrato Social y Ambiental para la Bogotá del Siglo XXI","31."," Protección y valoración del patrimonio tangible e intangible en Bogotá y la región","Propósito 2 : Cambiar Nuestros Hábitos de Vida para Reverdecer a Bogotá y Adaptarnos y Mitigar la Crisis Climática"]
[null,"Un Nuevo Contrato Social y Ambiental para la Bogotá del Siglo XXI","32.","Revitalización urbana para la competitividad","Propósito 2 : Cambiar Nuestros Hábitos de Vida para Reverdecer a Bogotá y Adaptarnos y Mitigar la Crisis Climática"]
[null,"Un Nuevo Contrato Social y Ambiental para la Bogotá del Siglo XXI","33.","Más árboles y más y mejor espacio público","Propósito 2 : Cambiar Nuestros Hábitos de Vida para Reverdecer a Bogotá y Adaptarnos y Mitigar la Crisis Climática"]
[null,"Un Nuevo Contrato Social y Ambiental para la Bogotá del Siglo XXI","34.","Bogotá protectora de los animales","Propósito 2 : Cambiar Nuestros Hábitos de Vida para Reverdecer a Bogotá y Adaptarnos y Mitigar la Crisis Climática"]
[null,"Un Nuevo Contrato Social y Ambiental para la Bogotá del Siglo XXI","35.","Manejo y prevención de contaminación","Propósito 2 : Cambiar Nuestros Hábitos de Vida para Reverdecer a Bogotá y Adaptarnos y Mitigar la Crisis Climática"]
[null,"Un Nuevo Contrato Social y Ambiental para la Bogotá del Siglo XXI","36.","Manejo y saneamiento de los cuerpos de agua","Propósito 2 : Cambiar Nuestros Hábitos de Vida para Reverdecer a Bogotá y Adaptarnos y Mitigar la Crisis Climática"]
[null,"Un Nuevo Contrato Social y Ambiental para la Bogotá del Siglo XXI","37.","Provisión y mejoramiento de servicios públicos","Propósito 2 : Cambiar Nuestros Hábitos de Vida para Reverdecer a Bogotá y Adaptarnos y Mitigar la Crisis Climática"]
[null,"Un Nuevo Contrato Social y Ambiental para la Bogotá del Siglo XXI","38.","Ecoeficiencia, reciclaje, manejo de residuos e inclusión de la población recicladora","Propósito 2 : Cambiar Nuestros Hábitos de Vida para Reverdecer a Bogotá y Adaptarnos y Mitigar la Crisis Climática"]
[null,"Un Nuevo Contrato Social y Ambiental para la Bogotá del Siglo XXI","39.","Bogotá territorio de paz y atención integral a las víctimas del conflicto armado","Propósito 3: Inspirar confianza y legitimidad para vivir sin miedo y ser epicentro de cultura ciudadana, paz y reconciliación"]
[null,"Un Nuevo Contrato Social y Ambiental para la Bogotá del Siglo XXI","40.","Más mujeres viven una vida libre de violencias, se sienten seguras y acceden con confianza al sistema de justicia","Propósito 3: Inspirar confianza y legitimidad para vivir sin miedo y ser epicentro de cultura ciudadana, paz y reconciliación"]
[null,"Un Nuevo Contrato Social y Ambiental para la Bogotá del Siglo XXI","41.","Sin machismo ni violencias contra las mujeres, las niñas y los niños","Propósito 3: Inspirar confianza y legitimidad para vivir sin miedo y ser epicentro de cultura ciudadana, paz y reconciliación"]
[null,"Un Nuevo Contrato Social y Ambiental para la Bogotá del Siglo XXI","42.","Conciencia y cultura ciudadana para la seguridad, la convivencia y la construcción de confianza","Propósito 3: Inspirar confianza y legitimidad para vivir sin miedo y ser epicentro de cultura ciudadana, paz y reconciliación"]
[null,"Un Nuevo Contrato Social y Ambiental para la Bogotá del Siglo XXI","43.","Cultura ciudadana para la confianza, la convivencia y la participación desde la vida cotidiana","Propósito 3: Inspirar confianza y legitimidad para vivir sin miedo y ser epicentro de cultura ciudadana, paz y reconciliación"]
[null,"Un Nuevo Contrato Social y Ambiental para la Bogotá del Siglo XXI","44.","Autoconciencia, respeto y cuidado en el espacio público","Propósito 3: Inspirar confianza y legitimidad para vivir sin miedo y ser epicentro de cultura ciudadana, paz y reconciliación"]
[null,"Un Nuevo Contrato Social y Ambiental para la Bogotá del Siglo XXI","45.","Espacio público más seguro y construido colectivamente","Propósito 3: Inspirar confianza y legitimidad para vivir sin miedo y ser epicentro de cultura ciudadana, paz y reconciliación"]
[null,"Un Nuevo Contrato Social y Ambiental para la Bogotá del Siglo XXI","46.","Atención a jóvenes y adultos infractores con impacto en su proyecto de vida","Propósito 3: Inspirar confianza y legitimidad para vivir sin miedo y ser epicentro de cultura ciudadana, paz y reconciliación"]
[null,"Un Nuevo Contrato Social y Ambiental para la Bogotá del Siglo XXI","47.","Calidad de Vida y Derechos de la Población privada de la libertad","Propósito 3: Inspirar confianza y legitimidad para vivir sin miedo y ser epicentro de cultura ciudadana, paz y reconciliación"]
[null,"Un Nuevo Contrato Social y Ambiental para la Bogotá del Siglo XXI","48.","Plataforma institucional para la seguridad y justicia","Propósito 3: Inspirar confianza y legitimidad para vivir sin miedo y ser epicentro de cultura ciudadana, paz y reconciliación"]
[null,"Un Nuevo Contrato Social y Ambiental para la Bogotá del Siglo XXI","49.","Movilidad segura, sostenible y accesible","Propósito 4: Hacer de Bogotá Región un modelo de movilidad multimodal, incluyente y sostenible"]
[null,"Un Nuevo Contrato Social y Ambiental para la Bogotá del Siglo XXI","50.","Red de metros","Propósito 4: Hacer de Bogotá Región un modelo de movilidad multimodal, incluyente y sostenible"]
[null,"Un Nuevo Contrato Social y Ambiental para la Bogotá del Siglo XXI","51.","Gobierno Abierto","Propósito 5: Construir Bogotá - Región con gobierno abierto, transparente y ciudadanía consciente"]
[null,"Un Nuevo Contrato Social y Ambiental para la Bogotá del Siglo XXI","52.","Integración regional, distrital y local","Propósito 5: Construir Bogotá - Región con gobierno abierto, transparente y ciudadanía consciente"]
[null,"Un Nuevo Contrato Social y Ambiental para la Bogotá del Siglo XXI","53.","Información para la toma de decisiones","Propósito 5: Construir Bogotá - Región con gobierno abierto, transparente y ciudadanía consciente"]
[null,"Un Nuevo Contrato Social y Ambiental para la Bogotá del Siglo XXI","54.","Transformación digital y gestión de TIC para un territorio inteligente","Propósito 5: Construir Bogotá - Región con gobierno abierto, transparente y ciudadanía consciente"]
[null,"Un Nuevo Contrato Social y Ambiental para la Bogotá del Siglo XXI","55.","Fortalecimiento de cultura ciudadana y su institucionalidad","Propósito 5: Construir Bogotá - Región con gobierno abierto, transparente y ciudadanía consciente"]
[null,"Un Nuevo Contrato Social y Ambiental para la Bogotá del Siglo XXI","56.","Gestión pública efectiva","Propósito 5: Construir Bogotá - Región con gobierno abierto, transparente y ciudadanía consciente"]
[null,"Un Nuevo Contrato Social y Ambiental para la Bogotá del Siglo XXI","57.","Gestión pública local","Propósito 5: Construir Bogotá - Región con gobierno abierto, transparente y ciudadanía consciente"]