{"text_format":"1","workbook":"xlsx","n_sheets":5,"sheets":["HOJA DE TRABAJO","Formato2020 ","Instructivo","Tipo","Eje_Pilar_Prop"],"not_rendered":{"charts":0,"images":1,"macros":1,"external_links":2,"defined_names":21,"comments":1,"pivot_tables":2},"unopened":[],"bounds":{"document_bytes":16777216,"sheet_cells":100000,"rows_first":2000,"rows_last":500,"rows_between":2000,"halvings":0,"cell_chars":16384,"cell_head_chars":4096},"cells_cut":0,"cells_raw":0,"read":"whole","date_system":"1900"}

{"sheet":"HOJA DE TRABAJO","index":0,"n_rows":82,"n_cols":8,"rows_kept":82,"cut":false,"hidden":false,"merged":[[2,7,3,7],[43,7,44,7],[41,4,41,7],[0,4,0,7]]}
[null,null,null,null,"REGISTROS"]
[]
["Etiquetas de fila","Suma de Valor Final ",null,null,"COMPROMISO","COMPROMISO ACUMULADO","SUMATORIA CONTRATOS FDLCH","DIFERENCIA"]
[1293,211330439,null,null,"RUBRO","PREDIS","FORMATO"]
[1294,2186614540,null,null,"FUNCIONAMIETO",2464019807,{"$f":"SUM(B17:B40)","v":2464019807},{"$f":"+F5-G5","v":0}]
[1295,181965000,null,null,"INVERSION DIRECTA",{"$f":"SUM(F7:F19)","v":18400660685},{"$f":"SUM(B4:B16)","v":18400660685},{"$f":"+F6-G6","v":0}]
[1296,482708685,null,null,"1293 - Contribuir en el desarrollo de la primera i  ",211330439,{"$f":"+GETPIVOTDATA(\"Valor Final \",$A$3,\"Número Proyecto\",1293)","v":211330439},0]
[1297,110000000,null,null,"1294 - Fortalecimiento a las personas mayores     ",2186614540,{"$f":"+GETPIVOTDATA(\"Valor Final \",$A$3,\"Número Proyecto\",1294)","v":2186614540},0]
[1298,652384456,null,null,"1295 - Brindar acciones integrales, para personas     ",181965000,{"$f":"+GETPIVOTDATA(\"Valor Final \",$A$3,\"Número Proyecto\",1295)","v":181965000},0]
[1299,70600000,null,null,"1296 - Reducción y mitigación del riesgo frente al   ",482708685,{"$f":"+GETPIVOTDATA(\"Valor Final \",$A$3,\"Número Proyecto\",1296)","v":482708685},0]
[1300,77145000,null,null,"1297 - Por un territorio educado, incluyente y div   ",110000000,{"$f":"+GETPIVOTDATA(\"Valor Final \",$A$3,\"Número Proyecto\",1297)","v":110000000},0]
[1301,3847273671,null,null,"1298 - Cultura y deporte: transformando vidas y ha   ",652384456,{"$f":"+GETPIVOTDATA(\"Valor Final \",$A$3,\"Número Proyecto\",1298)","v":652384456},0]
[1302,1058083851,null,null,"1299 - Asesoría para legalización de barrios y tit   ",70600000,{"$f":"+GETPIVOTDATA(\"Valor Final \",$A$3,\"Número Proyecto\",1299)","v":70600000},0]
[1303,381576497,null,null,"1300 - Adecuación y mantenimiento de parques     ",77145000,{"$f":"+GETPIVOTDATA(\"Valor Final \",$A$3,\"Número Proyecto\",1300)","v":77145000},0]
[1304,2498798384,null,null,"1301 - Mejorar la calidad de la movilidad    ",3847273671,{"$f":"+GETPIVOTDATA(\"Valor Final \",$A$3,\"Número Proyecto\",1301)","v":3847273671},0]
{"$rows_left_out":68}
{"sheet":"Formato2020 ","index":1,"n_rows":309,"n_cols":49,"rows_kept":309,"cut":false,"hidden":false,"merged":[[7,29,7,30],[11,33,11,36],[10,29,10,32],[5,31,5,37],[6,31,6,37],[7,31,7,37],[8,31,8,37],[9,31,9,37],[9,29,9,30],[10,33,10,36],[8,10,9,15],[8,29,8,30],[9,0,9,3],[9,5,9,7],[11,14,11,15],[10,0,10,15],[10,16,10,22],[10,23,10,28],[11,2,11,3],[11,8,11,12],[8,0,8,3],[8,5,8,7],[1,0,1,37],[2,0,2,37],[4,0,4,3],[4,8,4,10],[4,14,4,15],[4,22,4,37],[5,0,5,3],[5,8,5,10],[5,29,5,30],[6,0,6,3],[6,8,6,10],[6,29,6,30]]}
[]
["VEEDURIA DISTRITAL - RENDICION DE CUENTAS DE LA GESTION CONTRACTUAL EN EL DISTRITO CAPITAL (Acuerdo 380 de 2009)"]
["INFORMACION GENERAL DE CONTRATACION ENTIDADES DISTRITALES  -  ENERO 1 A 31 DICIEMBRE DE 2020"]
[]
["1. Entidad",null,null,null,"FONDO DE DESARROLLO LOCAL DE CHAPINERO",null,null,"2. Sector","Gobierno"]
["3. Presupuesto Disponible Inversión Directa PREDIS",null,null,null,18785956671,null,null,"5. Presupuesto Disponible Funcionamiento PREDIS",2283000000,null,null,null,null,null,null,null,null,null,null,null,null,null,null,null,null,null,null,null,null,"9. Nombre de quien diligencia el formato",null,"MARYARY SUNED QUINCHE SÁNCHEZ"]
["4. Presupuesto Comprometido de Inversión Directa según PREDIS ",null,null,null,18400660685,null,null,"6. Presupuesto Comprometido Funcionamiento según PREDIS",2077679242,null,null,null,null,null,null,null,null,null,null,null,null,null,null,null,null,null,null,null,null,"Cargo",null,"APOYO TÉCNICO"]
[null,null,null,null,null,null,null,null,null,null,null,null,null,null,null,null,null,null,null,null,null,null,null,null,null,null,null,null,null,"Dependencia",null,"ÁREA GESTIÓN DEL DESARROLLO LOCAL"]
["7. Presupuesto Disponible Operación (Régimen Privado)",null,null,null,null,null,null,null,null,null,null,null,null,null,null,null,null,null,null,null,null,null,null,null,null,null,null,null,null,"Teléfono",null,"3820660 - 3387000"]
["8. Presupuesto Comprometido Operación mediante contratos",null,null,null,null,null,null,null,null,null,null,null,null,null,null,null,null,null,null,null,null,null,null,null,null,null,null,null,null,"Correo Electrónico",null,"maryary.quinche@gobiernobogota.gov.co"]
["1- INFORMACION GENERAL",null,null,null,null,null,null,null,null,null,null,null,null,null,null,null,"2- INFORMACION FINANCIERA",null,null,null,null,null,null,"3 - PLAZOS ",null,null,null,null,null,"4. CESION",null,null,null,null,null,null,null,"5. %  Avance y/o cumplimiento"]
[1,2,3,null,4,null,6,7,8,null,null,null,null,9,10,null,11,12,13,14,15,16,17,18,19,20,21,22,23,24,25,26,27,null,null,null,null,29]
["Número Contrato","Año","Proceso Publicado en","Número de proceso contractual \nSECOP","Tipo de contrato ","Modalidad de Selección","Procedimiento o causal","Objeto","Afectación","Plan de Desarrollo Distrital","Número Programa","Equivalencia número de programa","Eje / Pilar / Propósito","Número Proyecto","Número  de Identificación del contratista\n(NIT con digito de verificación)","Nombre del contratista","Valor Inicial del contrato","Número de reducciones","Valor total reducciones \n(En valor negativo)","Número de adiciones","Valor total de adiciones ","Valor Final ","Giros\n(Valor en pesos)","Fecha de suscripción (DD/MM/AAAA)","Fecha de inicio (DD/MM/AAAA)","Fecha de terminación (DD/MM/AAAA)","Plazo en días","Número de prórrogas","Prorroga en días","Número  de Identificación del cesionario\n(NIT con digito de verificación)","Nombre cesionario","Fecha cesión\n(DD/MM/AAAA)","Valor cesión","Celebrado o por iniciar","En Ejecución","Terminado","Liquidado","% Avance y/o Cumplimiento",null,null,"Total Contratos","Validación Tipo","Validación Modalidad","Validación procedimiento","Validación afectación","Validación programa","secop","Fecha suscripción","PDD"]
["FDLCH-CPS-001-2020",2020,"SECOP II","CPS-001-2020","Contratos de prestación de servicios profesionales y de apoyo a la gestión","Contratación directa","Prestación de servicios profesionales y de apoyo a la gestión, o para la ejecución de trabajos artísticos que sólo puedan encomendarse a determinadas personas naturales;","PRESTACIÓN DE SERVICIOS PROFESIONALES PARA APOYAR LA GESTIÓN CONTRACTUAL A CARGO DEL ÁREA DE GESTIÓN DEL DESARROLLO LOCAL DE LA ALCALDÍA LOCAL DE CHAPINERO","Inversión","Bogotá Mejor para Todos",45,{"$f":"IF(ISERROR(VLOOKUP(K14,Eje_Pilar_Prop!$C$2:$E$104,2,FALSE)),\" \",VLOOKUP(K14,Eje_Pilar_Prop!$C$2:$E$104,2,FALSE))","v":"Gobernanza e influencia local, regional e internacional"},{"$f":"IF(ISERROR(VLOOKUP(K14,Eje_Pilar_Prop!$C$2:$E$104,3,FALSE)),\" \",VLOOKUP(K14,Eje_Pilar_Prop!$C$2:$E$104,3,FALSE))","v":"Eje Transversal 4 Gobierno Legitimo, Fortalecimiento Local y Eficiencia"},1304,1078368894,"JENNYFER PAOLA GALVIS TORRES",22050000,1,-1102050,2,11025000,{"$f":"+Q14+S14+U14","v":31972950},31972500,"2020-01-21","2020-01-22","2020-07-15",120,2,60,null,null,null,null,null,null,"X",null,{"$f":"IF(ISERROR(W14/V14),\"-\",(W14/V14))","v":0.99998592560273603},null,null,{"$f":"IF(SUMPRODUCT((A$14:A14=A14)*(B$14:B14=B14)*(D$14:D14=D14))>1,0,1)","v":1},{"$f":"IF(ISBLANK(E14),1,IFERROR(VLOOKUP(E14,tipo,1,FALSE),\"NO\"))","v":"Contratos de prestación de servicios profesionales y de apoyo a la gestión"},{"$f":"IF(ISBLANK(F14),1,IFERROR(VLOOKUP(F14,modal,1,FALSE),\"NO\"))","v":"Contratación directa"},{"$f":"IF(ISBLANK(G14),1,IFERROR(VLOOKUP(G14,Tipo!$C$12:$C$27,1,FALSE),\"NO\"))","v":"Prestación de servicios profesionales y de apoyo a la gestión, o para la ejecución de trabajos artísticos que sólo puedan encomendarse a determinadas personas naturales;"},{"$f":"IF(ISBLANK(I14),1,IFERROR(VLOOKUP(I14,afectacion,1,FALSE),\"NO\"))","v":"Inversión"},{"$f":"IF(ISBLANK(K14),1,IFERROR(VLOOKUP(K14,Eje_Pilar_Prop!$C$3:$C$104,1,FALSE),\"NO\"))","v":45},{"$f":"IF(ISBLANK(C14),1,IFERROR(VLOOKUP(C14,SECOP,1,FALSE),\"NO\"))","v":"SECOP II"},{"$f":"IF(OR(YEAR(X14)=2020,ISBLANK(X14)),1,\"NO\")","v":1},{"$f":"IF(ISBLANK(J14),1,IFERROR(VLOOKUP(J14,pdd,1,FALSE),\"NO\"))","v":"Bogotá Mejor para Todos"}]
["FDLCH-CPS-002-2020",2020,"SECOP II","CPS-002-2020","Contratos de prestación de servicios profesionales y de apoyo a la gestión","Contratación directa","Prestación de servicios profesionales y de apoyo a la gestión, o para la ejecución de trabajos artísticos que sólo puedan encomendarse a determinadas personas naturales;","PRESTACIÓN DE SERVICIOS PROFESIONALES PARA APOYAR LA GESTIÓN CONTRACTUAL A CARGO DEL ÁREA DE GESTIÓN DEL DESARROLLO LOCAL DE LA ALCALDÍA LOCAL DE CHAPINERO","Inversión","Bogotá Mejor para Todos",45,{"$f":"IF(ISERROR(VLOOKUP(K15,Eje_Pilar_Prop!$C$2:$E$104,2,FALSE)),\" \",VLOOKUP(K15,Eje_Pilar_Prop!$C$2:$E$104,2,FALSE))","v":"Gobernanza e influencia local, regional e internacional"},{"$f":"IF(ISERROR(VLOOKUP(K15,Eje_Pilar_Prop!$C$2:$E$104,3,FALSE)),\" \",VLOOKUP(K15,Eje_Pilar_Prop!$C$2:$E$104,3,FALSE))","v":"Eje Transversal 4 Gobierno Legitimo, Fortalecimiento Local y Eficiencia"},1304,51854194,"BONNY BIANEY AGUIRRE BEDOYA",22050000,1,-1102050,2,11025000,31972950,31972500,"2020-01-21","2020-01-22","2020-07-15",120,2,60,null,null,null,null,null,null,"X",null,0.99998592560273603,null,null,{"$f":"IF(SUMPRODUCT((A$14:A15=A15)*(B$14:B15=B15)*(D$14:D15=D15))>1,0,1)","v":1},"Contratos de prestación de servicios profesionales y de apoyo a la gestión","Contratación directa",{"$f":"IF(ISBLANK(G15),1,IFERROR(VLOOKUP(G15,Tipo!$C$12:$C$27,1,FALSE),\"NO\"))","v":"Prestación de servicios profesionales y de apoyo a la gestión, o para la ejecución de trabajos artísticos que sólo puedan encomendarse a determinadas personas naturales;"},"Inversión",{"$f":"IF(ISBLANK(K15),1,IFERROR(VLOOKUP(K15,Eje_Pilar_Prop!$C$3:$C$104,1,FALSE),\"NO\"))","v":45},"SECOP II",1,"Bogotá Mejor para Todos"]
{"$rows_left_out":295}
{"sheet":"Instructivo","index":2,"n_rows":103,"n_cols":4,"rows_kept":103,"cut":false,"hidden":true,"merged":[[101,1,101,3],[77,1,80,1],[77,2,80,2],[83,1,83,3],[84,1,85,1],[84,2,85,2],[98,1,98,3],[92,1,92,3],[68,1,70,1],[68,2,70,2],[71,1,72,1],[71,2,72,2],[74,1,75,1],[74,2,75,2],[67,1,67,3],[26,1,27,1],[26,2,27,2],[31,1,32,1],[31,2,32,2],[33,1,53,1],[35,2,36,2],[54,1,56,1],[54,2,56,2],[59,1,62,1],[61,2,62,2],[64,1,65,1],[29,1,30,1],[25,1,25,3],[1,1,1,3],[2,1,2,3],[3,1,3,3],[4,1,4,3],[5,1,5,3],[6,1,6,3],[7,1,7,3],[10,1,10,3],[11,1,11,3],[12,1,12,3],[14,1,14,3],[8,1,8,3],[9,1,9,3]]}
[]
[null,"INSTRUCTIVO"]
[null,"Recomendamos leer cuidadosamente y poner en práctica las instrucciones que se explican en este instructivo. De la calidad de la información que se registre, depende en gran medida la calidad del informe de rendición de cuentas de la Gestión Contractual que presenta el Alcalde Mayor, consolidado por la Veeduría Distrital."]
[null,"La base en Excel a diligenciar es inmodificable, debe utilizar versión Excel 2010 o posteriores, la versión 2007 no habilita los macros.  La base no permite que se incluyan columnas con otro tipo de información que la Veeduría Distrital no está solicitando o que se cambie el formato de celda establecido. Tenga en cuenta que algunas celdas están bloqueadas y/o solo permiten el registro de una información determinada."]
[null,"La información que se registre en la base, debe coincidir con los reportes realizados en PREDIS y en el SECOP"]
[null,"Diligencie la totalidad de celdas."]
[null,"Para insertar una o varias filas, haga click  en el opción Insertar Filas y digite el número de filas a insertar. Si usted no sigue este procedimiento las filas que inserte no tomaran el formato de las filas anteriores. Se recomienda que antes de iniciar el registro de información inserte las filas que requiere, sin embargo en cualquier momento que necesite puede hacer este paso."]
[null,"Si requiere inserte una o varias filas realícelo después de la fila A14 y antes de la fila de Totales para que tomen el formato de las filas anteriores."]
[null,"Si necesita pegar información debe hacerlo por secciones debido a que hay columnas formuladas que están protegidas (como la columna J, K, T y AK) que no permiten realizar esta opción. Utilice la opción de pegado especial valores para no borrar las listas desplegables ni los formatos de las columnas."]
[null,"Si al pegar quedan textos en rojo,  verifique y ajuste la información, el dato que adiciono no se encuentra en la lista desplegable o no corresponde con el criterio definido en el columna."]
[null,"En primer lugar diligencie toda la información correspondiente a los contratos suscritos con cargo a la vigencia 2020."]
[null,"Una vez incluidos todos los contratos de la vigencia 2020, a continuación diligencie el formato completo con la información correspondiente a las adiciones efectuadas con cargo a la vigencia 2020 de contratos suscritos en vigencias anteriores. La información general del contrato como: modalidad de selección, tipología contractual, objeto, entre otros, debe corresponder a la información del contrato adicionado o modificado. Respecto al valor solo se diligencia el valor en la columna adición, es decir la columna de valor inicial debe quedar en blanco. No olvide registrar el número de adiciones realizadas, en la columna correspondiente."]
[null,"En caso de haber realizado apropiaciones presupuestales en la vigencia a través de resoluciones, caja menor, honorarios ediles, servicios públicos, debe relacionar dicha información en una sola fila al final de la base, indicando de que se trata la apropiación y número de proyecto si hay lugar a ello. En el tipo de contrato se registra Otros gastos."]
[]
[null,"ENCABEZADO DEL FORMATO"]
{"$rows_left_out":89}
{"sheet":"Tipo","index":3,"n_rows":40,"n_cols":4,"rows_kept":40,"cut":false,"hidden":true,"merged":[]}
[null,"Tipo","Modalidad de Selección","afectacion"]
[1,"Obra pública","Concurso de méritos","Funcionamiento"]
[2,"Consultoría","Contratación directa","Inversión"]
[3,"Interventoría","Contratación mínima cuantia","Operación"]
[4,"Contratos de prestación de servicios","Selección abreviada"]
[5,"Contratos de prestación de servicios profesionales y de apoyo a la gestión","Licitación pública"]
[6,"Compraventa de bienes muebles","Régimen privado"]
[7,"Compraventa de bienes inmuebles","Régimen especial"]
[8,"Arrendamiento de bienes muebles"]
[9,"Arrendamiento de bienes inmuebles"]
[10,"Seguros","Selección abreviada"]
[11,"Suministro","Subasta inversa "]
[12,"Empréstitos","Bolsas de productos"]
[13,"Fiducia mercantil o encargo fiduciario","Acuerdo marco de precios "]
[14,"Concesión ","Selección abreviada por menor cuantía "]
{"$rows_left_out":26}
{"sheet":"Eje_Pilar_Prop","index":4,"n_rows":104,"n_cols":5,"rows_kept":104,"cut":false,"hidden":true,"merged":[]}
[]
[null,"PDD","No. Programa","Programa","Pilar /Eje / propósito"]
[null,"Bogotá Mejor para Todos",1,"Prevención y atención de la maternidad y la paternidad tempranas","Pilar 1 Igualdad de Calidad de Vida"]
[null,"Bogotá Mejor para Todos",2,"Desarrollo integral desde la gestación hasta la adolescencia","Pilar 1 Igualdad de Calidad de Vida"]
[null,"Bogotá Mejor para Todos",3,"Igualdad y autonomía para una Bogotá incluyente","Pilar 1 Igualdad de Calidad de Vida"]
[null,"Bogotá Mejor para Todos",4,"Familias protegidas y adaptadas al cambio climático","Pilar 1 Igualdad de Calidad de Vida"]
[null,"Bogotá Mejor para Todos",5,"Desarrollo integral para la felicidad y el ejercicio de la ciudadanía","Pilar 1 Igualdad de Calidad de Vida"]
[null,"Bogotá Mejor para Todos",6,"Calidad educativa para todos","Pilar 1 Igualdad de Calidad de Vida"]
[null,"Bogotá Mejor para Todos",7,"Inclusión educativa para la equidad","Pilar 1 Igualdad de Calidad de Vida"]
[null,"Bogotá Mejor para Todos",8,"Acceso con calidad a la educación superior","Pilar 1 Igualdad de Calidad de Vida"]
[null,"Bogotá Mejor para Todos",9,"Atención integral y eficiente en salud","Pilar 1 Igualdad de Calidad de Vida"]
[null,"Bogotá Mejor para Todos",10,"Modernización de la infraestructura física y tecnológica en salud","Pilar 1 Igualdad de Calidad de Vida"]
[null,"Bogotá Mejor para Todos",11,"Mejores oportunidades para el desarrollo a través de la cultura, la recreación y el deporte","Pilar 1 Igualdad de Calidad de Vida"]
[null,"Bogotá Mejor para Todos",12,"Mujeres protagonistas, activas y empoderadas en el cierre de brechas de género","Pilar 1 Igualdad de Calidad de Vida"]
[null,"Bogotá Mejor para Todos",13,"Infraestructura para el desarrollo del hábitat","Pilar 2 Democracía Urbana"]
{"$rows_left_out":89}