{"text_format":"1","workbook":"xlsx","n_sheets":4,"sheets":["Formato2019","Instructivo","Tipo","Eje_Pilar"],"not_rendered":{"charts":0,"images":1,"macros":1,"external_links":0,"defined_names":10,"comments":0,"pivot_tables":0},"unopened":[],"bounds":{"document_bytes":16777216,"sheet_cells":100000,"rows_first":2000,"rows_last":500,"rows_between":2000,"halvings":0,"cell_chars":16384,"cell_head_chars":4096},"cells_cut":0,"cells_raw":0,"read":"whole","date_system":"1900"}

{"sheet":"Formato2019","index":0,"n_rows":581,"n_cols":39,"rows_kept":581,"cut":false,"hidden":false,"merged":[[10,0,10,13],[10,14,10,20],[10,21,10,25],[10,26,10,30],[11,7,11,10],[11,12,11,13],[11,26,11,30],[5,22,5,31],[6,20,6,21],[6,22,6,31],[1,0,1,31],[2,0,2,31],[4,0,4,2],[4,8,4,9],[4,12,4,13],[4,20,4,31],[5,0,5,2],[5,8,5,9],[6,0,6,2],[6,8,6,9],[5,20,5,21],[7,20,7,21],[7,22,7,31],[8,20,8,21],[8,22,8,31],[9,20,9,21],[9,22,9,31],[7,0,7,13],[8,0,8,2],[8,4,8,6],[8,8,9,13],[9,0,9,2],[9,4,9,6]]}
[]
["VEEDURIA DISTRITAL - RENDICION DE CUENTAS DE LA GESTION CONTRACTUAL EN EL DISTRITO CAPITAL (Acuerdo 380 de 2009)"]
["INFORMACION GENERAL DE CONTRATACION ENTIDADES DISTRITALES  -  ENERO 1 A 31 DICIEMBRE DE 2019"]
[]
["1. Entidad:",null,null,"FONDO DE DESARROLLO LOCAL BARRIOS UNIDOS",null,null,"2. Sector","PUBLICO"]
["3. Presupuesto Disponible Inversión Directa PREDIS",null,null,21373641000,null,null,"5. Presupuesto Disponible Funcionamiento PREDIS",2098416000,null,null,null,null,null,null,null,null,null,null,null,null,"9. Nombre de quien diligencia el formato",null,"Alejandro Morales Pacheco"]
["4. Presupuesto Comprometido de Inversión Directa según PREDIS ",null,null,21249407365,null,null,"6. Presupuesto Comprometido Funcionamiento según PREDIS",1882541241,null,null,null,null,null,null,null,null,null,null,null,null,"Cargo",null,"Abogado contratista"]
[null,null,null,null,null,null,null,null,null,null,null,null,null,null,null,null,null,null,null,null,"Dependencia",null,"Oficina de contratación"]
["7. Presupuesto Disponible Operación (Regimen Privado)",null,null,null,null,null,null,null,null,null,null,null,null,null,null,null,null,null,null,null,"Teléfono",null,"2258580 ext 136"]
["8. Presupuesto Comprometido Operación mediante contratos",null,null,null,null,null,null,null,null,null,null,null,null,null,null,null,null,null,null,null,"Correo Electrónico",null,"alejandro.morales@gobiernobogota.gov.co"]
["1- INFORMACION GENERAL",null,null,null,null,null,null,null,null,null,null,null,null,null,"2- INFORMACION FINANCIERA",null,null,null,null,null,null,"3 - PLAZOS ",null,null,null,null,"4 - ESTADO ",null,null,null,null,"5. %  Avance y/o cumplimiento"]
[1,2,3,4,5,6,7,8,null,null,null,9,10,null,11,12,13,14,15,16,17,18,19,20,21,22,23,null,null,null,null,24]
["Número Contrato","Año","Número de proceso contractual","Tipo de contrato ","Modalidad de Selección","Procedimiento o causal","Objeto","Afectación","Número Programa","Equivalencia número de programa","Eje / Pilar","Número Proyecto","Número  de Identificación del contratista\n(NIT con digito de verificación)","Nombre del contratista","Valor Inicial del contrato","Número de reducciones","Valor total reducciones (En valor negativo)","Número de adiciones","Valor total de adiciones ","Valor Final ","Giros\n(Valor en pesos)","Fecha de suscripción (DD/MM/AAAA)","Fecha de inicio (DD/MM/AAAA)","Fecha de terminación (DD/MM/AAAA)","Plazo en días","Prorroga en días","Anulado","Celebrado o por iniciar","En Ejecución","Terminado","Liquidado","% Avance y/o Cumplimiento",null,"Total Contratos","Validación Tipo","Validación Modalidad","Validación procedimiento","Validación afectación","Validación programa"]
["001-2019",2019,"FDLBU-CD-001-2019","Contratos de prestación de servicios profesionales y de apoyo a la gestión","Contratación directa","Prestación de servicios profesionales y de apoyo a la gestión, o para la ejecución de trabajos artísticos que sólo puedan encomendarse a determinadas personas naturales;","PRESTAR SERVICIOS DE APOYO A LA GESTIÓN, PARA LA REVISIÓN, ORGANIZACIÓN, ACTUALIZACIÓN, TRANSFERENCIA Y DEMÁS ACTIVIDADES Y FUNCIONES RELACIONADAS CON EL ARCHIVO DE DOCUMENTOS DE LA ALCALDÍA LOCAL DE BARRIOS UNIDOS","Inversión",45,{"$f":"IF(ISERROR(VLOOKUP(I14,Eje_Pilar!$C$2:$E$47,2,FALSE)),\" \",VLOOKUP(I14,Eje_Pilar!$C$2:$E$47,2,FALSE))","v":"Gobernanza e influencia local, regional e internacional"},{"$f":"IF(ISERROR(VLOOKUP(I14,Eje_Pilar!$C$2:$E$47,3,FALSE)),\" \",VLOOKUP(I14,Eje_Pilar!$C$2:$E$47,3,FALSE))","v":"Eje Transversal 4 Gobierno Legitimo, Fortalecimiento Local y Eficiencia"},1559,52020954,"KATHERINNE VILLA SILVA",14300010,1,-11,2,4546667,{"$f":"+O14+Q14+S14","v":18846666},18846666,"2019-01-10","2019-01-16","2019-10-01",195,60,null,null,null,"x",null,{"$f":"IF(ISERROR(U14/T14),\"-\",(U14/T14))","v":1},null,{"$f":"IF(SUMPRODUCT((A$14:A14=A14)*(B$14:B14=B14)*(C$14:C14=C14))>1,0,1)","v":1},{"$f":"IFERROR(VLOOKUP(D14,tipo,1,FALSE),\"NO\")","v":"Contratos de prestación de servicios profesionales y de apoyo a la gestión"},{"$f":"IFERROR(VLOOKUP(E14,modal,1,FALSE),\"NO\")","v":"Contratación directa"},{"$f":"IFERROR(VLOOKUP(F14,Tipo!$C$12:$C$27,1,FALSE),\"NO\")","v":"Prestación de servicios profesionales y de apoyo a la gestión, o para la ejecución de trabajos artísticos que sólo puedan encomendarse a determinadas personas naturales;"},{"$f":"IFERROR(VLOOKUP(H14,afectacion,1,FALSE),\"NO\")","v":"Inversión"},{"$f":"IFERROR(VLOOKUP(I14,programa,1,FALSE),\"NO\")","v":45}]
["002-2019",2019,"FDLBU-CD-03-2019","Contratos de prestación de servicios profesionales y de apoyo a la gestión","Contratación directa","Prestación de servicios profesionales y de apoyo a la gestión, o para la ejecución de trabajos artísticos que sólo puedan encomendarse a determinadas personas naturales;","Prestar servicios de apoyo a la gestión de conducción de los vehículos a cargo del Fondo de Desarrollo Local de Barrios Unidos, así como apoyar la gestión administrativa que designe el supervisor","Inversión",45,{"$f":"IF(ISERROR(VLOOKUP(I15,Eje_Pilar!$C$2:$E$47,2,FALSE)),\" \",VLOOKUP(I15,Eje_Pilar!$C$2:$E$47,2,FALSE))","v":"Gobernanza e influencia local, regional e internacional"},{"$f":"IF(ISERROR(VLOOKUP(I15,Eje_Pilar!$C$2:$E$47,3,FALSE)),\" \",VLOOKUP(I15,Eje_Pilar!$C$2:$E$47,3,FALSE))","v":"Eje Transversal 4 Gobierno Legitimo, Fortalecimiento Local y Eficiencia"},1559,79879901,"JONATHAN ANDRES RUEDA",17906240,null,null,2,3432029,21338269,21338269,"2019-01-21","2019-01-25","2019-11-09",240,45,null,null,null,"x",null,{"$f":"IF(ISERROR(U15/T15),\"-\",(U15/T15))","v":1},null,{"$f":"IF(SUMPRODUCT((A$14:A15=A15)*(B$14:B15=B15)*(C$14:C15=C15))>1,0,1)","v":1},"Contratos de prestación de servicios profesionales y de apoyo a la gestión","Contratación directa",{"$f":"IFERROR(VLOOKUP(F15,Tipo!$C$12:$C$27,1,FALSE),\"NO\")","v":"Prestación de servicios profesionales y de apoyo a la gestión, o para la ejecución de trabajos artísticos que sólo puedan encomendarse a determinadas personas naturales;"},"Inversión",45]
["003-2019  ",2019,"FDLBU-CD-02-2019","Contratos de prestación de servicios profesionales y de apoyo a la gestión","Contratación directa","Prestación de servicios profesionales y de apoyo a la gestión, o para la ejecución de trabajos artísticos que sólo puedan encomendarse a determinadas personas naturales;","PRESTAR SERVICIOS DE APOYO A LA GESTIÓN, PARA LA REVISIÓN, ORGANIZACIÓN, ACTUALIZACIÓN, TRANSFERENCIA Y DEMÁS ACTIVIDADES Y FUNCIONES RELACIONADAS CON EL ARCHIVO DE DOCUMENTOS DE LA ALCALDÍA LOCAL DE BARRIOS UNIDOS","Inversión",45,{"$f":"IF(ISERROR(VLOOKUP(I16,Eje_Pilar!$C$2:$E$47,2,FALSE)),\" \",VLOOKUP(I16,Eje_Pilar!$C$2:$E$47,2,FALSE))","v":"Gobernanza e influencia local, regional e internacional"},{"$f":"IF(ISERROR(VLOOKUP(I16,Eje_Pilar!$C$2:$E$47,3,FALSE)),\" \",VLOOKUP(I16,Eje_Pilar!$C$2:$E$47,3,FALSE))","v":"Eje Transversal 4 Gobierno Legitimo, Fortalecimiento Local y Eficiencia"},1559,7300621,"MANUEL ARTURO MATEUS  CARO ",14300000,null,null,2,6600000,20900000,20900000,"2019-01-21","2019-01-24","2019-11-07",195,90,null,null,null,"x",null,{"$f":"IF(ISERROR(U16/T16),\"-\",(U16/T16))","v":1},null,{"$f":"IF(SUMPRODUCT((A$14:A16=A16)*(B$14:B16=B16)*(C$14:C16=C16))>1,0,1)","v":1},"Contratos de prestación de servicios profesionales y de apoyo a la gestión","Contratación directa",{"$f":"IFERROR(VLOOKUP(F16,Tipo!$C$12:$C$27,1,FALSE),\"NO\")","v":"Prestación de servicios profesionales y de apoyo a la gestión, o para la ejecución de trabajos artísticos que sólo puedan encomendarse a determinadas personas naturales;"},"Inversión",45]
["004-2019",2019,"FDLBU-CD-02-2019","Contratos de prestación de servicios profesionales y de apoyo a la gestión","Contratación directa","Prestación de servicios profesionales y de apoyo a la gestión, o para la ejecución de trabajos artísticos que sólo puedan encomendarse a determinadas personas naturales;","PRESTAR SERVICIOS DE APOYO A LA GESTIÓN, PARA LA REVISIÓN, ORGANIZACIÓN, ACTUALIZACIÓN, TRANSFERENCIA Y DEMÁS ACTIVIDADES Y FUNCIONES RELACIONADAS CON EL ARCHIVO DE DOCUMENTOS DE LA ALCALDÍA LOCAL DE BARRIOS UNIDOS","Inversión",45,{"$f":"IF(ISERROR(VLOOKUP(I17,Eje_Pilar!$C$2:$E$47,2,FALSE)),\" \",VLOOKUP(I17,Eje_Pilar!$C$2:$E$47,2,FALSE))","v":"Gobernanza e influencia local, regional e internacional"},{"$f":"IF(ISERROR(VLOOKUP(I17,Eje_Pilar!$C$2:$E$47,3,FALSE)),\" \",VLOOKUP(I17,Eje_Pilar!$C$2:$E$47,3,FALSE))","v":"Eje Transversal 4 Gobierno Legitimo, Fortalecimiento Local y Eficiencia"},1559,1053330288,"LEIDY CONSUELO ORTEGON PINILLA ",14300000,null,null,1,6600000,20900000,13273333,"2019-01-21","2019-01-25","2020-03-05",195,90,null,null,"x",null,null,0.63508770334928233,null,{"$f":"IF(SUMPRODUCT((A$14:A17=A17)*(B$14:B17=B17)*(C$14:C17=C17))>1,0,1)","v":1},"Contratos de prestación de servicios profesionales y de apoyo a la gestión","Contratación directa",{"$f":"IFERROR(VLOOKUP(F17,Tipo!$C$12:$C$27,1,FALSE),\"NO\")","v":"Prestación de servicios profesionales y de apoyo a la gestión, o para la ejecución de trabajos artísticos que sólo puedan encomendarse a determinadas personas naturales;"},"Inversión",45]
["005-2019",2019,"FDLBU-CD-004-2019","Contratos de prestación de servicios profesionales y de apoyo a la gestión","Contratación directa","Prestación de servicios profesionales y de apoyo a la gestión, o para la ejecución de trabajos artísticos que sólo puedan encomendarse a determinadas personas naturales;","Prestar servicios profesionales para apoyar el área de gestión del desarrollo administrativa y financiara y apoyar en la supervisión de contratos en los asuntos relativos a la planeación local de proyectos de infraestructura de acuerdo a las líneas de inversión vigentes","Inversión",17,{"$f":"IF(ISERROR(VLOOKUP(I18,Eje_Pilar!$C$2:$E$47,2,FALSE)),\" \",VLOOKUP(I18,Eje_Pilar!$C$2:$E$47,2,FALSE))","v":"Espacio público, derecho de todos"},{"$f":"IF(ISERROR(VLOOKUP(I18,Eje_Pilar!$C$2:$E$47,3,FALSE)),\" \",VLOOKUP(I18,Eje_Pilar!$C$2:$E$47,3,FALSE))","v":"Pilar 2 Democracía Urbana"},1558,1032433077,"OSCAR ALFONSO MONTEALEGRE HERRERA",80948500,1,-3988767,null,0,76959733,70859266,"2019-01-22","2019-01-22","2019-12-26",345,0,null,null,null,"x","x",0.92073170264247151,null,{"$f":"IF(SUMPRODUCT((A$14:A18=A18)*(B$14:B18=B18)*(C$14:C18=C18))>1,0,1)","v":1},"Contratos de prestación de servicios profesionales y de apoyo a la gestión","Contratación directa",{"$f":"IFERROR(VLOOKUP(F18,Tipo!$C$12:$C$27,1,FALSE),\"NO\")","v":"Prestación de servicios profesionales y de apoyo a la gestión, o para la ejecución de trabajos artísticos que sólo puedan encomendarse a determinadas personas naturales;"},"Inversión",17]
["006-2019",2019,"FDLBU-CD-005-2019","Contratos de prestación de servicios profesionales y de apoyo a la gestión","Contratación directa","Prestación de servicios profesionales y de apoyo a la gestión, o para la ejecución de trabajos artísticos que sólo puedan encomendarse a determinadas personas naturales;","PRESTAR LOS SERVICIOS PROFESIONALES AL FONDO DE DESARROLLO LOCAL-ALCALDIA LOCAL DE BARRIOS UNIDOS PARA LA ASESORÍA, REVISIÓN, SEGUIMIENTO Y CUMPLIMIENTO DE LAS NORMAS QUE REGULAN LOS CONTRATOS SUSCRITOS POR ESTE, EN EL DESARROLLO DE LAS DIFERENTES ETAPAS PRECONTRACTUAL, CONTRACTUAL Y POSCONTRACTUAL","Inversión",45,{"$f":"IF(ISERROR(VLOOKUP(I19,Eje_Pilar!$C$2:$E$47,2,FALSE)),\" \",VLOOKUP(I19,Eje_Pilar!$C$2:$E$47,2,FALSE))","v":"Gobernanza e influencia local, regional e internacional"},{"$f":"IF(ISERROR(VLOOKUP(I19,Eje_Pilar!$C$2:$E$47,3,FALSE)),\" \",VLOOKUP(I19,Eje_Pilar!$C$2:$E$47,3,FALSE))","v":"Eje Transversal 4 Gobierno Legitimo, Fortalecimiento Local y Eficiencia"},1559,52517812,"ADRIANA MONTEALEGRE RIAÑO",90482000,1,-1311333,1,5245333,94416000,81302667,"2019-01-21","2019-01-22","2020-01-20",345,20.099999999999998,null,null,"x",null,null,0.86111111464158618,null,{"$f":"IF(SUMPRODUCT((A$14:A19=A19)*(B$14:B19=B19)*(C$14:C19=C19))>1,0,1)","v":1},"Contratos de prestación de servicios profesionales y de apoyo a la gestión","Contratación directa",{"$f":"IFERROR(VLOOKUP(F19,Tipo!$C$12:$C$27,1,FALSE),\"NO\")","v":"Prestación de servicios profesionales y de apoyo a la gestión, o para la ejecución de trabajos artísticos que sólo puedan encomendarse a determinadas personas naturales;"},"Inversión",45]
["007-2019",2019,"FDLBU-CD-007-2019","Contratos de prestación de servicios profesionales y de apoyo a la gestión","Contratación directa","Prestación de servicios profesionales y de apoyo a la gestión, o para la ejecución de trabajos artísticos que sólo puedan encomendarse a determinadas personas naturales;","PRESTAR LOS SERVICIOS PROFESIONALES A LA ALCALDÍA LOCAL DE BARRIOS UNIDOS EN LA ADMINISTRACIÓN DE LA RED DE VOZ Y DATOS, EN LA ACTUALIZACIÓN Y SOPORTE CON LAS TECNOLOGÍAS Y SISTEMAS DE INFORMACIÓN, ASÍ COMO EL APOYO A LA SUPERVISIÓN DE LOS CONTRATOS QUE TIENEN RELACIÓN CON SOPORTES TECNOLÓGICOS Y TEMAS RELACIONADOS","Inversión",45,{"$f":"IF(ISERROR(VLOOKUP(I20,Eje_Pilar!$C$2:$E$47,2,FALSE)),\" \",VLOOKUP(I20,Eje_Pilar!$C$2:$E$47,2,FALSE))","v":"Gobernanza e influencia local, regional e internacional"},{"$f":"IF(ISERROR(VLOOKUP(I20,Eje_Pilar!$C$2:$E$47,3,FALSE)),\" \",VLOOKUP(I20,Eje_Pilar!$C$2:$E$47,3,FALSE))","v":"Eje Transversal 4 Gobierno Legitimo, Fortalecimiento Local y Eficiencia"},1559,19430488,"JUAN FRANCISCO BRICEÑO CASTAÑEDA",38250000,null,null,2,17850000,56100000,50830000,"2019-01-23","2019-01-24","2019-12-26",225,105,null,null,null,"x","x",0.90606060606060601,null,{"$f":"IF(SUMPRODUCT((A$14:A20=A20)*(B$14:B20=B20)*(C$14:C20=C20))>1,0,1)","v":1}]
{"$rows_left_out":562}
{"sheet":"Instructivo","index":1,"n_rows":298,"n_cols":13,"rows_kept":298,"cut":false,"hidden":false,"merged":[[1,1,1,3],[2,1,2,3],[4,1,4,3],[5,1,5,3],[6,1,6,3],[8,1,8,3],[9,1,9,3],[10,1,10,3],[3,1,3,3],[23,1,23,3],[12,1,12,3],[7,1,7,3],[63,1,63,3],[24,1,25,1],[24,2,25,2],[28,1,29,1],[28,2,29,2],[30,1,50,1],[32,2,33,2],[51,1,53,1],[51,2,53,2],[56,1,58,1],[57,2,58,2],[60,1,61,1],[87,1,87,3],[64,1,66,1],[64,2,66,2],[67,1,68,1],[67,2,68,2],[70,1,71,1],[70,2,71,2],[73,1,76,1],[73,2,76,2],[79,1,79,3],[80,1,81,1],[80,2,81,2]]}
[]
[null,"OBSERVACIONES INICIALES"]
[null,"Recomendamos leer cuidadosamente y poner en práctica las instrucciones que se explican en este instructivo. De la calidad de la información que se registre, depende en gran medida la calidad del informe de rendición de cuentas de la Gestión Contractual que presenta el Alcalde Mayor, consolidado por la Veeduría Distrital."]
[null,"La base en Excel a diligenciar es inmodificable, debe utilizar versión Excel 2010 o posteriores, la versión 2007 no habilita los macros.  La base no permite que se incluyan columnas con otro tipo de información que la Veeduría Distrital no está solicitando o que se cambie el formato de celda establecido. Tenga en cuenta que muchas celdas están bloqueadas y/o solo permiten el registro de una información determinada."]
[null,"La información que se registre en la base, debe coincidir con los reportes realizados en PREDIS y en el SECOP"]
[null,"Diligencie la totalidad de celdas."]
[null,"Para insertar una o varias filas, haga click  en el opción Insertar Filas y digite el número de filas a insertar. Si usted no sigue este procedimiento las filas que copie no tomaran el formato de las filas anteriores."]
[null,"Si requiere inserte una o varias filas realícelo despues de la fila A15 y antes de la fila de Totales para que tomen el formato de las filas anteriores."]
[null,"En primer lugar diligencie toda la información correspondiente a los contratos suscritos con cargo a la vigencia 2019."]
[null,"Una vez incluidos todos los contratos de la vigencia 2019, a continuación diligencie el formato completo con la información correspondiente a las adiciones efectuadas con cargo a la vigencia 2019 de contratos suscritos en vigencias anteriores. La información general del contrato como: modalidad de selección, tipología contractual, objeto, entre otros, debe corresponder a la información del contrato adicionado o modificado. Respecto al valor solo se diligencia el valor en la columna adiciòn, es decir la columna de valor inicial debe quedar en blanco. No olvide registrar el nùmero de adiciones realizadas, en la columna correspondiente."]
[null,"En caso de haber realizado apropiaciones presupuestales en la vigencia a través de resoluciones, caja menor, honorarios ediles, servicios públicos, debe relacionar dicha información en una sola fila al final de la base, indicando de que se trata la apropiación y número de proyecto si hay lugar a ello. En el tipo de contrato se registra Otros gastos."]
[]
[null,"ENCABEZADO DEL FORMATO"]
[null,1,"Entidad","Indique el nombre completo de la Entidad."]
[null,2,"Sector","Relacione el sector al cual pertenece la Entidad."]
[null,3,"Presupuesto Disponible Inversión Directa","Indique el valor total del presupuesto disponible de inversión directa, de acuerdo con el PREDIS, a 31 de diciembre de 2019."]
[null,4,"Presupuesto Comprometido de Inversión Directa ","Escriba el valor total del presupuesto comprometido de inversión directa, de acuerdo con el PREDIS a 31 de diciembre de 2019."]
[null,5,"Presupuesto Disponible Funcionamiento","Indique el valor total del presupuesto de funcionamiento disponible, de acuerdo con el PREDIS a 31 de diciembre de 2019."]
[null,6,"Presupuesto Comprometido funcionamiento ","Escriba el monto del presupuesto de funcionamiento, comprometido mediante contratos, de acuerdo con el PREDIS a 31 de diciembre de 2019."]
[null,7,"Presupuesto Disponible Operación","Coloque el monto del presupuesto de operación disponible, de acuerdo con el PREDIS, a 31 de diciembre de 2019. Los gastos de operación corresponden solamente a aquellas entidades de régimen de contratación  privado."]
{"$rows_left_out":279}
{"sheet":"Tipo","index":2,"n_rows":31,"n_cols":4,"rows_kept":31,"cut":false,"hidden":true,"merged":[]}
[null,"Tipo","Modalidad de Selección","afectacion"]
[1,"Obra pública","Concurso de méritos","Funcionamiento"]
[2,"Consultoría","Contratación directa","Inversión"]
[3,"Interventoría","Contratación mínima cuantia","Operación"]
[4,"Contratos de prestación de servicios","Selección abreviada"]
[5,"Contratos de prestación de servicios profesionales y de apoyo a la gestión","Licitación pública"]
[6,"Compraventa de bienes muebles","Régimen privado"]
[7,"Compraventa de bienes inmuebles","Régimen especial"]
[8,"Arrendamiento de bienes muebles"]
[9,"Arrendamiento de bienes inmuebles"]
[10,"Seguros","Selección abreviada"]
[11,"Suministro","Subasta inversa "]
[12,"Empréstitos","Bolsas de productos"]
[13,"Fiducia mercantil o encargo fiduciario","Acuerdo marco de precios "]
[14,"Concesión ","Selección abreviada por menor cuantía "]
[15,"Convenios de cooperacion"]
[16,"Contratos interadministrativos","contratacion directa"]
[17,"Convenios de apoyo y/o convenios de asociación ","Urgencia manifiesta"]
[18,"Asociaciones público privadas","Contratación de empréstitos"]
[19,"Otros","Contratos interadministrativos"]
{"$rows_left_out":12}
{"sheet":"Eje_Pilar","index":3,"n_rows":47,"n_cols":5,"rows_kept":47,"cut":false,"hidden":false,"merged":[]}
[]
[null,null,"Código","Programa - Bogotá Mejor para Todos","Pilar /Eje"]
[null,null,1,"Prevención y atención de la maternidad y la paternidad tempranas","Pilar 1 Igualdad de Calidad de Vida"]
[null,null,2,"Desarrollo integral desde la gestación hasta la adolescencia","Pilar 1 Igualdad de Calidad de Vida"]
[null,null,3,"Igualdad y autonomía para una Bogotá incluyente","Pilar 1 Igualdad de Calidad de Vida"]
[null,null,4,"Familias protegidas y adaptadas al cambio climático","Pilar 1 Igualdad de Calidad de Vida"]
[null,null,5,"Desarrollo integral para la felicidad y el ejercicio de la ciudadanía","Pilar 1 Igualdad de Calidad de Vida"]
[null,null,6,"Calidad educativa para todos","Pilar 1 Igualdad de Calidad de Vida"]
[null,null,7,"Inclusión educativa para la equidad","Pilar 1 Igualdad de Calidad de Vida"]
[null,null,8,"Acceso con calidad a la educación superior","Pilar 1 Igualdad de Calidad de Vida"]
[null,null,9,"Atención integral y eficiente en salud","Pilar 1 Igualdad de Calidad de Vida"]
[null,null,10,"Modernización de la infraestructura física y tecnológica en salud","Pilar 1 Igualdad de Calidad de Vida"]
[null,null,11,"Mejores oportunidades para el desarrollo a través de la cultura, la recreación y el deporte","Pilar 1 Igualdad de Calidad de Vida"]
[null,null,12,"Mujeres protagonistas, activas y empoderadas en el cierre de brechas de género","Pilar 1 Igualdad de Calidad de Vida"]
[null,null,13,"Infraestructura para el desarrollo del hábitat","Pilar 2 Democracía Urbana"]
[null,null,14,"Intervenciones integrales del hábitat","Pilar 2 Democracía Urbana"]
[null,null,15,"Recuperación, incorporación, vida urbana y control de la ilegalidad","Pilar 2 Democracía Urbana"]
[null,null,16,"Integración social para una ciudad de oportunidades","Pilar 2 Democracía Urbana"]
[null,null,17,"Espacio público, derecho de todos","Pilar 2 Democracía Urbana"]
[null,null,18,"Mejor movilidad para todos","Pilar 2 Democracía Urbana"]
{"$rows_left_out":27}