{"text_format":"1","workbook":"xlsx","n_sheets":4,"sheets":["Formato2019","Instructivo","Tipo","Eje_Pilar"],"not_rendered":{"charts":0,"images":1,"macros":1,"external_links":0,"defined_names":10,"comments":0,"pivot_tables":0},"unopened":[],"bounds":{"document_bytes":16777216,"sheet_cells":100000,"rows_first":2000,"rows_last":500,"rows_between":2000,"halvings":0,"cell_chars":16384,"cell_head_chars":4096},"cells_cut":0,"cells_raw":0,"read":"whole","date_system":"1900"}

{"sheet":"Formato2019","index":0,"n_rows":581,"n_cols":39,"rows_kept":581,"cut":false,"hidden":false,"merged":[[10,0,10,13],[10,14,10,20],[10,21,10,25],[10,26,10,30],[11,7,11,10],[11,12,11,13],[11,26,11,30],[5,22,5,31],[6,20,6,21],[6,22,6,31],[1,0,1,31],[2,0,2,31],[4,0,4,2],[4,8,4,9],[4,12,4,13],[4,20,4,31],[5,0,5,2],[5,8,5,9],[6,0,6,2],[6,8,6,9],[5,20,5,21],[7,20,7,21],[7,22,7,31],[8,20,8,21],[8,22,8,31],[9,20,9,21],[9,22,9,31],[7,0,7,13],[8,0,8,2],[8,4,8,6],[8,8,9,13],[9,0,9,2],[9,4,9,6]]}
[]
["VEEDURIA DISTRITAL - RENDICION DE CUENTAS DE LA GESTION CONTRACTUAL EN EL DISTRITO CAPITAL (Acuerdo 380 de 2009)"]
["INFORMACION GENERAL DE CONTRATACION ENTIDADES DISTRITALES  -  ENERO 1 A 31 DICIEMBRE DE 2019"]
[]
["1. Entidad:",null,null,"FONDO DE DESARROLLO LOCAL BARRIOS UNIDOS",null,null,"2. Sector","PUBLICO"]
["3. Presupuesto Disponible Inversión Directa PREDIS",null,null,21373641000,null,null,"5. Presupuesto Disponible Funcionamiento PREDIS",2098416000,null,null,null,null,null,null,null,null,null,null,null,null,"9. Nombre de quien diligencia el formato",null,"Alejandro Morales Pacheco"]
["4. Presupuesto Comprometido de Inversión Directa según PREDIS ",null,null,21249407365,null,null,"6. Presupuesto Comprometido Funcionamiento según PREDIS",1882541241,null,null,null,null,null,null,null,null,null,null,null,null,"Cargo",null,"Abogado contratista"]
[null,null,null,null,null,null,null,null,null,null,null,null,null,null,null,null,null,null,null,null,"Dependencia",null,"Oficina de contratación"]
["7. Presupuesto Disponible Operación (Regimen Privado)",null,null,null,null,null,null,null,null,null,null,null,null,null,null,null,null,null,null,null,"Teléfono",null,"2258580 ext 136"]
["8. Presupuesto Comprometido Operación mediante contratos",null,null,null,null,null,null,null,null,null,null,null,null,null,null,null,null,null,null,null,"Correo Electrónico",null,"alejandro.morales@gobiernobogota.gov.co"]
["1- INFORMACION GENERAL",null,null,null,null,null,null,null,null,null,null,null,null,null,"2- INFORMACION FINANCIERA",null,null,null,null,null,null,"3 - PLAZOS ",null,null,null,null,"4 - ESTADO ",null,null,null,null,"5. %  Avance y/o cumplimiento"]
[1,2,3,4,5,6,7,8,null,null,null,9,10,null,11,12,13,14,15,16,17,18,19,20,21,22,23,null,null,null,null,24]
["Número Contrato","Año","Número de proceso contractual","Tipo de contrato ","Modalidad de Selección","Procedimiento o causal","Objeto","Afectación","Número Programa","Equivalencia número de programa","Eje / Pilar","Número Proyecto","Número  de Identificación del contratista\n(NIT con digito de verificación)","Nombre del contratista","Valor Inicial del contrato","Número de reducciones","Valor total reducciones (En valor negativo)","Número de adiciones","Valor total de adiciones ","Valor Final ","Giros\n(Valor en pesos)","Fecha de suscripción (DD/MM/AAAA)","Fecha de inicio (DD/MM/AAAA)","Fecha de terminación (DD/MM/AAAA)","Plazo en días","Prorroga en días","Anulado","Celebrado o por iniciar","En Ejecución","Terminado","Liquidado","% Avance y/o Cumplimiento",null,"Total Contratos","Validación Tipo","Validación Modalidad","Validación procedimiento","Validación afectación","Validación programa"]
["001-2019",2019,"FDLBU-CD-001-2019","Contratos de prestación de servicios profesionales y de apoyo a la gestión","Contratación directa","Prestación de servicios profesionales y de apoyo a la gestión, o para la ejecución de trabajos artísticos que sólo puedan encomendarse a determinadas personas naturales;","PRESTAR SERVICIOS DE APOYO A LA GESTIÓN, PARA LA REVISIÓN, ORGANIZACIÓN, ACTUALIZACIÓN, TRANSFERENCIA Y DEMÁS ACTIVIDADES Y FUNCIONES RELACIONADAS CON EL ARCHIVO DE DOCUMENTOS DE LA ALCALDÍA LOCAL DE BARRIOS UNIDOS","Inversión",45,{"$f":"IF(ISERROR(VLOOKUP(I14,Eje_Pilar!$C$2:$E$47,2,FALSE)),\" \",VLOOKUP(I14,Eje_Pilar!$C$2:$E$47,2,FALSE))","v":"Gobernanza e influencia local, regional e internacional"},{"$f":"IF(ISERROR(VLOOKUP(I14,Eje_Pilar!$C$2:$E$47,3,FALSE)),\" \",VLOOKUP(I14,Eje_Pilar!$C$2:$E$47,3,FALSE))","v":"Eje Transversal 4 Gobierno Legitimo, Fortalecimiento Local y Eficiencia"},1559,52020954,"KATHERINNE VILLA SILVA",14300010,1,-11,2,4546667,{"$f":"+O14+Q14+S14","v":18846666},18846666,"2019-01-10","2019-01-16","2019-10-01",195,60,null,null,null,"x",null,{"$f":"IF(ISERROR(U14/T14),\"-\",(U14/T14))","v":1},null,{"$f":"IF(SUMPRODUCT((A$14:A14=A14)*(B$14:B14=B14)*(C$14:C14=C14))>1,0,1)","v":1},{"$f":"IFERROR(VLOOKUP(D14,tipo,1,FALSE),\"NO\")","v":"Contratos de prestación de servicios profesionales y de apoyo a la gestión"},{"$f":"IFERROR(VLOOKUP(E14,modal,1,FALSE),\"NO\")","v":"Contratación directa"},{"$f":"IFERROR(VLOOKUP(F14,Tipo!$C$12:$C$27,1,FALSE),\"NO\")","v":"Prestación de servicios profesionales y de apoyo a la gestión, o para la ejecución de trabajos artísticos que sólo puedan encomendarse a determinadas personas naturales;"},{"$f":"IFERROR(VLOOKUP(H14,afectacion,1,FALSE),\"NO\")","v":"Inversión"},{"$f":"IFERROR(VLOOKUP(I14,programa,1,FALSE),\"NO\")","v":45}]
["002-2019",2019,"FDLBU-CD-03-2019","Contratos de prestación de servicios profesionales y de apoyo a la gestión","Contratación directa","Prestación de servicios profesionales y de apoyo a la gestión, o para la ejecución de trabajos artísticos que sólo puedan encomendarse a determinadas personas naturales;","Prestar servicios de apoyo a la gestión de conducción de los vehículos a cargo del Fondo de Desarrollo Local de Barrios Unidos, así como apoyar la gestión administrativa que designe el supervisor","Inversión",45,{"$f":"IF(ISERROR(VLOOKUP(I15,Eje_Pilar!$C$2:$E$47,2,FALSE)),\" \",VLOOKUP(I15,Eje_Pilar!$C$2:$E$47,2,FALSE))","v":"Gobernanza e influencia local, regional e internacional"},{"$f":"IF(ISERROR(VLOOKUP(I15,Eje_Pilar!$C$2:$E$47,3,FALSE)),\" \",VLOOKUP(I15,Eje_Pilar!$C$2:$E$47,3,FALSE))","v":"Eje Transversal 4 Gobierno Legitimo, Fortalecimiento Local y Eficiencia"},1559,79879901,"JONATHAN ANDRES RUEDA",17906240,null,null,2,3432029,21338269,21338269,"2019-01-21","2019-01-25","2019-11-09",240,45,null,null,null,"x",null,{"$f":"IF(ISERROR(U15/T15),\"-\",(U15/T15))","v":1},null,{"$f":"IF(SUMPRODUCT((A$14:A15=A15)*(B$14:B15=B15)*(C$14:C15=C15))>1,0,1)","v":1},"Contratos de prestación de servicios profesionales y de apoyo a la gestión","Contratación directa",{"$f":"IFERROR(VLOOKUP(F15,Tipo!$C$12:$C$27,1,FALSE),\"NO\")","v":"Prestación de servicios profesionales y de apoyo a la gestión, o para la ejecución de trabajos artísticos que sólo puedan encomendarse a determinadas personas naturales;"},"Inversión",45]
["003-2019  ",2019,"FDLBU-CD-02-2019","Contratos de prestación de servicios profesionales y de apoyo a la gestión","Contratación directa","Prestación de servicios profesionales y de apoyo a la gestión, o para la ejecución de trabajos artísticos que sólo puedan encomendarse a determinadas personas naturales;","PRESTAR SERVICIOS DE APOYO A LA GESTIÓN, PARA LA REVISIÓN, ORGANIZACIÓN, ACTUALIZACIÓN, TRANSFERENCIA Y DEMÁS ACTIVIDADES Y FUNCIONES RELACIONADAS CON EL ARCHIVO DE DOCUMENTOS DE LA ALCALDÍA LOCAL DE BARRIOS UNIDOS","Inversión",45,{"$f":"IF(ISERROR(VLOOKUP(I16,Eje_Pilar!$C$2:$E$47,2,FALSE)),\" \",VLOOKUP(I16,Eje_Pilar!$C$2:$E$47,2,FALSE))","v":"Gobernanza e influencia local, regional e internacional"},{"$f":"IF(ISERROR(VLOOKUP(I16,Eje_Pilar!$C$2:$E$47,3,FALSE)),\" \",VLOOKUP(I16,Eje_Pilar!$C$2:$E$47,3,FALSE))","v":"Eje Transversal 4 Gobierno Legitimo, Fortalecimiento Local y Eficiencia"},1559,7300621,"MANUEL ARTURO MATEUS  CARO ",14300000,null,null,2,6600000,20900000,20900000,"2019-01-21","2019-01-24","2019-11-07",195,90,null,null,null,"x",null,{"$f":"IF(ISERROR(U16/T16),\"-\",(U16/T16))","v":1},null,{"$f":"IF(SUMPRODUCT((A$14:A16=A16)*(B$14:B16=B16)*(C$14:C16=C16))>1,0,1)","v":1},"Contratos de prestación de servicios profesionales y de apoyo a la gestión","Contratación directa",{"$f":"IFERROR(VLOOKUP(F16,Tipo!$C$12:$C$27,1,FALSE),\"NO\")","v":"Prestación de servicios profesionales y de apoyo a la gestión, o para la ejecución de trabajos artísticos que sólo puedan encomendarse a determinadas personas naturales;"},"Inversión",45]
["004-2019",2019,"FDLBU-CD-02-2019","Contratos de prestación de servicios profesionales y de apoyo a la gestión","Contratación directa","Prestación de servicios profesionales y de apoyo a la gestión, o para la ejecución de trabajos artísticos que sólo puedan encomendarse a determinadas personas naturales;","PRESTAR SERVICIOS DE APOYO A LA GESTIÓN, PARA LA REVISIÓN, ORGANIZACIÓN, ACTUALIZACIÓN, TRANSFERENCIA Y DEMÁS ACTIVIDADES Y FUNCIONES RELACIONADAS CON EL ARCHIVO DE DOCUMENTOS DE LA ALCALDÍA LOCAL DE BARRIOS UNIDOS","Inversión",45,{"$f":"IF(ISERROR(VLOOKUP(I17,Eje_Pilar!$C$2:$E$47,2,FALSE)),\" \",VLOOKUP(I17,Eje_Pilar!$C$2:$E$47,2,FALSE))","v":"Gobernanza e influencia local, regional e internacional"},{"$f":"IF(ISERROR(VLOOKUP(I17,Eje_Pilar!$C$2:$E$47,3,FALSE)),\" \",VLOOKUP(I17,Eje_Pilar!$C$2:$E$47,3,FALSE))","v":"Eje Transversal 4 Gobierno Legitimo, Fortalecimiento Local y Eficiencia"},1559,1053330288,"LEIDY CONSUELO ORTEGON PINILLA ",14300000,null,null,1,6600000,20900000,13273333,"2019-01-21","2019-01-25","2020-03-05",195,90,null,null,"x",null,null,0.63508770334928233,null,{"$f":"IF(SUMPRODUCT((A$14:A17=A17)*(B$14:B17=B17)*(C$14:C17=C17))>1,0,1)","v":1},"Contratos de prestación de servicios profesionales y de apoyo a la gestión","Contratación directa",{"$f":"IFERROR(VLOOKUP(F17,Tipo!$C$12:$C$27,1,FALSE),\"NO\")","v":"Prestación de servicios profesionales y de apoyo a la gestión, o para la ejecución de trabajos artísticos que sólo puedan encomendarse a determinadas personas naturales;"},"Inversión",45]
["005-2019",2019,"FDLBU-CD-004-2019","Contratos de prestación de servicios profesionales y de apoyo a la gestión","Contratación directa","Prestación de servicios profesionales y de apoyo a la gestión, o para la ejecución de trabajos artísticos que sólo puedan encomendarse a determinadas personas naturales;","Prestar servicios profesionales para apoyar el área de gestión del desarrollo administrativa y financiara y apoyar en la supervisión de contratos en los asuntos relativos a la planeación local de proyectos de infraestructura de acuerdo a las líneas de inversión vigentes","Inversión",17,{"$f":"IF(ISERROR(VLOOKUP(I18,Eje_Pilar!$C$2:$E$47,2,FALSE)),\" \",VLOOKUP(I18,Eje_Pilar!$C$2:$E$47,2,FALSE))","v":"Espacio público, derecho de todos"},{"$f":"IF(ISERROR(VLOOKUP(I18,Eje_Pilar!$C$2:$E$47,3,FALSE)),\" \",VLOOKUP(I18,Eje_Pilar!$C$2:$E$47,3,FALSE))","v":"Pilar 2 Democracía Urbana"},1558,1032433077,"OSCAR ALFONSO MONTEALEGRE HERRERA",80948500,1,-3988767,null,0,76959733,70859266,"2019-01-22","2019-01-22","2019-12-26",345,0,null,null,null,"x","x",0.92073170264247151,null,{"$f":"IF(SUMPRODUCT((A$14:A18=A18)*(B$14:B18=B18)*(C$14:C18=C18))>1,0,1)","v":1},"Contratos de prestación de servicios profesionales y de apoyo a la gestión","Contratación directa",{"$f":"IFERROR(VLOOKUP(F18,Tipo!$C$12:$C$27,1,FALSE),\"NO\")","v":"Prestación de servicios profesionales y de apoyo a la gestión, o para la ejecución de trabajos artísticos que sólo puedan encomendarse a determinadas personas naturales;"},"Inversión",17]
["006-2019",2019,"FDLBU-CD-005-2019","Contratos de prestación de servicios profesionales y de apoyo a la gestión","Contratación directa","Prestación de servicios profesionales y de apoyo a la gestión, o para la ejecución de trabajos artísticos que sólo puedan encomendarse a determinadas personas naturales;","PRESTAR LOS SERVICIOS PROFESIONALES AL FONDO DE DESARROLLO LOCAL-ALCALDIA LOCAL DE BARRIOS UNIDOS PARA LA ASESORÍA, REVISIÓN, SEGUIMIENTO Y CUMPLIMIENTO DE LAS NORMAS QUE REGULAN LOS CONTRATOS SUSCRITOS POR ESTE, EN EL DESARROLLO DE LAS DIFERENTES ETAPAS PRECONTRACTUAL, CONTRACTUAL Y POSCONTRACTUAL","Inversión",45,{"$f":"IF(ISERROR(VLOOKUP(I19,Eje_Pilar!$C$2:$E$47,2,FALSE)),\" \",VLOOKUP(I19,Eje_Pilar!$C$2:$E$47,2,FALSE))","v":"Gobernanza e influencia local, regional e internacional"},{"$f":"IF(ISERROR(VLOOKUP(I19,Eje_Pilar!$C$2:$E$47,3,FALSE)),\" \",VLOOKUP(I19,Eje_Pilar!$C$2:$E$47,3,FALSE))","v":"Eje Transversal 4 Gobierno Legitimo, Fortalecimiento Local y Eficiencia"},1559,52517812,"ADRIANA MONTEALEGRE RIAÑO",90482000,1,-1311333,1,5245333,94416000,81302667,"2019-01-21","2019-01-22","2020-01-20",345,20.099999999999998,null,null,"x",null,null,0.86111111464158618,null,{"$f":"IF(SUMPRODUCT((A$14:A19=A19)*(B$14:B19=B19)*(C$14:C19=C19))>1,0,1)","v":1},"Contratos de prestación de servicios profesionales y de apoyo a la gestión","Contratación directa",{"$f":"IFERROR(VLOOKUP(F19,Tipo!$C$12:$C$27,1,FALSE),\"NO\")","v":"Prestación de servicios profesionales y de apoyo a la gestión, o para la ejecución de trabajos artísticos que sólo puedan encomendarse a determinadas personas naturales;"},"Inversión",45]
["007-2019",2019,"FDLBU-CD-007-2019","Contratos de prestación de servicios profesionales y de apoyo a la gestión","Contratación directa","Prestación de servicios profesionales y de apoyo a la gestión, o para la ejecución de trabajos artísticos que sólo puedan encomendarse a determinadas personas naturales;","PRESTAR LOS SERVICIOS PROFESIONALES A LA ALCALDÍA LOCAL DE BARRIOS UNIDOS EN LA ADMINISTRACIÓN DE LA RED DE VOZ Y DATOS, EN LA ACTUALIZACIÓN Y SOPORTE CON LAS TECNOLOGÍAS Y SISTEMAS DE INFORMACIÓN, ASÍ COMO EL APOYO A LA SUPERVISIÓN DE LOS CONTRATOS QUE TIENEN RELACIÓN CON SOPORTES TECNOLÓGICOS Y TEMAS RELACIONADOS","Inversión",45,{"$f":"IF(ISERROR(VLOOKUP(I20,Eje_Pilar!$C$2:$E$47,2,FALSE)),\" \",VLOOKUP(I20,Eje_Pilar!$C$2:$E$47,2,FALSE))","v":"Gobernanza e influencia local, regional e internacional"},{"$f":"IF(ISERROR(VLOOKUP(I20,Eje_Pilar!$C$2:$E$47,3,FALSE)),\" \",VLOOKUP(I20,Eje_Pilar!$C$2:$E$47,3,FALSE))","v":"Eje Transversal 4 Gobierno Legitimo, Fortalecimiento Local y Eficiencia"},1559,19430488,"JUAN FRANCISCO BRICEÑO CASTAÑEDA",38250000,null,null,2,17850000,56100000,50830000,"2019-01-23","2019-01-24","2019-12-26",225,105,null,null,null,"x","x",0.90606060606060601,null,{"$f":"IF(SUMPRODUCT((A$14:A20=A20)*(B$14:B20=B20)*(C$14:C20=C20))>1,0,1)","v":1}]
["008-2019",2019,"FDLBU-CD-006-2019","Contratos de prestación de servicios profesionales y de apoyo a la gestión","Contratación directa","Prestación de servicios profesionales y de apoyo a la gestión, o para la ejecución de trabajos artísticos que sólo puedan encomendarse a determinadas personas naturales;","PRESTAR LOS SERVICIOS PROFESIONALES PARA APOYAR EL ÁREA DE GESTIÓN DEL DESARROLLO – ADMINISTRATIVO Y FINANCIERO, EN LOS ASUNTOS RELACIONADOS CON EL DESARROLLO DE LA GESTIÓN CONTRACTUAL PARA LA ADQUISICIÓN DE RECURSOS, ASÍ COMO DE LOS OTROS ASUNTOS JURÍDICOS REQUERIDOS EN EL DESARROLLO DE LA GESTIÓN DEL FONDO DE DESARROLLO LOCAL, DESCRITOS POR LA SECRETARÍA DISTRITAL DE GOBIERNO Y LAS NORMAS APLICABLES SOBRE LA MATERIA.        ","Inversión",45,{"$f":"IF(ISERROR(VLOOKUP(I21,Eje_Pilar!$C$2:$E$47,2,FALSE)),\" \",VLOOKUP(I21,Eje_Pilar!$C$2:$E$47,2,FALSE))","v":"Gobernanza e influencia local, regional e internacional"},{"$f":"IF(ISERROR(VLOOKUP(I21,Eje_Pilar!$C$2:$E$47,3,FALSE)),\" \",VLOOKUP(I21,Eje_Pilar!$C$2:$E$47,3,FALSE))","v":"Eje Transversal 4 Gobierno Legitimo, Fortalecimiento Local y Eficiencia"},1559,"52.705.855   \n\n1.030.582.824","XIMENA LOMBANA RIAÑO \nCEDIO A \nJUAN FELIPE GALINDO NIÑO",82800000,1,-1200000,1,7200000,88800000,74400000,"2019-01-22","2019-01-22","2020-01-31",345,30,null,null,"x",null,null,0.83783783783783783,null,{"$f":"IF(SUMPRODUCT((A$14:A21=A21)*(B$14:B21=B21)*(C$14:C21=C21))>1,0,1)","v":1}]
["009-2019",2019,"FDLBU-CD-009-2019","Contratos de prestación de servicios profesionales y de apoyo a la gestión","Contratación directa","Prestación de servicios profesionales y de apoyo a la gestión, o para la ejecución de trabajos artísticos que sólo puedan encomendarse a determinadas personas naturales;","PRESTAR LOS SERVICIOS PROFESIONALES PARA APOYAR EL ÁREA DE GESTIÓN DEL DESARROLLO ADMINISTRATIVO Y FINANCIERO, EN LOS ASUNTOS RELACIONADOS CON EL DESARROLLO DE LA GESTIÓN CONTRACTUAL PARA LA ADQUISICIÓN DE RECURSOS, ASÍ COMO DE LOS OTROS ASUNTOS JURÍDICOS REQUERIDOS EN EL DESARROLLO DE LA GESTIÓN DEL FONDO DE DESARROLLO LOCAL, DESCRITOS POR LA SECRETARÍA DISTRITAL DE GOBIERNO Y LAS NORMAS APLICABLES SOBRE LA MATERIA","Inversión",45,{"$f":"IF(ISERROR(VLOOKUP(I22,Eje_Pilar!$C$2:$E$47,2,FALSE)),\" \",VLOOKUP(I22,Eje_Pilar!$C$2:$E$47,2,FALSE))","v":"Gobernanza e influencia local, regional e internacional"},{"$f":"IF(ISERROR(VLOOKUP(I22,Eje_Pilar!$C$2:$E$47,3,FALSE)),\" \",VLOOKUP(I22,Eje_Pilar!$C$2:$E$47,3,FALSE))","v":"Eje Transversal 4 Gobierno Legitimo, Fortalecimiento Local y Eficiencia"},1559,1117515209,"NATALIA QUINTERO PERDOMO ",51750000,null,null,null,0,51750000,51750000,"2019-01-23","2019-01-24","2019-09-27",225,0,null,null,null,"x",null,1,null,{"$f":"IF(SUMPRODUCT((A$14:A22=A22)*(B$14:B22=B22)*(C$14:C22=C22))>1,0,1)","v":1},{"$f":"IFERROR(VLOOKUP(D22,tipo,1,FALSE),\"NO\")","v":"Contratos de prestación de servicios profesionales y de apoyo a la gestión"},{"$f":"IFERROR(VLOOKUP(E22,modal,1,FALSE),\"NO\")","v":"Contratación directa"},{"$f":"IFERROR(VLOOKUP(F22,Tipo!$C$12:$C$27,1,FALSE),\"NO\")","v":"Prestación de servicios profesionales y de apoyo a la gestión, o para la ejecución de trabajos artísticos que sólo puedan encomendarse a determinadas personas naturales;"},{"$f":"IFERROR(VLOOKUP(H22,afectacion,1,FALSE),\"NO\")","v":"Inversión"},{"$f":"IFERROR(VLOOKUP(I22,programa,1,FALSE),\"NO\")","v":45}]
["010-2019",2019,"FDLBU-CD-010-2019","Contratos de prestación de servicios profesionales y de apoyo a la gestión","Contratación directa","Prestación de servicios profesionales y de apoyo a la gestión, o para la ejecución de trabajos artísticos que sólo puedan encomendarse a determinadas personas naturales;","PRESTAR LOS SERVICIOS PROFESIONALES PARA APOYAR EL ÁREA DE GESTIÓN DEL DESARROLLO ADMINISTRATIVO Y FINANCIERO, EN LOS ASUNTOS RELACIONADOS CON EL DESARROLLO DE LA GESTIÓN CONTRACTUAL PARA LA ADQUISICIÓN DE RECURSOS, ASÍ COMO DE LOS OTROS ASUNTOS JURÍDICOS REQUERIDOS EN EL DESARROLLO DE LA GESTIÓN DEL FONDO DE DESARROLLO LOCAL, DESCRITOS POR LA SECRETARÍA DISTRITAL DE GOBIERNO Y LAS NORMAS APLICABLES SOBRE LA MATERIA","Inversión",45,{"$f":"IF(ISERROR(VLOOKUP(I23,Eje_Pilar!$C$2:$E$47,2,FALSE)),\" \",VLOOKUP(I23,Eje_Pilar!$C$2:$E$47,2,FALSE))","v":"Gobernanza e influencia local, regional e internacional"},{"$f":"IF(ISERROR(VLOOKUP(I23,Eje_Pilar!$C$2:$E$47,3,FALSE)),\" \",VLOOKUP(I23,Eje_Pilar!$C$2:$E$47,3,FALSE))","v":"Eje Transversal 4 Gobierno Legitimo, Fortalecimiento Local y Eficiencia"},1559,1000347681,"JENNIFFER ALEJANDRA LOZADA ARBOLEDA",51750000,1,-8280000,null,0,43470000,43470000,"2019-01-23","2019-01-23","2019-07-31",225,0,null,null,null,"x",null,1,null,{"$f":"IF(SUMPRODUCT((A$14:A23=A23)*(B$14:B23=B23)*(C$14:C23=C23))>1,0,1)","v":1},"Contratos de prestación de servicios profesionales y de apoyo a la gestión","Contratación directa",{"$f":"IFERROR(VLOOKUP(F23,Tipo!$C$12:$C$27,1,FALSE),\"NO\")","v":"Prestación de servicios profesionales y de apoyo a la gestión, o para la ejecución de trabajos artísticos que sólo puedan encomendarse a determinadas personas naturales;"},"Inversión",45]
["011-2019",2019,"FDLBU-CD-008-2019","Contratos de prestación de servicios profesionales y de apoyo a la gestión","Contratación directa","Prestación de servicios profesionales y de apoyo a la gestión, o para la ejecución de trabajos artísticos que sólo puedan encomendarse a determinadas personas naturales;","PRESTAR LOS SERVICIOS PROFESIONALES PARA APOYAR AL ÁREA GESTIÓN DEL DESARROLLO ADMINISTRATIVO Y FINANCIERO EN LOS ASUNTOS RELATIVOS A LA PLANEACIÓN LOCAL, ASÍ COMO EL APOYO A LA SUPERVISIÓN DE CONTRATOS SUSCRITOS POR LA ALCALDÍA LOCAL DE BARRIOS UNIDOS","Inversión",45,{"$f":"IF(ISERROR(VLOOKUP(I24,Eje_Pilar!$C$2:$E$47,2,FALSE)),\" \",VLOOKUP(I24,Eje_Pilar!$C$2:$E$47,2,FALSE))","v":"Gobernanza e influencia local, regional e internacional"},{"$f":"IF(ISERROR(VLOOKUP(I24,Eje_Pilar!$C$2:$E$47,3,FALSE)),\" \",VLOOKUP(I24,Eje_Pilar!$C$2:$E$47,3,FALSE))","v":"Eje Transversal 4 Gobierno Legitimo, Fortalecimiento Local y Eficiencia"},1559,52820766,"DAYAN ROCIO MARTINEZ PALENCIA",63250000,1,-1466667,2,11000000,72783333,56283333,"2019-01-24","2019-01-25","2020-02-15",345,45,null,null,"x",null,null,0.77329974707258875,null,{"$f":"IF(SUMPRODUCT((A$14:A24=A24)*(B$14:B24=B24)*(C$14:C24=C24))>1,0,1)","v":1},"Contratos de prestación de servicios profesionales y de apoyo a la gestión","Contratación directa",{"$f":"IFERROR(VLOOKUP(F24,Tipo!$C$12:$C$27,1,FALSE),\"NO\")","v":"Prestación de servicios profesionales y de apoyo a la gestión, o para la ejecución de trabajos artísticos que sólo puedan encomendarse a determinadas personas naturales;"},"Inversión",45]
["012-2019",2019,"FDLBU-CD-008-2019","Contratos de prestación de servicios profesionales y de apoyo a la gestión","Contratación directa","Prestación de servicios profesionales y de apoyo a la gestión, o para la ejecución de trabajos artísticos que sólo puedan encomendarse a determinadas personas naturales;","PRESTAR LOS SERVICIOS PROFESIONALES PARA APOYAR AL ÁREA GESTIÓN DEL DESARROLLO ADMINISTRATIVO Y FINANCIERO EN LOS ASUNTOS RELATIVOS A LA PLANEACIÓN LOCAL, ASÍ COMO EL APOYO A LA SUPERVISIÓN DE CONTRATOS SUSCRITOS POR LA ALCALDÍA LOCAL DE BARRIOS UNIDOS","Inversión",45,{"$f":"IF(ISERROR(VLOOKUP(I25,Eje_Pilar!$C$2:$E$47,2,FALSE)),\" \",VLOOKUP(I25,Eje_Pilar!$C$2:$E$47,2,FALSE))","v":"Gobernanza e influencia local, regional e internacional"},{"$f":"IF(ISERROR(VLOOKUP(I25,Eje_Pilar!$C$2:$E$47,3,FALSE)),\" \",VLOOKUP(I25,Eje_Pilar!$C$2:$E$47,3,FALSE))","v":"Eje Transversal 4 Gobierno Legitimo, Fortalecimiento Local y Eficiencia"},1559,"80.865.591 \n \n80.035.567","DIEGO FABIAN MOSQUERA HERNANDEZ \nCEDIO A \nCARLOS ANDRES VARGAS HERNANDEZ",63250000,1,-2200000,null,0,61050000,55550000,"2019-01-24","2019-01-29","2019-12-31",345,0,null,null,null,"x",null,0.90990990990990994,null,{"$f":"IF(SUMPRODUCT((A$14:A25=A25)*(B$14:B25=B25)*(C$14:C25=C25))>1,0,1)","v":1},"Contratos de prestación de servicios profesionales y de apoyo a la gestión","Contratación directa",{"$f":"IFERROR(VLOOKUP(F25,Tipo!$C$12:$C$27,1,FALSE),\"NO\")","v":"Prestación de servicios profesionales y de apoyo a la gestión, o para la ejecución de trabajos artísticos que sólo puedan encomendarse a determinadas personas naturales;"},"Inversión",45]
["013-2019",2019,"FDLBU-CD-011-2019","Contratos de prestación de servicios profesionales y de apoyo a la gestión","Contratación directa","Prestación de servicios profesionales y de apoyo a la gestión, o para la ejecución de trabajos artísticos que sólo puedan encomendarse a determinadas personas naturales;","PRESTAR SERVICIOS PROFESIONALES EN EL ÁREA DE GESTIÓN DEL DESARROLLO DE LA ALCALDÍA LOCAL DE BARRIOS UNIDOS, EN LOS TEMAS Y ACTIVIDADES RELACIONADAS CON LAS ETAPAS PRECONTRACTUAL Y POSCONTRACTUAL QUE LE SEAN ASIGNADOS POR EL ALCALDE LOCAL","Inversión",45,{"$f":"IF(ISERROR(VLOOKUP(I26,Eje_Pilar!$C$2:$E$47,2,FALSE)),\" \",VLOOKUP(I26,Eje_Pilar!$C$2:$E$47,2,FALSE))","v":"Gobernanza e influencia local, regional e internacional"},{"$f":"IF(ISERROR(VLOOKUP(I26,Eje_Pilar!$C$2:$E$47,3,FALSE)),\" \",VLOOKUP(I26,Eje_Pilar!$C$2:$E$47,3,FALSE))","v":"Eje Transversal 4 Gobierno Legitimo, Fortalecimiento Local y Eficiencia"},1559,80791247,"JOSE DARWIN SANGUINO VELEZ",69000000,1,-2400000,null,0,66600000,59400000,"2019-01-24","2019-01-29","2019-12-31",345,0,null,null,null,"x",null,0.89189189189189189,null,{"$f":"IF(SUMPRODUCT((A$14:A26=A26)*(B$14:B26=B26)*(C$14:C26=C26))>1,0,1)","v":1},"Contratos de prestación de servicios profesionales y de apoyo a la gestión","Contratación directa",{"$f":"IFERROR(VLOOKUP(F26,Tipo!$C$12:$C$27,1,FALSE),\"NO\")","v":"Prestación de servicios profesionales y de apoyo a la gestión, o para la ejecución de trabajos artísticos que sólo puedan encomendarse a determinadas personas naturales;"},"Inversión",45]
["014-2019",2019,"FDLBU-CD-012-2019","Contratos de prestación de servicios profesionales y de apoyo a la gestión","Contratación directa","Prestación de servicios profesionales y de apoyo a la gestión, o para la ejecución de trabajos artísticos que sólo puedan encomendarse a determinadas personas naturales;","PRESTAR LOS SERVICIOS PROFESIONALES PARA APOYAR AL ÁREA GESTIÓN DEL DESARROLLO – ADMINISTRATIVO Y FINANCIERO EN LOS ASUNTOS RELATIVOS A LA PLANEACIÓN LOCAL, ASÍ COMO EL APOYO A LA SUPERVISIÓN DE CONTRATOS SUSCRITOS POR LA ALCALDÍA LOCAL DE BARRIOS UNIDOS","Inversión",45,{"$f":"IF(ISERROR(VLOOKUP(I27,Eje_Pilar!$C$2:$E$47,2,FALSE)),\" \",VLOOKUP(I27,Eje_Pilar!$C$2:$E$47,2,FALSE))","v":"Gobernanza e influencia local, regional e internacional"},{"$f":"IF(ISERROR(VLOOKUP(I27,Eje_Pilar!$C$2:$E$47,3,FALSE)),\" \",VLOOKUP(I27,Eje_Pilar!$C$2:$E$47,3,FALSE))","v":"Eje Transversal 4 Gobierno Legitimo, Fortalecimiento Local y Eficiencia"},1559,"7.315.971\n \n91.274.561","ANDRES FELIPE MONROY ORTEGÓN\nCEDIO A \nVICTOR HUGO\nAGUILERA PINEDA",47250000,null,null,2,23625000,70875000,70875000,"2019-01-29","2019-02-01","2019-12-15",210,105,null,null,null,"x",null,1,null,{"$f":"IF(SUMPRODUCT((A$14:A27=A27)*(B$14:B27=B27)*(C$14:C27=C27))>1,0,1)","v":1},"Contratos de prestación de servicios profesionales y de apoyo a la gestión","Contratación directa",{"$f":"IFERROR(VLOOKUP(F27,Tipo!$C$12:$C$27,1,FALSE),\"NO\")","v":"Prestación de servicios profesionales y de apoyo a la gestión, o para la ejecución de trabajos artísticos que sólo puedan encomendarse a determinadas personas naturales;"},"Inversión",45]
["015-2019",2019,"FDLBU-CD-013-2019","Contratos de prestación de servicios profesionales y de apoyo a la gestión","Contratación directa","Prestación de servicios profesionales y de apoyo a la gestión, o para la ejecución de trabajos artísticos que sólo puedan encomendarse a determinadas personas naturales;","PRESTAR LOS SERVICIOS PROFESIONALES PARA APOYAR AL ÁREA DE GESTIÓN DEL DESARROLLO ADMINISTRATIVO Y FINANCIERO, EN LOS ASUNTOS RELACIONADOS CON EL DESARROLLO DE LA GESTIÓN CONTRACTUAL PARA LA ADQUISICIÓN DE RECURSOS","Inversión",45,{"$f":"IF(ISERROR(VLOOKUP(I28,Eje_Pilar!$C$2:$E$47,2,FALSE)),\" \",VLOOKUP(I28,Eje_Pilar!$C$2:$E$47,2,FALSE))","v":"Gobernanza e influencia local, regional e internacional"},{"$f":"IF(ISERROR(VLOOKUP(I28,Eje_Pilar!$C$2:$E$47,3,FALSE)),\" \",VLOOKUP(I28,Eje_Pilar!$C$2:$E$47,3,FALSE))","v":"Eje Transversal 4 Gobierno Legitimo, Fortalecimiento Local y Eficiencia"},1559,1010170182,"CESAR AUGUSTO CORTES GOMEZ",43500000,null,null,null,0,43500000,43500000,"2019-01-24","2019-01-25","2019-10-06",225,0,null,null,null,"x",null,1,null,{"$f":"IF(SUMPRODUCT((A$14:A28=A28)*(B$14:B28=B28)*(C$14:C28=C28))>1,0,1)","v":1},"Contratos de prestación de servicios profesionales y de apoyo a la gestión","Contratación directa",{"$f":"IFERROR(VLOOKUP(F28,Tipo!$C$12:$C$27,1,FALSE),\"NO\")","v":"Prestación de servicios profesionales y de apoyo a la gestión, o para la ejecución de trabajos artísticos que sólo puedan encomendarse a determinadas personas naturales;"},"Inversión",45]
["016-2019",2019,"FDLBU-CD-014-019","Contratos de prestación de servicios profesionales y de apoyo a la gestión","Contratación directa","Prestación de servicios profesionales y de apoyo a la gestión, o para la ejecución de trabajos artísticos que sólo puedan encomendarse a determinadas personas naturales;","PRESTAR LOS SERVICIOS PROFESIONALES PARA APOYAR EL ÁREA DE GESTIÓN DEL DESARROLLO – ADMINISTRATIVO Y FINANCIERO, EN LOS ASUNTOS RELACIONADOS CON EL DESARROLLO DE LA GESTIÓN CONTRACTUAL PARA LA ADQUISICIÓN DE RECURSOS, ASÍ COMO DE LOS OTROS ASUNTOS JURÍDICOS REQUERIDOS EN EL DESARROLLO DE LA GESTIÓN DEL FONDO DE DESARROLLO LOCAL, DESCRITOS POR LA SECRETARÍA DISTRITAL DE GOBIERNO Y LAS NORMAS APLICABLES SOBRE LA MATERIA.        ","Inversión",45,{"$f":"IF(ISERROR(VLOOKUP(I29,Eje_Pilar!$C$2:$E$47,2,FALSE)),\" \",VLOOKUP(I29,Eje_Pilar!$C$2:$E$47,2,FALSE))","v":"Gobernanza e influencia local, regional e internacional"},{"$f":"IF(ISERROR(VLOOKUP(I29,Eje_Pilar!$C$2:$E$47,3,FALSE)),\" \",VLOOKUP(I29,Eje_Pilar!$C$2:$E$47,3,FALSE))","v":"Eje Transversal 4 Gobierno Legitimo, Fortalecimiento Local y Eficiencia"},1559,"1.032.388.567\n \n1.032.448.800 ","JORGE ENRIQUE BUITRAGO MARIN CEDE A CESAR ALEJANDRO MORALES",55125000,null,null,2,25725000,80850000,74725000,"2019-01-24","2019-01-25","2019-12-25",225,105,null,null,null,"x",null,0.9242424242424242,null,{"$f":"IF(SUMPRODUCT((A$14:A29=A29)*(B$14:B29=B29)*(C$14:C29=C29))>1,0,1)","v":1},"Contratos de prestación de servicios profesionales y de apoyo a la gestión","Contratación directa",{"$f":"IFERROR(VLOOKUP(F29,Tipo!$C$12:$C$27,1,FALSE),\"NO\")","v":"Prestación de servicios profesionales y de apoyo a la gestión, o para la ejecución de trabajos artísticos que sólo puedan encomendarse a determinadas personas naturales;"},"Inversión",45]
["017-2019",2019,"FDLBU-CD-016-2019","Contratos de prestación de servicios profesionales y de apoyo a la gestión","Contratación directa","Prestación de servicios profesionales y de apoyo a la gestión, o para la ejecución de trabajos artísticos que sólo puedan encomendarse a determinadas personas naturales;","PRESTAR SUS SERVICIOS PROFESIONALES PARA APOYAR AL EQUIPO DE PRENSA Y COMUNICACIONES DE LA ALCALDÍA LOCAL EN LA REALIZACIÓN Y PUBLICACIÓN DE CONTENIDOS DE REDES SOCIALES Y CANALES DE DIVULGACIÓN DIGITAL (SITIO WEB) DE LA ALCALDÍA LOCAL","Inversión",45,{"$f":"IF(ISERROR(VLOOKUP(I30,Eje_Pilar!$C$2:$E$47,2,FALSE)),\" \",VLOOKUP(I30,Eje_Pilar!$C$2:$E$47,2,FALSE))","v":"Gobernanza e influencia local, regional e internacional"},{"$f":"IF(ISERROR(VLOOKUP(I30,Eje_Pilar!$C$2:$E$47,3,FALSE)),\" \",VLOOKUP(I30,Eje_Pilar!$C$2:$E$47,3,FALSE))","v":"Eje Transversal 4 Gobierno Legitimo, Fortalecimiento Local y Eficiencia"},1559,80221073,"JEISSON CAMILO URBINA MARTÍNEZ",45500000,null,null,2,13216667,58716667,58716667,"2019-01-25","2019-01-28","2019-10-27",210,60,null,null,null,"x",null,1,null,{"$f":"IF(SUMPRODUCT((A$14:A30=A30)*(B$14:B30=B30)*(C$14:C30=C30))>1,0,1)","v":1},"Contratos de prestación de servicios profesionales y de apoyo a la gestión","Contratación directa",{"$f":"IFERROR(VLOOKUP(F30,Tipo!$C$12:$C$27,1,FALSE),\"NO\")","v":"Prestación de servicios profesionales y de apoyo a la gestión, o para la ejecución de trabajos artísticos que sólo puedan encomendarse a determinadas personas naturales;"},"Inversión",45]
["018-2019",2019,"FDLBU-CD-017-2019","Contratos de prestación de servicios profesionales y de apoyo a la gestión","Contratación directa","Prestación de servicios profesionales y de apoyo a la gestión, o para la ejecución de trabajos artísticos que sólo puedan encomendarse a determinadas personas naturales;","PRESTAR LOS SERVICIOS TÉCNICOS PARA LA OPERACIÓN, SEGUIMIENTO Y CUMPLIMIENTO DE LOS PROCESOS Y PROCEDIMIENTOS DEL SERVICIO, APOYOS PARA LA SEGURIDAD ECONÓMICA TIPO C, REQUERIDOS PARA EL OPORTUNO Y ADECUADO REGISTRO, CRUCE Y REPORTE DE LOS DATOS EN EL SISTEMA MISIONAL SIRBE, QUE CONTRIBUYAN A LA GARANTÍA DE LOS DERECHOS DE LA POBLACIÓN MAYOR EN EL MARCO DE LA POLÍTICA PÚBLICA SOCIAL PARA EL ENVEJECIMIENTO Y LA VEJEZ  EN EL DISTRITO CAPITAL A CARGO DE LA ALCALDÍA LOCAL","Inversión",3,{"$f":"IF(ISERROR(VLOOKUP(I31,Eje_Pilar!$C$2:$E$47,2,FALSE)),\" \",VLOOKUP(I31,Eje_Pilar!$C$2:$E$47,2,FALSE))","v":"Igualdad y autonomía para una Bogotá incluyente"},{"$f":"IF(ISERROR(VLOOKUP(I31,Eje_Pilar!$C$2:$E$47,3,FALSE)),\" \",VLOOKUP(I31,Eje_Pilar!$C$2:$E$47,3,FALSE))","v":"Pilar 1 Igualdad de Calidad de Vida"},1556,1015424508,"DAIRO ALEXANDER BUSTOS TRIANA CEDIDO A ALEXIS GIOVANNY RISCANEBO ARANDA ",39750000,1,-2539583,1,3312500,40522917,33897917,"2019-01-25","2019-01-25","2020-01-31",360,30,null,null,"x",null,null,0.83651226292519865,null,{"$f":"IF(SUMPRODUCT((A$14:A31=A31)*(B$14:B31=B31)*(C$14:C31=C31))>1,0,1)","v":1},"Contratos de prestación de servicios profesionales y de apoyo a la gestión","Contratación directa",{"$f":"IFERROR(VLOOKUP(F31,Tipo!$C$12:$C$27,1,FALSE),\"NO\")","v":"Prestación de servicios profesionales y de apoyo a la gestión, o para la ejecución de trabajos artísticos que sólo puedan encomendarse a determinadas personas naturales;"},"Inversión",3]
["019-2019",2019,"FDLBU-CD-018-2019","Contratos de prestación de servicios profesionales y de apoyo a la gestión","Contratación directa","Prestación de servicios profesionales y de apoyo a la gestión, o para la ejecución de trabajos artísticos que sólo puedan encomendarse a determinadas personas naturales;","PRESTAR SUS SERVICIOS PROFESIONALES PARA APOYAR LA FORMULACIÓN, GESTIÓN Y SEGUIMIENTO DE ACTIVIDADES ENFOCADAS A LA GESTIÓN AMBIENTAL EXTERNA, ENCAMINADAS A LA MITIGACIÓN DE LOS DIFERENTES IMPACTOS AMBIENTALES Y LA CONSERVACIÓN DE LOS RECURSOS NATURALES DE LA LOCALIDAD","Inversión",38,{"$f":"IF(ISERROR(VLOOKUP(I32,Eje_Pilar!$C$2:$E$47,2,FALSE)),\" \",VLOOKUP(I32,Eje_Pilar!$C$2:$E$47,2,FALSE))","v":"Recuperación y manejo de la Estructura Ecológica Principal"},{"$f":"IF(ISERROR(VLOOKUP(I32,Eje_Pilar!$C$2:$E$47,3,FALSE)),\" \",VLOOKUP(I32,Eje_Pilar!$C$2:$E$47,3,FALSE))","v":"Eje Transversal 3 Sostenibilidad Ambiental basada en la eficiencia energética"},1532,51713042,"MARTHA ESPERANZA  MARTINEZ ",35700000,null,null,3,17850000,53550000,51340000,"2019-01-28","2019-01-30","2019-12-14",210,105,null,null,null,"x",null,0.95873015873015877,null,{"$f":"IF(SUMPRODUCT((A$14:A32=A32)*(B$14:B32=B32)*(C$14:C32=C32))>1,0,1)","v":1},"Contratos de prestación de servicios profesionales y de apoyo a la gestión","Contratación directa",{"$f":"IFERROR(VLOOKUP(F32,Tipo!$C$12:$C$27,1,FALSE),\"NO\")","v":"Prestación de servicios profesionales y de apoyo a la gestión, o para la ejecución de trabajos artísticos que sólo puedan encomendarse a determinadas personas naturales;"},"Inversión",38]
["020-2019",2019,"FDLBU-CD-020-2019","Arrendamiento de bienes inmuebles","Contratación directa","El arrendamiento o adquisición de inmuebles","ARRENDAMIENTO DE BODEGA DE USO INSTITUCIONAL PARA LAS ACTIVIDADES DE LA ALCALDÍA LOCAL Y DE LAS INSPECCIONES DE POLICÍA DE LA LOCALIDAD DE BARRIOS UNIDOS","Funcionamiento",null,{"$f":"IF(ISERROR(VLOOKUP(I33,Eje_Pilar!$C$2:$E$47,2,FALSE)),\" \",VLOOKUP(I33,Eje_Pilar!$C$2:$E$47,2,FALSE))","v":" "},{"$f":"IF(ISERROR(VLOOKUP(I33,Eje_Pilar!$C$2:$E$47,3,FALSE)),\" \",VLOOKUP(I33,Eje_Pilar!$C$2:$E$47,3,FALSE))","v":" "},null,"901.065.752-8","KYOSTART VENTURES S.A.S.",38464932,null,null,null,null,38464932,32597650,"2019-01-25","2019-01-28","2020-01-17",29.095890410958905,2.5479452054794516,null,null,"x",null,null,0.84746412654518666,null,{"$f":"IF(SUMPRODUCT((A$14:A33=A33)*(B$14:B33=B33)*(C$14:C33=C33))>1,0,1)","v":1},"Arrendamiento de bienes inmuebles","Contratación directa",{"$f":"IFERROR(VLOOKUP(F33,Tipo!$C$12:$C$27,1,FALSE),\"NO\")","v":"El arrendamiento o adquisición de inmuebles"},"Funcionamiento","NO"]
["021-2019",2019,"FDLBU-CD-021-2019","Contratos de prestación de servicios profesionales y de apoyo a la gestión","Contratación directa","Prestación de servicios profesionales y de apoyo a la gestión, o para la ejecución de trabajos artísticos que sólo puedan encomendarse a determinadas personas naturales;","PRESTAR SERVICIOS DE APOYO EN LAS LABORES DE LA DEPENDENCIA AL CONTADOR (A) DEL FONDO DE DESARROLLO LOCAL DE BARRIOS UNIDOS (FDLBU) EN LOS TRAMITES, MANEJO CONTABLE Y DE ARCHIVO EN FORMA PERMANENTE EN EL DESARROLLO DEL PROCESO DE CONSOLIDACIÓN DE INFORMACIÓN DEL SISTEMA CONTABLE Y FINANCIERO","Inversión",45,{"$f":"IF(ISERROR(VLOOKUP(I34,Eje_Pilar!$C$2:$E$47,2,FALSE)),\" \",VLOOKUP(I34,Eje_Pilar!$C$2:$E$47,2,FALSE))","v":"Gobernanza e influencia local, regional e internacional"},{"$f":"IF(ISERROR(VLOOKUP(I34,Eje_Pilar!$C$2:$E$47,3,FALSE)),\" \",VLOOKUP(I34,Eje_Pilar!$C$2:$E$47,3,FALSE))","v":"Eje Transversal 4 Gobierno Legitimo, Fortalecimiento Local y Eficiencia"},1559,19346335,"PEDRO JESUS SANCHEZ MOLINA ",23187500,null,null,3,11593750,34781250,34781250,"2019-01-28","2019-01-29","2019-12-13",210,105,null,null,null,"x",null,1,null,{"$f":"IF(SUMPRODUCT((A$14:A34=A34)*(B$14:B34=B34)*(C$14:C34=C34))>1,0,1)","v":1},"Contratos de prestación de servicios profesionales y de apoyo a la gestión","Contratación directa",{"$f":"IFERROR(VLOOKUP(F34,Tipo!$C$12:$C$27,1,FALSE),\"NO\")","v":"Prestación de servicios profesionales y de apoyo a la gestión, o para la ejecución de trabajos artísticos que sólo puedan encomendarse a determinadas personas naturales;"},"Inversión",45]
["022-2019",2019,"FDLBU-CD-028-2019","Contratos de prestación de servicios profesionales y de apoyo a la gestión","Contratación directa","Prestación de servicios profesionales y de apoyo a la gestión, o para la ejecución de trabajos artísticos que sólo puedan encomendarse a determinadas personas naturales;","PRESTAR SERVICIOS PROFESIONALES PARA APOYAR EL ÁREA DE GESTIÓN DEL DESARROLLO ADMINISTRATIVA Y FINANCIARA Y APOYAR EN LA SUPERVISIÓN DE CONTRATOS EN LOS ASUNTOS RELATIVOS A LA PLANEACIÓN LOCAL DE PROYECTOS DE INFRAESTRUCTURA DE ACUERDO A LAS LÍNEAS DE INVERSIÓN VIGENTES","Inversión",18,{"$f":"IF(ISERROR(VLOOKUP(I35,Eje_Pilar!$C$2:$E$47,2,FALSE)),\" \",VLOOKUP(I35,Eje_Pilar!$C$2:$E$47,2,FALSE))","v":"Mejor movilidad para todos"},{"$f":"IF(ISERROR(VLOOKUP(I35,Eje_Pilar!$C$2:$E$47,3,FALSE)),\" \",VLOOKUP(I35,Eje_Pilar!$C$2:$E$47,3,FALSE))","v":"Pilar 2 Democracía Urbana"},1561,80770148,"JOAQUÍN RODRIGO CISNEROS GARCÍA ",59400000,1,-4950000,1,2970000,57420000,47685000,"2019-01-30","2019-02-01","2020-01-30",360,17.999999999999989,null,null,"x",null,null,0.83045977011494254,null,{"$f":"IF(SUMPRODUCT((A$14:A35=A35)*(B$14:B35=B35)*(C$14:C35=C35))>1,0,1)","v":1},"Contratos de prestación de servicios profesionales y de apoyo a la gestión","Contratación directa",{"$f":"IFERROR(VLOOKUP(F35,Tipo!$C$12:$C$27,1,FALSE),\"NO\")","v":"Prestación de servicios profesionales y de apoyo a la gestión, o para la ejecución de trabajos artísticos que sólo puedan encomendarse a determinadas personas naturales;"},"Inversión",18]
["023-2019",2019,"FDLBU-CD-025-2019","Contratos de prestación de servicios profesionales y de apoyo a la gestión","Contratación directa","Prestación de servicios profesionales y de apoyo a la gestión, o para la ejecución de trabajos artísticos que sólo puedan encomendarse a determinadas personas naturales;","PRESTAR LOS SERVICIOS PROFESIONALES PARA APOYAR AL ÁREA DE GESTIÓN DEL DESARROLLO  ADMINISTRATIVO Y FINANCIERO, EN LOS ASUNTOS RELACIONADOS CON EL DESARROLLO DE LA GESTIÓN CONTRACTUAL PARA LA ADQUISICIÓN DE RECURSOS        ","Inversión",45,{"$f":"IF(ISERROR(VLOOKUP(I36,Eje_Pilar!$C$2:$E$47,2,FALSE)),\" \",VLOOKUP(I36,Eje_Pilar!$C$2:$E$47,2,FALSE))","v":"Gobernanza e influencia local, regional e internacional"},{"$f":"IF(ISERROR(VLOOKUP(I36,Eje_Pilar!$C$2:$E$47,3,FALSE)),\" \",VLOOKUP(I36,Eje_Pilar!$C$2:$E$47,3,FALSE))","v":"Eje Transversal 4 Gobierno Legitimo, Fortalecimiento Local y Eficiencia"},1559,1030558349,"EDNA ROCIO VALENZUELA JIMÉNEZ CEDE A DIANA MARCELA JOYA ROJAS \nGERMAN GARCÍA ",36000000,null,null,2,16800000,52800000,48480000,"2019-01-29","2019-01-29","2019-12-27",225,105,null,null,null,"x",null,0.91818181818181821,null,{"$f":"IF(SUMPRODUCT((A$14:A36=A36)*(B$14:B36=B36)*(C$14:C36=C36))>1,0,1)","v":1},"Contratos de prestación de servicios profesionales y de apoyo a la gestión","Contratación directa",{"$f":"IFERROR(VLOOKUP(F36,Tipo!$C$12:$C$27,1,FALSE),\"NO\")","v":"Prestación de servicios profesionales y de apoyo a la gestión, o para la ejecución de trabajos artísticos que sólo puedan encomendarse a determinadas personas naturales;"},"Inversión",45]
["024-2019",2019,"FDLBU-CD-026-2019","Contratos de prestación de servicios profesionales y de apoyo a la gestión","Contratación directa","Prestación de servicios profesionales y de apoyo a la gestión, o para la ejecución de trabajos artísticos que sólo puedan encomendarse a determinadas personas naturales;","APOYAR TÉCNICAMENTE LAS DISTINTAS ETAPAS DE LOS PROCESOS DE COMPETENCIA DE LAS INSPECCIONES DE POLICÍA DE LA LOCALIDAD, SEGÚN REPARTO","Inversión",45,{"$f":"IF(ISERROR(VLOOKUP(I37,Eje_Pilar!$C$2:$E$47,2,FALSE)),\" \",VLOOKUP(I37,Eje_Pilar!$C$2:$E$47,2,FALSE))","v":"Gobernanza e influencia local, regional e internacional"},{"$f":"IF(ISERROR(VLOOKUP(I37,Eje_Pilar!$C$2:$E$47,3,FALSE)),\" \",VLOOKUP(I37,Eje_Pilar!$C$2:$E$47,3,FALSE))","v":"Eje Transversal 4 Gobierno Legitimo, Fortalecimiento Local y Eficiencia"},1559,19274869,"HIPOLITO ACOSTA FORERO",32298000,null,null,2,16328433,48626433,48626433,"2019-01-30","2019-01-31","2019-10-30",180,90,null,null,null,"x",null,1,null,{"$f":"IF(SUMPRODUCT((A$14:A37=A37)*(B$14:B37=B37)*(C$14:C37=C37))>1,0,1)","v":1},"Contratos de prestación de servicios profesionales y de apoyo a la gestión","Contratación directa",{"$f":"IFERROR(VLOOKUP(F37,Tipo!$C$12:$C$27,1,FALSE),\"NO\")","v":"Prestación de servicios profesionales y de apoyo a la gestión, o para la ejecución de trabajos artísticos que sólo puedan encomendarse a determinadas personas naturales;"},"Inversión",45]
["025-2019",2019,"FDLBU-CD-027-2019","Contratos de prestación de servicios profesionales y de apoyo a la gestión","Contratación directa","Prestación de servicios profesionales y de apoyo a la gestión, o para la ejecución de trabajos artísticos que sólo puedan encomendarse a determinadas personas naturales;","APOYAR TÉCNICAMENTE LAS DISTINTAS ETAPAS DE LOS PROCESOS DE COMPETENCIA DE LAS INSPECCIONES DE POLICÍA DE LA LOCALIDAD, SEGÚN REPARTO","Inversión",45,{"$f":"IF(ISERROR(VLOOKUP(I38,Eje_Pilar!$C$2:$E$47,2,FALSE)),\" \",VLOOKUP(I38,Eje_Pilar!$C$2:$E$47,2,FALSE))","v":"Gobernanza e influencia local, regional e internacional"},{"$f":"IF(ISERROR(VLOOKUP(I38,Eje_Pilar!$C$2:$E$47,3,FALSE)),\" \",VLOOKUP(I38,Eje_Pilar!$C$2:$E$47,3,FALSE))","v":"Eje Transversal 4 Gobierno Legitimo, Fortalecimiento Local y Eficiencia"},1559,52714350,"MARLIES INGRID ULLOA MENDIETA",32298000,null,null,2,16328433,48626433,48626433,"2019-01-29","2019-01-31","2019-10-30",180,90,null,null,null,"x",null,1,null,{"$f":"IF(SUMPRODUCT((A$14:A38=A38)*(B$14:B38=B38)*(C$14:C38=C38))>1,0,1)","v":1},"Contratos de prestación de servicios profesionales y de apoyo a la gestión","Contratación directa",{"$f":"IFERROR(VLOOKUP(F38,Tipo!$C$12:$C$27,1,FALSE),\"NO\")","v":"Prestación de servicios profesionales y de apoyo a la gestión, o para la ejecución de trabajos artísticos que sólo puedan encomendarse a determinadas personas naturales;"},"Inversión",45]
["026-2019",2019,"FDLBU-CD-023-2019","Contratos de prestación de servicios profesionales y de apoyo a la gestión","Contratación directa","Prestación de servicios profesionales y de apoyo a la gestión, o para la ejecución de trabajos artísticos que sólo puedan encomendarse a determinadas personas naturales;","Prestar los servicios profesionales para apoyar el Área de Gestión del Desarrollo Administrativa - Financiara y apoyar en la supervisión de contratos en los asuntos relativos a la Planeación Local de proyectos de infraestructura de acuerdo a las líneas de inversión vigentes","Inversión",18,{"$f":"IF(ISERROR(VLOOKUP(I39,Eje_Pilar!$C$2:$E$47,2,FALSE)),\" \",VLOOKUP(I39,Eje_Pilar!$C$2:$E$47,2,FALSE))","v":"Mejor movilidad para todos"},{"$f":"IF(ISERROR(VLOOKUP(I39,Eje_Pilar!$C$2:$E$47,3,FALSE)),\" \",VLOOKUP(I39,Eje_Pilar!$C$2:$E$47,3,FALSE))","v":"Pilar 2 Democracía Urbana"},1561,1090374848,"JAMES FERNANDO NUÑEZ RODRIGUEZ ",66000000,1,-5133333,1,4216667,65083334,54266667,"2019-01-28","2019-01-30","2020-01-30",360,23.099999999999987,null,null,"x",null,null,0.83380281348217344,null,{"$f":"IF(SUMPRODUCT((A$14:A39=A39)*(B$14:B39=B39)*(C$14:C39=C39))>1,0,1)","v":1},"Contratos de prestación de servicios profesionales y de apoyo a la gestión","Contratación directa",{"$f":"IFERROR(VLOOKUP(F39,Tipo!$C$12:$C$27,1,FALSE),\"NO\")","v":"Prestación de servicios profesionales y de apoyo a la gestión, o para la ejecución de trabajos artísticos que sólo puedan encomendarse a determinadas personas naturales;"},"Inversión",18]
["027-2019",2019,"FDLBU-CD-030-2019","Contratos de prestación de servicios profesionales y de apoyo a la gestión","Contratación directa","Prestación de servicios profesionales y de apoyo a la gestión, o para la ejecución de trabajos artísticos que sólo puedan encomendarse a determinadas personas naturales;","PRESTAR SERVICIOS PROFESIONALES DE APOYO A LA OFICINA DE PRESUPUESTO DEL FONDO DE DESARROLLO LOCAL EN EL REGISTRO, ANÁLISIS Y GESTIÓN DE OBLIGACIONES POR PAGAR Y OTROS ASUNTOS QUE EN MATERIA DE PRESUPUESTO LOCAL LE SEAN DESIGNADOS","Inversión",45,{"$f":"IF(ISERROR(VLOOKUP(I40,Eje_Pilar!$C$2:$E$47,2,FALSE)),\" \",VLOOKUP(I40,Eje_Pilar!$C$2:$E$47,2,FALSE))","v":"Gobernanza e influencia local, regional e internacional"},{"$f":"IF(ISERROR(VLOOKUP(I40,Eje_Pilar!$C$2:$E$47,3,FALSE)),\" \",VLOOKUP(I40,Eje_Pilar!$C$2:$E$47,3,FALSE))","v":"Eje Transversal 4 Gobierno Legitimo, Fortalecimiento Local y Eficiencia"},1559,7320162,"JOSE RAUL PINILLA CHILLON ",31885000,null,null,3,11539333,43424333,43424333,"2019-01-28","2019-01-29","2019-11-13",210,75,null,null,null,"x",null,1,null,{"$f":"IF(SUMPRODUCT((A$14:A40=A40)*(B$14:B40=B40)*(C$14:C40=C40))>1,0,1)","v":1},"Contratos de prestación de servicios profesionales y de apoyo a la gestión","Contratación directa",{"$f":"IFERROR(VLOOKUP(F40,Tipo!$C$12:$C$27,1,FALSE),\"NO\")","v":"Prestación de servicios profesionales y de apoyo a la gestión, o para la ejecución de trabajos artísticos que sólo puedan encomendarse a determinadas personas naturales;"},"Inversión",45]
["028-2019",2019,"FDLBU-CD-036-2019","Contratos de prestación de servicios profesionales y de apoyo a la gestión","Contratación directa","Prestación de servicios profesionales y de apoyo a la gestión, o para la ejecución de trabajos artísticos que sólo puedan encomendarse a determinadas personas naturales;","PRESTAR SERVICIOS DE APOYO A LOS ARCHIVOS DE GESTIÓN DE LA ENTIDAD EN LA IMPLEMENTACIÓN DE LOS PROCESOS DE CLASIFICACIÓN, ORDENACIÓN, SELECCIÓN NATURAL, FOLIACIÓN, IDENTIFICACION, LEVANTAMIENTO DE INVENTARIOS, ALMACENAMIENTO Y APLICACIÓN DE PROTOCOLOS DE ELIMINACION Y TRANSFERENCIAS DOCUMENTALES, ALISTAMIENTO Y PRESTAMO DE EXPEDIENTES EN EL ÁREA DE GESTIÓN POLICIVA JURÍDICA.","Inversión",45,{"$f":"IF(ISERROR(VLOOKUP(I41,Eje_Pilar!$C$2:$E$47,2,FALSE)),\" \",VLOOKUP(I41,Eje_Pilar!$C$2:$E$47,2,FALSE))","v":"Gobernanza e influencia local, regional e internacional"},{"$f":"IF(ISERROR(VLOOKUP(I41,Eje_Pilar!$C$2:$E$47,3,FALSE)),\" \",VLOOKUP(I41,Eje_Pilar!$C$2:$E$47,3,FALSE))","v":"Eje Transversal 4 Gobierno Legitimo, Fortalecimiento Local y Eficiencia"},1559,"1.136.883.122\n\n79.781.055","JUAN JOSE QUINTERO  FONSECA CEDIÓ A JUAN CARLOS PINEDA SANCHEZ",13200000,null,null,2,6673333,19873333,19873333,"2019-01-31","2019-01-31","2019-10-30",180,90,null,null,null,"x",null,1,null,{"$f":"IF(SUMPRODUCT((A$14:A41=A41)*(B$14:B41=B41)*(C$14:C41=C41))>1,0,1)","v":1},"Contratos de prestación de servicios profesionales y de apoyo a la gestión","Contratación directa",{"$f":"IFERROR(VLOOKUP(F41,Tipo!$C$12:$C$27,1,FALSE),\"NO\")","v":"Prestación de servicios profesionales y de apoyo a la gestión, o para la ejecución de trabajos artísticos que sólo puedan encomendarse a determinadas personas naturales;"},"Inversión",45]
["029-2019",2019,"FDLBU-CD-029-2019","Contratos de prestación de servicios profesionales y de apoyo a la gestión","Contratación directa","Prestación de servicios profesionales y de apoyo a la gestión, o para la ejecución de trabajos artísticos que sólo puedan encomendarse a determinadas personas naturales;","PRESTAR SERVICIOS DE APOYO A LA GESTIÓN, PARA LA REVISIÓN, ORGANIZACIÓN, ACTUALIZACIÓN, TRANSFERENCIA Y DEMÁS ACTIVIDADES Y FUNCIONES RELACIONADAS CON EL ARCHIVO DE DOCUMENTOS DE LA ALCALDÍA LOCAL DE BARRIOS UNIDOS","Inversión",45,{"$f":"IF(ISERROR(VLOOKUP(I42,Eje_Pilar!$C$2:$E$47,2,FALSE)),\" \",VLOOKUP(I42,Eje_Pilar!$C$2:$E$47,2,FALSE))","v":"Gobernanza e influencia local, regional e internacional"},{"$f":"IF(ISERROR(VLOOKUP(I42,Eje_Pilar!$C$2:$E$47,3,FALSE)),\" \",VLOOKUP(I42,Eje_Pilar!$C$2:$E$47,3,FALSE))","v":"Eje Transversal 4 Gobierno Legitimo, Fortalecimiento Local y Eficiencia"},1559,1100959714,"CINTYA ALEXANDRA GAMEZ  PARRA",14300000,null,null,2,6600000,20900000,20900000,"2019-01-30","2019-01-30","2019-11-13",195,90,null,null,null,"x",null,1,null,{"$f":"IF(SUMPRODUCT((A$14:A42=A42)*(B$14:B42=B42)*(C$14:C42=C42))>1,0,1)","v":1},"Contratos de prestación de servicios profesionales y de apoyo a la gestión","Contratación directa",{"$f":"IFERROR(VLOOKUP(F42,Tipo!$C$12:$C$27,1,FALSE),\"NO\")","v":"Prestación de servicios profesionales y de apoyo a la gestión, o para la ejecución de trabajos artísticos que sólo puedan encomendarse a determinadas personas naturales;"},"Inversión",45]
["030-2019",2019,"FDLBU-CD-029-2019","Contratos de prestación de servicios profesionales y de apoyo a la gestión","Contratación directa","Prestación de servicios profesionales y de apoyo a la gestión, o para la ejecución de trabajos artísticos que sólo puedan encomendarse a determinadas personas naturales;","PRESTAR SERVICIOS DE APOYO A LA GESTIÓN, PARA LA REVISIÓN, ORGANIZACIÓN, ACTUALIZACIÓN, TRANSFERENCIA Y DEMÁS ACTIVIDADES Y FUNCIONES RELACIONADAS CON EL ARCHIVO DE DOCUMENTOS DE LA ALCALDÍA LOCAL DE BARRIOS UNIDOS","Inversión",45,{"$f":"IF(ISERROR(VLOOKUP(I43,Eje_Pilar!$C$2:$E$47,2,FALSE)),\" \",VLOOKUP(I43,Eje_Pilar!$C$2:$E$47,2,FALSE))","v":"Gobernanza e influencia local, regional e internacional"},{"$f":"IF(ISERROR(VLOOKUP(I43,Eje_Pilar!$C$2:$E$47,3,FALSE)),\" \",VLOOKUP(I43,Eje_Pilar!$C$2:$E$47,3,FALSE))","v":"Eje Transversal 4 Gobierno Legitimo, Fortalecimiento Local y Eficiencia"},1559,1026250874,"LINA MARIA PAEZ BOGOYA",14300000,null,null,2,6600000,20900000,20900000,"2019-01-30","2019-01-30","2019-11-13",195,90,null,null,null,"x",null,1,null,{"$f":"IF(SUMPRODUCT((A$14:A43=A43)*(B$14:B43=B43)*(C$14:C43=C43))>1,0,1)","v":1},"Contratos de prestación de servicios profesionales y de apoyo a la gestión","Contratación directa",{"$f":"IFERROR(VLOOKUP(F43,Tipo!$C$12:$C$27,1,FALSE),\"NO\")","v":"Prestación de servicios profesionales y de apoyo a la gestión, o para la ejecución de trabajos artísticos que sólo puedan encomendarse a determinadas personas naturales;"},"Inversión",45]
["031-2019",2019,"FDLBU-CD-032-2019","Contratos de prestación de servicios profesionales y de apoyo a la gestión","Contratación directa","Prestación de servicios profesionales y de apoyo a la gestión, o para la ejecución de trabajos artísticos que sólo puedan encomendarse a determinadas personas naturales;","APOYAR TÉCNICAMENTE LAS DISTINTAS ETAPAS DE LOS PROCESOS DE COMPETENCIA DE LAS INSPECCIONES DE POLICÍA DE LA LOCALIDAD, SEGÚN REPARTO","Inversión",45,{"$f":"IF(ISERROR(VLOOKUP(I44,Eje_Pilar!$C$2:$E$47,2,FALSE)),\" \",VLOOKUP(I44,Eje_Pilar!$C$2:$E$47,2,FALSE))","v":"Gobernanza e influencia local, regional e internacional"},{"$f":"IF(ISERROR(VLOOKUP(I44,Eje_Pilar!$C$2:$E$47,3,FALSE)),\" \",VLOOKUP(I44,Eje_Pilar!$C$2:$E$47,3,FALSE))","v":"Eje Transversal 4 Gobierno Legitimo, Fortalecimiento Local y Eficiencia"},1559,52352454,"FABIOLA RODRÍGUEZ CARREÑO",32298000,null,null,2,16328433,48626433,48626433,"2019-01-30","2019-01-31","2019-10-30",180,90,null,null,null,"x",null,1,null,{"$f":"IF(SUMPRODUCT((A$14:A44=A44)*(B$14:B44=B44)*(C$14:C44=C44))>1,0,1)","v":1},"Contratos de prestación de servicios profesionales y de apoyo a la gestión","Contratación directa",{"$f":"IFERROR(VLOOKUP(F44,Tipo!$C$12:$C$27,1,FALSE),\"NO\")","v":"Prestación de servicios profesionales y de apoyo a la gestión, o para la ejecución de trabajos artísticos que sólo puedan encomendarse a determinadas personas naturales;"},"Inversión",45]
["032-2019",2019,"FDLBU-CD-031-2019","Contratos de prestación de servicios profesionales y de apoyo a la gestión","Contratación directa","Prestación de servicios profesionales y de apoyo a la gestión, o para la ejecución de trabajos artísticos que sólo puedan encomendarse a determinadas personas naturales;","PRESTAR LOS SERVICIOS DE APOYO A LA GESTIÓN DE CONDUCCIÓN DE LOS VEHÍCULOS A CARGO DEL FONDO DE DESARROLLO LOCAL DE BARRIOS UNIDOS, -DESPACHO, ASÍ COMO APOYAR LA GESTIÓN ADMINISTRATIVA QUE DESIGNE EL SUPERVISOR","Inversión",45,{"$f":"IF(ISERROR(VLOOKUP(I45,Eje_Pilar!$C$2:$E$47,2,FALSE)),\" \",VLOOKUP(I45,Eje_Pilar!$C$2:$E$47,2,FALSE))","v":"Gobernanza e influencia local, regional e internacional"},{"$f":"IF(ISERROR(VLOOKUP(I45,Eje_Pilar!$C$2:$E$47,3,FALSE)),\" \",VLOOKUP(I45,Eje_Pilar!$C$2:$E$47,3,FALSE))","v":"Eje Transversal 4 Gobierno Legitimo, Fortalecimiento Local y Eficiencia"},1559,7321025,"WILLINGTON ORTIZ ALARCON",33930290,1,-1180184,1,2950000,35700106,29799646,"2019-01-28","2019-01-29","2020-01-31",345,30,null,null,"x",null,null,0.83472149914624905,null,{"$f":"IF(SUMPRODUCT((A$14:A45=A45)*(B$14:B45=B45)*(C$14:C45=C45))>1,0,1)","v":1},"Contratos de prestación de servicios profesionales y de apoyo a la gestión","Contratación directa",{"$f":"IFERROR(VLOOKUP(F45,Tipo!$C$12:$C$27,1,FALSE),\"NO\")","v":"Prestación de servicios profesionales y de apoyo a la gestión, o para la ejecución de trabajos artísticos que sólo puedan encomendarse a determinadas personas naturales;"},"Inversión",45]
["033-2019",2019,"FDLBU-CD-029-2019","Contratos de prestación de servicios profesionales y de apoyo a la gestión","Contratación directa","Prestación de servicios profesionales y de apoyo a la gestión, o para la ejecución de trabajos artísticos que sólo puedan encomendarse a determinadas personas naturales;","PRESTAR SERVICIOS DE APOYO A LA GESTIÓN, PARA LA REVISIÓN, ORGANIZACIÓN, ACTUALIZACIÓN, TRANSFERENCIA Y DEMÁS ACTIVIDADES Y FUNCIONES RELACIONADAS CON EL ARCHIVO DE DOCUMENTOS DE LA ALCALDÍA LOCAL DE BARRIOS UNIDOS","Inversión",45,{"$f":"IF(ISERROR(VLOOKUP(I46,Eje_Pilar!$C$2:$E$47,2,FALSE)),\" \",VLOOKUP(I46,Eje_Pilar!$C$2:$E$47,2,FALSE))","v":"Gobernanza e influencia local, regional e internacional"},{"$f":"IF(ISERROR(VLOOKUP(I46,Eje_Pilar!$C$2:$E$47,3,FALSE)),\" \",VLOOKUP(I46,Eje_Pilar!$C$2:$E$47,3,FALSE))","v":"Eje Transversal 4 Gobierno Legitimo, Fortalecimiento Local y Eficiencia"},1559,41778154,"LUZ MYRIAM PEÑA SANCHEZ",14300000,null,null,2,6600000,20900000,20900000,"2019-01-30","2019-01-30","2019-11-13",195,90,null,null,null,"x",null,1,null,{"$f":"IF(SUMPRODUCT((A$14:A46=A46)*(B$14:B46=B46)*(C$14:C46=C46))>1,0,1)","v":1},"Contratos de prestación de servicios profesionales y de apoyo a la gestión","Contratación directa",{"$f":"IFERROR(VLOOKUP(F46,Tipo!$C$12:$C$27,1,FALSE),\"NO\")","v":"Prestación de servicios profesionales y de apoyo a la gestión, o para la ejecución de trabajos artísticos que sólo puedan encomendarse a determinadas personas naturales;"},"Inversión",45]
["034-2019",2019,"FDLBU-CD-029-2019","Contratos de prestación de servicios profesionales y de apoyo a la gestión","Contratación directa","Prestación de servicios profesionales y de apoyo a la gestión, o para la ejecución de trabajos artísticos que sólo puedan encomendarse a determinadas personas naturales;","PRESTAR SERVICIOS DE APOYO A LA GESTIÓN, PARA LA REVISIÓN, ORGANIZACIÓN, ACTUALIZACIÓN, TRANSFERENCIA Y DEMÁS ACTIVIDADES Y FUNCIONES RELACIONADAS CON EL ARCHIVO DE DOCUMENTOS DE LA ALCALDÍA LOCAL DE BARRIOS UNIDOS","Inversión",45,{"$f":"IF(ISERROR(VLOOKUP(I47,Eje_Pilar!$C$2:$E$47,2,FALSE)),\" \",VLOOKUP(I47,Eje_Pilar!$C$2:$E$47,2,FALSE))","v":"Gobernanza e influencia local, regional e internacional"},{"$f":"IF(ISERROR(VLOOKUP(I47,Eje_Pilar!$C$2:$E$47,3,FALSE)),\" \",VLOOKUP(I47,Eje_Pilar!$C$2:$E$47,3,FALSE))","v":"Eje Transversal 4 Gobierno Legitimo, Fortalecimiento Local y Eficiencia"},1559,80246449,"DIEGO ANDRES SORA CORTES",14300000,null,null,2,6600000,20900000,19873333,"2019-01-30","2019-01-31","2019-11-14",195,90,null,null,null,"x",null,0.95087717703349284,null,{"$f":"IF(SUMPRODUCT((A$14:A47=A47)*(B$14:B47=B47)*(C$14:C47=C47))>1,0,1)","v":1},"Contratos de prestación de servicios profesionales y de apoyo a la gestión","Contratación directa",{"$f":"IFERROR(VLOOKUP(F47,Tipo!$C$12:$C$27,1,FALSE),\"NO\")","v":"Prestación de servicios profesionales y de apoyo a la gestión, o para la ejecución de trabajos artísticos que sólo puedan encomendarse a determinadas personas naturales;"},"Inversión",45]
["035-2019",2019,"FDLBU-CD-015-2019","Contratos de prestación de servicios profesionales y de apoyo a la gestión","Contratación directa","Prestación de servicios profesionales y de apoyo a la gestión, o para la ejecución de trabajos artísticos que sólo puedan encomendarse a determinadas personas naturales;","PRESTAR LOS SERVICIOS DE APOYO A LA GESTIÓN DE CONDUCCIÓN DE LOS VEHÍCULOS A CARGO DEL FONDO DE DESARROLLO LOCAL DE BARRIOS UNIDOS, ASÍ COMO APOYAR LA GESTIÓN ADMINISTRATIVA QUE DESIGNE EL SUPERVISOR","Inversión",45,{"$f":"IF(ISERROR(VLOOKUP(I48,Eje_Pilar!$C$2:$E$47,2,FALSE)),\" \",VLOOKUP(I48,Eje_Pilar!$C$2:$E$47,2,FALSE))","v":"Gobernanza e influencia local, regional e internacional"},{"$f":"IF(ISERROR(VLOOKUP(I48,Eje_Pilar!$C$2:$E$47,3,FALSE)),\" \",VLOOKUP(I48,Eje_Pilar!$C$2:$E$47,3,FALSE))","v":"Eje Transversal 4 Gobierno Legitimo, Fortalecimiento Local y Eficiencia"},1559,79501810,"CARLOS EDUARDO LÓPEZ BRICEÑO",17906240,null,null,2,3432029,21338269,21338269,"2019-01-30","2019-01-30","2019-11-14",240,45,null,null,null,"x",null,1,null,{"$f":"IF(SUMPRODUCT((A$14:A48=A48)*(B$14:B48=B48)*(C$14:C48=C48))>1,0,1)","v":1},"Contratos de prestación de servicios profesionales y de apoyo a la gestión","Contratación directa",{"$f":"IFERROR(VLOOKUP(F48,Tipo!$C$12:$C$27,1,FALSE),\"NO\")","v":"Prestación de servicios profesionales y de apoyo a la gestión, o para la ejecución de trabajos artísticos que sólo puedan encomendarse a determinadas personas naturales;"},"Inversión",45]
["036-2019",2019,"FDLBU-CD-035-2019","Contratos de prestación de servicios profesionales y de apoyo a la gestión","Contratación directa","Prestación de servicios profesionales y de apoyo a la gestión, o para la ejecución de trabajos artísticos que sólo puedan encomendarse a determinadas personas naturales;","PRESTAR LOS SERVICIOS DE APOYO A LA GESTIÓN DE CONDUCCIÓN DE LOS VEHÍCULOS A CARGO DEL FONDO DE DESARROLLO LOCAL DE BARRIOS UNIDOS, ASÍ COMO APOYAR LA GESTIÓN ADMINISTRATIVA QUE DESIGNE EL SUPERVISOR","Inversión",45,{"$f":"IF(ISERROR(VLOOKUP(I49,Eje_Pilar!$C$2:$E$47,2,FALSE)),\" \",VLOOKUP(I49,Eje_Pilar!$C$2:$E$47,2,FALSE))","v":"Gobernanza e influencia local, regional e internacional"},{"$f":"IF(ISERROR(VLOOKUP(I49,Eje_Pilar!$C$2:$E$47,3,FALSE)),\" \",VLOOKUP(I49,Eje_Pilar!$C$2:$E$47,3,FALSE))","v":"Eje Transversal 4 Gobierno Legitimo, Fortalecimiento Local y Eficiencia"},1559,8717340,"NELSON CARDENAS VALENCIA",17906240,null,null,2,3432029,21338269,21338269,"2019-01-30","2019-01-30","2019-11-14",240,45,null,null,null,"x",null,1,null,{"$f":"IF(SUMPRODUCT((A$14:A49=A49)*(B$14:B49=B49)*(C$14:C49=C49))>1,0,1)","v":1},"Contratos de prestación de servicios profesionales y de apoyo a la gestión","Contratación directa",{"$f":"IFERROR(VLOOKUP(F49,Tipo!$C$12:$C$27,1,FALSE),\"NO\")","v":"Prestación de servicios profesionales y de apoyo a la gestión, o para la ejecución de trabajos artísticos que sólo puedan encomendarse a determinadas personas naturales;"},"Inversión",45]
["037-2019",2019,"FDLBU-CD-029-2019","Contratos de prestación de servicios profesionales y de apoyo a la gestión","Contratación directa","Prestación de servicios profesionales y de apoyo a la gestión, o para la ejecución de trabajos artísticos que sólo puedan encomendarse a determinadas personas naturales;","PRESTAR SERVICIOS DE APOYO A LA GESTIÓN, PARA LA REVISIÓN, ORGANIZACIÓN, ACTUALIZACIÓN, TRANSFERENCIA Y DEMÁS ACTIVIDADES Y FUNCIONES RELACIONADAS CON EL ARCHIVO DE DOCUMENTOS DE LA ALCALDÍA LOCAL DE BARRIOS UNIDOS","Inversión",45,{"$f":"IF(ISERROR(VLOOKUP(I50,Eje_Pilar!$C$2:$E$47,2,FALSE)),\" \",VLOOKUP(I50,Eje_Pilar!$C$2:$E$47,2,FALSE))","v":"Gobernanza e influencia local, regional e internacional"},{"$f":"IF(ISERROR(VLOOKUP(I50,Eje_Pilar!$C$2:$E$47,3,FALSE)),\" \",VLOOKUP(I50,Eje_Pilar!$C$2:$E$47,3,FALSE))","v":"Eje Transversal 4 Gobierno Legitimo, Fortalecimiento Local y Eficiencia"},1559,52352104,"ANA ISABEL BEJARANO BABATIVA",14300000,null,null,4,7113333,21413333,20680000,"2019-01-31","2019-02-04","2019-12-10",195,96.9,null,null,null,"x",null,0.96575343969105598,null,{"$f":"IF(SUMPRODUCT((A$14:A50=A50)*(B$14:B50=B50)*(C$14:C50=C50))>1,0,1)","v":1},"Contratos de prestación de servicios profesionales y de apoyo a la gestión","Contratación directa",{"$f":"IFERROR(VLOOKUP(F50,Tipo!$C$12:$C$27,1,FALSE),\"NO\")","v":"Prestación de servicios profesionales y de apoyo a la gestión, o para la ejecución de trabajos artísticos que sólo puedan encomendarse a determinadas personas naturales;"},"Inversión",45]
["038-2019",2019,"FDLBU-CD-37-2019","Contratos de prestación de servicios profesionales y de apoyo a la gestión","Contratación directa","Prestación de servicios profesionales y de apoyo a la gestión, o para la ejecución de trabajos artísticos que sólo puedan encomendarse a determinadas personas naturales;","PRESTAR SERVICIOS DE APOYO EN EL MANTENIMIENTO DE LAS CONDICIONES OPERATIVAS DE LA ALCALDIA LOCAL DE BARRIOS UNIDOS EJECUTANDO ACTIVIDADES DE SEGUIMIENTO, REPARACIÓN Y MANTENIMIENTO DE EQUIPOS Y ARTEFACTOS ELÉCTRICOS, CON EL FIN DE GARANTIZAR EL BUEN FUNCIONAMIENTO DE LOS MISMOS.EN LAS DIFERENTES DEPENDENCIAS","Inversión",45,{"$f":"IF(ISERROR(VLOOKUP(I51,Eje_Pilar!$C$2:$E$47,2,FALSE)),\" \",VLOOKUP(I51,Eje_Pilar!$C$2:$E$47,2,FALSE))","v":"Gobernanza e influencia local, regional e internacional"},{"$f":"IF(ISERROR(VLOOKUP(I51,Eje_Pilar!$C$2:$E$47,3,FALSE)),\" \",VLOOKUP(I51,Eje_Pilar!$C$2:$E$47,3,FALSE))","v":"Eje Transversal 4 Gobierno Legitimo, Fortalecimiento Local y Eficiencia"},1559,79577058,"SAMUEL DAVID CAMACHO ORTIZ",33350000,null,-1256667,null,0,32093333,24359999,"2019-01-30","2019-01-30","2020-03-19",330,48.90000000000002,null,null,"x",null,null,0.75903612130282638,null,{"$f":"IF(SUMPRODUCT((A$14:A51=A51)*(B$14:B51=B51)*(C$14:C51=C51))>1,0,1)","v":1},"Contratos de prestación de servicios profesionales y de apoyo a la gestión","Contratación directa",{"$f":"IFERROR(VLOOKUP(F51,Tipo!$C$12:$C$27,1,FALSE),\"NO\")","v":"Prestación de servicios profesionales y de apoyo a la gestión, o para la ejecución de trabajos artísticos que sólo puedan encomendarse a determinadas personas naturales;"},"Inversión",45]
["039-2019",2019,"FDLBU-CD-038-2019","Contratos de prestación de servicios profesionales y de apoyo a la gestión","Contratación directa","Prestación de servicios profesionales y de apoyo a la gestión, o para la ejecución de trabajos artísticos que sólo puedan encomendarse a determinadas personas naturales;","APOYAR LA GESTIÓN DEL RIESGO, QUE PROMUEVA LAS ACCIONES REQUERIDAS PARA LA PREVENCIÓN Y ATENCIÓN DE EMERGENCIAS O EVENTOS GENERADOS POR LA MATERIALIZACIÓN DE LOS RIESGOS Y RESPONDA DE MANERA OPERATIVA E INMEDIATA ANTE LA OCURRENCIA DE SITUACIONES ADVERSAS EN TEMAS DE EMERGENCIAS EN LA LOCALIDAD","Inversión",45,{"$f":"IF(ISERROR(VLOOKUP(I52,Eje_Pilar!$C$2:$E$47,2,FALSE)),\" \",VLOOKUP(I52,Eje_Pilar!$C$2:$E$47,2,FALSE))","v":"Gobernanza e influencia local, regional e internacional"},{"$f":"IF(ISERROR(VLOOKUP(I52,Eje_Pilar!$C$2:$E$47,3,FALSE)),\" \",VLOOKUP(I52,Eje_Pilar!$C$2:$E$47,3,FALSE))","v":"Eje Transversal 4 Gobierno Legitimo, Fortalecimiento Local y Eficiencia"},1559,1110454618,"HERNAN CAMILO VALDES DÍAZ",31885000,null,null,1,9110000,40995000,40995000,"2019-02-04","2019-02-05","2019-11-04",210,60,null,null,null,"x",null,1,null,{"$f":"IF(SUMPRODUCT((A$14:A52=A52)*(B$14:B52=B52)*(C$14:C52=C52))>1,0,1)","v":1},"Contratos de prestación de servicios profesionales y de apoyo a la gestión","Contratación directa",{"$f":"IFERROR(VLOOKUP(F52,Tipo!$C$12:$C$27,1,FALSE),\"NO\")","v":"Prestación de servicios profesionales y de apoyo a la gestión, o para la ejecución de trabajos artísticos que sólo puedan encomendarse a determinadas personas naturales;"},"Inversión",45]
["040-2019",2019,"FDLBU-CD-034-2019","Contratos de prestación de servicios profesionales y de apoyo a la gestión","Contratación directa","Prestación de servicios profesionales y de apoyo a la gestión, o para la ejecución de trabajos artísticos que sólo puedan encomendarse a determinadas personas naturales;","PRESTAR SUS SERVICIOS PROFESIONALES PARA APOYAR TÉCNICAMENTE A LOS RESPONSABLES E INTEGRANTES DE LOS PROCESOS EN LA IMPLEMENTACIÓN DE HERRAMIENTAS DE GESTIÓN, SIGUIENDO LOS LINEAMIENTOS METODOLÓGICOS ESTABLECIDOS POR LA OFICINA ASESORA DE PLANEACIÓN DE LA SECRETARÍA DISTRITAL DE GOBIERNO","Inversión",45,{"$f":"IF(ISERROR(VLOOKUP(I53,Eje_Pilar!$C$2:$E$47,2,FALSE)),\" \",VLOOKUP(I53,Eje_Pilar!$C$2:$E$47,2,FALSE))","v":"Gobernanza e influencia local, regional e internacional"},{"$f":"IF(ISERROR(VLOOKUP(I53,Eje_Pilar!$C$2:$E$47,3,FALSE)),\" \",VLOOKUP(I53,Eje_Pilar!$C$2:$E$47,3,FALSE))","v":"Eje Transversal 4 Gobierno Legitimo, Fortalecimiento Local y Eficiencia"},1559,52422505,"NAYIBE RODRIGUEZ MARTINEZ ",35700000,null,null,2,17850000,53550000,48450000,"2019-01-31","2019-02-04","2019-12-30",210,105,null,null,null,"x",null,0.90476190476190477,null,{"$f":"IF(SUMPRODUCT((A$14:A53=A53)*(B$14:B53=B53)*(C$14:C53=C53))>1,0,1)","v":1},"Contratos de prestación de servicios profesionales y de apoyo a la gestión","Contratación directa",{"$f":"IFERROR(VLOOKUP(F53,Tipo!$C$12:$C$27,1,FALSE),\"NO\")","v":"Prestación de servicios profesionales y de apoyo a la gestión, o para la ejecución de trabajos artísticos que sólo puedan encomendarse a determinadas personas naturales;"},"Inversión",45]
["041-2019",2019,"FDLBU-CD-39-2019","Contratos de prestación de servicios profesionales y de apoyo a la gestión","Contratación directa","Prestación de servicios profesionales y de apoyo a la gestión, o para la ejecución de trabajos artísticos que sólo puedan encomendarse a determinadas personas naturales;","PRESTAR SERVICIOS PROFESIONALES PARA APOYAR AL DESPACHO DE LA ALCALDÍA LOCAL DE BARRIOS UNIDOS, EN LA REVISIÓN, CONTROL Y VIGILANCIA DE LOS DOCUMENTOS EMITIDOS POR LAS DIFERENTES DEPENDENCIAS DEL ÁREA DE GESTIÓN POLICIVA JURÍDICA Y DE GESTIÓN DEL DESARROLLO LOCAL, BRINDAR LINEAMIENTOS JURÍDICOS, EVALUAR Y ORIENTAR TEMAS PRIORITARIOS DEL DESPACHO DE LA ALCALDÍA LOCAL","Inversión",45,{"$f":"IF(ISERROR(VLOOKUP(I54,Eje_Pilar!$C$2:$E$47,2,FALSE)),\" \",VLOOKUP(I54,Eje_Pilar!$C$2:$E$47,2,FALSE))","v":"Gobernanza e influencia local, regional e internacional"},{"$f":"IF(ISERROR(VLOOKUP(I54,Eje_Pilar!$C$2:$E$47,3,FALSE)),\" \",VLOOKUP(I54,Eje_Pilar!$C$2:$E$47,3,FALSE))","v":"Eje Transversal 4 Gobierno Legitimo, Fortalecimiento Local y Eficiencia"},1559,11188944,"WBEIMAR ARNULFO HERNANDEZ ROA",80948339,1,-53496294,null,0,27452045,27452045,"2019-01-30","2019-02-04","2019-05-31",345,0,null,null,null,"x",null,1,null,{"$f":"IF(SUMPRODUCT((A$14:A54=A54)*(B$14:B54=B54)*(C$14:C54=C54))>1,0,1)","v":1},"Contratos de prestación de servicios profesionales y de apoyo a la gestión","Contratación directa",{"$f":"IFERROR(VLOOKUP(F54,Tipo!$C$12:$C$27,1,FALSE),\"NO\")","v":"Prestación de servicios profesionales y de apoyo a la gestión, o para la ejecución de trabajos artísticos que sólo puedan encomendarse a determinadas personas naturales;"},"Inversión",45]
["042-2019",2019,"FDLBU-CD-042-2019","Contratos de prestación de servicios profesionales y de apoyo a la gestión","Contratación directa","Prestación de servicios profesionales y de apoyo a la gestión, o para la ejecución de trabajos artísticos que sólo puedan encomendarse a determinadas personas naturales;","PRESTAR LOS SERVICIOS PROFESIONALES PARA APOYAR AL ÁREA GESTIÓN DEL DESARROLLO ADMINISTRATIVO Y FINANCIERO EN LOS ASUNTOS RELATIVOS A LA PLANEACIÓN LOCAL, ASÍ COMO EL APOYO A LA SUPERVISIÓN DE CONTRATOS SUSCRITOS POR LA ALCALDÍA LOCAL DE BARRIOS UNIDOS","Inversión",45,{"$f":"IF(ISERROR(VLOOKUP(I55,Eje_Pilar!$C$2:$E$47,2,FALSE)),\" \",VLOOKUP(I55,Eje_Pilar!$C$2:$E$47,2,FALSE))","v":"Gobernanza e influencia local, regional e internacional"},{"$f":"IF(ISERROR(VLOOKUP(I55,Eje_Pilar!$C$2:$E$47,3,FALSE)),\" \",VLOOKUP(I55,Eje_Pilar!$C$2:$E$47,3,FALSE))","v":"Eje Transversal 4 Gobierno Legitimo, Fortalecimiento Local y Eficiencia"},1559,1019028211,"LAURA CATALINA MARTINEZ",36400000,null,null,1,10400000,46800000,46800000,"2019-01-31","2019-02-04","2019-11-03",210,60,null,null,null,"x",null,1,null,{"$f":"IF(SUMPRODUCT((A$14:A55=A55)*(B$14:B55=B55)*(C$14:C55=C55))>1,0,1)","v":1},"Contratos de prestación de servicios profesionales y de apoyo a la gestión","Contratación directa",{"$f":"IFERROR(VLOOKUP(F55,Tipo!$C$12:$C$27,1,FALSE),\"NO\")","v":"Prestación de servicios profesionales y de apoyo a la gestión, o para la ejecución de trabajos artísticos que sólo puedan encomendarse a determinadas personas naturales;"},"Inversión",45]
["043-2019",2019,"FDLBU-CD-040-2019","Contratos de prestación de servicios profesionales y de apoyo a la gestión","Contratación directa","Prestación de servicios profesionales y de apoyo a la gestión, o para la ejecución de trabajos artísticos que sólo puedan encomendarse a determinadas personas naturales;","APOYAR JURÍDICAMENTE LA EJECUCIÓN DE LAS ACCIONES REQUERIDAS PARA LA DEPURACIÓN DE LAS ACTUACIONES ADMINISTRATIVAS QUE CURSAN EN LA ALCALDÍA LOCAL","Inversión",45,{"$f":"IF(ISERROR(VLOOKUP(I56,Eje_Pilar!$C$2:$E$47,2,FALSE)),\" \",VLOOKUP(I56,Eje_Pilar!$C$2:$E$47,2,FALSE))","v":"Gobernanza e influencia local, regional e internacional"},{"$f":"IF(ISERROR(VLOOKUP(I56,Eje_Pilar!$C$2:$E$47,3,FALSE)),\" \",VLOOKUP(I56,Eje_Pilar!$C$2:$E$47,3,FALSE))","v":"Eje Transversal 4 Gobierno Legitimo, Fortalecimiento Local y Eficiencia"},1559,80761043,"CARLOS ANDRES MERIZALDE RUSINQUE ",31885000,null,null,1,9110000,40995000,40995000,"2019-02-05","2019-02-06","2019-11-05",210,60,null,null,null,"x",null,1,null,{"$f":"IF(SUMPRODUCT((A$14:A56=A56)*(B$14:B56=B56)*(C$14:C56=C56))>1,0,1)","v":1},"Contratos de prestación de servicios profesionales y de apoyo a la gestión","Contratación directa",{"$f":"IFERROR(VLOOKUP(F56,Tipo!$C$12:$C$27,1,FALSE),\"NO\")","v":"Prestación de servicios profesionales y de apoyo a la gestión, o para la ejecución de trabajos artísticos que sólo puedan encomendarse a determinadas personas naturales;"},"Inversión",45]
["044-2019",2019,"FDLBU-CD-043-2019","Contratos de prestación de servicios profesionales y de apoyo a la gestión","Contratación directa","Prestación de servicios profesionales y de apoyo a la gestión, o para la ejecución de trabajos artísticos que sólo puedan encomendarse a determinadas personas naturales;","PRESTAR SUS SERVICIOS PROFESIONALES PARA APOYAR EL (LA) ALCALDE(SA) LOCAL EN LA GESTIÓN DE LOS ASUNTOS RELACIONADOS CON SEGURIDAD CIUDADANA, CONVIVENCIA Y PREVENCIÓN DE CONFLICTIVIDADES, VIOLENCIAS Y DELITOS EN LA LOCALIDAD, DE CONFORMIDAD CON EL MARCO NORMATIVO APLICABLE EN LA MATERIA.","Inversión",19,{"$f":"IF(ISERROR(VLOOKUP(I57,Eje_Pilar!$C$2:$E$47,2,FALSE)),\" \",VLOOKUP(I57,Eje_Pilar!$C$2:$E$47,2,FALSE))","v":"Seguridad y convivencia para todos"},{"$f":"IF(ISERROR(VLOOKUP(I57,Eje_Pilar!$C$2:$E$47,3,FALSE)),\" \",VLOOKUP(I57,Eje_Pilar!$C$2:$E$47,3,FALSE))","v":"Pilar 3 Construcción de Comunidad y Cultura Ciudadana"},1563,79556340,"LUIS BASILIO GUTIERREZ SAENZ",73252800,1,-6918320,1,1831320,68165800,55957000,"2019-02-01","2019-02-05","2020-01-30",360,9.0000000000000213,null,null,"x",null,null,0.82089552238805974,null,{"$f":"IF(SUMPRODUCT((A$14:A57=A57)*(B$14:B57=B57)*(C$14:C57=C57))>1,0,1)","v":1},"Contratos de prestación de servicios profesionales y de apoyo a la gestión","Contratación directa",{"$f":"IFERROR(VLOOKUP(F57,Tipo!$C$12:$C$27,1,FALSE),\"NO\")","v":"Prestación de servicios profesionales y de apoyo a la gestión, o para la ejecución de trabajos artísticos que sólo puedan encomendarse a determinadas personas naturales;"},"Inversión",19]
["045-2019",2019,"FDLBU-CD-045-2019","Contratos de prestación de servicios profesionales y de apoyo a la gestión","Contratación directa","Prestación de servicios profesionales y de apoyo a la gestión, o para la ejecución de trabajos artísticos que sólo puedan encomendarse a determinadas personas naturales;","PRESTAR SERVICIOS PROFESIONALES MEDIANTE LOS CUALES SE CONTRIBUYA A LA REVISIÓN, SEGUIMIENTO Y PROYECCIÓN DE RESPUESTA DE LOS INFORMES SOLICITADOS POR LOS ENTES DE CONTROL, ENTIDADES Y CIUDADANÍA EN GENERAL RELATIVOS A LA GESTIÓN DE LA ALCALDÍA LOCAL DE BARRIOS UNIDOS, DE ACUERDO A SUS COMPETENCIAS MISIONALES","Inversión",45,{"$f":"IF(ISERROR(VLOOKUP(I58,Eje_Pilar!$C$2:$E$47,2,FALSE)),\" \",VLOOKUP(I58,Eje_Pilar!$C$2:$E$47,2,FALSE))","v":"Gobernanza e influencia local, regional e internacional"},{"$f":"IF(ISERROR(VLOOKUP(I58,Eje_Pilar!$C$2:$E$47,3,FALSE)),\" \",VLOOKUP(I58,Eje_Pilar!$C$2:$E$47,3,FALSE))","v":"Eje Transversal 4 Gobierno Legitimo, Fortalecimiento Local y Eficiencia"},1559,52392065,"CLAUDIA PATRICIA YOPASA POVEDA",27720000,null,null,2,13860000,41580000,41580000,"2019-02-08","2019-02-08","2019-11-07",180,90,null,null,null,"x",null,1,null,{"$f":"IF(SUMPRODUCT((A$14:A58=A58)*(B$14:B58=B58)*(C$14:C58=C58))>1,0,1)","v":1},"Contratos de prestación de servicios profesionales y de apoyo a la gestión","Contratación directa",{"$f":"IFERROR(VLOOKUP(F58,Tipo!$C$12:$C$27,1,FALSE),\"NO\")","v":"Prestación de servicios profesionales y de apoyo a la gestión, o para la ejecución de trabajos artísticos que sólo puedan encomendarse a determinadas personas naturales;"},"Inversión",45]
["046-2019",2019,"FDLBU-CD-040-2019","Contratos de prestación de servicios profesionales y de apoyo a la gestión","Contratación directa","Prestación de servicios profesionales y de apoyo a la gestión, o para la ejecución de trabajos artísticos que sólo puedan encomendarse a determinadas personas naturales;","APOYAR JURÍDICAMENTE LA EJECUCIÓN DE LAS ACCIONES REQUERIDAS PARA LA DEPURACIÓN DE LAS ACTUACIONES ADMINISTRATIVAS QUE CURSAN EN LA ALCALDÍA LOCAL","Inversión",45,{"$f":"IF(ISERROR(VLOOKUP(I59,Eje_Pilar!$C$2:$E$47,2,FALSE)),\" \",VLOOKUP(I59,Eje_Pilar!$C$2:$E$47,2,FALSE))","v":"Gobernanza e influencia local, regional e internacional"},{"$f":"IF(ISERROR(VLOOKUP(I59,Eje_Pilar!$C$2:$E$47,3,FALSE)),\" \",VLOOKUP(I59,Eje_Pilar!$C$2:$E$47,3,FALSE))","v":"Eje Transversal 4 Gobierno Legitimo, Fortalecimiento Local y Eficiencia"},1559,52731958,"MERLY JOHANNA GARCIA LOPEZ",31885000,null,null,1,9110000,40995000,40995000,"2019-02-07","2019-02-08","2019-11-02",210,60,null,null,null,"x",null,1,null,{"$f":"IF(SUMPRODUCT((A$14:A59=A59)*(B$14:B59=B59)*(C$14:C59=C59))>1,0,1)","v":1},"Contratos de prestación de servicios profesionales y de apoyo a la gestión","Contratación directa",{"$f":"IFERROR(VLOOKUP(F59,Tipo!$C$12:$C$27,1,FALSE),\"NO\")","v":"Prestación de servicios profesionales y de apoyo a la gestión, o para la ejecución de trabajos artísticos que sólo puedan encomendarse a determinadas personas naturales;"},"Inversión",45]
["047-2019",2019,"FDLBU-CD-040-2019","Contratos de prestación de servicios profesionales y de apoyo a la gestión","Contratación directa","Prestación de servicios profesionales y de apoyo a la gestión, o para la ejecución de trabajos artísticos que sólo puedan encomendarse a determinadas personas naturales;","APOYAR JURÍDICAMENTE LA EJECUCIÓN DE LAS ACCIONES REQUERIDAS PARA LA DEPURACIÓN DE LAS ACTUACIONES ADMINISTRATIVAS QUE CURSAN EN LA ALCALDÍA LOCAL","Inversión",45,{"$f":"IF(ISERROR(VLOOKUP(I60,Eje_Pilar!$C$2:$E$47,2,FALSE)),\" \",VLOOKUP(I60,Eje_Pilar!$C$2:$E$47,2,FALSE))","v":"Gobernanza e influencia local, regional e internacional"},{"$f":"IF(ISERROR(VLOOKUP(I60,Eje_Pilar!$C$2:$E$47,3,FALSE)),\" \",VLOOKUP(I60,Eje_Pilar!$C$2:$E$47,3,FALSE))","v":"Eje Transversal 4 Gobierno Legitimo, Fortalecimiento Local y Eficiencia"},1559,53040726,"KATERIN DANAY MERCADO HOYOS CEDE A SHIRLEY JOHANA VELANDIA MERCADO",31885000,null,null,2,15942500,47827500,44790833,"2019-02-04","2019-02-06","2019-12-20",210,105,null,null,null,"x",null,0.93650792953844542,null,{"$f":"IF(SUMPRODUCT((A$14:A60=A60)*(B$14:B60=B60)*(C$14:C60=C60))>1,0,1)","v":1},"Contratos de prestación de servicios profesionales y de apoyo a la gestión","Contratación directa",{"$f":"IFERROR(VLOOKUP(F60,Tipo!$C$12:$C$27,1,FALSE),\"NO\")","v":"Prestación de servicios profesionales y de apoyo a la gestión, o para la ejecución de trabajos artísticos que sólo puedan encomendarse a determinadas personas naturales;"},"Inversión",45]
["048-2019",2019,"FDLBU-CD-041-2019","Contratos de prestación de servicios profesionales y de apoyo a la gestión","Contratación directa","Prestación de servicios profesionales y de apoyo a la gestión, o para la ejecución de trabajos artísticos que sólo puedan encomendarse a determinadas personas naturales;","PRESTAR SERVICIOS PROFESIONALES ESPECIALIZADOS EN EL ÁREA DE GESTIÓN DEL DESARROLLO, PARA LIDERAR LA EJECUCIÓN Y SEGUIMIENTO DE LOS DIFERENTES PROYECTOS DE INVERSIÓN Y CONTRATOS DEL ÁREA DE GESTIÓN DEL DESARROLLO LOCAL  INFRAESTRUCTURA, DE LA LOCALIDAD DE BARRIOS UNIDOS","Inversión",18,{"$f":"IF(ISERROR(VLOOKUP(I61,Eje_Pilar!$C$2:$E$47,2,FALSE)),\" \",VLOOKUP(I61,Eje_Pilar!$C$2:$E$47,2,FALSE))","v":"Mejor movilidad para todos"},{"$f":"IF(ISERROR(VLOOKUP(I61,Eje_Pilar!$C$2:$E$47,3,FALSE)),\" \",VLOOKUP(I61,Eje_Pilar!$C$2:$E$47,3,FALSE))","v":"Pilar 2 Democracía Urbana"},1561,1020761303,"KARLO FERNANDEZ CALA CEDIÓ A WALTER EDISSON CHAVARRO ACUÑA",83950000,1,-4380000,1,7300000,86870000,71540000,"2019-02-01","2019-02-04","2020-01-31",345,30,null,null,"x",null,null,0.82352941176470584,null,{"$f":"IF(SUMPRODUCT((A$14:A61=A61)*(B$14:B61=B61)*(C$14:C61=C61))>1,0,1)","v":1},"Contratos de prestación de servicios profesionales y de apoyo a la gestión","Contratación directa",{"$f":"IFERROR(VLOOKUP(F61,Tipo!$C$12:$C$27,1,FALSE),\"NO\")","v":"Prestación de servicios profesionales y de apoyo a la gestión, o para la ejecución de trabajos artísticos que sólo puedan encomendarse a determinadas personas naturales;"},"Inversión",18]
["049-2019",2019,"FDLBU-CD-040-2019","Contratos de prestación de servicios profesionales y de apoyo a la gestión","Contratación directa","Prestación de servicios profesionales y de apoyo a la gestión, o para la ejecución de trabajos artísticos que sólo puedan encomendarse a determinadas personas naturales;","APOYAR JURÍDICAMENTE LA EJECUCIÓN DE LAS ACCIONES REQUERIDAS PARA LA DEPURACIÓN DE LAS ACTUACIONES ADMINISTRATIVAS QUE CURSAN EN LA ALCALDÍA LOCAL","Inversión",45,{"$f":"IF(ISERROR(VLOOKUP(I62,Eje_Pilar!$C$2:$E$47,2,FALSE)),\" \",VLOOKUP(I62,Eje_Pilar!$C$2:$E$47,2,FALSE))","v":"Gobernanza e influencia local, regional e internacional"},{"$f":"IF(ISERROR(VLOOKUP(I62,Eje_Pilar!$C$2:$E$47,3,FALSE)),\" \",VLOOKUP(I62,Eje_Pilar!$C$2:$E$47,3,FALSE))","v":"Eje Transversal 4 Gobierno Legitimo, Fortalecimiento Local y Eficiencia"},1559,80740127,"EDWIN JAVIER CIFUENTES VILLAMIZAR",31885000,null,null,2,13665000,45550000,40387667,"2019-02-04","2019-02-05","2019-12-04",210,90,null,null,null,"x",null,0.88666667398463228,null,{"$f":"IF(SUMPRODUCT((A$14:A62=A62)*(B$14:B62=B62)*(C$14:C62=C62))>1,0,1)","v":1},"Contratos de prestación de servicios profesionales y de apoyo a la gestión","Contratación directa",{"$f":"IFERROR(VLOOKUP(F62,Tipo!$C$12:$C$27,1,FALSE),\"NO\")","v":"Prestación de servicios profesionales y de apoyo a la gestión, o para la ejecución de trabajos artísticos que sólo puedan encomendarse a determinadas personas naturales;"},"Inversión",45]
["050-2019",2019,"FDLBU-CD-040-2019","Contratos de prestación de servicios profesionales y de apoyo a la gestión","Contratación directa","Prestación de servicios profesionales y de apoyo a la gestión, o para la ejecución de trabajos artísticos que sólo puedan encomendarse a determinadas personas naturales;","APOYAR JURÍDICAMENTE LA EJECUCIÓN DE LAS ACCIONES REQUERIDAS PARA LA DEPURACIÓN DE LAS ACTUACIONES ADMINISTRATIVAS QUE CURSAN EN LA ALCALDÍA LOCAL","Inversión",45,{"$f":"IF(ISERROR(VLOOKUP(I63,Eje_Pilar!$C$2:$E$47,2,FALSE)),\" \",VLOOKUP(I63,Eje_Pilar!$C$2:$E$47,2,FALSE))","v":"Gobernanza e influencia local, regional e internacional"},{"$f":"IF(ISERROR(VLOOKUP(I63,Eje_Pilar!$C$2:$E$47,3,FALSE)),\" \",VLOOKUP(I63,Eje_Pilar!$C$2:$E$47,3,FALSE))","v":"Eje Transversal 4 Gobierno Legitimo, Fortalecimiento Local y Eficiencia"},1559,53159645,"DIANA PAOLA GONZALEZ MURILLO",31885000,null,null,2,13665000,45550000,44790833,"2019-02-04","2019-02-06","2019-12-05",210,90,null,null,null,"x",null,0.98333332601536771,null,{"$f":"IF(SUMPRODUCT((A$14:A63=A63)*(B$14:B63=B63)*(C$14:C63=C63))>1,0,1)","v":1},"Contratos de prestación de servicios profesionales y de apoyo a la gestión","Contratación directa",{"$f":"IFERROR(VLOOKUP(F63,Tipo!$C$12:$C$27,1,FALSE),\"NO\")","v":"Prestación de servicios profesionales y de apoyo a la gestión, o para la ejecución de trabajos artísticos que sólo puedan encomendarse a determinadas personas naturales;"},"Inversión",45]
["051-2019",2019,"FDLBU-CD-040-2019","Contratos de prestación de servicios profesionales y de apoyo a la gestión","Contratación directa","Prestación de servicios profesionales y de apoyo a la gestión, o para la ejecución de trabajos artísticos que sólo puedan encomendarse a determinadas personas naturales;","APOYAR JURÍDICAMENTE LA EJECUCIÓN DE LAS ACCIONES REQUERIDAS PARA LA DEPURACIÓN DE LAS ACTUACIONES ADMINISTRATIVAS QUE CURSAN EN LA ALCALDÍA LOCAL","Inversión",45,{"$f":"IF(ISERROR(VLOOKUP(I64,Eje_Pilar!$C$2:$E$47,2,FALSE)),\" \",VLOOKUP(I64,Eje_Pilar!$C$2:$E$47,2,FALSE))","v":"Gobernanza e influencia local, regional e internacional"},{"$f":"IF(ISERROR(VLOOKUP(I64,Eje_Pilar!$C$2:$E$47,3,FALSE)),\" \",VLOOKUP(I64,Eje_Pilar!$C$2:$E$47,3,FALSE))","v":"Eje Transversal 4 Gobierno Legitimo, Fortalecimiento Local y Eficiencia"},1559,1000269976,"KAREN LORENA MARÍN CALDERON",31885000,null,null,2,13665000,45550000,44790833,"2019-02-04","2019-02-06","2019-12-05",210,90,null,null,null,"x",null,0.98333332601536771,null,{"$f":"IF(SUMPRODUCT((A$14:A64=A64)*(B$14:B64=B64)*(C$14:C64=C64))>1,0,1)","v":1},"Contratos de prestación de servicios profesionales y de apoyo a la gestión","Contratación directa",{"$f":"IFERROR(VLOOKUP(F64,Tipo!$C$12:$C$27,1,FALSE),\"NO\")","v":"Prestación de servicios profesionales y de apoyo a la gestión, o para la ejecución de trabajos artísticos que sólo puedan encomendarse a determinadas personas naturales;"},"Inversión",45]
["052-2019",2019,"FDLBU-CD-044-2019","Contratos de prestación de servicios profesionales y de apoyo a la gestión","Contratación directa","Prestación de servicios profesionales y de apoyo a la gestión, o para la ejecución de trabajos artísticos que sólo puedan encomendarse a determinadas personas naturales;","APOYAR AL DESPACHO DE LA ALCALDÍA LOCAL DE BARRIOS UNIDOS EN LA REVISIÓN, CONTROL Y VIGILANCIA DE LOS DOCUMENTOS EMITIDOS POR EL ÁREA DE GESTIÓN POLICIVA Y EN LA SUPERVISION DE CONTRATOS QUE LE SEAN ASIGNADOS","Inversión",45,{"$f":"IF(ISERROR(VLOOKUP(I65,Eje_Pilar!$C$2:$E$47,2,FALSE)),\" \",VLOOKUP(I65,Eje_Pilar!$C$2:$E$47,2,FALSE))","v":"Gobernanza e influencia local, regional e internacional"},{"$f":"IF(ISERROR(VLOOKUP(I65,Eje_Pilar!$C$2:$E$47,3,FALSE)),\" \",VLOOKUP(I65,Eje_Pilar!$C$2:$E$47,3,FALSE))","v":"Eje Transversal 4 Gobierno Legitimo, Fortalecimiento Local y Eficiencia"},1559,1032379593,"LEONARDO ALFONSO MOYA GUAJE",57000000,null,null,3,28373333,85373333,70680001,"2019-02-01","2019-02-05","2020-01-28",225,111.9,null,null,"x",null,null,0.82789319001988593,null,{"$f":"IF(SUMPRODUCT((A$14:A65=A65)*(B$14:B65=B65)*(C$14:C65=C65))>1,0,1)","v":1},"Contratos de prestación de servicios profesionales y de apoyo a la gestión","Contratación directa",{"$f":"IFERROR(VLOOKUP(F65,Tipo!$C$12:$C$27,1,FALSE),\"NO\")","v":"Prestación de servicios profesionales y de apoyo a la gestión, o para la ejecución de trabajos artísticos que sólo puedan encomendarse a determinadas personas naturales;"},"Inversión",45]
["053-2019",2019,"FDLBU-CD-046-2019","Contratos de prestación de servicios profesionales y de apoyo a la gestión","Contratación directa","Prestación de servicios profesionales y de apoyo a la gestión, o para la ejecución de trabajos artísticos que sólo puedan encomendarse a determinadas personas naturales;","PRESTAR SERVICIOS PROFESIONALES PARA APOYAR AL ALCALDE(SA) LOCAL EN LA PROMOCIÓN, ACOMPAÑAMIENTO, COORDINACIÓN Y ATENCIÓN DE LAS INSTANCIAS DE COORDINACIÓN INTERINSTITUCIONALES Y LAS INSTANCIAS DE PARTICIPACIÓN LOCALES, ASÍ COMO LOS PROCESOS COMUNITARIOS EN LA LOCALIDAD","Inversión",45,{"$f":"IF(ISERROR(VLOOKUP(I66,Eje_Pilar!$C$2:$E$47,2,FALSE)),\" \",VLOOKUP(I66,Eje_Pilar!$C$2:$E$47,2,FALSE))","v":"Gobernanza e influencia local, regional e internacional"},{"$f":"IF(ISERROR(VLOOKUP(I66,Eje_Pilar!$C$2:$E$47,3,FALSE)),\" \",VLOOKUP(I66,Eje_Pilar!$C$2:$E$47,3,FALSE))","v":"Eje Transversal 4 Gobierno Legitimo, Fortalecimiento Local y Eficiencia"},1562,79240491,"LUIS ALBERTO MORA TORRES",69600000,1,-7733333,null,0,61866667,56066667,"2019-02-06","2019-02-11","2019-12-31",360,0,null,null,null,"x",null,0.9062500005051185,null,{"$f":"IF(SUMPRODUCT((A$14:A66=A66)*(B$14:B66=B66)*(C$14:C66=C66))>1,0,1)","v":1},"Contratos de prestación de servicios profesionales y de apoyo a la gestión","Contratación directa",{"$f":"IFERROR(VLOOKUP(F66,Tipo!$C$12:$C$27,1,FALSE),\"NO\")","v":"Prestación de servicios profesionales y de apoyo a la gestión, o para la ejecución de trabajos artísticos que sólo puedan encomendarse a determinadas personas naturales;"},"Inversión",45]
["054-2019",2019,"FDLBU-CD-047-2019","Contratos de prestación de servicios profesionales y de apoyo a la gestión","Contratación directa","Prestación de servicios profesionales y de apoyo a la gestión, o para la ejecución de trabajos artísticos que sólo puedan encomendarse a determinadas personas naturales;","PRESTAR SUS SERVICIOS PROFESIONALES APOYAR AL (LA) ALCALDE(SA) LOCAL EN LA PROMOCIÓN, ARTICULACIÓN, ACOMPAÑAMIENTO Y SEGUIMIENTO PARA LA ATENCIÓN Y PROTECCIÓN DE LOS ANIMALES DOMÉSTICOS Y SILVESTRES DE LA LOCALIDAD","Inversión",38,{"$f":"IF(ISERROR(VLOOKUP(I67,Eje_Pilar!$C$2:$E$47,2,FALSE)),\" \",VLOOKUP(I67,Eje_Pilar!$C$2:$E$47,2,FALSE))","v":"Recuperación y manejo de la Estructura Ecológica Principal"},{"$f":"IF(ISERROR(VLOOKUP(I67,Eje_Pilar!$C$2:$E$47,3,FALSE)),\" \",VLOOKUP(I67,Eje_Pilar!$C$2:$E$47,3,FALSE))","v":"Eje Transversal 3 Sostenibilidad Ambiental basada en la eficiencia energética"},1532,1019015732,"PAOLA ANDREA MOYA RODRÍGUEZ",13665000,null,null,null,0,13665000,13665000,"2019-02-21","2019-02-22","2019-05-21",90,0,null,null,null,"x",null,1,null,{"$f":"IF(SUMPRODUCT((A$14:A67=A67)*(B$14:B67=B67)*(C$14:C67=C67))>1,0,1)","v":1},"Contratos de prestación de servicios profesionales y de apoyo a la gestión","Contratación directa",{"$f":"IFERROR(VLOOKUP(F67,Tipo!$C$12:$C$27,1,FALSE),\"NO\")","v":"Prestación de servicios profesionales y de apoyo a la gestión, o para la ejecución de trabajos artísticos que sólo puedan encomendarse a determinadas personas naturales;"},"Inversión",38]
["055-2019",2019,"FDLBU-CD-052-2019","Contratos de prestación de servicios profesionales y de apoyo a la gestión","Contratación directa","Prestación de servicios profesionales y de apoyo a la gestión, o para la ejecución de trabajos artísticos que sólo puedan encomendarse a determinadas personas naturales;","SERVICIOS PROFESIONALES PARA GESTIÓN DE LOS TRÁMITES DEL PROCESO DE COBRO PERSUASIVO DE ACREENCIAS A FAVOR DE LA ADMINISTRACIÓN DISTRITAL PARA LOGRAR EL PAGO VOLUNTARIO DE LAS MISMAS, Y SEGUIMIENTO AL COBRO COACTIVO","Inversión",45,{"$f":"IF(ISERROR(VLOOKUP(I68,Eje_Pilar!$C$2:$E$47,2,FALSE)),\" \",VLOOKUP(I68,Eje_Pilar!$C$2:$E$47,2,FALSE))","v":"Gobernanza e influencia local, regional e internacional"},{"$f":"IF(ISERROR(VLOOKUP(I68,Eje_Pilar!$C$2:$E$47,3,FALSE)),\" \",VLOOKUP(I68,Eje_Pilar!$C$2:$E$47,3,FALSE))","v":"Eje Transversal 4 Gobierno Legitimo, Fortalecimiento Local y Eficiencia"},1559,79056337,"JORGE ARMANDO SOLANO PEÑA",29607500,null,null,1,9110000,38717500,38717500,"2019-02-06","2019-02-11","2019-10-25",195,60,null,null,null,"x",null,1,null,{"$f":"IF(SUMPRODUCT((A$14:A68=A68)*(B$14:B68=B68)*(C$14:C68=C68))>1,0,1)","v":1},"Contratos de prestación de servicios profesionales y de apoyo a la gestión","Contratación directa",{"$f":"IFERROR(VLOOKUP(F68,Tipo!$C$12:$C$27,1,FALSE),\"NO\")","v":"Prestación de servicios profesionales y de apoyo a la gestión, o para la ejecución de trabajos artísticos que sólo puedan encomendarse a determinadas personas naturales;"},"Inversión",45]
["056-2019",2019,"FDLBU-CD-051-2019","Contratos de prestación de servicios profesionales y de apoyo a la gestión","Contratación directa","Prestación de servicios profesionales y de apoyo a la gestión, o para la ejecución de trabajos artísticos que sólo puedan encomendarse a determinadas personas naturales;","PRESTAR SERVICIOS PROFESIONALES PARA APOYAR TÉCNICAMENTE LAS DISTINTAS ETAPAS DE LOS PROCESOS DE COMPETENCIA DE LA ALCALDÍA LOCAL PARA LA DEPURACIÓN DE ACTUACIONES ADMINISTRATIVAS","Inversión",45,{"$f":"IF(ISERROR(VLOOKUP(I69,Eje_Pilar!$C$2:$E$47,2,FALSE)),\" \",VLOOKUP(I69,Eje_Pilar!$C$2:$E$47,2,FALSE))","v":"Gobernanza e influencia local, regional e internacional"},{"$f":"IF(ISERROR(VLOOKUP(I69,Eje_Pilar!$C$2:$E$47,3,FALSE)),\" \",VLOOKUP(I69,Eje_Pilar!$C$2:$E$47,3,FALSE))","v":"Eje Transversal 4 Gobierno Legitimo, Fortalecimiento Local y Eficiencia"},1559,88214685,"JOEL EMIRO RINCON SINDRAY",20400000,null,null,null,0,20400000,20400000,"2019-02-06","2019-02-11","2019-06-10",120,0,null,null,null,"x",null,1,null,{"$f":"IF(SUMPRODUCT((A$14:A69=A69)*(B$14:B69=B69)*(C$14:C69=C69))>1,0,1)","v":1},"Contratos de prestación de servicios profesionales y de apoyo a la gestión","Contratación directa",{"$f":"IFERROR(VLOOKUP(F69,Tipo!$C$12:$C$27,1,FALSE),\"NO\")","v":"Prestación de servicios profesionales y de apoyo a la gestión, o para la ejecución de trabajos artísticos que sólo puedan encomendarse a determinadas personas naturales;"},"Inversión",45]
["057-2019",2019,"FDLBU-CD-051-2019","Contratos de prestación de servicios profesionales y de apoyo a la gestión","Contratación directa","Prestación de servicios profesionales y de apoyo a la gestión, o para la ejecución de trabajos artísticos que sólo puedan encomendarse a determinadas personas naturales;","PRESTAR SERVICIOS PROFESIONALES PARA APOYAR TÉCNICAMENTE LAS DISTINTAS ETAPAS DE LOS PROCESOS DE COMPETENCIA DE LA ALCALDÍA LOCAL PARA LA DEPURACIÓN DE ACTUACIONES ADMINISTRATIVAS","Inversión",45,{"$f":"IF(ISERROR(VLOOKUP(I70,Eje_Pilar!$C$2:$E$47,2,FALSE)),\" \",VLOOKUP(I70,Eje_Pilar!$C$2:$E$47,2,FALSE))","v":"Gobernanza e influencia local, regional e internacional"},{"$f":"IF(ISERROR(VLOOKUP(I70,Eje_Pilar!$C$2:$E$47,3,FALSE)),\" \",VLOOKUP(I70,Eje_Pilar!$C$2:$E$47,3,FALSE))","v":"Eje Transversal 4 Gobierno Legitimo, Fortalecimiento Local y Eficiencia"},1559,52421810,"YHAMILA SALINAS RUANO",20400000,null,null,null,0,20400000,20400000,"2019-02-06","2019-02-12","2019-06-11",120,0,null,null,null,"x",null,1,null,{"$f":"IF(SUMPRODUCT((A$14:A70=A70)*(B$14:B70=B70)*(C$14:C70=C70))>1,0,1)","v":1},"Contratos de prestación de servicios profesionales y de apoyo a la gestión","Contratación directa",{"$f":"IFERROR(VLOOKUP(F70,Tipo!$C$12:$C$27,1,FALSE),\"NO\")","v":"Prestación de servicios profesionales y de apoyo a la gestión, o para la ejecución de trabajos artísticos que sólo puedan encomendarse a determinadas personas naturales;"},"Inversión",45]
["058-2019",2019,"FDLBU-CD-051-2019","Contratos de prestación de servicios profesionales y de apoyo a la gestión","Contratación directa","Prestación de servicios profesionales y de apoyo a la gestión, o para la ejecución de trabajos artísticos que sólo puedan encomendarse a determinadas personas naturales;","PRESTAR SERVICIOS PROFESIONALES PARA APOYAR TÉCNICAMENTE LAS DISTINTAS ETAPAS DE LOS PROCESOS DE COMPETENCIA DE LA ALCALDÍA LOCAL PARA LA DEPURACIÓN DE ACTUACIONES ADMINISTRATIVAS","Inversión",45,{"$f":"IF(ISERROR(VLOOKUP(I71,Eje_Pilar!$C$2:$E$47,2,FALSE)),\" \",VLOOKUP(I71,Eje_Pilar!$C$2:$E$47,2,FALSE))","v":"Gobernanza e influencia local, regional e internacional"},{"$f":"IF(ISERROR(VLOOKUP(I71,Eje_Pilar!$C$2:$E$47,3,FALSE)),\" \",VLOOKUP(I71,Eje_Pilar!$C$2:$E$47,3,FALSE))","v":"Eje Transversal 4 Gobierno Legitimo, Fortalecimiento Local y Eficiencia"},1559,1019045051,"CARLOS IVAN GARCIA QUINTERO",20400000,null,null,null,0,20400000,20400000,"2019-02-06","2019-02-08","2019-06-07",120,0,null,null,null,"x",null,1,null,{"$f":"IF(SUMPRODUCT((A$14:A71=A71)*(B$14:B71=B71)*(C$14:C71=C71))>1,0,1)","v":1},"Contratos de prestación de servicios profesionales y de apoyo a la gestión","Contratación directa",{"$f":"IFERROR(VLOOKUP(F71,Tipo!$C$12:$C$27,1,FALSE),\"NO\")","v":"Prestación de servicios profesionales y de apoyo a la gestión, o para la ejecución de trabajos artísticos que sólo puedan encomendarse a determinadas personas naturales;"},"Inversión",45]
["059-2019",2019,"FDLBU-CD-053-2019","Contratos de prestación de servicios profesionales y de apoyo a la gestión","Contratación directa","Prestación de servicios profesionales y de apoyo a la gestión, o para la ejecución de trabajos artísticos que sólo puedan encomendarse a determinadas personas naturales;","APOYAR JURÍDICAMENTE LA EJECUCIÓN DE LAS ACCIONES REQUERIDAS PARA EL APOYO EN OPERATIVOS Y DEPURACIÓN DE LAS ACTUACIONES ADMINISTRATIVAS QUE CURSAN EN LA ALCALDÍA LOCAL EN CUANTO A LA INSPECCIÓN, VIGILANCIA Y CONTROL EN LOS ESTABLECIMIENTOS DE COMERCIO Y MEDIDAS A IMPONER POR INFRACCIÓN DE LAS NORMAS PARA SU FUNCIONAMIENTO\t","Inversión",45,{"$f":"IF(ISERROR(VLOOKUP(I72,Eje_Pilar!$C$2:$E$47,2,FALSE)),\" \",VLOOKUP(I72,Eje_Pilar!$C$2:$E$47,2,FALSE))","v":"Gobernanza e influencia local, regional e internacional"},{"$f":"IF(ISERROR(VLOOKUP(I72,Eje_Pilar!$C$2:$E$47,3,FALSE)),\" \",VLOOKUP(I72,Eje_Pilar!$C$2:$E$47,3,FALSE))","v":"Eje Transversal 4 Gobierno Legitimo, Fortalecimiento Local y Eficiencia"},1559,9533924,"OSCAR RODOLFO LOPEZ RODRIGUEZ",19500000,null,null,null,0,19500000,19500000,"2019-02-06","2019-02-12","2019-05-11",90,0,null,null,null,"x",null,1,null,{"$f":"IF(SUMPRODUCT((A$14:A72=A72)*(B$14:B72=B72)*(C$14:C72=C72))>1,0,1)","v":1},"Contratos de prestación de servicios profesionales y de apoyo a la gestión","Contratación directa",{"$f":"IFERROR(VLOOKUP(F72,Tipo!$C$12:$C$27,1,FALSE),\"NO\")","v":"Prestación de servicios profesionales y de apoyo a la gestión, o para la ejecución de trabajos artísticos que sólo puedan encomendarse a determinadas personas naturales;"},"Inversión",45]
["060-2019",2019,"FDLBU-CD-054-2019","Contratos de prestación de servicios profesionales y de apoyo a la gestión","Contratación directa","Prestación de servicios profesionales y de apoyo a la gestión, o para la ejecución de trabajos artísticos que sólo puedan encomendarse a determinadas personas naturales;","PRESTAR SERVICIOS PROFESIONALES PARA APOYAR AL ÁREA GESTIÓN DEL DESARROLLO – ADMINISTRATIVO Y FINANCIERO EN LOS ASUNTOS RELATIVOS A LA PLANEACIÓN LOCAL, EN LA SUPERVISIÓN DE CONTRATOS SUSCRITOS POR LA ALCALDÍA LOCAL DE BARRIOS UNIDOS DIRIGIDOS A LA PREVENCIÓN DE PROBLEMÁTICAS SOCIALES","Inversión",2,{"$f":"IF(ISERROR(VLOOKUP(I73,Eje_Pilar!$C$2:$E$47,2,FALSE)),\" \",VLOOKUP(I73,Eje_Pilar!$C$2:$E$47,2,FALSE))","v":"Desarrollo integral desde la gestación hasta la adolescencia"},{"$f":"IF(ISERROR(VLOOKUP(I73,Eje_Pilar!$C$2:$E$47,3,FALSE)),\" \",VLOOKUP(I73,Eje_Pilar!$C$2:$E$47,3,FALSE))","v":"Pilar 1 Igualdad de Calidad de Vida"},1533,52434625,"MARIA FERNANDA LONDOÑO GALLEGO",55000000,null,-1666667,1,4583333,57916666,48333333,"2019-02-11","2019-02-11","2020-01-25",330,24.900000000000002,null,null,"x",null,null,0.83453237795145185,null,{"$f":"IF(SUMPRODUCT((A$14:A73=A73)*(B$14:B73=B73)*(C$14:C73=C73))>1,0,1)","v":1},"Contratos de prestación de servicios profesionales y de apoyo a la gestión","Contratación directa",{"$f":"IFERROR(VLOOKUP(F73,Tipo!$C$12:$C$27,1,FALSE),\"NO\")","v":"Prestación de servicios profesionales y de apoyo a la gestión, o para la ejecución de trabajos artísticos que sólo puedan encomendarse a determinadas personas naturales;"},"Inversión",2]
["061-2019",2019,"FDLBU-CD-024-2019","Contratos de prestación de servicios profesionales y de apoyo a la gestión","Contratación directa","Prestación de servicios profesionales y de apoyo a la gestión, o para la ejecución de trabajos artísticos que sólo puedan encomendarse a determinadas personas naturales;","APOYAR JURÍDICAMENTE LA EJECUCIÓN DE LAS ACCIONES REQUERIDAS PARA LA DEPURACIÓN DE LAS ACTUACIONES ADMINISTRATIVAS QUE CURSAN EN LA ALCALDÍA LOCAL","Inversión",45,{"$f":"IF(ISERROR(VLOOKUP(I74,Eje_Pilar!$C$2:$E$47,2,FALSE)),\" \",VLOOKUP(I74,Eje_Pilar!$C$2:$E$47,2,FALSE))","v":"Gobernanza e influencia local, regional e internacional"},{"$f":"IF(ISERROR(VLOOKUP(I74,Eje_Pilar!$C$2:$E$47,3,FALSE)),\" \",VLOOKUP(I74,Eje_Pilar!$C$2:$E$47,3,FALSE))","v":"Eje Transversal 4 Gobierno Legitimo, Fortalecimiento Local y Eficiencia"},1559,1019026658,"MARCELA ORTIZ ROLDAN ",27330000,null,null,2,13665000,40995000,40995000,"2019-02-11","2019-02-12","2019-11-11",180,90,null,null,null,"x",null,1,null,{"$f":"IF(SUMPRODUCT((A$14:A74=A74)*(B$14:B74=B74)*(C$14:C74=C74))>1,0,1)","v":1},"Contratos de prestación de servicios profesionales y de apoyo a la gestión","Contratación directa",{"$f":"IFERROR(VLOOKUP(F74,Tipo!$C$12:$C$27,1,FALSE),\"NO\")","v":"Prestación de servicios profesionales y de apoyo a la gestión, o para la ejecución de trabajos artísticos que sólo puedan encomendarse a determinadas personas naturales;"},"Inversión",45]
["062-2019",2019,"FDLBU-CD-024-2019","Contratos de prestación de servicios profesionales y de apoyo a la gestión","Contratación directa","Prestación de servicios profesionales y de apoyo a la gestión, o para la ejecución de trabajos artísticos que sólo puedan encomendarse a determinadas personas naturales;","APOYAR JURÍDICAMENTE LA EJECUCIÓN DE LAS ACCIONES REQUERIDAS PARA LA DEPURACIÓN DE LAS ACTUACIONES ADMINISTRATIVAS QUE CURSAN EN LA ALCALDÍA LOCAL","Inversión",45,{"$f":"IF(ISERROR(VLOOKUP(I75,Eje_Pilar!$C$2:$E$47,2,FALSE)),\" \",VLOOKUP(I75,Eje_Pilar!$C$2:$E$47,2,FALSE))","v":"Gobernanza e influencia local, regional e internacional"},{"$f":"IF(ISERROR(VLOOKUP(I75,Eje_Pilar!$C$2:$E$47,3,FALSE)),\" \",VLOOKUP(I75,Eje_Pilar!$C$2:$E$47,3,FALSE))","v":"Eje Transversal 4 Gobierno Legitimo, Fortalecimiento Local y Eficiencia"},1559,79314533,"LUIS JOAQUIN PIMIENTO CASTRO ",27330000,null,null,2,13665000,40995000,39173000,"2019-02-08","2019-02-12","2019-11-11",180,90,null,null,null,"x",null,0.9555555555555556,null,{"$f":"IF(SUMPRODUCT((A$14:A75=A75)*(B$14:B75=B75)*(C$14:C75=C75))>1,0,1)","v":1},"Contratos de prestación de servicios profesionales y de apoyo a la gestión","Contratación directa",{"$f":"IFERROR(VLOOKUP(F75,Tipo!$C$12:$C$27,1,FALSE),\"NO\")","v":"Prestación de servicios profesionales y de apoyo a la gestión, o para la ejecución de trabajos artísticos que sólo puedan encomendarse a determinadas personas naturales;"},"Inversión",45]
["063-2019",2019,"FDLBU-CD-024-2019","Contratos de prestación de servicios profesionales y de apoyo a la gestión","Contratación directa","Prestación de servicios profesionales y de apoyo a la gestión, o para la ejecución de trabajos artísticos que sólo puedan encomendarse a determinadas personas naturales;","APOYAR JURÍDICAMENTE LA EJECUCIÓN DE LAS ACCIONES REQUERIDAS PARA LA DEPURACIÓN DE LAS ACTUACIONES ADMINISTRATIVAS QUE CURSAN EN LA ALCALDÍA LOCAL","Inversión",45,{"$f":"IF(ISERROR(VLOOKUP(I76,Eje_Pilar!$C$2:$E$47,2,FALSE)),\" \",VLOOKUP(I76,Eje_Pilar!$C$2:$E$47,2,FALSE))","v":"Gobernanza e influencia local, regional e internacional"},{"$f":"IF(ISERROR(VLOOKUP(I76,Eje_Pilar!$C$2:$E$47,3,FALSE)),\" \",VLOOKUP(I76,Eje_Pilar!$C$2:$E$47,3,FALSE))","v":"Eje Transversal 4 Gobierno Legitimo, Fortalecimiento Local y Eficiencia"},1559,53008833,"SANDRA MILENA GUARNIZO RUDA ",27330000,null,null,2,13665000,40995000,40995000,"2019-02-08","2019-02-08","2019-11-07",180,90,null,null,null,"x",null,1,null,{"$f":"IF(SUMPRODUCT((A$14:A76=A76)*(B$14:B76=B76)*(C$14:C76=C76))>1,0,1)","v":1},"Contratos de prestación de servicios profesionales y de apoyo a la gestión","Contratación directa",{"$f":"IFERROR(VLOOKUP(F76,Tipo!$C$12:$C$27,1,FALSE),\"NO\")","v":"Prestación de servicios profesionales y de apoyo a la gestión, o para la ejecución de trabajos artísticos que sólo puedan encomendarse a determinadas personas naturales;"},"Inversión",45]
["064-2019",2019,"FDLBU-CD-024-2019","Contratos de prestación de servicios profesionales y de apoyo a la gestión","Contratación directa","Prestación de servicios profesionales y de apoyo a la gestión, o para la ejecución de trabajos artísticos que sólo puedan encomendarse a determinadas personas naturales;","APOYAR JURÍDICAMENTE LA EJECUCIÓN DE LAS ACCIONES REQUERIDAS PARA LA DEPURACIÓN DE LAS ACTUACIONES ADMINISTRATIVAS QUE CURSAN EN LA ALCALDÍA LOCAL","Inversión",45,{"$f":"IF(ISERROR(VLOOKUP(I77,Eje_Pilar!$C$2:$E$47,2,FALSE)),\" \",VLOOKUP(I77,Eje_Pilar!$C$2:$E$47,2,FALSE))","v":"Gobernanza e influencia local, regional e internacional"},{"$f":"IF(ISERROR(VLOOKUP(I77,Eje_Pilar!$C$2:$E$47,3,FALSE)),\" \",VLOOKUP(I77,Eje_Pilar!$C$2:$E$47,3,FALSE))","v":"Eje Transversal 4 Gobierno Legitimo, Fortalecimiento Local y Eficiencia"},1559,1032376529,"LINA MARIA ORTIZ CORTAZAR",27330000,null,null,2,13665000,40995000,40995000,"2019-02-08","2019-02-11","2019-11-10",180,90,null,null,null,"x",null,1,null,{"$f":"IF(SUMPRODUCT((A$14:A77=A77)*(B$14:B77=B77)*(C$14:C77=C77))>1,0,1)","v":1},"Contratos de prestación de servicios profesionales y de apoyo a la gestión","Contratación directa",{"$f":"IFERROR(VLOOKUP(F77,Tipo!$C$12:$C$27,1,FALSE),\"NO\")","v":"Prestación de servicios profesionales y de apoyo a la gestión, o para la ejecución de trabajos artísticos que sólo puedan encomendarse a determinadas personas naturales;"},"Inversión",45]
["065-2019",2019,"FDLBU-CD-024-2019","Contratos de prestación de servicios profesionales y de apoyo a la gestión","Contratación directa","Prestación de servicios profesionales y de apoyo a la gestión, o para la ejecución de trabajos artísticos que sólo puedan encomendarse a determinadas personas naturales;","APOYAR JURÍDICAMENTE LA EJECUCIÓN DE LAS ACCIONES REQUERIDAS PARA LA DEPURACIÓN DE LAS ACTUACIONES ADMINISTRATIVAS QUE CURSAN EN LA ALCALDÍA LOCAL","Inversión",45,{"$f":"IF(ISERROR(VLOOKUP(I78,Eje_Pilar!$C$2:$E$47,2,FALSE)),\" \",VLOOKUP(I78,Eje_Pilar!$C$2:$E$47,2,FALSE))","v":"Gobernanza e influencia local, regional e internacional"},{"$f":"IF(ISERROR(VLOOKUP(I78,Eje_Pilar!$C$2:$E$47,3,FALSE)),\" \",VLOOKUP(I78,Eje_Pilar!$C$2:$E$47,3,FALSE))","v":"Eje Transversal 4 Gobierno Legitimo, Fortalecimiento Local y Eficiencia"},1559,1015420645,"JUAN CARLOS PANTANO SEGURA ",27330000,null,null,2,13665000,{"$f":"+O78+Q78+S78","v":40995000},40995000,"2019-02-07","2019-02-18","2019-11-17",180,90,null,null,null,"x",null,1,null,{"$f":"IF(SUMPRODUCT((A$14:A78=A78)*(B$14:B78=B78)*(C$14:C78=C78))>1,0,1)","v":1},"Contratos de prestación de servicios profesionales y de apoyo a la gestión","Contratación directa",{"$f":"IFERROR(VLOOKUP(F78,Tipo!$C$12:$C$27,1,FALSE),\"NO\")","v":"Prestación de servicios profesionales y de apoyo a la gestión, o para la ejecución de trabajos artísticos que sólo puedan encomendarse a determinadas personas naturales;"},"Inversión",45]
["066-2019",2019,"FDLBU-CD-024-2019","Contratos de prestación de servicios profesionales y de apoyo a la gestión","Contratación directa","Prestación de servicios profesionales y de apoyo a la gestión, o para la ejecución de trabajos artísticos que sólo puedan encomendarse a determinadas personas naturales;","APOYAR JURÍDICAMENTE LA EJECUCIÓN DE LAS ACCIONES REQUERIDAS PARA LA DEPURACIÓN DE LAS ACTUACIONES ADMINISTRATIVAS QUE CURSAN EN LA ALCALDÍA LOCAL","Inversión",45,{"$f":"IF(ISERROR(VLOOKUP(I79,Eje_Pilar!$C$2:$E$47,2,FALSE)),\" \",VLOOKUP(I79,Eje_Pilar!$C$2:$E$47,2,FALSE))","v":"Gobernanza e influencia local, regional e internacional"},{"$f":"IF(ISERROR(VLOOKUP(I79,Eje_Pilar!$C$2:$E$47,3,FALSE)),\" \",VLOOKUP(I79,Eje_Pilar!$C$2:$E$47,3,FALSE))","v":"Eje Transversal 4 Gobierno Legitimo, Fortalecimiento Local y Eficiencia"},1559,51920607,"CECILIA SOSA GOMEZ ",27330000,null,null,1,9110000,36440000,36440000,"2019-02-13","2019-02-15","2019-08-14",180,60,null,null,null,"x",null,1,null,{"$f":"IF(SUMPRODUCT((A$14:A79=A79)*(B$14:B79=B79)*(C$14:C79=C79))>1,0,1)","v":1},"Contratos de prestación de servicios profesionales y de apoyo a la gestión","Contratación directa",{"$f":"IFERROR(VLOOKUP(F79,Tipo!$C$12:$C$27,1,FALSE),\"NO\")","v":"Prestación de servicios profesionales y de apoyo a la gestión, o para la ejecución de trabajos artísticos que sólo puedan encomendarse a determinadas personas naturales;"},"Inversión",45]
["067-2019",2019,"FDLBU-CD-024-2019","Contratos de prestación de servicios profesionales y de apoyo a la gestión","Contratación directa","Prestación de servicios profesionales y de apoyo a la gestión, o para la ejecución de trabajos artísticos que sólo puedan encomendarse a determinadas personas naturales;","APOYAR JURÍDICAMENTE LA EJECUCIÓN DE LAS ACCIONES REQUERIDAS PARA LA DEPURACIÓN DE LAS ACTUACIONES ADMINISTRATIVAS QUE CURSAN EN LA ALCALDÍA LOCAL","Inversión",45,{"$f":"IF(ISERROR(VLOOKUP(I80,Eje_Pilar!$C$2:$E$47,2,FALSE)),\" \",VLOOKUP(I80,Eje_Pilar!$C$2:$E$47,2,FALSE))","v":"Gobernanza e influencia local, regional e internacional"},{"$f":"IF(ISERROR(VLOOKUP(I80,Eje_Pilar!$C$2:$E$47,3,FALSE)),\" \",VLOOKUP(I80,Eje_Pilar!$C$2:$E$47,3,FALSE))","v":"Eje Transversal 4 Gobierno Legitimo, Fortalecimiento Local y Eficiencia"},1559,79297494,"WILLIAM JAVIER RIVERA MENDOZA ",27330000,null,null,2,13665000,40995000,40995000,"2019-02-07","2019-02-18","2019-11-17",180,90,null,null,null,"x",null,{"$f":"IF(ISERROR(U80/T80),\"-\",(U80/T80))","v":1},null,{"$f":"IF(SUMPRODUCT((A$14:A80=A80)*(B$14:B80=B80)*(C$14:C80=C80))>1,0,1)","v":1},"Contratos de prestación de servicios profesionales y de apoyo a la gestión","Contratación directa",{"$f":"IFERROR(VLOOKUP(F80,Tipo!$C$12:$C$27,1,FALSE),\"NO\")","v":"Prestación de servicios profesionales y de apoyo a la gestión, o para la ejecución de trabajos artísticos que sólo puedan encomendarse a determinadas personas naturales;"},"Inversión",45]
["068-2019",2019,"FDLBU-CD-024-2019","Contratos de prestación de servicios profesionales y de apoyo a la gestión","Contratación directa","Prestación de servicios profesionales y de apoyo a la gestión, o para la ejecución de trabajos artísticos que sólo puedan encomendarse a determinadas personas naturales;","APOYAR JURÍDICAMENTE LA EJECUCIÓN DE LAS ACCIONES REQUERIDAS PARA LA DEPURACIÓN DE LAS ACTUACIONES ADMINISTRATIVAS QUE CURSAN EN LA ALCALDÍA LOCAL","Inversión",45,{"$f":"IF(ISERROR(VLOOKUP(I81,Eje_Pilar!$C$2:$E$47,2,FALSE)),\" \",VLOOKUP(I81,Eje_Pilar!$C$2:$E$47,2,FALSE))","v":"Gobernanza e influencia local, regional e internacional"},{"$f":"IF(ISERROR(VLOOKUP(I81,Eje_Pilar!$C$2:$E$47,3,FALSE)),\" \",VLOOKUP(I81,Eje_Pilar!$C$2:$E$47,3,FALSE))","v":"Eje Transversal 4 Gobierno Legitimo, Fortalecimiento Local y Eficiencia"},1559,1090457719,"YEXULY YOJANA NIETO FLOREZ ",27330000,null,null,2,13665000,40995000,39932167,"2019-02-07","2019-02-08","2019-11-07",180,90,null,null,null,"x",null,0.97407408220514702,null,{"$f":"IF(SUMPRODUCT((A$14:A81=A81)*(B$14:B81=B81)*(C$14:C81=C81))>1,0,1)","v":1},"Contratos de prestación de servicios profesionales y de apoyo a la gestión","Contratación directa",{"$f":"IFERROR(VLOOKUP(F81,Tipo!$C$12:$C$27,1,FALSE),\"NO\")","v":"Prestación de servicios profesionales y de apoyo a la gestión, o para la ejecución de trabajos artísticos que sólo puedan encomendarse a determinadas personas naturales;"},"Inversión",45]
["069-2019",2019,"FDLBU-CD-024-2019","Contratos de prestación de servicios profesionales y de apoyo a la gestión","Contratación directa","Prestación de servicios profesionales y de apoyo a la gestión, o para la ejecución de trabajos artísticos que sólo puedan encomendarse a determinadas personas naturales;","APOYAR JURÍDICAMENTE LA EJECUCIÓN DE LAS ACCIONES REQUERIDAS PARA LA DEPURACIÓN DE LAS ACTUACIONES ADMINISTRATIVAS QUE CURSAN EN LA ALCALDÍA LOCAL","Inversión",45,{"$f":"IF(ISERROR(VLOOKUP(I82,Eje_Pilar!$C$2:$E$47,2,FALSE)),\" \",VLOOKUP(I82,Eje_Pilar!$C$2:$E$47,2,FALSE))","v":"Gobernanza e influencia local, regional e internacional"},{"$f":"IF(ISERROR(VLOOKUP(I82,Eje_Pilar!$C$2:$E$47,3,FALSE)),\" \",VLOOKUP(I82,Eje_Pilar!$C$2:$E$47,3,FALSE))","v":"Eje Transversal 4 Gobierno Legitimo, Fortalecimiento Local y Eficiencia"},1559,52196889,"SANDRA MARINA GUTIERREZ FLOREZ ",27330000,null,null,2,13665000,40995000,40843167,"2019-02-07","2019-02-11","2019-11-24",180,90,null,null,null,"x",null,0.99629630442736916,null,{"$f":"IF(SUMPRODUCT((A$14:A82=A82)*(B$14:B82=B82)*(C$14:C82=C82))>1,0,1)","v":1},"Contratos de prestación de servicios profesionales y de apoyo a la gestión","Contratación directa",{"$f":"IFERROR(VLOOKUP(F82,Tipo!$C$12:$C$27,1,FALSE),\"NO\")","v":"Prestación de servicios profesionales y de apoyo a la gestión, o para la ejecución de trabajos artísticos que sólo puedan encomendarse a determinadas personas naturales;"},"Inversión",45]
["070-2019",2019,"FDLBU-CD-024-2019","Contratos de prestación de servicios profesionales y de apoyo a la gestión","Contratación directa","Prestación de servicios profesionales y de apoyo a la gestión, o para la ejecución de trabajos artísticos que sólo puedan encomendarse a determinadas personas naturales;","APOYAR JURÍDICAMENTE LA EJECUCIÓN DE LAS ACCIONES REQUERIDAS PARA LA DEPURACIÓN DE LAS ACTUACIONES ADMINISTRATIVAS QUE CURSAN EN LA ALCALDÍA LOCAL","Inversión",45,{"$f":"IF(ISERROR(VLOOKUP(I83,Eje_Pilar!$C$2:$E$47,2,FALSE)),\" \",VLOOKUP(I83,Eje_Pilar!$C$2:$E$47,2,FALSE))","v":"Gobernanza e influencia local, regional e internacional"},{"$f":"IF(ISERROR(VLOOKUP(I83,Eje_Pilar!$C$2:$E$47,3,FALSE)),\" \",VLOOKUP(I83,Eje_Pilar!$C$2:$E$47,3,FALSE))","v":"Eje Transversal 4 Gobierno Legitimo, Fortalecimiento Local y Eficiencia"},1559,35195802,"ADRIANA LILIANA CARDENAS VILLALOBOS ",27330000,null,null,2,13665000,40995000,40995000,"2019-02-08","2019-02-13","2019-11-12",180,90,null,null,null,"x",null,1,null,{"$f":"IF(SUMPRODUCT((A$14:A83=A83)*(B$14:B83=B83)*(C$14:C83=C83))>1,0,1)","v":1},"Contratos de prestación de servicios profesionales y de apoyo a la gestión","Contratación directa",{"$f":"IFERROR(VLOOKUP(F83,Tipo!$C$12:$C$27,1,FALSE),\"NO\")","v":"Prestación de servicios profesionales y de apoyo a la gestión, o para la ejecución de trabajos artísticos que sólo puedan encomendarse a determinadas personas naturales;"},"Inversión",45]
["071-2019",2019,"FDLBU-CD-048-2019","Contratos de prestación de servicios profesionales y de apoyo a la gestión","Contratación directa","Prestación de servicios profesionales y de apoyo a la gestión, o para la ejecución de trabajos artísticos que sólo puedan encomendarse a determinadas personas naturales;","PRESTAR APOYO ADMINISTRATIVO Y OPERATIVO AL ÁREA DEL ALMACÉN DE LA ALCALDÍA LOCAL DE BARRIOS UNIDOS, EN LOS PROCESOS DE CUIDADO, PROTECCIÓN, ALMACENAMIENTO, TRASLADO Y ENTREGA DE BIENES DEL FONDO DE DESARROLLO LOCAL DE ACUERDO A LOS PROCESOS Y PROCEDIMIENTOS VIGENTES","Inversión",45,{"$f":"IF(ISERROR(VLOOKUP(I84,Eje_Pilar!$C$2:$E$47,2,FALSE)),\" \",VLOOKUP(I84,Eje_Pilar!$C$2:$E$47,2,FALSE))","v":"Gobernanza e influencia local, regional e internacional"},{"$f":"IF(ISERROR(VLOOKUP(I84,Eje_Pilar!$C$2:$E$47,3,FALSE)),\" \",VLOOKUP(I84,Eje_Pilar!$C$2:$E$47,3,FALSE))","v":"Eje Transversal 4 Gobierno Legitimo, Fortalecimiento Local y Eficiencia"},1559,1032397330,"SERGIO ERNESTO BUSTOS HERRERA ",16500000,null,null,1,3300000,19800000,19800000,"2019-02-08","2019-02-11","2019-11-13",225,45,null,null,null,"x",null,1,null,{"$f":"IF(SUMPRODUCT((A$14:A84=A84)*(B$14:B84=B84)*(C$14:C84=C84))>1,0,1)","v":1},"Contratos de prestación de servicios profesionales y de apoyo a la gestión","Contratación directa",{"$f":"IFERROR(VLOOKUP(F84,Tipo!$C$12:$C$27,1,FALSE),\"NO\")","v":"Prestación de servicios profesionales y de apoyo a la gestión, o para la ejecución de trabajos artísticos que sólo puedan encomendarse a determinadas personas naturales;"},"Inversión",45]
["072-2019",2019,"FDLBU-CD-050-2019","Contratos de prestación de servicios profesionales y de apoyo a la gestión","Contratación directa","Prestación de servicios profesionales y de apoyo a la gestión, o para la ejecución de trabajos artísticos que sólo puedan encomendarse a determinadas personas naturales;","PRESTAR SUS SERVICIOS PROFESIONALES PARA COORDINAR, LIDERAR Y ASESORAR LOS PLANES Y ESTRATEGIAS DE COMUNICACIÓN INTERNA Y EXTERNA PARA LA DIVULGACIÓN DE LOS PROGRAMAS, PROYECTOS Y ACTIVIDADES DE LA ALCALDÍA LOCAL","Inversión",45,{"$f":"IF(ISERROR(VLOOKUP(I85,Eje_Pilar!$C$2:$E$47,2,FALSE)),\" \",VLOOKUP(I85,Eje_Pilar!$C$2:$E$47,2,FALSE))","v":"Gobernanza e influencia local, regional e internacional"},{"$f":"IF(ISERROR(VLOOKUP(I85,Eje_Pilar!$C$2:$E$47,3,FALSE)),\" \",VLOOKUP(I85,Eje_Pilar!$C$2:$E$47,3,FALSE))","v":"Eje Transversal 4 Gobierno Legitimo, Fortalecimiento Local y Eficiencia"},1559,52860493,"YULIETH PAOLA GOMEZ LEMA",45000000,null,null,2,21000000,66000000,58000000,"2019-02-07","2019-02-11","2020-01-10",225,105,null,null,null,"x",null,0.87878787878787878,null,{"$f":"IF(SUMPRODUCT((A$14:A85=A85)*(B$14:B85=B85)*(C$14:C85=C85))>1,0,1)","v":1},"Contratos de prestación de servicios profesionales y de apoyo a la gestión","Contratación directa",{"$f":"IFERROR(VLOOKUP(F85,Tipo!$C$12:$C$27,1,FALSE),\"NO\")","v":"Prestación de servicios profesionales y de apoyo a la gestión, o para la ejecución de trabajos artísticos que sólo puedan encomendarse a determinadas personas naturales;"},"Inversión",45]
["073-2019",2019,"FDLBU-CD-57-2019","Contratos de prestación de servicios profesionales y de apoyo a la gestión","Contratación directa","Prestación de servicios profesionales y de apoyo a la gestión, o para la ejecución de trabajos artísticos que sólo puedan encomendarse a determinadas personas naturales;","PRESTAR SERVICIOS PROFESIONALES PARA APOYAR AL ÁREA GESTIÓN DEL DESARROLLO ADMINISTRATIVO Y FINANCIERO EN LOS ASUNTOS RELATIVOS A LA PLANEACIÓN LOCAL, EN TEMAS RELACIONADOS A RECREACION Y DEPORTE, ASÍ COMO EL APOYO A LA SUPERVISIÓN DE CONTRATOS SUSCRITOS POR LA ALCALDÍA LOCAL DE BARRIOS UNIDOS QUE LE SEAN ASIGNADOS","Inversión",11,{"$f":"IF(ISERROR(VLOOKUP(I86,Eje_Pilar!$C$2:$E$47,2,FALSE)),\" \",VLOOKUP(I86,Eje_Pilar!$C$2:$E$47,2,FALSE))","v":"Mejores oportunidades para el desarrollo a través de la cultura, la recreación y el deporte"},{"$f":"IF(ISERROR(VLOOKUP(I86,Eje_Pilar!$C$2:$E$47,3,FALSE)),\" \",VLOOKUP(I86,Eje_Pilar!$C$2:$E$47,3,FALSE))","v":"Pilar 1 Igualdad de Calidad de Vida"},791,52914672,"GINA ANDREA REY AMADOR",78000000,1,-8016667,1,3250000,73233333,63483333,"2019-02-07","2019-02-08","2020-01-15",360,15,null,null,"x",null,null,0.8668639047194534,null,{"$f":"IF(SUMPRODUCT((A$14:A86=A86)*(B$14:B86=B86)*(C$14:C86=C86))>1,0,1)","v":1},{"$f":"IFERROR(VLOOKUP(D86,tipo,1,FALSE),\"NO\")","v":"Contratos de prestación de servicios profesionales y de apoyo a la gestión"},{"$f":"IFERROR(VLOOKUP(E86,modal,1,FALSE),\"NO\")","v":"Contratación directa"},{"$f":"IFERROR(VLOOKUP(F86,Tipo!$C$12:$C$27,1,FALSE),\"NO\")","v":"Prestación de servicios profesionales y de apoyo a la gestión, o para la ejecución de trabajos artísticos que sólo puedan encomendarse a determinadas personas naturales;"},{"$f":"IFERROR(VLOOKUP(H86,afectacion,1,FALSE),\"NO\")","v":"Inversión"},{"$f":"IFERROR(VLOOKUP(I86,programa,1,FALSE),\"NO\")","v":11}]
["074-2019",2019,"FDLBU-CD-58-2019","Contratos de prestación de servicios profesionales y de apoyo a la gestión","Contratación directa","Prestación de servicios profesionales y de apoyo a la gestión, o para la ejecución de trabajos artísticos que sólo puedan encomendarse a determinadas personas naturales;","PRESTAR SERVICIOS DE APOYO EN LAS ACTIVIDADES DE SEGURIDAD Y CONVIVENCIA CIUDADANA, RECUPERACIÓN DEL ESPACIO PÚBLICO PARA EL LOGRO DE LAS METAS DE GESTIÓN DE LA VIGENCIA","Inversión",19,{"$f":"IF(ISERROR(VLOOKUP(I87,Eje_Pilar!$C$2:$E$47,2,FALSE)),\" \",VLOOKUP(I87,Eje_Pilar!$C$2:$E$47,2,FALSE))","v":"Seguridad y convivencia para todos"},{"$f":"IF(ISERROR(VLOOKUP(I87,Eje_Pilar!$C$2:$E$47,3,FALSE)),\" \",VLOOKUP(I87,Eje_Pilar!$C$2:$E$47,3,FALSE))","v":"Pilar 3 Construcción de Comunidad y Cultura Ciudadana"},1563,79843350,"OCTAVIO TARAZONA HERNANDEZ",39750000,1,-4527083,1,3312500,38535417,31910417,"2019-02-07","2019-02-12","2020-01-31",360,30,null,null,"x",null,null,0.82808023071347592,null,{"$f":"IF(SUMPRODUCT((A$14:A87=A87)*(B$14:B87=B87)*(C$14:C87=C87))>1,0,1)","v":1},"Contratos de prestación de servicios profesionales y de apoyo a la gestión","Contratación directa",{"$f":"IFERROR(VLOOKUP(F87,Tipo!$C$12:$C$27,1,FALSE),\"NO\")","v":"Prestación de servicios profesionales y de apoyo a la gestión, o para la ejecución de trabajos artísticos que sólo puedan encomendarse a determinadas personas naturales;"},"Inversión",19]
["075-2019",2019,"FDLBU-CD-060-2019","Contratos de prestación de servicios profesionales y de apoyo a la gestión","Contratación directa","Prestación de servicios profesionales y de apoyo a la gestión, o para la ejecución de trabajos artísticos que sólo puedan encomendarse a determinadas personas naturales;","“PRESTAR SERVICIOS PROFESIONALES ESPECIALIZADOS EN EL ÁREA DE GESTIÓN DEL DESARROLLO, PARA LIDERAR LA FORMULACIÓN, SEGUIMIENTO Y EVALUACIÓN DE POLÍTICAS, PLANES, PROGRAMAS Y PROYECTOS DE DESARROLLO LOCAL, PARA EL CUMPLIMIENTO DE LAS METAS DEL PLAN DE DESARROLLO LOCAL DE BARRIOS UNIDOS","Inversión",45,{"$f":"IF(ISERROR(VLOOKUP(I88,Eje_Pilar!$C$2:$E$47,2,FALSE)),\" \",VLOOKUP(I88,Eje_Pilar!$C$2:$E$47,2,FALSE))","v":"Gobernanza e influencia local, regional e internacional"},{"$f":"IF(ISERROR(VLOOKUP(I88,Eje_Pilar!$C$2:$E$47,3,FALSE)),\" \",VLOOKUP(I88,Eje_Pilar!$C$2:$E$47,3,FALSE))","v":"Eje Transversal 4 Gobierno Legitimo, Fortalecimiento Local y Eficiencia"},1559,79701199,"IVAN MAURICIO MEJIA CASTRO",80948339,1,-56077255,null,0,24871084,24871084,"2019-02-04","2019-02-08","2019-05-23",345,0,null,null,null,"x",null,1,null,{"$f":"IF(SUMPRODUCT((A$14:A88=A88)*(B$14:B88=B88)*(C$14:C88=C88))>1,0,1)","v":1},"Contratos de prestación de servicios profesionales y de apoyo a la gestión","Contratación directa",{"$f":"IFERROR(VLOOKUP(F88,Tipo!$C$12:$C$27,1,FALSE),\"NO\")","v":"Prestación de servicios profesionales y de apoyo a la gestión, o para la ejecución de trabajos artísticos que sólo puedan encomendarse a determinadas personas naturales;"},"Inversión",45]
["076-2019",2019,"FDLBU-CD-061-2019","Contratos de prestación de servicios profesionales y de apoyo a la gestión","Contratación directa","Prestación de servicios profesionales y de apoyo a la gestión, o para la ejecución de trabajos artísticos que sólo puedan encomendarse a determinadas personas naturales;","PRESTAR SERVICIOS DE APOYO A LA GESTIÓN, PARA REALIZACIÓN DE VISITAS, APLICACIÓN DE ENCUESTAS, Y DEMÁS ACTIVIDADES NECESARIAS PARA LA PROMOCIÓN, DIVULGACIÓN Y CONTROL DE LAS AYUDAS OTORGADAS POR EL FONDO DE DESARROLLO LOCAL A LA POBLACIÓN EN ESTADO DE VULNERABILIDAD","Inversión",45,{"$f":"IF(ISERROR(VLOOKUP(I89,Eje_Pilar!$C$2:$E$47,2,FALSE)),\" \",VLOOKUP(I89,Eje_Pilar!$C$2:$E$47,2,FALSE))","v":"Gobernanza e influencia local, regional e internacional"},{"$f":"IF(ISERROR(VLOOKUP(I89,Eje_Pilar!$C$2:$E$47,3,FALSE)),\" \",VLOOKUP(I89,Eje_Pilar!$C$2:$E$47,3,FALSE))","v":"Eje Transversal 4 Gobierno Legitimo, Fortalecimiento Local y Eficiencia"},1559,1023943343,"BRYAN NICOLAS CRUZ ARIAS",22773190,1,-966135,null,0,21807055,19736765,"2019-02-08","2019-02-13","2019-12-31",360,0,null,null,null,"x",null,0.90506329259040252,null,{"$f":"IF(SUMPRODUCT((A$14:A89=A89)*(B$14:B89=B89)*(C$14:C89=C89))>1,0,1)","v":1},"Contratos de prestación de servicios profesionales y de apoyo a la gestión","Contratación directa",{"$f":"IFERROR(VLOOKUP(F89,Tipo!$C$12:$C$27,1,FALSE),\"NO\")","v":"Prestación de servicios profesionales y de apoyo a la gestión, o para la ejecución de trabajos artísticos que sólo puedan encomendarse a determinadas personas naturales;"},"Inversión",45]
["077-2019",2019,"FDLBU-CD-062-2019","Contratos de prestación de servicios profesionales y de apoyo a la gestión","Contratación directa","Prestación de servicios profesionales y de apoyo a la gestión, o para la ejecución de trabajos artísticos que sólo puedan encomendarse a determinadas personas naturales;","PRESTAR SERVICIOS DE APOYO EN LAS ACTIVIDADES DE SEGURIDAD, CONVIVENCIA CIUDADANA Y RECUPERACIÓN DEL ESPACIO PÚBLICO PARA EL LOGRO DE LAS METAS DE GESTIÓN DE LA VIGENCIA","Inversión",19,{"$f":"IF(ISERROR(VLOOKUP(I90,Eje_Pilar!$C$2:$E$47,2,FALSE)),\" \",VLOOKUP(I90,Eje_Pilar!$C$2:$E$47,2,FALSE))","v":"Seguridad y convivencia para todos"},{"$f":"IF(ISERROR(VLOOKUP(I90,Eje_Pilar!$C$2:$E$47,3,FALSE)),\" \",VLOOKUP(I90,Eje_Pilar!$C$2:$E$47,3,FALSE))","v":"Pilar 3 Construcción de Comunidad y Cultura Ciudadana"},1563,3129754,"NESTOR YESID SECHAGUA ",17000000,null,null,null,0,17000000,17000000,"2019-02-08","2019-02-13","2019-12-12",300,0,null,null,null,"x",null,1,null,{"$f":"IF(SUMPRODUCT((A$14:A90=A90)*(B$14:B90=B90)*(C$14:C90=C90))>1,0,1)","v":1},"Contratos de prestación de servicios profesionales y de apoyo a la gestión","Contratación directa",{"$f":"IFERROR(VLOOKUP(F90,Tipo!$C$12:$C$27,1,FALSE),\"NO\")","v":"Prestación de servicios profesionales y de apoyo a la gestión, o para la ejecución de trabajos artísticos que sólo puedan encomendarse a determinadas personas naturales;"},"Inversión",19]
["078-2019",2019,"FDLBU-CD-59-2019","Contratos de prestación de servicios profesionales y de apoyo a la gestión","Contratación directa","Prestación de servicios profesionales y de apoyo a la gestión, o para la ejecución de trabajos artísticos que sólo puedan encomendarse a determinadas personas naturales;","PRESTAR SERVICIOS PROFESIONALES PARA APOYAR LA FORMULACIÓN, GESTIÓN Y SEGUIMIENTO DE ACTIVIDADES ENFOCADAS AL APROVECHAMIENTO Y EMBELLECIMIENTO DEL INMUEBLE DESTINADO PARA EL FUNCIONAMIENTO DE LA ALCALDÍA LOCAL DE BARRIOS UNIDOS, EN EL MARCO DEL MANEJO DE LOS RECURSOS NATURALES EXISTENTES","Inversión",38,{"$f":"IF(ISERROR(VLOOKUP(I91,Eje_Pilar!$C$2:$E$47,2,FALSE)),\" \",VLOOKUP(I91,Eje_Pilar!$C$2:$E$47,2,FALSE))","v":"Recuperación y manejo de la Estructura Ecológica Principal"},{"$f":"IF(ISERROR(VLOOKUP(I91,Eje_Pilar!$C$2:$E$47,3,FALSE)),\" \",VLOOKUP(I91,Eje_Pilar!$C$2:$E$47,3,FALSE))","v":"Eje Transversal 3 Sostenibilidad Ambiental basada en la eficiencia energética"},1532,79491967,"FERNANDO FLOREZ MORA",60000000,1,-36833333,null,0,23166667,23166667,"2019-02-07","2019-02-12","2019-07-02",360,0,null,null,null,"x",null,1,null,{"$f":"IF(SUMPRODUCT((A$14:A91=A91)*(B$14:B91=B91)*(C$14:C91=C91))>1,0,1)","v":1},"Contratos de prestación de servicios profesionales y de apoyo a la gestión","Contratación directa",{"$f":"IFERROR(VLOOKUP(F91,Tipo!$C$12:$C$27,1,FALSE),\"NO\")","v":"Prestación de servicios profesionales y de apoyo a la gestión, o para la ejecución de trabajos artísticos que sólo puedan encomendarse a determinadas personas naturales;"},"Inversión",38]
["079-2019",2019,"FDLBU-CD-063-2019","Contratos de prestación de servicios profesionales y de apoyo a la gestión","Contratación directa","Prestación de servicios profesionales y de apoyo a la gestión, o para la ejecución de trabajos artísticos que sólo puedan encomendarse a determinadas personas naturales;","PRESTAR SUS SERVICIOS PROFESIONALES PARA LA IMPLEMENTACION DE LAS ACCIONES Y LINEAMIENTOS TECNICOS SURTIDOS DEL PROGRAMA DE GESTION DOCUMENTAL Y DEMAS INSTRUMENTOS TECNICOS ARCHIVISTICOS","Inversión",45,{"$f":"IF(ISERROR(VLOOKUP(I92,Eje_Pilar!$C$2:$E$47,2,FALSE)),\" \",VLOOKUP(I92,Eje_Pilar!$C$2:$E$47,2,FALSE))","v":"Gobernanza e influencia local, regional e internacional"},{"$f":"IF(ISERROR(VLOOKUP(I92,Eje_Pilar!$C$2:$E$47,3,FALSE)),\" \",VLOOKUP(I92,Eje_Pilar!$C$2:$E$47,3,FALSE))","v":"Eje Transversal 4 Gobierno Legitimo, Fortalecimiento Local y Eficiencia"},1559,52897368,"MONICA MARÍA NAVARRETE CRUZ",27330000,null,null,2,13665000,40995000,40995000,"2019-02-08","2019-02-11","2019-11-10",180,90,null,null,null,"x",null,1,null,{"$f":"IF(SUMPRODUCT((A$14:A92=A92)*(B$14:B92=B92)*(C$14:C92=C92))>1,0,1)","v":1},"Contratos de prestación de servicios profesionales y de apoyo a la gestión","Contratación directa",{"$f":"IFERROR(VLOOKUP(F92,Tipo!$C$12:$C$27,1,FALSE),\"NO\")","v":"Prestación de servicios profesionales y de apoyo a la gestión, o para la ejecución de trabajos artísticos que sólo puedan encomendarse a determinadas personas naturales;"},"Inversión",45]
["080-2019",2019,"FDLBU-CD-064-2019","Contratos de prestación de servicios profesionales y de apoyo a la gestión","Contratación directa","Prestación de servicios profesionales y de apoyo a la gestión, o para la ejecución de trabajos artísticos que sólo puedan encomendarse a determinadas personas naturales;","PRESTAR SUS SERVICIOS PROFESIONALES PARA APOYAR AL EQUIPO DE PRENSA Y COMUNICACIONES DE LA ALCALDÍA LOCAL EN LA CREACIÓN, REALIZACIÓN Y PRODUCCIÓN DE VÍDEOS QUE TRANSMITAN UN MENSAJE EN LA COMUNICACIÓN INTERNA Y EXTERNA","Inversión",45,{"$f":"IF(ISERROR(VLOOKUP(I93,Eje_Pilar!$C$2:$E$47,2,FALSE)),\" \",VLOOKUP(I93,Eje_Pilar!$C$2:$E$47,2,FALSE))","v":"Gobernanza e influencia local, regional e internacional"},{"$f":"IF(ISERROR(VLOOKUP(I93,Eje_Pilar!$C$2:$E$47,3,FALSE)),\" \",VLOOKUP(I93,Eje_Pilar!$C$2:$E$47,3,FALSE))","v":"Eje Transversal 4 Gobierno Legitimo, Fortalecimiento Local y Eficiencia"},1559,1053814308,"MANUELA GÓMEZ MORENO",34650000,null,null,2,17325000,51975000,47520000,"2019-02-12","2019-02-13","2019-12-27",210,105,null,null,null,"x",null,0.91428571428571426,null,{"$f":"IF(SUMPRODUCT((A$14:A93=A93)*(B$14:B93=B93)*(C$14:C93=C93))>1,0,1)","v":1},"Contratos de prestación de servicios profesionales y de apoyo a la gestión","Contratación directa",{"$f":"IFERROR(VLOOKUP(F93,Tipo!$C$12:$C$27,1,FALSE),\"NO\")","v":"Prestación de servicios profesionales y de apoyo a la gestión, o para la ejecución de trabajos artísticos que sólo puedan encomendarse a determinadas personas naturales;"},"Inversión",45]
["081-2019",2019,"FDLBU-CD-065-2019","Contratos de prestación de servicios profesionales y de apoyo a la gestión","Contratación directa","Prestación de servicios profesionales y de apoyo a la gestión, o para la ejecución de trabajos artísticos que sólo puedan encomendarse a determinadas personas naturales;","PRESTAR SERVICIOS PROFESIONALES PARA APOYAR AL DESPACHO DE LA ALCALDÍA LOCAL DE BARRIOS UNIDOS EN LA REVISIÓN, CONTROL Y VIGILANCIA DE LOS DOCUMENTOS EMITIDOS POR LAS DIFERENTES ÁREAS Y LA SUPERVISIÓN DE CONTRATOS QUE LE SEAN ASIGNADOS","Inversión",45,{"$f":"IF(ISERROR(VLOOKUP(I94,Eje_Pilar!$C$2:$E$47,2,FALSE)),\" \",VLOOKUP(I94,Eje_Pilar!$C$2:$E$47,2,FALSE))","v":"Gobernanza e influencia local, regional e internacional"},{"$f":"IF(ISERROR(VLOOKUP(I94,Eje_Pilar!$C$2:$E$47,3,FALSE)),\" \",VLOOKUP(I94,Eje_Pilar!$C$2:$E$47,3,FALSE))","v":"Eje Transversal 4 Gobierno Legitimo, Fortalecimiento Local y Eficiencia"},1559,19097825,"JOSÉ VICENTE BERARDINELLI SOLANO",52500000,1,-1,null,0,52499999,52499999,"2019-02-08","2019-02-08","2019-09-22",225,0,null,null,null,"x",null,1,null,{"$f":"IF(SUMPRODUCT((A$14:A94=A94)*(B$14:B94=B94)*(C$14:C94=C94))>1,0,1)","v":1},"Contratos de prestación de servicios profesionales y de apoyo a la gestión","Contratación directa",{"$f":"IFERROR(VLOOKUP(F94,Tipo!$C$12:$C$27,1,FALSE),\"NO\")","v":"Prestación de servicios profesionales y de apoyo a la gestión, o para la ejecución de trabajos artísticos que sólo puedan encomendarse a determinadas personas naturales;"},"Inversión",45]
["082-2019",2019,"FDLBU-CD-066-2019","Contratos de prestación de servicios profesionales y de apoyo a la gestión","Contratación directa","Prestación de servicios profesionales y de apoyo a la gestión, o para la ejecución de trabajos artísticos que sólo puedan encomendarse a determinadas personas naturales;","PRESTAR SUS SERVICIOS PROFESIONALES APOYANDO AL PROMOTOR DE LA MEJORA DE LA ALCALDÍA DE BARRIOS UNIDOS, EN CUANTO AL SEGUIMIENTO, Y FORTALECIMIENTO DE LA OPTIMIZACIÓN DE LOS PROCESOS Y TRÁMITES INTERNOS, EL DESARROLLO DE SISTEMAS DE ALERTAS TEMPRANAS, SIGUIENDO LOS LINEAMIENTOS ESTABLECIDOS PARA LA OFICINA ASESORA DE PLANEACIÓN","Inversión",45,{"$f":"IF(ISERROR(VLOOKUP(I95,Eje_Pilar!$C$2:$E$47,2,FALSE)),\" \",VLOOKUP(I95,Eje_Pilar!$C$2:$E$47,2,FALSE))","v":"Gobernanza e influencia local, regional e internacional"},{"$f":"IF(ISERROR(VLOOKUP(I95,Eje_Pilar!$C$2:$E$47,3,FALSE)),\" \",VLOOKUP(I95,Eje_Pilar!$C$2:$E$47,3,FALSE))","v":"Eje Transversal 4 Gobierno Legitimo, Fortalecimiento Local y Eficiencia"},1559,1020779113,"DANIEL FELIPE SANTIAGO COHEN",37500000,null,null,2,12500000,50000000,43000000,"2019-02-08","2019-02-13","2019-12-12",225,75,null,null,null,"x",null,0.86,null,{"$f":"IF(SUMPRODUCT((A$14:A95=A95)*(B$14:B95=B95)*(C$14:C95=C95))>1,0,1)","v":1},"Contratos de prestación de servicios profesionales y de apoyo a la gestión","Contratación directa",{"$f":"IFERROR(VLOOKUP(F95,Tipo!$C$12:$C$27,1,FALSE),\"NO\")","v":"Prestación de servicios profesionales y de apoyo a la gestión, o para la ejecución de trabajos artísticos que sólo puedan encomendarse a determinadas personas naturales;"},"Inversión",45]
["083-2019",2019,"FDLBU-CD-067-2019","Contratos de prestación de servicios profesionales y de apoyo a la gestión","Contratación directa","Prestación de servicios profesionales y de apoyo a la gestión, o para la ejecución de trabajos artísticos que sólo puedan encomendarse a determinadas personas naturales;","APOYAR ADMINISTRATIVA Y ASISTENCIALMENTE A LAS INSPECCIONES DE POLICÍA DE LA LOCALIDAD","Inversión",45,{"$f":"IF(ISERROR(VLOOKUP(I96,Eje_Pilar!$C$2:$E$47,2,FALSE)),\" \",VLOOKUP(I96,Eje_Pilar!$C$2:$E$47,2,FALSE))","v":"Gobernanza e influencia local, regional e internacional"},{"$f":"IF(ISERROR(VLOOKUP(I96,Eje_Pilar!$C$2:$E$47,3,FALSE)),\" \",VLOOKUP(I96,Eje_Pilar!$C$2:$E$47,3,FALSE))","v":"Eje Transversal 4 Gobierno Legitimo, Fortalecimiento Local y Eficiencia"},1559,1015479643,"EDGAR FELIPE BAQUERO DUARTE",10800000,null,null,2,5400000,16200000,15180000,"2019-02-11","2019-02-18","2019-11-17",180,90,null,null,null,"x",null,0.937037037037037,null,{"$f":"IF(SUMPRODUCT((A$14:A96=A96)*(B$14:B96=B96)*(C$14:C96=C96))>1,0,1)","v":1},"Contratos de prestación de servicios profesionales y de apoyo a la gestión","Contratación directa",{"$f":"IFERROR(VLOOKUP(F96,Tipo!$C$12:$C$27,1,FALSE),\"NO\")","v":"Prestación de servicios profesionales y de apoyo a la gestión, o para la ejecución de trabajos artísticos que sólo puedan encomendarse a determinadas personas naturales;"},"Inversión",45]
["084-2019",2019,"FDLBU-CD-72-2019","Contratos de prestación de servicios profesionales y de apoyo a la gestión","Contratación directa","Prestación de servicios profesionales y de apoyo a la gestión, o para la ejecución de trabajos artísticos que sólo puedan encomendarse a determinadas personas naturales;","PRESTAR SERVICIOS PROFESIONALES PARA EL DESARROLLO, EJECUCIÓN Y SEGUIMIENTO DE LOS PLANES, PROGRAMAS Y PROYECTOS DE LA ALCALDÍA LOCAL DE BARRIOS UNIDOS EN EL MARCO DEL PROYECTO DE CULTURA CIUDADANA, DEPORTE Y ARTE PARA UN MEJOR FUTURO, ASÍ COMO EN EL SEGUIMIENTO DE PROCESOS","Inversión",11,{"$f":"IF(ISERROR(VLOOKUP(I97,Eje_Pilar!$C$2:$E$47,2,FALSE)),\" \",VLOOKUP(I97,Eje_Pilar!$C$2:$E$47,2,FALSE))","v":"Mejores oportunidades para el desarrollo a través de la cultura, la recreación y el deporte"},{"$f":"IF(ISERROR(VLOOKUP(I97,Eje_Pilar!$C$2:$E$47,3,FALSE)),\" \",VLOOKUP(I97,Eje_Pilar!$C$2:$E$47,3,FALSE))","v":"Pilar 1 Igualdad de Calidad de Vida"},791,1023930613,"ANGIE NATALIA GOMEZ GUTIERREZ",54660000,1,-6073333,1,1518333,50105000,44031667,"2019-02-07","2019-02-11","2020-01-10",360,9.9000000000000021,null,null,null,"x",null,0.87878788544057485,null,{"$f":"IF(SUMPRODUCT((A$14:A97=A97)*(B$14:B97=B97)*(C$14:C97=C97))>1,0,1)","v":1},"Contratos de prestación de servicios profesionales y de apoyo a la gestión","Contratación directa",{"$f":"IFERROR(VLOOKUP(F97,Tipo!$C$12:$C$27,1,FALSE),\"NO\")","v":"Prestación de servicios profesionales y de apoyo a la gestión, o para la ejecución de trabajos artísticos que sólo puedan encomendarse a determinadas personas naturales;"},"Inversión",11]
["085-2019",2019,"FDLBU-CD-062-2019","Contratos de prestación de servicios profesionales y de apoyo a la gestión","Contratación directa","Prestación de servicios profesionales y de apoyo a la gestión, o para la ejecución de trabajos artísticos que sólo puedan encomendarse a determinadas personas naturales;","PRESTAR SERVICIOS DE APOYO EN LAS ACTIVIDADES DE SEGURIDAD, CONVIVENCIA CIUDADANA Y RECUPERACIÓN DEL ESPACIO PÚBLICO PARA EL LOGRO DE LAS METAS DE GESTIÓN DE LA VIGENCIA","Inversión",19,{"$f":"IF(ISERROR(VLOOKUP(I98,Eje_Pilar!$C$2:$E$47,2,FALSE)),\" \",VLOOKUP(I98,Eje_Pilar!$C$2:$E$47,2,FALSE))","v":"Seguridad y convivencia para todos"},{"$f":"IF(ISERROR(VLOOKUP(I98,Eje_Pilar!$C$2:$E$47,3,FALSE)),\" \",VLOOKUP(I98,Eje_Pilar!$C$2:$E$47,3,FALSE))","v":"Pilar 3 Construcción de Comunidad y Cultura Ciudadana"},1563,1030597333,"MIGUEL ANTONIO GAVIRIA CHAVEZ ",17000000,null,null,null,0,17000000,17000000,"2019-02-11","2019-02-13","2019-12-12",300,0,null,null,null,"x",null,1,null,{"$f":"IF(SUMPRODUCT((A$14:A98=A98)*(B$14:B98=B98)*(C$14:C98=C98))>1,0,1)","v":1},"Contratos de prestación de servicios profesionales y de apoyo a la gestión","Contratación directa",{"$f":"IFERROR(VLOOKUP(F98,Tipo!$C$12:$C$27,1,FALSE),\"NO\")","v":"Prestación de servicios profesionales y de apoyo a la gestión, o para la ejecución de trabajos artísticos que sólo puedan encomendarse a determinadas personas naturales;"},"Inversión",19]
["086-2019",2019,"FDLBU-CD-070-2019","Contratos de prestación de servicios profesionales y de apoyo a la gestión","Contratación directa","Prestación de servicios profesionales y de apoyo a la gestión, o para la ejecución de trabajos artísticos que sólo puedan encomendarse a determinadas personas naturales;","APOYAR LA GESTIÓN DOCUMENTAL DE LA ALCALDÍA LOCAL, ACOMPAÑANDO AL EQUIPO JURÍDICO DE DEPURACIÓN EN LAS LABORES OPERATIVAS QUE GENERA EL PROCESO DE IMPULSO DE LAS ACTUACIONES ADMINISTRATIVAS EXISTENTES EN LAS DIFERENTES ALCALDÍAS LOCALES","Inversión",45,{"$f":"IF(ISERROR(VLOOKUP(I99,Eje_Pilar!$C$2:$E$47,2,FALSE)),\" \",VLOOKUP(I99,Eje_Pilar!$C$2:$E$47,2,FALSE))","v":"Gobernanza e influencia local, regional e internacional"},{"$f":"IF(ISERROR(VLOOKUP(I99,Eje_Pilar!$C$2:$E$47,3,FALSE)),\" \",VLOOKUP(I99,Eje_Pilar!$C$2:$E$47,3,FALSE))","v":"Eje Transversal 4 Gobierno Legitimo, Fortalecimiento Local y Eficiencia"},1559,1022953015,"ELIANA GRISEL CADENA CANO",7200000,null,null,null,0,7200000,7200000,"2019-02-11","2019-02-13","2019-06-12",120,0,null,null,null,"x",null,1,null,{"$f":"IF(SUMPRODUCT((A$14:A99=A99)*(B$14:B99=B99)*(C$14:C99=C99))>1,0,1)","v":1},"Contratos de prestación de servicios profesionales y de apoyo a la gestión","Contratación directa",{"$f":"IFERROR(VLOOKUP(F99,Tipo!$C$12:$C$27,1,FALSE),\"NO\")","v":"Prestación de servicios profesionales y de apoyo a la gestión, o para la ejecución de trabajos artísticos que sólo puedan encomendarse a determinadas personas naturales;"},"Inversión",45]
["087-2019",2019,"FDLBU-CD-068-2019","Contratos de prestación de servicios profesionales y de apoyo a la gestión","Contratación directa","Prestación de servicios profesionales y de apoyo a la gestión, o para la ejecución de trabajos artísticos que sólo puedan encomendarse a determinadas personas naturales;","PRESTAR LOS SERVICIOS PROFESIONALES AL ÁREA DE GESTIÓN POLICIVA Y DESPACHO DEL ALCALDE, CON EL FIN DE QUE CON SUJECIÓN AL ORDEN DE LLEGADA SE ADELANTEN LOS PROCESOS O PROCEDIMIENTOS CORRESPONDIENTES PARA EL TRÁMITE, AUXILIO Y DEVOLUCIÓN DE LAS COMISIONES QUE EN VIRTUD DEL ARTÍCULO 37 Y SIGUIENTES DEL CÓDIGO GENERAL DE PROCESOS, SEAN DESIGNADAS POR LOS JUECES DE LA REPÚBLICA Y QUE CORRESPONDAN AL ÁMBITO TERRITORIAL DE ESTA ALCALDÍA","Inversión",45,{"$f":"IF(ISERROR(VLOOKUP(I100,Eje_Pilar!$C$2:$E$47,2,FALSE)),\" \",VLOOKUP(I100,Eje_Pilar!$C$2:$E$47,2,FALSE))","v":"Gobernanza e influencia local, regional e internacional"},{"$f":"IF(ISERROR(VLOOKUP(I100,Eje_Pilar!$C$2:$E$47,3,FALSE)),\" \",VLOOKUP(I100,Eje_Pilar!$C$2:$E$47,3,FALSE))","v":"Eje Transversal 4 Gobierno Legitimo, Fortalecimiento Local y Eficiencia"},1559,11409589,"HUGO JAVIER CESPEDES RODRIGUEZ",35475000,null,null,3,17658666,53133666,45408000,"2019-02-11","2019-02-13","2020-01-19",225,111.9,null,null,"x",null,null,0.85459941725082544,null,{"$f":"IF(SUMPRODUCT((A$14:A100=A100)*(B$14:B100=B100)*(C$14:C100=C100))>1,0,1)","v":1},"Contratos de prestación de servicios profesionales y de apoyo a la gestión","Contratación directa",{"$f":"IFERROR(VLOOKUP(F100,Tipo!$C$12:$C$27,1,FALSE),\"NO\")","v":"Prestación de servicios profesionales y de apoyo a la gestión, o para la ejecución de trabajos artísticos que sólo puedan encomendarse a determinadas personas naturales;"},"Inversión",45]
["088-2019",2019,"FDLBU-CD-069-2019","Contratos de prestación de servicios profesionales y de apoyo a la gestión","Contratación directa","Prestación de servicios profesionales y de apoyo a la gestión, o para la ejecución de trabajos artísticos que sólo puedan encomendarse a determinadas personas naturales;","PRESTAR SERVICIOS DE APOYO PROFESIONAL, CON CONOCIMIENTO EN NORMAS INTERNACIONALES DE INFORMACIÓN FINANCIERA, PARA ADELANTAR LAS ACTIVIDADES QUE DEN CUMPLIMIENTO A PROCEDIMIENTOS, ADMINISTRATIVOS Y CONTABLES APLICABLES EN EL NUEVO MARCO NORMATIVO CONTABLE","Inversión",45,{"$f":"IF(ISERROR(VLOOKUP(I101,Eje_Pilar!$C$2:$E$47,2,FALSE)),\" \",VLOOKUP(I101,Eje_Pilar!$C$2:$E$47,2,FALSE))","v":"Gobernanza e influencia local, regional e internacional"},{"$f":"IF(ISERROR(VLOOKUP(I101,Eje_Pilar!$C$2:$E$47,3,FALSE)),\" \",VLOOKUP(I101,Eje_Pilar!$C$2:$E$47,3,FALSE))","v":"Eje Transversal 4 Gobierno Legitimo, Fortalecimiento Local y Eficiencia"},1559,3077869,"JORGE EDUARDO AGUIRRE",38500000,null,null,null,0,38500000,38500000,"2019-02-12","2019-02-12","2019-09-11",210,0,null,null,null,"x",null,1,null,{"$f":"IF(SUMPRODUCT((A$14:A101=A101)*(B$14:B101=B101)*(C$14:C101=C101))>1,0,1)","v":1},"Contratos de prestación de servicios profesionales y de apoyo a la gestión","Contratación directa",{"$f":"IFERROR(VLOOKUP(F101,Tipo!$C$12:$C$27,1,FALSE),\"NO\")","v":"Prestación de servicios profesionales y de apoyo a la gestión, o para la ejecución de trabajos artísticos que sólo puedan encomendarse a determinadas personas naturales;"},"Inversión",45]
["089-2019",2019,"FDLBU-CD-074-2019","Contratos de prestación de servicios profesionales y de apoyo a la gestión","Contratación directa","Prestación de servicios profesionales y de apoyo a la gestión, o para la ejecución de trabajos artísticos que sólo puedan encomendarse a determinadas personas naturales;","PRESTAR POR SUS PROPIOS MEDIOS, CON PLENA AUTONOMÍA TÉCNICA, ADMINISTRATIVA Y FINANCIERA, LOS SERVICIOS PROFESIONALES PARA APOYAR EL ÁREA DE GESTIÓN DEL DESARROLLO ADMINISTRATIVA Y FINANCIARA Y APOYAR EN LA SUPERVISIÓN DE CONTRATOS EN LOS ASUNTOS RELATIVOS A LA PLANEACIÓN LOCAL DE PROYECTOS DE INFRAESTRUCTURA DE ACUERDO A LAS LÍNEAS DE INVERSIÓN VIGENTES","Inversión",17,{"$f":"IF(ISERROR(VLOOKUP(I102,Eje_Pilar!$C$2:$E$47,2,FALSE)),\" \",VLOOKUP(I102,Eje_Pilar!$C$2:$E$47,2,FALSE))","v":"Espacio público, derecho de todos"},{"$f":"IF(ISERROR(VLOOKUP(I102,Eje_Pilar!$C$2:$E$47,3,FALSE)),\" \",VLOOKUP(I102,Eje_Pilar!$C$2:$E$47,3,FALSE))","v":"Pilar 2 Democracía Urbana"},1558,1015424383,"NATHALIA DEL PILAR CAMARGO CASALLAS",59400000,1,-7095000,1,2805000,55110000,47355000,"2019-02-15","2019-02-14","2020-01-17",360,17.100000000000009,null,null,"x",null,null,0.85928143712574845,null,{"$f":"IF(SUMPRODUCT((A$14:A102=A102)*(B$14:B102=B102)*(C$14:C102=C102))>1,0,1)","v":1},"Contratos de prestación de servicios profesionales y de apoyo a la gestión","Contratación directa",{"$f":"IFERROR(VLOOKUP(F102,Tipo!$C$12:$C$27,1,FALSE),\"NO\")","v":"Prestación de servicios profesionales y de apoyo a la gestión, o para la ejecución de trabajos artísticos que sólo puedan encomendarse a determinadas personas naturales;"},"Inversión",17]
["090-2019",2019,"FDLBU-CD-73-2019","Contratos de prestación de servicios profesionales y de apoyo a la gestión","Contratación directa","Prestación de servicios profesionales y de apoyo a la gestión, o para la ejecución de trabajos artísticos que sólo puedan encomendarse a determinadas personas naturales;","APOYAR JURÍDICAMENTE LA EJECUCIÓN DE LAS ACCIONES REQUERIDAS PARA EL TRÁMITE E IMPULSO PROCESAL DE LAS ACTUACIONES CONTRAVENCIONALES Y/O QUERELLAS QUE CURSEN EN LAS INSPECCIONES DE POLICÍA DE LA LOCALIDAD”.","Inversión",45,{"$f":"IF(ISERROR(VLOOKUP(I103,Eje_Pilar!$C$2:$E$47,2,FALSE)),\" \",VLOOKUP(I103,Eje_Pilar!$C$2:$E$47,2,FALSE))","v":"Gobernanza e influencia local, regional e internacional"},{"$f":"IF(ISERROR(VLOOKUP(I103,Eje_Pilar!$C$2:$E$47,3,FALSE)),\" \",VLOOKUP(I103,Eje_Pilar!$C$2:$E$47,3,FALSE))","v":"Eje Transversal 4 Gobierno Legitimo, Fortalecimiento Local y Eficiencia"},1559,79276482,"ALEJANDRO CARRILLO RINCON",27330000,null,null,2,13665000,40995000,40995000,"2019-02-08","2019-02-13","2019-11-12",180,90,null,null,null,"x",null,1,null,{"$f":"IF(SUMPRODUCT((A$14:A103=A103)*(B$14:B103=B103)*(C$14:C103=C103))>1,0,1)","v":1},"Contratos de prestación de servicios profesionales y de apoyo a la gestión","Contratación directa",{"$f":"IFERROR(VLOOKUP(F103,Tipo!$C$12:$C$27,1,FALSE),\"NO\")","v":"Prestación de servicios profesionales y de apoyo a la gestión, o para la ejecución de trabajos artísticos que sólo puedan encomendarse a determinadas personas naturales;"},"Inversión",45]
["091-2019",2019,"FDLBU-CD-036-2019","Contratos de prestación de servicios profesionales y de apoyo a la gestión","Contratación directa","Prestación de servicios profesionales y de apoyo a la gestión, o para la ejecución de trabajos artísticos que sólo puedan encomendarse a determinadas personas naturales;","PRESTAR SERVICIOS DE APOYO A LOS ARCHIVOS DE GESTIÓN DE LA ENTIDAD EN LA IMPLEMENTACIÓN DE LOS PROCESOS DE CLASIFICACIÓN, ORDENACIÓN, SELECCIÓN NATURAL, FOLIACIÓN, IDENTIFICACION, LEVANTAMIENTO DE INVENTARIOS, ALMACENAMIENTO Y APLICACIÓN DE PROTOCOLOS DE ELIMINACION Y TRANSFERENCIAS DOCUMENTALES, ALISTAMIENTO Y PRESTAMO DE EXPEDIENTES EN EL ÁREA DE GESTIÓN POLICIVA JURÍDICA.","Inversión",45,{"$f":"IF(ISERROR(VLOOKUP(I104,Eje_Pilar!$C$2:$E$47,2,FALSE)),\" \",VLOOKUP(I104,Eje_Pilar!$C$2:$E$47,2,FALSE))","v":"Gobernanza e influencia local, regional e internacional"},{"$f":"IF(ISERROR(VLOOKUP(I104,Eje_Pilar!$C$2:$E$47,3,FALSE)),\" \",VLOOKUP(I104,Eje_Pilar!$C$2:$E$47,3,FALSE))","v":"Eje Transversal 4 Gobierno Legitimo, Fortalecimiento Local y Eficiencia"},1559,51780762,"DIANA CRISTINA MARTINEZ CASTRO ",13200000,null,null,2,6600000,19800000,19800000,"2019-02-11","2019-02-13","2019-11-12",180,90,null,null,null,"x",null,1,null,{"$f":"IF(SUMPRODUCT((A$14:A104=A104)*(B$14:B104=B104)*(C$14:C104=C104))>1,0,1)","v":1},"Contratos de prestación de servicios profesionales y de apoyo a la gestión","Contratación directa",{"$f":"IFERROR(VLOOKUP(F104,Tipo!$C$12:$C$27,1,FALSE),\"NO\")","v":"Prestación de servicios profesionales y de apoyo a la gestión, o para la ejecución de trabajos artísticos que sólo puedan encomendarse a determinadas personas naturales;"},"Inversión",45]
["092-2019",2019,"FDLBU-CD-073-2019","Contratos de prestación de servicios profesionales y de apoyo a la gestión","Contratación directa","Prestación de servicios profesionales y de apoyo a la gestión, o para la ejecución de trabajos artísticos que sólo puedan encomendarse a determinadas personas naturales;","APOYAR JURÍDICAMENTE LA EJECUCIÓN DE LAS ACCIONES REQUERIDAS PARA EL TRÁMITE E IMPULSO PROCESAL DE LAS ACTUACIONES CONTRAVENCIONALES Y/O QUERELLAS QUE CURSEN EN LAS INSPECCIONES DE POLICÍA DE LA LOCALIDAD","Inversión",45,{"$f":"IF(ISERROR(VLOOKUP(I105,Eje_Pilar!$C$2:$E$47,2,FALSE)),\" \",VLOOKUP(I105,Eje_Pilar!$C$2:$E$47,2,FALSE))","v":"Gobernanza e influencia local, regional e internacional"},{"$f":"IF(ISERROR(VLOOKUP(I105,Eje_Pilar!$C$2:$E$47,3,FALSE)),\" \",VLOOKUP(I105,Eje_Pilar!$C$2:$E$47,3,FALSE))","v":"Eje Transversal 4 Gobierno Legitimo, Fortalecimiento Local y Eficiencia"},1559,51994040,"CONSUELO DEL MILAGRO CHAVARRO PULIDO ",27330000,null,null,2,13665000,40995000,40995000,"2019-02-11","2019-02-12","2019-11-11",180,90,null,null,null,"x",null,1,null,{"$f":"IF(SUMPRODUCT((A$14:A105=A105)*(B$14:B105=B105)*(C$14:C105=C105))>1,0,1)","v":1},"Contratos de prestación de servicios profesionales y de apoyo a la gestión","Contratación directa",{"$f":"IFERROR(VLOOKUP(F105,Tipo!$C$12:$C$27,1,FALSE),\"NO\")","v":"Prestación de servicios profesionales y de apoyo a la gestión, o para la ejecución de trabajos artísticos que sólo puedan encomendarse a determinadas personas naturales;"},"Inversión",45]
["093-2019",2019,"FDLBU-CD-073-2019","Contratos de prestación de servicios profesionales y de apoyo a la gestión","Contratación directa","Prestación de servicios profesionales y de apoyo a la gestión, o para la ejecución de trabajos artísticos que sólo puedan encomendarse a determinadas personas naturales;","APOYAR JURÍDICAMENTE LA EJECUCIÓN DE LAS ACCIONES REQUERIDAS PARA EL TRÁMITE E IMPULSO PROCESAL DE LAS ACTUACIONES CONTRAVENCIONALES Y/O QUERELLAS QUE CURSEN EN LAS INSPECCIONES DE POLICÍA DE LA LOCALIDAD","Inversión",45,{"$f":"IF(ISERROR(VLOOKUP(I106,Eje_Pilar!$C$2:$E$47,2,FALSE)),\" \",VLOOKUP(I106,Eje_Pilar!$C$2:$E$47,2,FALSE))","v":"Gobernanza e influencia local, regional e internacional"},{"$f":"IF(ISERROR(VLOOKUP(I106,Eje_Pilar!$C$2:$E$47,3,FALSE)),\" \",VLOOKUP(I106,Eje_Pilar!$C$2:$E$47,3,FALSE))","v":"Eje Transversal 4 Gobierno Legitimo, Fortalecimiento Local y Eficiencia"},1559,1019034361,"INGRI JOHANA GALINDO  CASTILLO",27330000,null,null,2,13665000,40995000,40995000,"2019-02-14","2019-02-15","2019-11-14",180,90,null,null,null,"x",null,1,null,{"$f":"IF(SUMPRODUCT((A$14:A106=A106)*(B$14:B106=B106)*(C$14:C106=C106))>1,0,1)","v":1},"Contratos de prestación de servicios profesionales y de apoyo a la gestión","Contratación directa",{"$f":"IFERROR(VLOOKUP(F106,Tipo!$C$12:$C$27,1,FALSE),\"NO\")","v":"Prestación de servicios profesionales y de apoyo a la gestión, o para la ejecución de trabajos artísticos que sólo puedan encomendarse a determinadas personas naturales;"},"Inversión",45]
["094-2019",2019,"FDLBU-CD-055-2019","Contratos de prestación de servicios profesionales y de apoyo a la gestión","Contratación directa","Prestación de servicios profesionales y de apoyo a la gestión, o para la ejecución de trabajos artísticos que sólo puedan encomendarse a determinadas personas naturales;","PRESTAR LOS SERVICIOS PROFESIONALES PARA LA OPERACIÓN, PRESTACIÓN, SEGUIMIENTO Y CUMPLIMIENTO DE LOS PROCEDIMIENTOS ADMINISTRATIVOS, OPERATIVOS Y PROGRAMÁTICOS DEL SERVICIO APOYO ECONÓMICO TIPO C, QUE CONTRIBUYAN A LA GARANTÍA DE LOS DERECHOS DE LA POBLACIÓN MAYOR EN EL MARCO DE LA POLÍTICA PÚBLICA SOCIAL PARA EL ENVEJECIMIENTO Y LA VEJEZ EN EL DISTRITO CAPITAL A CARGO DE LA ALCALDÍA LOCAL","Inversión",3,{"$f":"IF(ISERROR(VLOOKUP(I107,Eje_Pilar!$C$2:$E$47,2,FALSE)),\" \",VLOOKUP(I107,Eje_Pilar!$C$2:$E$47,2,FALSE))","v":"Igualdad y autonomía para una Bogotá incluyente"},{"$f":"IF(ISERROR(VLOOKUP(I107,Eje_Pilar!$C$2:$E$47,3,FALSE)),\" \",VLOOKUP(I107,Eje_Pilar!$C$2:$E$47,3,FALSE))","v":"Pilar 1 Igualdad de Calidad de Vida"},1556,"1.075.666.029\n\n1.016.006.137\n\n","PAOLA ANDREA HERRERA CABALLERO\nCEDIO A\n DAIRO ALEXANDER BUSTOS TRIANA",54660000,1,-7136167,1,4555000,52078833,39932167,"2019-02-12","2019-03-08","2020-01-31",360,30,null,null,"x",null,null,0.76676385970476724,null,{"$f":"IF(SUMPRODUCT((A$14:A107=A107)*(B$14:B107=B107)*(C$14:C107=C107))>1,0,1)","v":1},"Contratos de prestación de servicios profesionales y de apoyo a la gestión","Contratación directa",{"$f":"IFERROR(VLOOKUP(F107,Tipo!$C$12:$C$27,1,FALSE),\"NO\")","v":"Prestación de servicios profesionales y de apoyo a la gestión, o para la ejecución de trabajos artísticos que sólo puedan encomendarse a determinadas personas naturales;"},"Inversión",3]
["095-2019",2019,"FDLBU-CD-056-2019","Contratos de prestación de servicios profesionales y de apoyo a la gestión","Contratación directa","Prestación de servicios profesionales y de apoyo a la gestión, o para la ejecución de trabajos artísticos que sólo puedan encomendarse a determinadas personas naturales;","PRESTAR SUS SERVICIOS PROFESIONALES PARA APOYAR AL EQUIPO DE PRENSA Y COMUNICACIONES DE LA ALCALDÍA LOCAL EN LA REALIZACIÓN DE PRODUCTOS Y PIEZAS DIGITALES, IMPRESAS Y PUBLICITARIAS DE GRAN FORMATO Y DE ANIMACIÓN GRÁFICA, ASÍ COMO APOYAR LA PRODUCCIÓN Y MONTAJE DE EVENTOS","Inversión",45,{"$f":"IF(ISERROR(VLOOKUP(I108,Eje_Pilar!$C$2:$E$47,2,FALSE)),\" \",VLOOKUP(I108,Eje_Pilar!$C$2:$E$47,2,FALSE))","v":"Gobernanza e influencia local, regional e internacional"},{"$f":"IF(ISERROR(VLOOKUP(I108,Eje_Pilar!$C$2:$E$47,3,FALSE)),\" \",VLOOKUP(I108,Eje_Pilar!$C$2:$E$47,3,FALSE))","v":"Eje Transversal 4 Gobierno Legitimo, Fortalecimiento Local y Eficiencia"},1559,1019019775,"JUAN DAVID BERMUDEZ JACOME",42000000,null,null,1,9000000,51000000,51000000,"2019-02-14","2019-02-18","2019-11-02",210,45,null,null,null,"x",null,1,null,{"$f":"IF(SUMPRODUCT((A$14:A108=A108)*(B$14:B108=B108)*(C$14:C108=C108))>1,0,1)","v":1},"Contratos de prestación de servicios profesionales y de apoyo a la gestión","Contratación directa",{"$f":"IFERROR(VLOOKUP(F108,Tipo!$C$12:$C$27,1,FALSE),\"NO\")","v":"Prestación de servicios profesionales y de apoyo a la gestión, o para la ejecución de trabajos artísticos que sólo puedan encomendarse a determinadas personas naturales;"},"Inversión",45]
["096-2019",2019,"FDLBU-CD-071-2019","Contratos de prestación de servicios profesionales y de apoyo a la gestión","Contratación directa","Prestación de servicios profesionales y de apoyo a la gestión, o para la ejecución de trabajos artísticos que sólo puedan encomendarse a determinadas personas naturales;","PRESTAR SERVICIOS TÉCNICOS PARA APOYAR LA GESTIÓN Y SEGUIMIENTO DEL PLAN INSTITUCIONAL DE GESTIÓN AMBIENTAL -PIGA Y ACTIVIDADES ENFOCADAS A LA GESTIÓN AMBIENTAL EXTERNA","Inversión",38,{"$f":"IF(ISERROR(VLOOKUP(I109,Eje_Pilar!$C$2:$E$47,2,FALSE)),\" \",VLOOKUP(I109,Eje_Pilar!$C$2:$E$47,2,FALSE))","v":"Recuperación y manejo de la Estructura Ecológica Principal"},{"$f":"IF(ISERROR(VLOOKUP(I109,Eje_Pilar!$C$2:$E$47,3,FALSE)),\" \",VLOOKUP(I109,Eje_Pilar!$C$2:$E$47,3,FALSE))","v":"Eje Transversal 3 Sostenibilidad Ambiental basada en la eficiencia energética"},1532,41708200,"LUZ MARINA TIQUE CORREA",23187500,null,null,2,11593750,34781250,31247917,"2019-02-14","2019-02-18","2020-01-02",210,60,null,null,null,"x",null,0.89841270799640616,null,{"$f":"IF(SUMPRODUCT((A$14:A109=A109)*(B$14:B109=B109)*(C$14:C109=C109))>1,0,1)","v":1},"Contratos de prestación de servicios profesionales y de apoyo a la gestión","Contratación directa",{"$f":"IFERROR(VLOOKUP(F109,Tipo!$C$12:$C$27,1,FALSE),\"NO\")","v":"Prestación de servicios profesionales y de apoyo a la gestión, o para la ejecución de trabajos artísticos que sólo puedan encomendarse a determinadas personas naturales;"},"Inversión",38]
["097-2019",2019,"FDLBU-CD-049-2019","Contratos de prestación de servicios profesionales y de apoyo a la gestión","Contratación directa","Prestación de servicios profesionales y de apoyo a la gestión, o para la ejecución de trabajos artísticos que sólo puedan encomendarse a determinadas personas naturales;","PRESTAR SUS SERVICIOS PROFESIONALES PARA APOYAR AL EQUIPO DE PRENSA Y COMUNICACIONES DE LA ALCALDÍA LOCAL MEDIANTE EL REGISTRO, LA EDICIÓN Y LA PRESENTACIÓN DE FOTOGRAFÍAS DE LOS ACONTECIMIENTOS, HECHOS Y EVENTOS DE LA ALCALDÍA LOCAL EN LOS MEDIOS DE COMUNICACIÓN, ESPECIALMENTE ESCRITOS, DIGITALES Y AUDIOVISUALES","Inversión",45,{"$f":"IF(ISERROR(VLOOKUP(I110,Eje_Pilar!$C$2:$E$47,2,FALSE)),\" \",VLOOKUP(I110,Eje_Pilar!$C$2:$E$47,2,FALSE))","v":"Gobernanza e influencia local, regional e internacional"},{"$f":"IF(ISERROR(VLOOKUP(I110,Eje_Pilar!$C$2:$E$47,3,FALSE)),\" \",VLOOKUP(I110,Eje_Pilar!$C$2:$E$47,3,FALSE))","v":"Eje Transversal 4 Gobierno Legitimo, Fortalecimiento Local y Eficiencia"},1559,1026260917,"MIGUEL FELIPE LOPEZ MENDEZ",34650000,null,null,1,7425000,42075000,42075000,"2019-02-14","2019-02-18","2019-11-03",210,45,null,null,null,"x",null,1,null,{"$f":"IF(SUMPRODUCT((A$14:A110=A110)*(B$14:B110=B110)*(C$14:C110=C110))>1,0,1)","v":1},"Contratos de prestación de servicios profesionales y de apoyo a la gestión","Contratación directa",{"$f":"IFERROR(VLOOKUP(F110,Tipo!$C$12:$C$27,1,FALSE),\"NO\")","v":"Prestación de servicios profesionales y de apoyo a la gestión, o para la ejecución de trabajos artísticos que sólo puedan encomendarse a determinadas personas naturales;"},"Inversión",45]
["098-2019",2019,"FDLBU-CD-062-2019","Contratos de prestación de servicios profesionales y de apoyo a la gestión","Contratación directa","Prestación de servicios profesionales y de apoyo a la gestión, o para la ejecución de trabajos artísticos que sólo puedan encomendarse a determinadas personas naturales;","PRESTAR SERVICIOS DE APOYO EN LAS ACTIVIDADES DE SEGURIDAD, CONVIVENCIA CIUDADANA Y RECUPERACIÓN DEL ESPACIO PÚBLICO PARA EL LOGRO DE LAS METAS DE GESTIÓN DE LA VIGENCIA","Inversión",19,{"$f":"IF(ISERROR(VLOOKUP(I111,Eje_Pilar!$C$2:$E$47,2,FALSE)),\" \",VLOOKUP(I111,Eje_Pilar!$C$2:$E$47,2,FALSE))","v":"Seguridad y convivencia para todos"},{"$f":"IF(ISERROR(VLOOKUP(I111,Eje_Pilar!$C$2:$E$47,3,FALSE)),\" \",VLOOKUP(I111,Eje_Pilar!$C$2:$E$47,3,FALSE))","v":"Pilar 3 Construcción de Comunidad y Cultura Ciudadana"},1563,1015407930,"YHEINS LEIGNELET LEMUS FRANCO",17000000,null,null,null,0,17000000,16036667,"2019-02-12","2019-02-18","2019-12-17",300,0,null,null,null,"x",null,0.94333335294117648,null,{"$f":"IF(SUMPRODUCT((A$14:A111=A111)*(B$14:B111=B111)*(C$14:C111=C111))>1,0,1)","v":1},"Contratos de prestación de servicios profesionales y de apoyo a la gestión","Contratación directa",{"$f":"IFERROR(VLOOKUP(F111,Tipo!$C$12:$C$27,1,FALSE),\"NO\")","v":"Prestación de servicios profesionales y de apoyo a la gestión, o para la ejecución de trabajos artísticos que sólo puedan encomendarse a determinadas personas naturales;"},"Inversión",19]
["099-2019",2019,"FDLBU-CD-73-2019","Contratos de prestación de servicios profesionales y de apoyo a la gestión","Contratación directa","Prestación de servicios profesionales y de apoyo a la gestión, o para la ejecución de trabajos artísticos que sólo puedan encomendarse a determinadas personas naturales;","APOYAR JURÍDICAMENTE LA EJECUCIÓN DE LAS ACCIONES REQUERIDAS PARA EL TRÁMITE E IMPULSO PROCESAL DE LAS ACTUACIONES CONTRAVENCIONALES Y/O QUERELLAS QUE CURSEN EN LAS INSPECCIONES DE POLICÍA DE LA LOCALIDAD”.","Inversión",45,{"$f":"IF(ISERROR(VLOOKUP(I112,Eje_Pilar!$C$2:$E$47,2,FALSE)),\" \",VLOOKUP(I112,Eje_Pilar!$C$2:$E$47,2,FALSE))","v":"Gobernanza e influencia local, regional e internacional"},{"$f":"IF(ISERROR(VLOOKUP(I112,Eje_Pilar!$C$2:$E$47,3,FALSE)),\" \",VLOOKUP(I112,Eje_Pilar!$C$2:$E$47,3,FALSE))","v":"Eje Transversal 4 Gobierno Legitimo, Fortalecimiento Local y Eficiencia"},1559,37747954,"ENERIET DAZA ARIZA",27330000,null,null,2,13665000,40995000,40995000,"2019-02-14","2019-02-15","2019-11-14",180,90,null,null,null,"x",null,1,null,{"$f":"IF(SUMPRODUCT((A$14:A112=A112)*(B$14:B112=B112)*(C$14:C112=C112))>1,0,1)","v":1},"Contratos de prestación de servicios profesionales y de apoyo a la gestión","Contratación directa",{"$f":"IFERROR(VLOOKUP(F112,Tipo!$C$12:$C$27,1,FALSE),\"NO\")","v":"Prestación de servicios profesionales y de apoyo a la gestión, o para la ejecución de trabajos artísticos que sólo puedan encomendarse a determinadas personas naturales;"},"Inversión",45]
["100-2019",2019,"FDLBU-CD-75-2019","Contratos de prestación de servicios profesionales y de apoyo a la gestión","Contratación directa","Prestación de servicios profesionales y de apoyo a la gestión, o para la ejecución de trabajos artísticos que sólo puedan encomendarse a determinadas personas naturales;","PRESTAR SERVICIOS DE APOYO AL ÁREA DE GESTIÓN DEL DESARROLLO ADMINISTRATIVA Y FINANCIERA EN LAS LABORES QUE REQUIERA LA JUNTA ADMINISTRADORA LOCAL DE BARRIOS UNIDOS COMO GRABACIÓN DE SESIONES, TRANSCRIPCIÓN DE ACTAS Y ATENCIÓN A LA CIUDADANÍA","Inversión",45,{"$f":"IF(ISERROR(VLOOKUP(I113,Eje_Pilar!$C$2:$E$47,2,FALSE)),\" \",VLOOKUP(I113,Eje_Pilar!$C$2:$E$47,2,FALSE))","v":"Gobernanza e influencia local, regional e internacional"},{"$f":"IF(ISERROR(VLOOKUP(I113,Eje_Pilar!$C$2:$E$47,3,FALSE)),\" \",VLOOKUP(I113,Eje_Pilar!$C$2:$E$47,3,FALSE))","v":"Eje Transversal 4 Gobierno Legitimo, Fortalecimiento Local y Eficiencia"},1559,1002681312,"WILSON ANDRES SALAMANCA ALFONSO",16500000,null,null,null,0,16500000,16206667,"2019-02-14","2019-02-20","2019-10-04",225,0,null,null,null,"x",null,0.98222224242424239,null,{"$f":"IF(SUMPRODUCT((A$14:A113=A113)*(B$14:B113=B113)*(C$14:C113=C113))>1,0,1)","v":1},"Contratos de prestación de servicios profesionales y de apoyo a la gestión","Contratación directa",{"$f":"IFERROR(VLOOKUP(F113,Tipo!$C$12:$C$27,1,FALSE),\"NO\")","v":"Prestación de servicios profesionales y de apoyo a la gestión, o para la ejecución de trabajos artísticos que sólo puedan encomendarse a determinadas personas naturales;"},"Inversión",45]
["101-2019",2019,"FDLBU-CD-062-2019","Contratos de prestación de servicios profesionales y de apoyo a la gestión","Contratación directa","Prestación de servicios profesionales y de apoyo a la gestión, o para la ejecución de trabajos artísticos que sólo puedan encomendarse a determinadas personas naturales;","PRESTAR SERVICIOS DE APOYO EN LAS ACTIVIDADES DE SEGURIDAD, CONVIVENCIA CIUDADANA Y RECUPERACIÓN DEL ESPACIO PÚBLICO PARA EL LOGRO DE LAS METAS DE GESTIÓN DE LA VIGENCIA","Inversión",19,{"$f":"IF(ISERROR(VLOOKUP(I114,Eje_Pilar!$C$2:$E$47,2,FALSE)),\" \",VLOOKUP(I114,Eje_Pilar!$C$2:$E$47,2,FALSE))","v":"Seguridad y convivencia para todos"},{"$f":"IF(ISERROR(VLOOKUP(I114,Eje_Pilar!$C$2:$E$47,3,FALSE)),\" \",VLOOKUP(I114,Eje_Pilar!$C$2:$E$47,3,FALSE))","v":"Pilar 3 Construcción de Comunidad y Cultura Ciudadana"},1563,1014305782,"GIOVANNI FRANCISCO JIMENEZ ",17000000,null,null,null,0,17000000,15583333,"2019-02-22","2019-02-26","2019-12-25",300,0,null,null,null,"x",null,0.9166666470588235,null,{"$f":"IF(SUMPRODUCT((A$14:A114=A114)*(B$14:B114=B114)*(C$14:C114=C114))>1,0,1)","v":1},"Contratos de prestación de servicios profesionales y de apoyo a la gestión","Contratación directa",{"$f":"IFERROR(VLOOKUP(F114,Tipo!$C$12:$C$27,1,FALSE),\"NO\")","v":"Prestación de servicios profesionales y de apoyo a la gestión, o para la ejecución de trabajos artísticos que sólo puedan encomendarse a determinadas personas naturales;"},"Inversión",19]
["102-2019",2019,"FDLBU-CD-076-2019","Contratos de prestación de servicios profesionales y de apoyo a la gestión","Contratación directa","Prestación de servicios profesionales y de apoyo a la gestión, o para la ejecución de trabajos artísticos que sólo puedan encomendarse a determinadas personas naturales;","PRESTAR LOS SERVICIOS PROFESIONALES EN LOS TEMAS RELACIONADOS CON EL ÁREA DE SISTEMAS, GESTIÓN DE TICS Y TODO LO RELACIONADO CON EL RECURSO TECNOLÓGICO DE LA ALCALDÍA LOCAL DE BARRIO UNIDOS","Inversión",45,{"$f":"IF(ISERROR(VLOOKUP(I115,Eje_Pilar!$C$2:$E$47,2,FALSE)),\" \",VLOOKUP(I115,Eje_Pilar!$C$2:$E$47,2,FALSE))","v":"Gobernanza e influencia local, regional e internacional"},{"$f":"IF(ISERROR(VLOOKUP(I115,Eje_Pilar!$C$2:$E$47,3,FALSE)),\" \",VLOOKUP(I115,Eje_Pilar!$C$2:$E$47,3,FALSE))","v":"Eje Transversal 4 Gobierno Legitimo, Fortalecimiento Local y Eficiencia"},1559,11321690,"HERNANDO FUERTES NIETO",29607500,1,-151833,1,9110000,38565667,38565667,"2019-02-15","2019-02-20","2019-11-03",195,60,null,null,null,"x",null,1,null,{"$f":"IF(SUMPRODUCT((A$14:A115=A115)*(B$14:B115=B115)*(C$14:C115=C115))>1,0,1)","v":1},"Contratos de prestación de servicios profesionales y de apoyo a la gestión","Contratación directa",{"$f":"IFERROR(VLOOKUP(F115,Tipo!$C$12:$C$27,1,FALSE),\"NO\")","v":"Prestación de servicios profesionales y de apoyo a la gestión, o para la ejecución de trabajos artísticos que sólo puedan encomendarse a determinadas personas naturales;"},"Inversión",45]
["103-2019",2019,"FDLBU-CD-070-2019","Contratos de prestación de servicios profesionales y de apoyo a la gestión","Contratación directa","Prestación de servicios profesionales y de apoyo a la gestión, o para la ejecución de trabajos artísticos que sólo puedan encomendarse a determinadas personas naturales;","APOYAR LA GESTIÓN DOCUMENTAL DE LA ALCALDÍA LOCAL, ACOMPAÑANDO AL EQUIPO JURÍDICO DE DEPURACIÓN EN LAS LABORES OPERATIVAS QUE GENERA EL PROCESO DE IMPULSO DE LAS ACTUACIONES ADMINISTRATIVAS EXISTENTES EN LAS DIFERENTES ALCALDÍAS LOCALES","Inversión",45,{"$f":"IF(ISERROR(VLOOKUP(I116,Eje_Pilar!$C$2:$E$47,2,FALSE)),\" \",VLOOKUP(I116,Eje_Pilar!$C$2:$E$47,2,FALSE))","v":"Gobernanza e influencia local, regional e internacional"},{"$f":"IF(ISERROR(VLOOKUP(I116,Eje_Pilar!$C$2:$E$47,3,FALSE)),\" \",VLOOKUP(I116,Eje_Pilar!$C$2:$E$47,3,FALSE))","v":"Eje Transversal 4 Gobierno Legitimo, Fortalecimiento Local y Eficiencia"},1559,52543694,"JENNY PATRICIA CARDOZO PARADA ",7200000,null,null,1,3600000,10800000,10620000,"2019-02-22","2019-03-05","2019-09-03",120,60,null,null,null,"x",null,0.98333333333333328,null,{"$f":"IF(SUMPRODUCT((A$14:A116=A116)*(B$14:B116=B116)*(C$14:C116=C116))>1,0,1)","v":1},"Contratos de prestación de servicios profesionales y de apoyo a la gestión","Contratación directa",{"$f":"IFERROR(VLOOKUP(F116,Tipo!$C$12:$C$27,1,FALSE),\"NO\")","v":"Prestación de servicios profesionales y de apoyo a la gestión, o para la ejecución de trabajos artísticos que sólo puedan encomendarse a determinadas personas naturales;"},"Inversión",45]
["104-2019",2019,"FDLBU-CD-061-2019","Contratos de prestación de servicios profesionales y de apoyo a la gestión","Contratación directa","Prestación de servicios profesionales y de apoyo a la gestión, o para la ejecución de trabajos artísticos que sólo puedan encomendarse a determinadas personas naturales;","PRESTAR SERVICIOS DE APOYO A LA GESTIÓN, PARA REALIZACIÓN DE VISITAS, APLICACIÓN DE ENCUESTAS, Y DEMÁS ACTIVIDADES NECESARIAS PARA LA PROMOCIÓN, DIVULGACIÓN Y CONTROL DE LAS AYUDAS OTORGADAS POR EL FONDO DE DESARROLLO LOCAL A LA POBLACIÓN EN ESTADO DE VULNERABILIDAD","Inversión",45,{"$f":"IF(ISERROR(VLOOKUP(I117,Eje_Pilar!$C$2:$E$47,2,FALSE)),\" \",VLOOKUP(I117,Eje_Pilar!$C$2:$E$47,2,FALSE))","v":"Gobernanza e influencia local, regional e internacional"},{"$f":"IF(ISERROR(VLOOKUP(I117,Eje_Pilar!$C$2:$E$47,3,FALSE)),\" \",VLOOKUP(I117,Eje_Pilar!$C$2:$E$47,3,FALSE))","v":"Eje Transversal 4 Gobierno Legitimo, Fortalecimiento Local y Eficiencia"},1559,80035265,"BERNARDO HERNANDEZ",22773190,1,-1656232,null,0,21116958,19046668,"2019-02-19","2019-02-25","2019-12-31",360,0,null,null,null,"x",null,0.90196078431372551,null,{"$f":"IF(SUMPRODUCT((A$14:A117=A117)*(B$14:B117=B117)*(C$14:C117=C117))>1,0,1)","v":1},"Contratos de prestación de servicios profesionales y de apoyo a la gestión","Contratación directa",{"$f":"IFERROR(VLOOKUP(F117,Tipo!$C$12:$C$27,1,FALSE),\"NO\")","v":"Prestación de servicios profesionales y de apoyo a la gestión, o para la ejecución de trabajos artísticos que sólo puedan encomendarse a determinadas personas naturales;"},"Inversión",45]
["105-2019",2019,"FDLBU-CD-062-2019","Contratos de prestación de servicios profesionales y de apoyo a la gestión","Contratación directa","Prestación de servicios profesionales y de apoyo a la gestión, o para la ejecución de trabajos artísticos que sólo puedan encomendarse a determinadas personas naturales;","PRESTAR SERVICIOS DE APOYO EN LAS ACTIVIDADES DE SEGURIDAD, CONVIVENCIA CIUDADANA Y RECUPERACIÓN DEL ESPACIO PÚBLICO PARA EL LOGRO DE LAS METAS DE GESTIÓN DE LA VIGENCIA","Inversión",19,{"$f":"IF(ISERROR(VLOOKUP(I118,Eje_Pilar!$C$2:$E$47,2,FALSE)),\" \",VLOOKUP(I118,Eje_Pilar!$C$2:$E$47,2,FALSE))","v":"Seguridad y convivencia para todos"},{"$f":"IF(ISERROR(VLOOKUP(I118,Eje_Pilar!$C$2:$E$47,3,FALSE)),\" \",VLOOKUP(I118,Eje_Pilar!$C$2:$E$47,3,FALSE))","v":"Pilar 3 Construcción de Comunidad y Cultura Ciudadana"},1563,1019071525,"JUAN SEBASTIAN   MARTIN BERMEO ",17000000,null,null,null,0,17000000,15923333,"2019-02-13","2019-02-20","2019-12-19",300,0,null,null,null,"x",null,0.93666664705882352,null,{"$f":"IF(SUMPRODUCT((A$14:A118=A118)*(B$14:B118=B118)*(C$14:C118=C118))>1,0,1)","v":1},"Contratos de prestación de servicios profesionales y de apoyo a la gestión","Contratación directa",{"$f":"IFERROR(VLOOKUP(F118,Tipo!$C$12:$C$27,1,FALSE),\"NO\")","v":"Prestación de servicios profesionales y de apoyo a la gestión, o para la ejecución de trabajos artísticos que sólo puedan encomendarse a determinadas personas naturales;"},"Inversión",19]
["106-2019",2019,"FDLBU-CD-062-2019","Contratos de prestación de servicios profesionales y de apoyo a la gestión","Contratación directa","Prestación de servicios profesionales y de apoyo a la gestión, o para la ejecución de trabajos artísticos que sólo puedan encomendarse a determinadas personas naturales;","PRESTAR SERVICIOS DE APOYO EN LAS ACTIVIDADES DE SEGURIDAD, CONVIVENCIA CIUDADANA Y RECUPERACIÓN DEL ESPACIO PÚBLICO PARA EL LOGRO DE LAS METAS DE GESTIÓN DE LA VIGENCIA","Inversión",19,{"$f":"IF(ISERROR(VLOOKUP(I119,Eje_Pilar!$C$2:$E$47,2,FALSE)),\" \",VLOOKUP(I119,Eje_Pilar!$C$2:$E$47,2,FALSE))","v":"Seguridad y convivencia para todos"},{"$f":"IF(ISERROR(VLOOKUP(I119,Eje_Pilar!$C$2:$E$47,3,FALSE)),\" \",VLOOKUP(I119,Eje_Pilar!$C$2:$E$47,3,FALSE))","v":"Pilar 3 Construcción de Comunidad y Cultura Ciudadana"},1563,1018467983,"MOISES DAYAN FRANCISCO GOMEZ GUERRERO",17000000,null,null,null,0,17000000,15866667,"2019-02-13","2019-02-21","2019-12-20",300,0,null,null,null,"x",null,0.93333335294117648,null,{"$f":"IF(SUMPRODUCT((A$14:A119=A119)*(B$14:B119=B119)*(C$14:C119=C119))>1,0,1)","v":1},"Contratos de prestación de servicios profesionales y de apoyo a la gestión","Contratación directa",{"$f":"IFERROR(VLOOKUP(F119,Tipo!$C$12:$C$27,1,FALSE),\"NO\")","v":"Prestación de servicios profesionales y de apoyo a la gestión, o para la ejecución de trabajos artísticos que sólo puedan encomendarse a determinadas personas naturales;"},"Inversión",19]
["107-2019",2019,"FDLBU-CD-077-2019","Contratos de prestación de servicios profesionales y de apoyo a la gestión","Contratación directa","Prestación de servicios profesionales y de apoyo a la gestión, o para la ejecución de trabajos artísticos que sólo puedan encomendarse a determinadas personas naturales;","PRESTAR SERVICIOS PROFESIONALES PARA APOYAR TÉCNICAMENTE LAS DISTINTAS ETAPAS DE LOS PROCESOS DE COMPETENCIA DE LA ALCALDÍA LOCAL PARA LA DEPURACIÓN DE ACTUACIONES ADMINISTRATIVAS","Inversión",45,{"$f":"IF(ISERROR(VLOOKUP(I120,Eje_Pilar!$C$2:$E$47,2,FALSE)),\" \",VLOOKUP(I120,Eje_Pilar!$C$2:$E$47,2,FALSE))","v":"Gobernanza e influencia local, regional e internacional"},{"$f":"IF(ISERROR(VLOOKUP(I120,Eje_Pilar!$C$2:$E$47,3,FALSE)),\" \",VLOOKUP(I120,Eje_Pilar!$C$2:$E$47,3,FALSE))","v":"Eje Transversal 4 Gobierno Legitimo, Fortalecimiento Local y Eficiencia"},1559,80098149,"GEOVANNY ROJAS CASTRO",20400000,null,null,null,0,20400000,20400000,"2019-02-14","2019-02-20","2019-06-19",120,0,null,null,null,"x",null,1,null,{"$f":"IF(SUMPRODUCT((A$14:A120=A120)*(B$14:B120=B120)*(C$14:C120=C120))>1,0,1)","v":1},"Contratos de prestación de servicios profesionales y de apoyo a la gestión","Contratación directa",{"$f":"IFERROR(VLOOKUP(F120,Tipo!$C$12:$C$27,1,FALSE),\"NO\")","v":"Prestación de servicios profesionales y de apoyo a la gestión, o para la ejecución de trabajos artísticos que sólo puedan encomendarse a determinadas personas naturales;"},"Inversión",45]
["108-2019",2019,"FDLBU-CD-078-2019","Contratos de prestación de servicios profesionales y de apoyo a la gestión","Contratación directa","Prestación de servicios profesionales y de apoyo a la gestión, o para la ejecución de trabajos artísticos que sólo puedan encomendarse a determinadas personas naturales;","PRESTAR SERVICIOS PROFESIONALES EN EL  AREA DE GESTION DEL DESARROLLO LOCAL EN LA OFICINA DE PARTICIPACION PARA APOYAR EN LA PROMOCIÓN, ACOMPAÑAMIENTO, COORDINACIÓN Y ATENCIÓN DE LAS INSTANCIAS DE COORDINACIÓN INTERINSTITUCIONALES Y LAS INSTANCIAS DE PARTICIPACIÓN LOCALES, ASÍ COMO LOS PROCESOS COMUNITARIOS EN LA LOCALIDAD","Inversión",45,{"$f":"IF(ISERROR(VLOOKUP(I121,Eje_Pilar!$C$2:$E$47,2,FALSE)),\" \",VLOOKUP(I121,Eje_Pilar!$C$2:$E$47,2,FALSE))","v":"Gobernanza e influencia local, regional e internacional"},{"$f":"IF(ISERROR(VLOOKUP(I121,Eje_Pilar!$C$2:$E$47,3,FALSE)),\" \",VLOOKUP(I121,Eje_Pilar!$C$2:$E$47,3,FALSE))","v":"Eje Transversal 4 Gobierno Legitimo, Fortalecimiento Local y Eficiencia"},1562,79576545,"JUAN CARLOS CARRERO MANCERA",61200000,1,-8500000,null,0,52700000,47600000,"2019-02-21","2019-02-21","2019-12-31",360,0,null,null,null,"x",null,0.90322580645161288,null,{"$f":"IF(SUMPRODUCT((A$14:A121=A121)*(B$14:B121=B121)*(C$14:C121=C121))>1,0,1)","v":1},"Contratos de prestación de servicios profesionales y de apoyo a la gestión","Contratación directa",{"$f":"IFERROR(VLOOKUP(F121,Tipo!$C$12:$C$27,1,FALSE),\"NO\")","v":"Prestación de servicios profesionales y de apoyo a la gestión, o para la ejecución de trabajos artísticos que sólo puedan encomendarse a determinadas personas naturales;"},"Inversión",45]
["109-2019",2019,"FDLBU-CD-080-2019","Contratos de prestación de servicios profesionales y de apoyo a la gestión","Contratación directa","Prestación de servicios profesionales y de apoyo a la gestión, o para la ejecución de trabajos artísticos que sólo puedan encomendarse a determinadas personas naturales;","PRESTAR SERVICIOS PROFESIONALES PARA APOYAR LA FORMULACIÓN, EJECUCIÓN, SEGUIMIENTO Y MEJORA CONTINUA DE LAS HERRAMIENTAS QUE CONFORMAN LA GESTIÓN AMBIENTAL INSTITUCIONAL DE LA ALCALDÍA LOCAL","Inversión",38,{"$f":"IF(ISERROR(VLOOKUP(I122,Eje_Pilar!$C$2:$E$47,2,FALSE)),\" \",VLOOKUP(I122,Eje_Pilar!$C$2:$E$47,2,FALSE))","v":"Recuperación y manejo de la Estructura Ecológica Principal"},{"$f":"IF(ISERROR(VLOOKUP(I122,Eje_Pilar!$C$2:$E$47,3,FALSE)),\" \",VLOOKUP(I122,Eje_Pilar!$C$2:$E$47,3,FALSE))","v":"Eje Transversal 3 Sostenibilidad Ambiental basada en la eficiencia energética"},1532,1061772302,"PAULA DANIELA CORAL CEBALLOS ",31885000,null,null,1,6832500,38717500,37047333,"2019-02-21","2019-02-27","2019-11-11",210,45,null,null,null,"x",null,0.95686273648866793,null,{"$f":"IF(SUMPRODUCT((A$14:A122=A122)*(B$14:B122=B122)*(C$14:C122=C122))>1,0,1)","v":1},"Contratos de prestación de servicios profesionales y de apoyo a la gestión","Contratación directa",{"$f":"IFERROR(VLOOKUP(F122,Tipo!$C$12:$C$27,1,FALSE),\"NO\")","v":"Prestación de servicios profesionales y de apoyo a la gestión, o para la ejecución de trabajos artísticos que sólo puedan encomendarse a determinadas personas naturales;"},"Inversión",38]
["110-2019",2019,"FDLBU-CD-079-2019","Contratos de prestación de servicios profesionales y de apoyo a la gestión","Contratación directa","Prestación de servicios profesionales y de apoyo a la gestión, o para la ejecución de trabajos artísticos que sólo puedan encomendarse a determinadas personas naturales;","APOYAR AL ALCALDE LOCAL EN LA FORMULACIÓN, SEGUIMIENTO E IMPLEMENTACIÓN DE LA ESTRATEGIA LOCAL PARA LA TERMINACIÓN JURÍDICA DE LAS ACTUACIONES ADMINISTRATIVAS QUE CURSAN EN LA ALCALDÍA LOCAL","Inversión",45,{"$f":"IF(ISERROR(VLOOKUP(I123,Eje_Pilar!$C$2:$E$47,2,FALSE)),\" \",VLOOKUP(I123,Eje_Pilar!$C$2:$E$47,2,FALSE))","v":"Gobernanza e influencia local, regional e internacional"},{"$f":"IF(ISERROR(VLOOKUP(I123,Eje_Pilar!$C$2:$E$47,3,FALSE)),\" \",VLOOKUP(I123,Eje_Pilar!$C$2:$E$47,3,FALSE))","v":"Eje Transversal 4 Gobierno Legitimo, Fortalecimiento Local y Eficiencia"},1559,80126559,"HERNAN DAVID OVALLE BRICEÑO",26000000,null,null,null,0,26000000,26000000,"2019-02-20","2019-02-21","2019-06-20",120,0,null,null,null,"x",null,1,null,{"$f":"IF(SUMPRODUCT((A$14:A123=A123)*(B$14:B123=B123)*(C$14:C123=C123))>1,0,1)","v":1},"Contratos de prestación de servicios profesionales y de apoyo a la gestión","Contratación directa",{"$f":"IFERROR(VLOOKUP(F123,Tipo!$C$12:$C$27,1,FALSE),\"NO\")","v":"Prestación de servicios profesionales y de apoyo a la gestión, o para la ejecución de trabajos artísticos que sólo puedan encomendarse a determinadas personas naturales;"},"Inversión",45]
["111-2019",2019,"FDLBU-CD-062-2019","Contratos de prestación de servicios profesionales y de apoyo a la gestión","Contratación directa","Prestación de servicios profesionales y de apoyo a la gestión, o para la ejecución de trabajos artísticos que sólo puedan encomendarse a determinadas personas naturales;","PRESTAR SERVICIOS DE APOYO EN LAS ACTIVIDADES DE SEGURIDAD, CONVIVENCIA CIUDADANA Y RECUPERACIÓN DEL ESPACIO PÚBLICO PARA EL LOGRO DE LAS METAS DE GESTIÓN DE LA VIGENCIA","Inversión",19,{"$f":"IF(ISERROR(VLOOKUP(I124,Eje_Pilar!$C$2:$E$47,2,FALSE)),\" \",VLOOKUP(I124,Eje_Pilar!$C$2:$E$47,2,FALSE))","v":"Seguridad y convivencia para todos"},{"$f":"IF(ISERROR(VLOOKUP(I124,Eje_Pilar!$C$2:$E$47,3,FALSE)),\" \",VLOOKUP(I124,Eje_Pilar!$C$2:$E$47,3,FALSE))","v":"Pilar 3 Construcción de Comunidad y Cultura Ciudadana"},1563,1000473998,"JUAN CAMILO GORDILLO CANTOR CEDIÓ A HECTOR HORACIO PEREZ PRIETO",17000000,1,-170000,null,0,16830000,13373333,"2019-02-13","2019-03-05","2019-12-31",300,0,null,null,null,"x",null,0.79461277480689241,null,{"$f":"IF(SUMPRODUCT((A$14:A124=A124)*(B$14:B124=B124)*(C$14:C124=C124))>1,0,1)","v":1},"Contratos de prestación de servicios profesionales y de apoyo a la gestión","Contratación directa",{"$f":"IFERROR(VLOOKUP(F124,Tipo!$C$12:$C$27,1,FALSE),\"NO\")","v":"Prestación de servicios profesionales y de apoyo a la gestión, o para la ejecución de trabajos artísticos que sólo puedan encomendarse a determinadas personas naturales;"},"Inversión",19]
["112-2019",2019,"FDLBU-CD-085-2019","Contratos de prestación de servicios profesionales y de apoyo a la gestión","Contratación directa","Prestación de servicios profesionales y de apoyo a la gestión, o para la ejecución de trabajos artísticos que sólo puedan encomendarse a determinadas personas naturales;","PRESTAR SERVICIOS PROFESIONALES PARA APOYAR AL ÁREA GESTIÓN DEL DESARROLLO – ADMINISTRATIVO Y FINANCIERO EN LOS ASUNTOS RELATIVOS A LA PLANEACIÓN LOCAL, EN LA SUPERVISIÓN DE CONTRATOS SUSCRITOS POR LA ALCALDÍA LOCAL DE BARRIOS UNIDOS DIRIGIDOS AL OTORGAMIENTO DE AYUDAS TÉCNICAS Y LO RELACIONADO CON ASISTENCIA PERSONAL, MEJORAMIENTO DE LA CALIDAD DE VIDA Y PROMOCIÓN DEL BIENESTAR PARA PERSONAS CON DISCAPACIDAD O EN ESTADO DE VULNERABILIDAD","Inversión",3,{"$f":"IF(ISERROR(VLOOKUP(I125,Eje_Pilar!$C$2:$E$47,2,FALSE)),\" \",VLOOKUP(I125,Eje_Pilar!$C$2:$E$47,2,FALSE))","v":"Igualdad y autonomía para una Bogotá incluyente"},{"$f":"IF(ISERROR(VLOOKUP(I125,Eje_Pilar!$C$2:$E$47,3,FALSE)),\" \",VLOOKUP(I125,Eje_Pilar!$C$2:$E$47,3,FALSE))","v":"Pilar 1 Igualdad de Calidad de Vida"},1556," 52.534.135     \n \n52.967.638","SANDRA BIBIANA LADINO REYES \nCEDIÓ A \nPAOLA ANDREA SANTOS RUEDA",72000000,1,-45600000,null,0,26400000,26400000,"2019-02-27","2019-03-20","2019-07-31",360,0,null,null,null,"x",null,1,null,{"$f":"IF(SUMPRODUCT((A$14:A125=A125)*(B$14:B125=B125)*(C$14:C125=C125))>1,0,1)","v":1},"Contratos de prestación de servicios profesionales y de apoyo a la gestión","Contratación directa",{"$f":"IFERROR(VLOOKUP(F125,Tipo!$C$12:$C$27,1,FALSE),\"NO\")","v":"Prestación de servicios profesionales y de apoyo a la gestión, o para la ejecución de trabajos artísticos que sólo puedan encomendarse a determinadas personas naturales;"},"Inversión",3]
["113-2019",2019,"FDLBU-CD-082-2019","Contratos de prestación de servicios profesionales y de apoyo a la gestión","Contratación directa","Prestación de servicios profesionales y de apoyo a la gestión, o para la ejecución de trabajos artísticos que sólo puedan encomendarse a determinadas personas naturales;","PRESTAR LOS SERVICIOS DE APOYO A LA GESTIÓN EN LA ALCALDÍA LOCAL DE BARRIOS UNIDOS EN COORDINACIÓN CON LA DIRECCIÓN PARA LA GESTIÓN POLICIVA DE LA SECRETARÍA DISTRITAL DE GOBIERNO, EN EL DESARROLLO DEL PROCESO DE INTERVENCIÓN EN GESTIÓN DOCUMENTAL, CARGUE EN EL APLICATIVO SI ACTUA Y DIGITALIZACIÓN DE LAS ACTUACIONES ADMINISTRATIVAS","Inversión",45,{"$f":"IF(ISERROR(VLOOKUP(I126,Eje_Pilar!$C$2:$E$47,2,FALSE)),\" \",VLOOKUP(I126,Eje_Pilar!$C$2:$E$47,2,FALSE))","v":"Gobernanza e influencia local, regional e internacional"},{"$f":"IF(ISERROR(VLOOKUP(I126,Eje_Pilar!$C$2:$E$47,3,FALSE)),\" \",VLOOKUP(I126,Eje_Pilar!$C$2:$E$47,3,FALSE))","v":"Eje Transversal 4 Gobierno Legitimo, Fortalecimiento Local y Eficiencia"},1559,"1.014.262.307\n \n1.014.215.583","KIMBERLY ANDREA VARGAS ROJAS \nCEDIO A \nDANIEL GERENA MARIN",10800000,null,null,2,5400000,16200000,15840000,"2019-02-21","2019-03-08","2019-12-06",180,90,null,null,null,"x",null,0.97777777777777775,null,{"$f":"IF(SUMPRODUCT((A$14:A126=A126)*(B$14:B126=B126)*(C$14:C126=C126))>1,0,1)","v":1},"Contratos de prestación de servicios profesionales y de apoyo a la gestión","Contratación directa",{"$f":"IFERROR(VLOOKUP(F126,Tipo!$C$12:$C$27,1,FALSE),\"NO\")","v":"Prestación de servicios profesionales y de apoyo a la gestión, o para la ejecución de trabajos artísticos que sólo puedan encomendarse a determinadas personas naturales;"},"Inversión",45]
["114-2019",2019,"FDLBU-CD-083-2019","Contratos de prestación de servicios profesionales y de apoyo a la gestión","Contratación directa","Prestación de servicios profesionales y de apoyo a la gestión, o para la ejecución de trabajos artísticos que sólo puedan encomendarse a determinadas personas naturales;","PRESTAR SERVICIOS PROFESIONALES PARA APOYAR TÉCNICAMENTE LAS DISTINTAS ETAPAS DE LOS PROCESOS DE COMPETENCIA DE LA ALCALDÍA LOCAL PARA LA DEPURACIÓN DE ACTUACIONES ADMINISTRATIVAS","Inversión",45,{"$f":"IF(ISERROR(VLOOKUP(I127,Eje_Pilar!$C$2:$E$47,2,FALSE)),\" \",VLOOKUP(I127,Eje_Pilar!$C$2:$E$47,2,FALSE))","v":"Gobernanza e influencia local, regional e internacional"},{"$f":"IF(ISERROR(VLOOKUP(I127,Eje_Pilar!$C$2:$E$47,3,FALSE)),\" \",VLOOKUP(I127,Eje_Pilar!$C$2:$E$47,3,FALSE))","v":"Eje Transversal 4 Gobierno Legitimo, Fortalecimiento Local y Eficiencia"},1559,79907951,"JUAN CARLOS ROJAS ROJAS",20400000,null,null,null,0,20400000,14790000,"2019-02-25","2019-03-05","2019-07-30",120,0,null,null,null,"x",null,0.72499999999999998,null,{"$f":"IF(SUMPRODUCT((A$14:A127=A127)*(B$14:B127=B127)*(C$14:C127=C127))>1,0,1)","v":1},"Contratos de prestación de servicios profesionales y de apoyo a la gestión","Contratación directa",{"$f":"IFERROR(VLOOKUP(F127,Tipo!$C$12:$C$27,1,FALSE),\"NO\")","v":"Prestación de servicios profesionales y de apoyo a la gestión, o para la ejecución de trabajos artísticos que sólo puedan encomendarse a determinadas personas naturales;"},"Inversión",45]
["115-2019",2019,"FDLBU-CD-084-2019","Contratos de prestación de servicios profesionales y de apoyo a la gestión","Contratación directa","Prestación de servicios profesionales y de apoyo a la gestión, o para la ejecución de trabajos artísticos que sólo puedan encomendarse a determinadas personas naturales;","PRESTAR SERVICIOS PROFESIONALES EN EL  AREA DE GESTION DEL DESARROLLO LOCAL EN LA OFICINA DE PARTICIPACION PARA APOYAR EN LA PROMOCIÓN, ACOMPAÑAMIENTO, COORDINACIÓN Y ATENCIÓN DE LAS INSTANCIAS DE COORDINACIÓN INTERINSTITUCIONALES Y LAS INSTANCIAS DE PARTICIPACIÓN LOCALES, ASÍ COMO LOS PROCESOS COMUNITARIOS EN LA LOCALIDAD","Inversión",45,{"$f":"IF(ISERROR(VLOOKUP(I128,Eje_Pilar!$C$2:$E$47,2,FALSE)),\" \",VLOOKUP(I128,Eje_Pilar!$C$2:$E$47,2,FALSE))","v":"Gobernanza e influencia local, regional e internacional"},{"$f":"IF(ISERROR(VLOOKUP(I128,Eje_Pilar!$C$2:$E$47,3,FALSE)),\" \",VLOOKUP(I128,Eje_Pilar!$C$2:$E$47,3,FALSE))","v":"Eje Transversal 4 Gobierno Legitimo, Fortalecimiento Local y Eficiencia"},1562,1012346785,"JHON ESTIVEN MARIN RODRIGUEZ",61200000,null,null,null,0,61200000,46750000,"2019-02-21","2019-02-26","2019-12-31",360,0,null,null,null,"x",null,0.76388888888888884,null,{"$f":"IF(SUMPRODUCT((A$14:A128=A128)*(B$14:B128=B128)*(C$14:C128=C128))>1,0,1)","v":1},"Contratos de prestación de servicios profesionales y de apoyo a la gestión","Contratación directa",{"$f":"IFERROR(VLOOKUP(F128,Tipo!$C$12:$C$27,1,FALSE),\"NO\")","v":"Prestación de servicios profesionales y de apoyo a la gestión, o para la ejecución de trabajos artísticos que sólo puedan encomendarse a determinadas personas naturales;"},"Inversión",45]
["116-2019",2019,"FDLBU-CD-081-2019","Contratos de prestación de servicios profesionales y de apoyo a la gestión","Contratación directa","Prestación de servicios profesionales y de apoyo a la gestión, o para la ejecución de trabajos artísticos que sólo puedan encomendarse a determinadas personas naturales;","PRESTAR LOS SERVICIOS PROFESIONALES EN LA OFICINA DE INFRAESTRUCTURA DE LA ALCALDÍA LOCAL DE BARRIOS UNIDOS, APOYANDO EN TEMAS ADMINISTRATIVOS QUE CONTRIBUYAN A LA GESTIÓN Y EL LOGRO DE LAS METAS DEL PLAN DE DESARROLLO LOCAL","Inversión",18,{"$f":"IF(ISERROR(VLOOKUP(I129,Eje_Pilar!$C$2:$E$47,2,FALSE)),\" \",VLOOKUP(I129,Eje_Pilar!$C$2:$E$47,2,FALSE))","v":"Mejor movilidad para todos"},{"$f":"IF(ISERROR(VLOOKUP(I129,Eje_Pilar!$C$2:$E$47,3,FALSE)),\" \",VLOOKUP(I129,Eje_Pilar!$C$2:$E$47,3,FALSE))","v":"Pilar 2 Democracía Urbana"},1561,1014195591,"LEIDY JOHANA MOLANO LOZADA ",30000000,null,null,2,15000000,45000000,45000000,"2019-02-25","2019-02-25","2019-11-27",180,90,null,null,null,"x",null,1,null,{"$f":"IF(SUMPRODUCT((A$14:A129=A129)*(B$14:B129=B129)*(C$14:C129=C129))>1,0,1)","v":1},"Contratos de prestación de servicios profesionales y de apoyo a la gestión","Contratación directa",{"$f":"IFERROR(VLOOKUP(F129,Tipo!$C$12:$C$27,1,FALSE),\"NO\")","v":"Prestación de servicios profesionales y de apoyo a la gestión, o para la ejecución de trabajos artísticos que sólo puedan encomendarse a determinadas personas naturales;"},"Inversión",18]
["117-2019",2019,"FDLBU-CD-086-2019","Contratos de prestación de servicios profesionales y de apoyo a la gestión","Contratación directa","Prestación de servicios profesionales y de apoyo a la gestión, o para la ejecución de trabajos artísticos que sólo puedan encomendarse a determinadas personas naturales;","APOYAR JURÍDICAMENTE LA EJECUCIÓN DE LAS ACCIONES REQUERIDAS PARA EL APOYO EN OPERATIVOS Y DEPURACIÓN DE LAS ACTUACIONES ADMINISTRATIVAS QUE CURSAN EN LA ALCALDÍA LOCAL EN CUANTO A LA INSPECCIÓN, VIGILANCIA Y CONTROL EN LOS ESTABLECIMIENTOS DE COMERCIO Y MEDIDAS A IMPONER POR INFRACCIÓN DE LAS NORMAS PARA SU FUNCIONAMIENTO","Inversión",45,{"$f":"IF(ISERROR(VLOOKUP(I130,Eje_Pilar!$C$2:$E$47,2,FALSE)),\" \",VLOOKUP(I130,Eje_Pilar!$C$2:$E$47,2,FALSE))","v":"Gobernanza e influencia local, regional e internacional"},{"$f":"IF(ISERROR(VLOOKUP(I130,Eje_Pilar!$C$2:$E$47,3,FALSE)),\" \",VLOOKUP(I130,Eje_Pilar!$C$2:$E$47,3,FALSE))","v":"Eje Transversal 4 Gobierno Legitimo, Fortalecimiento Local y Eficiencia"},1559,79914846,"JUAN PABLO BARRIOS ROMERO",19500000,null,null,null,9750000,29250000,29250000,"2019-02-27","2019-02-28","2019-07-12",90,0,null,null,null,"x",null,1,null,{"$f":"IF(SUMPRODUCT((A$14:A130=A130)*(B$14:B130=B130)*(C$14:C130=C130))>1,0,1)","v":1},"Contratos de prestación de servicios profesionales y de apoyo a la gestión","Contratación directa",{"$f":"IFERROR(VLOOKUP(F130,Tipo!$C$12:$C$27,1,FALSE),\"NO\")","v":"Prestación de servicios profesionales y de apoyo a la gestión, o para la ejecución de trabajos artísticos que sólo puedan encomendarse a determinadas personas naturales;"},"Inversión",45]
["118-2019",2019,"FDLBU-CD-87-2019","Contratos de prestación de servicios profesionales y de apoyo a la gestión","Contratación directa","Prestación de servicios profesionales y de apoyo a la gestión, o para la ejecución de trabajos artísticos que sólo puedan encomendarse a determinadas personas naturales;","PRESTAR SERVICIOS DE APOYO EN LA OFICINA DE ATENCION A LA CIUDADANIA DE LA ALCALDIA LOCAL DE BARRIOS UNIDOS, EN LA ALIMENTACION Y ACTUALIZACION DIARIA DE LA BASE DE DATOS DISEÑADA PARA EL SEGUIMIENTO DE LAS SOLICITUDES, REQUERIMIENTOS Y DERECHOS DE PETICION RADICADOS POR PARTE DE LA COMUNIDAD Y LAS DEMAS ACTIVIDADES PROPIAS EN EL TEMA QUE ASI SE REQUIERAN","Inversión",45,{"$f":"IF(ISERROR(VLOOKUP(I131,Eje_Pilar!$C$2:$E$47,2,FALSE)),\" \",VLOOKUP(I131,Eje_Pilar!$C$2:$E$47,2,FALSE))","v":"Gobernanza e influencia local, regional e internacional"},{"$f":"IF(ISERROR(VLOOKUP(I131,Eje_Pilar!$C$2:$E$47,3,FALSE)),\" \",VLOOKUP(I131,Eje_Pilar!$C$2:$E$47,3,FALSE))","v":"Eje Transversal 4 Gobierno Legitimo, Fortalecimiento Local y Eficiencia"},1559,1010127986,"ANDRES FELIPE LOPEZ GUEVARA",9440520,1,-8916047,null,0,524473,524473,"2019-03-14","2019-03-22","2019-06-28",180,0,null,null,null,"x",null,1,null,{"$f":"IF(SUMPRODUCT((A$14:A131=A131)*(B$14:B131=B131)*(C$14:C131=C131))>1,0,1)","v":1},"Contratos de prestación de servicios profesionales y de apoyo a la gestión","Contratación directa",{"$f":"IFERROR(VLOOKUP(F131,Tipo!$C$12:$C$27,1,FALSE),\"NO\")","v":"Prestación de servicios profesionales y de apoyo a la gestión, o para la ejecución de trabajos artísticos que sólo puedan encomendarse a determinadas personas naturales;"},"Inversión",45]
["119-2019",2019,"FDLBU-088-2019","Contratos de prestación de servicios profesionales y de apoyo a la gestión","Contratación directa","Prestación de servicios profesionales y de apoyo a la gestión, o para la ejecución de trabajos artísticos que sólo puedan encomendarse a determinadas personas naturales;","PRESTAR SERVICIOS ASISTENCIALES EN EL ÁREA DE GESTIÓN DEL DESARROLLO LOCAL EN EL ÁREA DE PLANEACIÓN, PARA LOGRAR EL CUMPLIMIENTO DE LAS METAS DEL PLAN DE DESARROLLO LOCAL DE LA VIGENCIA","Inversión",45,{"$f":"IF(ISERROR(VLOOKUP(I132,Eje_Pilar!$C$2:$E$47,2,FALSE)),\" \",VLOOKUP(I132,Eje_Pilar!$C$2:$E$47,2,FALSE))","v":"Gobernanza e influencia local, regional e internacional"},{"$f":"IF(ISERROR(VLOOKUP(I132,Eje_Pilar!$C$2:$E$47,3,FALSE)),\" \",VLOOKUP(I132,Eje_Pilar!$C$2:$E$47,3,FALSE))","v":"Eje Transversal 4 Gobierno Legitimo, Fortalecimiento Local y Eficiencia"},1559,11408092,"ALBERTO ROLDAN ROJAS",19875000,null,null,2,9937500,29812500,29481250,"2019-01-28","2019-03-05","2019-12-03",180,90,null,null,null,"x",null,0.98888888888888893,null,{"$f":"IF(SUMPRODUCT((A$14:A132=A132)*(B$14:B132=B132)*(C$14:C132=C132))>1,0,1)","v":1},"Contratos de prestación de servicios profesionales y de apoyo a la gestión","Contratación directa",{"$f":"IFERROR(VLOOKUP(F132,Tipo!$C$12:$C$27,1,FALSE),\"NO\")","v":"Prestación de servicios profesionales y de apoyo a la gestión, o para la ejecución de trabajos artísticos que sólo puedan encomendarse a determinadas personas naturales;"},"Inversión",45]
["120-2019",2019,"FDLBU-CD-062-2019","Contratos de prestación de servicios profesionales y de apoyo a la gestión","Contratación directa","Prestación de servicios profesionales y de apoyo a la gestión, o para la ejecución de trabajos artísticos que sólo puedan encomendarse a determinadas personas naturales;","PRESTAR SERVICIOS DE APOYO EN LAS ACTIVIDADES DE SEGURIDAD, CONVIVENCIA CIUDADANA Y RECUPERACION DEL ESPACIO PUBLICO PARA EL LOGRO DE LAS METAS DE GESTION DE LA VIGENCIA”","Inversión",19,{"$f":"IF(ISERROR(VLOOKUP(I133,Eje_Pilar!$C$2:$E$47,2,FALSE)),\" \",VLOOKUP(I133,Eje_Pilar!$C$2:$E$47,2,FALSE))","v":"Seguridad y convivencia para todos"},{"$f":"IF(ISERROR(VLOOKUP(I133,Eje_Pilar!$C$2:$E$47,3,FALSE)),\" \",VLOOKUP(I133,Eje_Pilar!$C$2:$E$47,3,FALSE))","v":"Pilar 3 Construcción de Comunidad y Cultura Ciudadana"},1563,1088264710,"LUZ ESTRELLA ORTIZ CARDONA ",15300000,null,null,null,0,15300000,13260000,"2019-03-08","2019-03-08","2019-12-06",270,0,null,null,null,"x",null,0.8666666666666667,null,{"$f":"IF(SUMPRODUCT((A$14:A133=A133)*(B$14:B133=B133)*(C$14:C133=C133))>1,0,1)","v":1},"Contratos de prestación de servicios profesionales y de apoyo a la gestión","Contratación directa",{"$f":"IFERROR(VLOOKUP(F133,Tipo!$C$12:$C$27,1,FALSE),\"NO\")","v":"Prestación de servicios profesionales y de apoyo a la gestión, o para la ejecución de trabajos artísticos que sólo puedan encomendarse a determinadas personas naturales;"},"Inversión",19]
["121-2019",2019,"FDLBU-091-2019","Contratos de prestación de servicios profesionales y de apoyo a la gestión","Contratación directa","Prestación de servicios profesionales y de apoyo a la gestión, o para la ejecución de trabajos artísticos que sólo puedan encomendarse a determinadas personas naturales;","PRESTAR SERVICIOS DE APOYO AL ÁREA DE GESTIÓN DEL DESARROLLO ADMINISTRATIVA Y FINANCIERA EN LAS LABORES QUE REQUIERA LA JUNTA ADMINISTRADORA LOCAL DE BARRIOS UNIDOS COMO GRABACIÓN DE SESIONES, TRANSCRIPCIÓN DE ACTAS Y ATENCIÓN A LA CIUDADANÍA","Inversión",45,{"$f":"IF(ISERROR(VLOOKUP(I134,Eje_Pilar!$C$2:$E$47,2,FALSE)),\" \",VLOOKUP(I134,Eje_Pilar!$C$2:$E$47,2,FALSE))","v":"Gobernanza e influencia local, regional e internacional"},{"$f":"IF(ISERROR(VLOOKUP(I134,Eje_Pilar!$C$2:$E$47,3,FALSE)),\" \",VLOOKUP(I134,Eje_Pilar!$C$2:$E$47,3,FALSE))","v":"Eje Transversal 4 Gobierno Legitimo, Fortalecimiento Local y Eficiencia"},1559,1020778464,"MARIA CAMILA RODRIGUEZ CASTRO",16500000,null,null,2,7700000,24200000,17893333,"2019-03-07","2019-03-08","2020-02-27",225,105,null,null,"x",null,null,0.73939392561983475,null,{"$f":"IF(SUMPRODUCT((A$14:A134=A134)*(B$14:B134=B134)*(C$14:C134=C134))>1,0,1)","v":1},"Contratos de prestación de servicios profesionales y de apoyo a la gestión","Contratación directa",{"$f":"IFERROR(VLOOKUP(F134,Tipo!$C$12:$C$27,1,FALSE),\"NO\")","v":"Prestación de servicios profesionales y de apoyo a la gestión, o para la ejecución de trabajos artísticos que sólo puedan encomendarse a determinadas personas naturales;"},"Inversión",45]
["122-2019",2019,"FDLBU-092-2019","Contratos de prestación de servicios profesionales y de apoyo a la gestión","Contratación directa","Prestación de servicios profesionales y de apoyo a la gestión, o para la ejecución de trabajos artísticos que sólo puedan encomendarse a determinadas personas naturales;","PRESTAR LOS SERVICIOS PROFESIONALES, PARA REALIZAR, LAS ACCIONES PEDAGÓGICAS PREVENTIVAS Y DE SENSIBILIZACIÓN PARA EL ACATAMIENTO VOLUNTARIO DE LA NORMATIVA EN MATERIA DEL RÉGIMEN URBANÍSTICO, LEGAL FUNCIONAMIENTO DE LOS ESTABLECIMIENTOS COMERCIALES, USO DEL ESPACIO PÚBLICO Y MEDIO AMBIENTE EN EL ÁREA DE GESTIÓN POLICIVA JURÍDICA DE LA ALCALDÍA LOCAL DE BARRIOS UNIDOS Y LAS RESPUESTAS A PETICIONES REPRESADAS SIN RESPUESTA EN LAS ÁREAS PRIORIZADAS POR EL ALCALDE LOCAL","Inversión",45,{"$f":"IF(ISERROR(VLOOKUP(I135,Eje_Pilar!$C$2:$E$47,2,FALSE)),\" \",VLOOKUP(I135,Eje_Pilar!$C$2:$E$47,2,FALSE))","v":"Gobernanza e influencia local, regional e internacional"},{"$f":"IF(ISERROR(VLOOKUP(I135,Eje_Pilar!$C$2:$E$47,3,FALSE)),\" \",VLOOKUP(I135,Eje_Pilar!$C$2:$E$47,3,FALSE))","v":"Eje Transversal 4 Gobierno Legitimo, Fortalecimiento Local y Eficiencia"},1559,80087618,"JOSE ALEJANDRO GARCIA GARCIA ",30000000,null,null,null,0,30000000,30000000,"2019-03-06","2019-03-08","2019-09-06",180,0,null,null,null,"x",null,1,null,{"$f":"IF(SUMPRODUCT((A$14:A135=A135)*(B$14:B135=B135)*(C$14:C135=C135))>1,0,1)","v":1},"Contratos de prestación de servicios profesionales y de apoyo a la gestión","Contratación directa",{"$f":"IFERROR(VLOOKUP(F135,Tipo!$C$12:$C$27,1,FALSE),\"NO\")","v":"Prestación de servicios profesionales y de apoyo a la gestión, o para la ejecución de trabajos artísticos que sólo puedan encomendarse a determinadas personas naturales;"},"Inversión",45]
["123-2019",2019,"FDLBU-CD-062-2019","Contratos de prestación de servicios profesionales y de apoyo a la gestión","Contratación directa","Prestación de servicios profesionales y de apoyo a la gestión, o para la ejecución de trabajos artísticos que sólo puedan encomendarse a determinadas personas naturales;","PRESTAR SERVICIOS DE APOYO EN LAS ACTIVIDADES DE SEGURIDAD, CONVIVENCIA CIUDADANA Y RECUPERACIÓN DEL ESPACIO PÚBLICO PARA EL LOGRO DE LAS METAS DE GESTIÓN DE LA VIGENCIA","Inversión",19,{"$f":"IF(ISERROR(VLOOKUP(I136,Eje_Pilar!$C$2:$E$47,2,FALSE)),\" \",VLOOKUP(I136,Eje_Pilar!$C$2:$E$47,2,FALSE))","v":"Seguridad y convivencia para todos"},{"$f":"IF(ISERROR(VLOOKUP(I136,Eje_Pilar!$C$2:$E$47,3,FALSE)),\" \",VLOOKUP(I136,Eje_Pilar!$C$2:$E$47,3,FALSE))","v":"Pilar 3 Construcción de Comunidad y Cultura Ciudadana"},1563,80193189,"SERGIO DANIEL TRIANA POSADA ",15300000,null,null,null,0,15300000,15300000,"2019-03-08","2019-03-13","2019-12-11",270,0,null,null,null,"x",null,1,null,{"$f":"IF(SUMPRODUCT((A$14:A136=A136)*(B$14:B136=B136)*(C$14:C136=C136))>1,0,1)","v":1},"Contratos de prestación de servicios profesionales y de apoyo a la gestión","Contratación directa",{"$f":"IFERROR(VLOOKUP(F136,Tipo!$C$12:$C$27,1,FALSE),\"NO\")","v":"Prestación de servicios profesionales y de apoyo a la gestión, o para la ejecución de trabajos artísticos que sólo puedan encomendarse a determinadas personas naturales;"},"Inversión",19]
["124-2019",2019,"FDLBU-CD-090-2019","Contratos de prestación de servicios profesionales y de apoyo a la gestión","Contratación directa","Prestación de servicios profesionales y de apoyo a la gestión, o para la ejecución de trabajos artísticos que sólo puedan encomendarse a determinadas personas naturales;","PRESTAR SERVICIOS PROFESIONALES AL DESPACHO PARA EL DISEÑO Y PRODUCCIÓN DE HERRAMIENTAS Y APLICACIONES QUE CONTRIBUYAN A BRINDAR INFORMACIÓN CLARA Y OPORTUNA A LA COMUNIDAD DE LA LOCALIDAD DE BARRIOS UNIDOS","Inversión",45,{"$f":"IF(ISERROR(VLOOKUP(I137,Eje_Pilar!$C$2:$E$47,2,FALSE)),\" \",VLOOKUP(I137,Eje_Pilar!$C$2:$E$47,2,FALSE))","v":"Gobernanza e influencia local, regional e internacional"},{"$f":"IF(ISERROR(VLOOKUP(I137,Eje_Pilar!$C$2:$E$47,3,FALSE)),\" \",VLOOKUP(I137,Eje_Pilar!$C$2:$E$47,3,FALSE))","v":"Eje Transversal 4 Gobierno Legitimo, Fortalecimiento Local y Eficiencia"},1562,1019029838,"JORGE EDUARDO SEBASTIAN VEGA HENAO",42000000,null,null,null,0,42000000,15400000,"2019-03-14","2019-03-15","2020-01-14",210,0,null,null,null,"x","x",0.36666666666666664,null,{"$f":"IF(SUMPRODUCT((A$14:A137=A137)*(B$14:B137=B137)*(C$14:C137=C137))>1,0,1)","v":1},"Contratos de prestación de servicios profesionales y de apoyo a la gestión","Contratación directa",{"$f":"IFERROR(VLOOKUP(F137,Tipo!$C$12:$C$27,1,FALSE),\"NO\")","v":"Prestación de servicios profesionales y de apoyo a la gestión, o para la ejecución de trabajos artísticos que sólo puedan encomendarse a determinadas personas naturales;"},"Inversión",45]
["125-2019",2019,"FDLBU-MC-089-2019","Suministro","Contratación mínima cuantia","No aplica","CONTRATAR EL SUMINISTRO DE COMBUSTIBLE PARA LOS VEHÍCULOS QUE CONFORMAN EL PARQUE AUTOMOTOR DE PROPIEDAD Y/O AL SERVICIO DEL FONDO DE DESARROLLO LOCAL DE BARRIOS UNIDOS","Funcionamiento",null,{"$f":"IF(ISERROR(VLOOKUP(I138,Eje_Pilar!$C$2:$E$47,2,FALSE)),\" \",VLOOKUP(I138,Eje_Pilar!$C$2:$E$47,2,FALSE))","v":" "},{"$f":"IF(ISERROR(VLOOKUP(I138,Eje_Pilar!$C$2:$E$47,3,FALSE)),\" \",VLOOKUP(I138,Eje_Pilar!$C$2:$E$47,3,FALSE))","v":" "},null,"830.513.729-3","COMBUSTIBLES DE COLOMBIA S.A.",17000000,null,null,1,8500000,25500000,16653525,"2019-03-15","2019-03-18","2020-03-31",285,90,null,null,"x",null,null,0.65307941176470585,null,{"$f":"IF(SUMPRODUCT((A$14:A138=A138)*(B$14:B138=B138)*(C$14:C138=C138))>1,0,1)","v":1},"Suministro","Contratación mínima cuantia",{"$f":"IFERROR(VLOOKUP(F138,Tipo!$C$12:$C$27,1,FALSE),\"NO\")","v":"NO"},"Funcionamiento","NO"]
["126-2019",2019,"FDLBU-CD-096-2019","Contratos de prestación de servicios profesionales y de apoyo a la gestión","Contratación directa","Prestación de servicios profesionales y de apoyo a la gestión, o para la ejecución de trabajos artísticos que sólo puedan encomendarse a determinadas personas naturales;","APOYAR EN LA DEPURACION DE LAS BASES DE DATOS DE TODOS LOS DERECHOS DE PETICION QUE ACTUALMENTE TIENEN ABIERTOS LAS INPECCIONES DE POLICIA DE LA ALCALDIA LOCAL DE BARRIOS Y LOS DEMAS APLICATIVOS INSTITUCIONALES QUE ASI SE REQUIERAN, REALIZANDO EL TRAMITE Y LAS ACTIVIDADES NECESARIAS PARA EL CIERRE DEFINITO DE LOS MISMOS, ADEMAS DE BRINDAR UNA RESPUESTA OPORTUNA A LOS QUE RADICAN DIARIAMENTE TENIENDO EN CUENTA LOS LINEAMIENTOS ESTABLECIDOS POR LA SECRETARIA DISTRITAL DE GOBIERNO","Inversión",45,{"$f":"IF(ISERROR(VLOOKUP(I139,Eje_Pilar!$C$2:$E$47,2,FALSE)),\" \",VLOOKUP(I139,Eje_Pilar!$C$2:$E$47,2,FALSE))","v":"Gobernanza e influencia local, regional e internacional"},{"$f":"IF(ISERROR(VLOOKUP(I139,Eje_Pilar!$C$2:$E$47,3,FALSE)),\" \",VLOOKUP(I139,Eje_Pilar!$C$2:$E$47,3,FALSE))","v":"Eje Transversal 4 Gobierno Legitimo, Fortalecimiento Local y Eficiencia"},1559,1015427264,"PAULA LORENA LEGUIZAMÓN MELO",10800000,null,null,2,5400000,16200000,14640000,"2019-03-27","2019-03-28","2019-12-27",180,90,null,null,null,"x",null,0.90370370370370368,null,{"$f":"IF(SUMPRODUCT((A$14:A139=A139)*(B$14:B139=B139)*(C$14:C139=C139))>1,0,1)","v":1},"Contratos de prestación de servicios profesionales y de apoyo a la gestión","Contratación directa",{"$f":"IFERROR(VLOOKUP(F139,Tipo!$C$12:$C$27,1,FALSE),\"NO\")","v":"Prestación de servicios profesionales y de apoyo a la gestión, o para la ejecución de trabajos artísticos que sólo puedan encomendarse a determinadas personas naturales;"},"Inversión",45]
["127-2019",2019,"FDLBU-CD-097-2019","Contratos de prestación de servicios profesionales y de apoyo a la gestión","Contratación directa","Prestación de servicios profesionales y de apoyo a la gestión, o para la ejecución de trabajos artísticos que sólo puedan encomendarse a determinadas personas naturales;","PRESTAR SERVICIOS PROFESIONALES PARA APOYAR EL ÁREA DE GESTIÓN DEL DESARROLLO ADMINISTRATIVA Y FINANCIARA Y APOYAR EN LA SUPERVISIÓN DE CONTRATOS EN LOS ASUNTOS RELATIVOS A LA PLANEACIÓN LOCAL DE PROYECTOS DE INFRAESTRUCTURA DE ACUERDO A LAS LÍNEAS DE INVERSIÓN VIGENTES","Inversión",18,{"$f":"IF(ISERROR(VLOOKUP(I140,Eje_Pilar!$C$2:$E$47,2,FALSE)),\" \",VLOOKUP(I140,Eje_Pilar!$C$2:$E$47,2,FALSE))","v":"Mejor movilidad para todos"},{"$f":"IF(ISERROR(VLOOKUP(I140,Eje_Pilar!$C$2:$E$47,3,FALSE)),\" \",VLOOKUP(I140,Eje_Pilar!$C$2:$E$47,3,FALSE))","v":"Pilar 2 Democracía Urbana"},1561,52007470,"ADRIANA ANGÉLICA LEÓN BLANCO",44550000,null,null,1,22475000,67025000,39435000,"2019-04-02","2019-04-02","2020-05-15",270,135,null,null,"x",null,null,0.58836255128683324,null,{"$f":"IF(SUMPRODUCT((A$14:A140=A140)*(B$14:B140=B140)*(C$14:C140=C140))>1,0,1)","v":1},"Contratos de prestación de servicios profesionales y de apoyo a la gestión","Contratación directa",{"$f":"IFERROR(VLOOKUP(F140,Tipo!$C$12:$C$27,1,FALSE),\"NO\")","v":"Prestación de servicios profesionales y de apoyo a la gestión, o para la ejecución de trabajos artísticos que sólo puedan encomendarse a determinadas personas naturales;"},"Inversión",18]
["128-2019",2019,"FDLBU-CD-098-2019","Contratos de prestación de servicios profesionales y de apoyo a la gestión","Contratación directa","Prestación de servicios profesionales y de apoyo a la gestión, o para la ejecución de trabajos artísticos que sólo puedan encomendarse a determinadas personas naturales;","APOYAR TÉCNICAMENTE LAS DISTINTAS ETAPAS DE LOS PROCESOS DE COMPETENCIA DE LAS INSPECCIONES DE POLICÍA DE LA LOCALIDAD, SEGÚN REPARTO","Inversión",45,{"$f":"IF(ISERROR(VLOOKUP(I141,Eje_Pilar!$C$2:$E$47,2,FALSE)),\" \",VLOOKUP(I141,Eje_Pilar!$C$2:$E$47,2,FALSE))","v":"Gobernanza e influencia local, regional e internacional"},{"$f":"IF(ISERROR(VLOOKUP(I141,Eje_Pilar!$C$2:$E$47,3,FALSE)),\" \",VLOOKUP(I141,Eje_Pilar!$C$2:$E$47,3,FALSE))","v":"Eje Transversal 4 Gobierno Legitimo, Fortalecimiento Local y Eficiencia"},1559,19221558,"GUSTAVO ALCIDES PINILLA CORTES",32298000,null,null,1,5383000,37681000,37322133,"2019-03-29","2019-04-03","2019-11-02",180,30,null,null,null,"x",null,0.99047618162999918,null,{"$f":"IF(SUMPRODUCT((A$14:A141=A141)*(B$14:B141=B141)*(C$14:C141=C141))>1,0,1)","v":1},"Contratos de prestación de servicios profesionales y de apoyo a la gestión","Contratación directa",{"$f":"IFERROR(VLOOKUP(F141,Tipo!$C$12:$C$27,1,FALSE),\"NO\")","v":"Prestación de servicios profesionales y de apoyo a la gestión, o para la ejecución de trabajos artísticos que sólo puedan encomendarse a determinadas personas naturales;"},"Inversión",45]
["129-2019",2019,"FDLBU-CD-100-2019","Contratos de prestación de servicios profesionales y de apoyo a la gestión","Contratación directa","Prestación de servicios profesionales y de apoyo a la gestión, o para la ejecución de trabajos artísticos que sólo puedan encomendarse a determinadas personas naturales;","PRESTAR SERVICIOS DE APOYO EN LAS ACTIVIDADES DE SEGURIDAD, CONVIVENCIA CIUDADANA Y RECUPERACION DEL ESPACIO PUBLICO PARA EL LOGRO DE LAS METAS DE GESTION DE LA VIGENCIA","Inversión",19,{"$f":"IF(ISERROR(VLOOKUP(I142,Eje_Pilar!$C$2:$E$47,2,FALSE)),\" \",VLOOKUP(I142,Eje_Pilar!$C$2:$E$47,2,FALSE))","v":"Seguridad y convivencia para todos"},{"$f":"IF(ISERROR(VLOOKUP(I142,Eje_Pilar!$C$2:$E$47,3,FALSE)),\" \",VLOOKUP(I142,Eje_Pilar!$C$2:$E$47,3,FALSE))","v":"Pilar 3 Construcción de Comunidad y Cultura Ciudadana"},1563,"53.108.007\n \n1.088.264.000","TAMIA PALOMA RIBADENEIRA MIÑO \nCEDIO A \nLUZ ESTRELLA ORTIZ CARDONA",15300000,null,null,1,1700000,{"$f":"+O142+Q142+S142","v":17000000},13430000,"2019-04-03","2019-04-04","2020-01-31",270,30,null,null,"x",null,null,0.79,null,{"$f":"IF(SUMPRODUCT((A$14:A142=A142)*(B$14:B142=B142)*(C$14:C142=C142))>1,0,1)","v":1},"Contratos de prestación de servicios profesionales y de apoyo a la gestión","Contratación directa",{"$f":"IFERROR(VLOOKUP(F142,Tipo!$C$12:$C$27,1,FALSE),\"NO\")","v":"Prestación de servicios profesionales y de apoyo a la gestión, o para la ejecución de trabajos artísticos que sólo puedan encomendarse a determinadas personas naturales;"},"Inversión",19]
["130-2019",2019,"FDLBU-MC-099-2019","Contratos de prestación de servicios","Contratación mínima cuantia","No aplica","PRESTAR LOS SERVICIOS DE APOYO PARA LA PREPARACIÓN Y REALIZACIÓN DE LA RENDICIÓN DE CUENTAS VIGENCIA 2018 DE LA ALCALDIA LOCAL DE BARRIOS UNIDOS","Inversión",45,{"$f":"IF(ISERROR(VLOOKUP(I143,Eje_Pilar!$C$2:$E$47,2,FALSE)),\" \",VLOOKUP(I143,Eje_Pilar!$C$2:$E$47,2,FALSE))","v":"Gobernanza e influencia local, regional e internacional"},{"$f":"IF(ISERROR(VLOOKUP(I143,Eje_Pilar!$C$2:$E$47,3,FALSE)),\" \",VLOOKUP(I143,Eje_Pilar!$C$2:$E$47,3,FALSE))","v":"Eje Transversal 4 Gobierno Legitimo, Fortalecimiento Local y Eficiencia"},1562,9005029391,"CORPACTO SAS",11118632,null,null,null,0,11118632,11118632,"2019-04-05","2019-04-05","2019-05-04",30,0,null,null,null,"x",null,1,null,{"$f":"IF(SUMPRODUCT((A$14:A143=A143)*(B$14:B143=B143)*(C$14:C143=C143))>1,0,1)","v":1},"Contratos de prestación de servicios","Contratación mínima cuantia",{"$f":"IFERROR(VLOOKUP(F143,Tipo!$C$12:$C$27,1,FALSE),\"NO\")","v":"NO"},"Inversión",45]
["131-2019",2019,"FDLBU-MC-095-2019","Contratos de prestación de servicios","Contratación mínima cuantia","No aplica","CONTRATAR EL SERVICIO DE MANTENIMIENTO PREVENTIVO Y CORRECTIVO, INCLUIDA MANO DE OBRA Y SUMINISTRO DE REPUESTOS E INSUMOS QUE CUBRAN TODOS LOS ASPECTOS TÉCNICOS, MECÁNICOS Y ELÉCTRICOS, PARA LOS VEHÍCULOS QUE INTEGRAN EL PARQUE AUTOMOTOR DEL FONDO DE DESARROLLO LOCAL DE BARRIOS UNIDOS O A LOS QUE LLEGARE A SER RESPONSABLE EL FONDO DURANTE LA VIGENCIA DEL CONTRATO","Funcionamiento",null,{"$f":"IF(ISERROR(VLOOKUP(I144,Eje_Pilar!$C$2:$E$47,2,FALSE)),\" \",VLOOKUP(I144,Eje_Pilar!$C$2:$E$47,2,FALSE))","v":" "},{"$f":"IF(ISERROR(VLOOKUP(I144,Eje_Pilar!$C$2:$E$47,3,FALSE)),\" \",VLOOKUP(I144,Eje_Pilar!$C$2:$E$47,3,FALSE))","v":" "},null,"860.515.236-2","PRECAR LTDA",20000000,null,null,1,5000000,25000000,14752239,"2019-04-09","2019-04-10","2020-04-10",360,0,null,null,"x",null,null,{"$f":"IF(ISERROR(U144/T144),\"-\",(U144/T144))","v":0.59008956000000001},null,{"$f":"IF(SUMPRODUCT((A$14:A144=A144)*(B$14:B144=B144)*(C$14:C144=C144))>1,0,1)","v":1},"Contratos de prestación de servicios","Contratación mínima cuantia",{"$f":"IFERROR(VLOOKUP(F144,Tipo!$C$12:$C$27,1,FALSE),\"NO\")","v":"NO"},"Funcionamiento","NO"]
["132-2019",2019,"FDLBU-CD-101-2019","Contratos de prestación de servicios profesionales y de apoyo a la gestión","Contratación directa","Prestación de servicios profesionales y de apoyo a la gestión, o para la ejecución de trabajos artísticos que sólo puedan encomendarse a determinadas personas naturales;","APOYAR EN LA DEPURACION DE LAS BASES DE DATOS DE TODOS LOS DERECHOS DE PETICION QUE ACTUALMENTE TIENEN ABIERTOS LAS INPECCIONES DE POLICIA DE LA ALCALDIA LOCAL DE BARRIOS Y LOS DEMAS APLICATIVOS INSTITUCIONALES QUE ASI SE REQUIERAN, REALIZANDO EL TRAMITE Y LAS ACTIVIDADES NECESARIAS PARA EL CIERRE DEFINITO DE LOS MISMOS, ADEMAS DE BRINDAR UNA RESPUESTA OPORTUNA A LOS QUE RADICAN DIARIAMENTE TENIENDO EN CUENTA LOS LINEAMIENTOS ESTABLECIDOS POR LA SECRETARIA DISTRITAL DE GOBIERNO","Inversión",45,{"$f":"IF(ISERROR(VLOOKUP(I145,Eje_Pilar!$C$2:$E$47,2,FALSE)),\" \",VLOOKUP(I145,Eje_Pilar!$C$2:$E$47,2,FALSE))","v":"Gobernanza e influencia local, regional e internacional"},{"$f":"IF(ISERROR(VLOOKUP(I145,Eje_Pilar!$C$2:$E$47,3,FALSE)),\" \",VLOOKUP(I145,Eje_Pilar!$C$2:$E$47,3,FALSE))","v":"Eje Transversal 4 Gobierno Legitimo, Fortalecimiento Local y Eficiencia"},1559,79796296,"EDGAR ANDRES CORTES TORRES",10800000,null,null,1,2700000,13500000,13500000,"2019-04-08","2019-04-15","2019-11-29",180,45,null,null,null,"x",null,1,null,{"$f":"IF(SUMPRODUCT((A$14:A145=A145)*(B$14:B145=B145)*(C$14:C145=C145))>1,0,1)","v":1},"Contratos de prestación de servicios profesionales y de apoyo a la gestión","Contratación directa",{"$f":"IFERROR(VLOOKUP(F145,Tipo!$C$12:$C$27,1,FALSE),\"NO\")","v":"Prestación de servicios profesionales y de apoyo a la gestión, o para la ejecución de trabajos artísticos que sólo puedan encomendarse a determinadas personas naturales;"},"Inversión",45]
["133-2019",2019,"FDLBU-CD-102-2019","Contratos de prestación de servicios profesionales y de apoyo a la gestión","Contratación directa","Prestación de servicios profesionales y de apoyo a la gestión, o para la ejecución de trabajos artísticos que sólo puedan encomendarse a determinadas personas naturales;","APOYAR EN LA DEPURACIÓN DE LAS BASES DE DATOS DE TODOS LOS DERECHOS DE PETICIÓN QUE ACTUALMENTE TIENEN ABIERTOS LAS INSPECCIONES DE POLICÍA DE LA ALCALDÍA LOCAL DE BARRIOS Y LOS DEMÁS APLICATIVOS INSTITUCIONALES QUE ASÍ SE REQUIERAN, REALIZANDO EL TRAMITE Y LAS ACTIVIDADES NECESARIAS PARA EL CIERRE DEFINITIVO DE LOS MISMOS, ADEMAS DE BRINDAR UNA RESPUESTA OPORTUNA A LOS QUE RADICAN DIARIAMENTE TENIENDO EN CUENTA LOS LINEAMIENTOS ESTABLECIDOS POR LA SECRETARIA DISTRITAL DE GOBIERNO","Inversión",45,{"$f":"IF(ISERROR(VLOOKUP(I146,Eje_Pilar!$C$2:$E$47,2,FALSE)),\" \",VLOOKUP(I146,Eje_Pilar!$C$2:$E$47,2,FALSE))","v":"Gobernanza e influencia local, regional e internacional"},{"$f":"IF(ISERROR(VLOOKUP(I146,Eje_Pilar!$C$2:$E$47,3,FALSE)),\" \",VLOOKUP(I146,Eje_Pilar!$C$2:$E$47,3,FALSE))","v":"Eje Transversal 4 Gobierno Legitimo, Fortalecimiento Local y Eficiencia"},1559,"1.019.131.782\n \n1.019.141.002","NEIDER FARID CASTILLO BORJA\nCEDIO A\nKEVIN JULIAN SEPULVEDA MENDIVELSO",10800000,null,null,1,1800000,12600000,12120000,"2019-04-12","2019-04-25","2019-11-24",180,30,null,null,null,"x",null,0.96190476190476193,null,{"$f":"IF(SUMPRODUCT((A$14:A146=A146)*(B$14:B146=B146)*(C$14:C146=C146))>1,0,1)","v":1},"Contratos de prestación de servicios profesionales y de apoyo a la gestión","Contratación directa",{"$f":"IFERROR(VLOOKUP(F146,Tipo!$C$12:$C$27,1,FALSE),\"NO\")","v":"Prestación de servicios profesionales y de apoyo a la gestión, o para la ejecución de trabajos artísticos que sólo puedan encomendarse a determinadas personas naturales;"},"Inversión",45]
["134-2019",2019,"FDLBU-CD-103-2019","Contratos de prestación de servicios profesionales y de apoyo a la gestión","Contratación directa","Prestación de servicios profesionales y de apoyo a la gestión, o para la ejecución de trabajos artísticos que sólo puedan encomendarse a determinadas personas naturales;","APOYAR EN LA DEPURACION DE LAS BASES DE DATOS DE TODOS LOS DERECHOS DE PETICION QUE ACTUALMENTE TIENEN ABIERTOS LAS INPECCIONES DE POLICIA DE LA ALCALDIA LOCAL DE BARRIOS Y LOS DEMAS APLICATIVOS INSTITUCIONALES QUE ASI SE REQUIERAN, REALIZANDO EL TRAMITE Y LAS ACTIVIDADES NECESARIAS PARA EL CIERRE DEFINITO DE LOS MISMOS, ADEMAS DE BRINDAR UNA RESPUESTA OPORTUNA A LOS QUE RADICAN DIARIAMENTE TENIENDO EN CUENTA LOS LINEAMIENTOS ESTABLECIDOS POR LA SECRETARIA DISTRITAL DE GOBIERNO","Inversión",45,{"$f":"IF(ISERROR(VLOOKUP(I147,Eje_Pilar!$C$2:$E$47,2,FALSE)),\" \",VLOOKUP(I147,Eje_Pilar!$C$2:$E$47,2,FALSE))","v":"Gobernanza e influencia local, regional e internacional"},{"$f":"IF(ISERROR(VLOOKUP(I147,Eje_Pilar!$C$2:$E$47,3,FALSE)),\" \",VLOOKUP(I147,Eje_Pilar!$C$2:$E$47,3,FALSE))","v":"Eje Transversal 4 Gobierno Legitimo, Fortalecimiento Local y Eficiencia"},1559,"1.032.459.058\n                                     1.018.464.867                                 ","JAIRO ANDRES BECERRA GONZALEZ\nCEDIO A \nANDREA NATALIA MORENO SALAZAR",10800000,null,null,1,5400000,16200000,11100000,"2019-04-11","2019-04-25","2020-01-24",180,90,null,null,"x",null,null,0.68518518518518523,null,{"$f":"IF(SUMPRODUCT((A$14:A147=A147)*(B$14:B147=B147)*(C$14:C147=C147))>1,0,1)","v":1},"Contratos de prestación de servicios profesionales y de apoyo a la gestión","Contratación directa",{"$f":"IFERROR(VLOOKUP(F147,Tipo!$C$12:$C$27,1,FALSE),\"NO\")","v":"Prestación de servicios profesionales y de apoyo a la gestión, o para la ejecución de trabajos artísticos que sólo puedan encomendarse a determinadas personas naturales;"},"Inversión",45]
["135-2019",2019,"FDLBU-CD-104-2019","Contratos de prestación de servicios profesionales y de apoyo a la gestión","Contratación directa","Prestación de servicios profesionales y de apoyo a la gestión, o para la ejecución de trabajos artísticos que sólo puedan encomendarse a determinadas personas naturales;","APOYAR LAS LABORES DE ENTREGA Y RECIBO DE LAS COMUNICACIONES EMITIDAS O RECIBIDAS POR LAS INSPECCIONES DE POLICÍA DE LA LOCALIDAD","Inversión",45,{"$f":"IF(ISERROR(VLOOKUP(I148,Eje_Pilar!$C$2:$E$47,2,FALSE)),\" \",VLOOKUP(I148,Eje_Pilar!$C$2:$E$47,2,FALSE))","v":"Gobernanza e influencia local, regional e internacional"},{"$f":"IF(ISERROR(VLOOKUP(I148,Eje_Pilar!$C$2:$E$47,3,FALSE)),\" \",VLOOKUP(I148,Eje_Pilar!$C$2:$E$47,3,FALSE))","v":"Eje Transversal 4 Gobierno Legitimo, Fortalecimiento Local y Eficiencia"},1559,52703945,"MONICA ELIZABETH BLANCO",13567488,null,null,1,2261248,15828736,15828736,"2019-04-16","2019-04-22","2019-11-21",180,30,null,null,null,"x",null,1,null,{"$f":"IF(SUMPRODUCT((A$14:A148=A148)*(B$14:B148=B148)*(C$14:C148=C148))>1,0,1)","v":1},"Contratos de prestación de servicios profesionales y de apoyo a la gestión","Contratación directa",{"$f":"IFERROR(VLOOKUP(F148,Tipo!$C$12:$C$27,1,FALSE),\"NO\")","v":"Prestación de servicios profesionales y de apoyo a la gestión, o para la ejecución de trabajos artísticos que sólo puedan encomendarse a determinadas personas naturales;"},"Inversión",45]
["136-2019",2019,"FDLBU-MC-105-2019","Suministro","Contratación mínima cuantia","No aplica","CONTRATAR POR EL SISTEMA DE PRECIOS UNITARIOS FIJOS, EL SUMINISTRO PARA CAJAS DE ARCHIVO, CARPETAS DE CONTRATOS Y GESTIÓN, ELEMENTOS DE PAPELERIA Y ÚTILES DE OFICINA PARA LAS DIFERENTES DEPENDENCIAS DE LA ALCALDÍA LOCAL DE BARRIOS UNIDOS","Funcionamiento",null,{"$f":"IF(ISERROR(VLOOKUP(I149,Eje_Pilar!$C$2:$E$47,2,FALSE)),\" \",VLOOKUP(I149,Eje_Pilar!$C$2:$E$47,2,FALSE))","v":" "},{"$f":"IF(ISERROR(VLOOKUP(I149,Eje_Pilar!$C$2:$E$47,3,FALSE)),\" \",VLOOKUP(I149,Eje_Pilar!$C$2:$E$47,3,FALSE))","v":" "},null,"830.113.914-3 ","INSTITUCIONAL STAR SERVICES LTDA ",23000000,null,null,null,0,23000000,7259081,"2019-05-10","2019-03-20","2020-03-20",300,0,null,null,"x",null,null,0.31561221739130435,null,{"$f":"IF(SUMPRODUCT((A$14:A149=A149)*(B$14:B149=B149)*(C$14:C149=C149))>1,0,1)","v":1},"Suministro","Contratación mínima cuantia",{"$f":"IFERROR(VLOOKUP(F149,Tipo!$C$12:$C$27,1,FALSE),\"NO\")","v":"NO"},"Funcionamiento","NO"]
["137-2019",2019,"FDLBU-CD-108-2019","Contratos de prestación de servicios profesionales y de apoyo a la gestión","Contratación directa","Prestación de servicios profesionales y de apoyo a la gestión, o para la ejecución de trabajos artísticos que sólo puedan encomendarse a determinadas personas naturales;","CONTRATAR SERVICIOS DE PROFESIONALES PARA EL FORTALECIMIENTO A LA GESTIÓN LOCAL DE PROCESOS SEGUIMIENTO A LOS PROYECTOS DE INVERSIÓN, EJECUCIÓN PRESUPUESTAL Y CUMPLIMIENTO DE METAS","Inversión",45,{"$f":"IF(ISERROR(VLOOKUP(I150,Eje_Pilar!$C$2:$E$47,2,FALSE)),\" \",VLOOKUP(I150,Eje_Pilar!$C$2:$E$47,2,FALSE))","v":"Gobernanza e influencia local, regional e internacional"},{"$f":"IF(ISERROR(VLOOKUP(I150,Eje_Pilar!$C$2:$E$47,3,FALSE)),\" \",VLOOKUP(I150,Eje_Pilar!$C$2:$E$47,3,FALSE))","v":"Eje Transversal 4 Gobierno Legitimo, Fortalecimiento Local y Eficiencia"},1559,79939391,"ANDRÉS DÍAZ LEAL",55076000,1,-40126800,null,0,14949200,14949200,"2019-05-16","2019-05-17","2019-07-12",210,0,null,null,null,"x",null,1,null,{"$f":"IF(SUMPRODUCT((A$14:A150=A150)*(B$14:B150=B150)*(C$14:C150=C150))>1,0,1)","v":1},{"$f":"IFERROR(VLOOKUP(D150,tipo,1,FALSE),\"NO\")","v":"Contratos de prestación de servicios profesionales y de apoyo a la gestión"},{"$f":"IFERROR(VLOOKUP(E150,modal,1,FALSE),\"NO\")","v":"Contratación directa"},{"$f":"IFERROR(VLOOKUP(F150,Tipo!$C$12:$C$27,1,FALSE),\"NO\")","v":"Prestación de servicios profesionales y de apoyo a la gestión, o para la ejecución de trabajos artísticos que sólo puedan encomendarse a determinadas personas naturales;"},{"$f":"IFERROR(VLOOKUP(H150,afectacion,1,FALSE),\"NO\")","v":"Inversión"},{"$f":"IFERROR(VLOOKUP(I150,programa,1,FALSE),\"NO\")","v":45}]
["138-2019",2019,"FDLBU-CD-109-2019","Contratos de prestación de servicios profesionales y de apoyo a la gestión","Contratación directa","Prestación de servicios profesionales y de apoyo a la gestión, o para la ejecución de trabajos artísticos que sólo puedan encomendarse a determinadas personas naturales;","PRESTAR LOS SERVICIOS PROFESIONALES PARA APOYAR EL ÁREA DE GESTIÓN DEL DESARROLLO LOCAL Y APOYAR EN LA EJECUCIÓN Y SEGUIMIENTO EN MATERIA DE ESPACIO PÚBLICO-PARQUES DE LA LOCALIDAD, DE ACUERDO A LAS LÍNEAS DE INVERSIÓN VIGENTES EN LO CONCERNIENTE A ESPACIO PÚBLICO","Inversión",17,{"$f":"IF(ISERROR(VLOOKUP(I151,Eje_Pilar!$C$2:$E$47,2,FALSE)),\" \",VLOOKUP(I151,Eje_Pilar!$C$2:$E$47,2,FALSE))","v":"Espacio público, derecho de todos"},{"$f":"IF(ISERROR(VLOOKUP(I151,Eje_Pilar!$C$2:$E$47,3,FALSE)),\" \",VLOOKUP(I151,Eje_Pilar!$C$2:$E$47,3,FALSE))","v":"Pilar 2 Democracía Urbana"},1558,74083047,"WILMAR TINJACA",31885000,null,null,null,0,31885000,28544667,"2019-05-21","2019-05-24","2019-12-22",210,0,null,null,null,"x",null,0.89523810569233186,null,{"$f":"IF(SUMPRODUCT((A$14:A151=A151)*(B$14:B151=B151)*(C$14:C151=C151))>1,0,1)","v":1},"Contratos de prestación de servicios profesionales y de apoyo a la gestión","Contratación directa",{"$f":"IFERROR(VLOOKUP(F151,Tipo!$C$12:$C$27,1,FALSE),\"NO\")","v":"Prestación de servicios profesionales y de apoyo a la gestión, o para la ejecución de trabajos artísticos que sólo puedan encomendarse a determinadas personas naturales;"},"Inversión",17]
["139-2019",2019,"FDLBU-MC-106-2019","Seguros","Contratación mínima cuantia","No aplica","SUMINISTRO DE LA PÓLIZA DE VIDA GRUPO DE EDILES DE LA LOCALIDAD BARRIOS UNIDOS – BOGOTA D.C. CON UNA VIGENCIA NO INFERIOR A 365 DIAS, EXPEDIDAS POR COMPAÑÍAS DE SEGUROS DE VÍDA LEGALMENTE CONSTITUÍDA EN COLOMBIA","Funcionamiento",null,{"$f":"IF(ISERROR(VLOOKUP(I152,Eje_Pilar!$C$2:$E$47,2,FALSE)),\" \",VLOOKUP(I152,Eje_Pilar!$C$2:$E$47,2,FALSE))","v":" "},{"$f":"IF(ISERROR(VLOOKUP(I152,Eje_Pilar!$C$2:$E$47,3,FALSE)),\" \",VLOOKUP(I152,Eje_Pilar!$C$2:$E$47,3,FALSE))","v":" "},null,"860.002.400-2","PREVISORA SEGUROS",7803337,null,null,null,0,7803337,7803337,"2019-05-24","2019-05-28","2020-05-24",360,0,null,null,"x",null,null,1,null,{"$f":"IF(SUMPRODUCT((A$14:A152=A152)*(B$14:B152=B152)*(C$14:C152=C152))>1,0,1)","v":1},"Seguros","Contratación mínima cuantia",{"$f":"IFERROR(VLOOKUP(F152,Tipo!$C$12:$C$27,1,FALSE),\"NO\")","v":"NO"},"Funcionamiento","NO"]
["140-2019",2019,"FDLBU-MC-107-2019","Contratos de prestación de servicios","Contratación mínima cuantia","No aplica","CONTRATAR EL SERVICIO DE MENSAJERÍA ESPECIALIZADA Y/O EXPRESA PARA LA ALCALDÍA LOCAL DE BARRIOS UNIDOS","Funcionamiento",null,{"$f":"IF(ISERROR(VLOOKUP(I153,Eje_Pilar!$C$2:$E$47,2,FALSE)),\" \",VLOOKUP(I153,Eje_Pilar!$C$2:$E$47,2,FALSE))","v":" "},{"$f":"IF(ISERROR(VLOOKUP(I153,Eje_Pilar!$C$2:$E$47,3,FALSE)),\" \",VLOOKUP(I153,Eje_Pilar!$C$2:$E$47,3,FALSE))","v":" "},null,"811.034.171-1","REDEX S.A.S.",13000000,null,null,null,0,13000000,0,"2019-05-28","2019-05-28","2019-11-28",180,0,null,null,null,"x",null,0,null,{"$f":"IF(SUMPRODUCT((A$14:A153=A153)*(B$14:B153=B153)*(C$14:C153=C153))>1,0,1)","v":1},"Contratos de prestación de servicios","Contratación mínima cuantia",{"$f":"IFERROR(VLOOKUP(F153,Tipo!$C$12:$C$27,1,FALSE),\"NO\")","v":"NO"},"Funcionamiento","NO"]
["141-2019",2019,"FDLBU- LP-093-2019","Contratos de prestación de servicios","Licitación pública","No aplica","PRESTAR LOS SERVICIOS PARA PROMOVER EL BUEN USO DEL TIEMPO LIBRE, MEDIANTE LA PRÁCTICA DE DEPORTES CON LA IMPLEMENTACIÓN DE ESCUELAS DE FORMACIÓN DEPORTIVA, CON EL FIN DE MEJORAR EL DESARROLLO FÍSICO E INTEGRAL, Y LA REALIZACIÓN DE DOS (2) EVENTOS RECREO DEPORTIVOS, FORTALECIENDO LA INTEGRACIÓN DE LA COMUNIDAD Y EL APROVECHAMIENTO DE LOS PARQUES DE LA LOCALIDAD DE BARRIOS UNIDOS. ","Inversión",11,{"$f":"IF(ISERROR(VLOOKUP(I154,Eje_Pilar!$C$2:$E$47,2,FALSE)),\" \",VLOOKUP(I154,Eje_Pilar!$C$2:$E$47,2,FALSE))","v":"Mejores oportunidades para el desarrollo a través de la cultura, la recreación y el deporte"},{"$f":"IF(ISERROR(VLOOKUP(I154,Eje_Pilar!$C$2:$E$47,3,FALSE)),\" \",VLOOKUP(I154,Eje_Pilar!$C$2:$E$47,3,FALSE))","v":"Pilar 1 Igualdad de Calidad de Vida"},791,900258517,"CITIUS COLOMBIA",515736000,null,null,null,0,515736000,174575211,"2019-05-26","2019-06-13","2020-03-07",210,0,null,null,"x",null,null,0.33849723695844386,null,{"$f":"IF(SUMPRODUCT((A$14:A154=A154)*(B$14:B154=B154)*(C$14:C154=C154))>1,0,1)","v":1},"Contratos de prestación de servicios","Licitación pública",{"$f":"IFERROR(VLOOKUP(F154,Tipo!$C$12:$C$27,1,FALSE),\"NO\")","v":"NO"},"Inversión",11]
["142-2019",2019,"FDLBU-CD-113-2019","Convenios de cooperacion","Contratación directa","Prestación de servicios profesionales y de apoyo a la gestión, o para la ejecución de trabajos artísticos que sólo puedan encomendarse a determinadas personas naturales;","AUNAR ESFUERZOS TÉCNICOS, FINANCIEROS Y ADMINISTRATIVOS DE ACUERDO CON LA COMPETENCIA DEL FDL Y LA NATURALEZA JURÍDICA DE GN, PARA EL DESARROLLO DE LAS ACTIVIDADES PROPIAS DE LOS PROYECTOS DE INFRAESTRUCTURA DEL SISTEMA DE MOVILIDAD Y ESPACIO PÚBLICO A CARGO DEL FDL Y DE LA INFRAESTRUCTURA DE REDES Y ACTIVOS DE DISTRIBUCIÓN DE GAS NATURAL A CARGO DE GN, EN CUMPLIMIENTO DE LO EXPUESTO EN LA LEY 1682 DE 2013, DENTRO DE LOS PRINCIPIOS CONSTITUCIONALES Y LEGALES.","Funcionamiento",null,{"$f":"IF(ISERROR(VLOOKUP(I155,Eje_Pilar!$C$2:$E$47,2,FALSE)),\" \",VLOOKUP(I155,Eje_Pilar!$C$2:$E$47,2,FALSE))","v":" "},{"$f":"IF(ISERROR(VLOOKUP(I155,Eje_Pilar!$C$2:$E$47,3,FALSE)),\" \",VLOOKUP(I155,Eje_Pilar!$C$2:$E$47,3,FALSE))","v":" "},null,"800.007.813-5","GAS NATURAL S.A. ESP",null,null,null,null,null,0,null,"2019-05-30",null,null,1800,0,null,null,"x",null,null,"-",null,{"$f":"IF(SUMPRODUCT((A$14:A155=A155)*(B$14:B155=B155)*(C$14:C155=C155))>1,0,1)","v":1},"Convenios de cooperacion","Contratación directa",{"$f":"IFERROR(VLOOKUP(F155,Tipo!$C$12:$C$27,1,FALSE),\"NO\")","v":"Prestación de servicios profesionales y de apoyo a la gestión, o para la ejecución de trabajos artísticos que sólo puedan encomendarse a determinadas personas naturales;"},"Funcionamiento","NO"]
["143-2019",2019,"FDLBU-CD-110-2019","Contratos interadministrativos","Contratación directa","Prestación de servicios profesionales y de apoyo a la gestión, o para la ejecución de trabajos artísticos que sólo puedan encomendarse a determinadas personas naturales;","PRESTAR LOS SERVICIOS DE INTERNET PARA LAS SEDES DE LA ALCALDIA LOCAL DE BARRIOS UNIDOS","Funcionamiento",null,{"$f":"IF(ISERROR(VLOOKUP(I156,Eje_Pilar!$C$2:$E$47,2,FALSE)),\" \",VLOOKUP(I156,Eje_Pilar!$C$2:$E$47,2,FALSE))","v":" "},{"$f":"IF(ISERROR(VLOOKUP(I156,Eje_Pilar!$C$2:$E$47,3,FALSE)),\" \",VLOOKUP(I156,Eje_Pilar!$C$2:$E$47,3,FALSE))","v":" "},null,"899.999.115-8","EMPRESA DE TELECOMUNICAICONES DE BOGOTA S.A. ESP",15966468,null,null,null,0,15966468,5322160,"2019-06-12","2019-08-01","2020-08-01",360,0,null,null,"x",null,null,0.3333335838583712,null,{"$f":"IF(SUMPRODUCT((A$14:A156=A156)*(B$14:B156=B156)*(C$14:C156=C156))>1,0,1)","v":1},"Contratos interadministrativos","Contratación directa",{"$f":"IFERROR(VLOOKUP(F156,Tipo!$C$12:$C$27,1,FALSE),\"NO\")","v":"Prestación de servicios profesionales y de apoyo a la gestión, o para la ejecución de trabajos artísticos que sólo puedan encomendarse a determinadas personas naturales;"},"Funcionamiento","NO"]
["144-2019",2019,"FDLBU-CD-114-2019","Contratos interadministrativos","Contratación directa","Contratos interadministrativos","AUNAR ESFUERZOS ENTRE LA SUBRED INTEGRADA DE SERVICIOS DE SALUD NORTE Y EL FONDO DE DESARROLLO LOCAL DE BARRIOS UNIDOS PARA EL OTORGAMIENTO DE DISPOSITIVOS DE ASISTENCIA PERSONAL - AYUDAS TÉCNICAS, NO INCLUIDAS O NO CUBIERTAS EN EL PLAN DE BENEFICIOS DE SALUD -PBS-, COMO ACCIÓN QUE FACILITA EL MEJORAMIENTO DE LA CALIDAD DE VIDA Y LA PROMOCIÓN DEL BIENESTAR PARA LAS PERSONAS CON DISCAPACIDAD, RESIDENTES EN LA LOCALIDAD DE BARRIOS UNIDOS, EN EL DESARROLLO DE LA POLÍTICA PÚBLICA DISTRITAL","Inversión",3,{"$f":"IF(ISERROR(VLOOKUP(I157,Eje_Pilar!$C$2:$E$47,2,FALSE)),\" \",VLOOKUP(I157,Eje_Pilar!$C$2:$E$47,2,FALSE))","v":"Igualdad y autonomía para una Bogotá incluyente"},{"$f":"IF(ISERROR(VLOOKUP(I157,Eje_Pilar!$C$2:$E$47,3,FALSE)),\" \",VLOOKUP(I157,Eje_Pilar!$C$2:$E$47,3,FALSE))","v":"Pilar 1 Igualdad de Calidad de Vida"},1556,"900.971.006-4","CONVENIO INTERADMINISTRATIVO SUB-RED NORTE \n",205000000,null,null,null,0,205000000,184500000,"2019-06-25","2019-08-27","2020-02-26",180,0,null,null,"x",null,null,0.9,null,{"$f":"IF(SUMPRODUCT((A$14:A157=A157)*(B$14:B157=B157)*(C$14:C157=C157))>1,0,1)","v":1},"Contratos interadministrativos","Contratación directa",{"$f":"IFERROR(VLOOKUP(F157,Tipo!$C$12:$C$27,1,FALSE),\"NO\")","v":"Contratos interadministrativos"},"Inversión",3]
["145-2019",2019,"FDLBU-135-2019","Convenios de cooperacion","Contratación directa","Prestación de servicios profesionales y de apoyo a la gestión, o para la ejecución de trabajos artísticos que sólo puedan encomendarse a determinadas personas naturales;","AUNAR ESFUERZOS TÉCNICOS, ADMINISTRATIVOS, LOGÍSTICOS Y FINANCIEROS ENTRE EL FONDO DE DESARROLLO LOCAL BARRIOS UNIDOS  Y LA ORQUESTA FILARMÓNICA DE BOGOTÁ PARA EL DESARROLLO Y CONTINUIDAD DEL CENTRO FILARMÓNICO, COMO UN ESPACIO PARA EL PROCESO DE FORMACIÓN MUSICAL IMPLEMENTADO POR LA OFB DIRIGIDO A LA LOCALIDAD","Funcionamiento",null,{"$f":"IF(ISERROR(VLOOKUP(I158,Eje_Pilar!$C$2:$E$47,2,FALSE)),\" \",VLOOKUP(I158,Eje_Pilar!$C$2:$E$47,2,FALSE))","v":" "},{"$f":"IF(ISERROR(VLOOKUP(I158,Eje_Pilar!$C$2:$E$47,3,FALSE)),\" \",VLOOKUP(I158,Eje_Pilar!$C$2:$E$47,3,FALSE))","v":" "},null,"899.999.282-1","ORQUESTA FILARMONICA DE BOGOTÁ",null,null,null,null,null,0,null,"2019-06-25","2019-07-02","2020-03-21",180,66.300000000000026,null,null,"x",null,null,"-",null,{"$f":"IF(SUMPRODUCT((A$14:A158=A158)*(B$14:B158=B158)*(C$14:C158=C158))>1,0,1)","v":1},"Convenios de cooperacion","Contratación directa",{"$f":"IFERROR(VLOOKUP(F158,Tipo!$C$12:$C$27,1,FALSE),\"NO\")","v":"Prestación de servicios profesionales y de apoyo a la gestión, o para la ejecución de trabajos artísticos que sólo puedan encomendarse a determinadas personas naturales;"},"Funcionamiento","NO"]
["146-2019",2019,"FDLBU-CD-120-2019","Contratos de prestación de servicios profesionales y de apoyo a la gestión","Contratación directa","Prestación de servicios profesionales y de apoyo a la gestión, o para la ejecución de trabajos artísticos que sólo puedan encomendarse a determinadas personas naturales;","CONTRATAR LOS SERVICIOS DE APOYO PARA EL FORTALECIMIENTO A LA GESTIÓN LOCAL DE PROCESOS INSTITUCIONALES Y SOCIALES DE INTERÉS PÚBLICO ARTICULADA POR EL FONDO DE DESARROLLO LOCAL DE BARRIOS UNIDOS EN COMPAÑÍA DE SECTORES ADMINISTRATIVOS DEL DISTRITO, INSTANCIAS Y ORGANIZACIONES SOCIALES EN LA LOCALIDAD","Inversión",45,{"$f":"IF(ISERROR(VLOOKUP(I159,Eje_Pilar!$C$2:$E$47,2,FALSE)),\" \",VLOOKUP(I159,Eje_Pilar!$C$2:$E$47,2,FALSE))","v":"Gobernanza e influencia local, regional e internacional"},{"$f":"IF(ISERROR(VLOOKUP(I159,Eje_Pilar!$C$2:$E$47,3,FALSE)),\" \",VLOOKUP(I159,Eje_Pilar!$C$2:$E$47,3,FALSE))","v":"Eje Transversal 4 Gobierno Legitimo, Fortalecimiento Local y Eficiencia"},1559,1014213720,"CAROLINA REALPE ",7949800,null,null,2,3246168,11195968,9672257,"2019-06-25","2019-07-05","2019-12-23",120,48.9,null,null,null,"x",null,0.86390538093713742,null,{"$f":"IF(SUMPRODUCT((A$14:A159=A159)*(B$14:B159=B159)*(C$14:C159=C159))>1,0,1)","v":1},"Contratos de prestación de servicios profesionales y de apoyo a la gestión","Contratación directa",{"$f":"IFERROR(VLOOKUP(F159,Tipo!$C$12:$C$27,1,FALSE),\"NO\")","v":"Prestación de servicios profesionales y de apoyo a la gestión, o para la ejecución de trabajos artísticos que sólo puedan encomendarse a determinadas personas naturales;"},"Inversión",45]
["147-2019",2019,"FDLBU-CD-121-2019","Contratos de prestación de servicios profesionales y de apoyo a la gestión","Contratación directa","Prestación de servicios profesionales y de apoyo a la gestión, o para la ejecución de trabajos artísticos que sólo puedan encomendarse a determinadas personas naturales;","CONTRATAR LOS SERVICIOS DE APOYO PARA EL FORTALECIMIENTO A LA GESTIÓN LOCAL DE PROCESOS INSTITUCIONALES Y SOCIALES DE INTERÉS PÚBLICO ARTICULADA POR EL FONDO DE DESARROLLO LOCAL DE BARRIOS UNIDOS EN COMPAÑÍA DE SECTORES ADMINISTRATIVOS DEL DISTRITO, INSTANCIAS Y ORGANIZACIONES SOCIALES EN LA LOCALIDAD","Inversión",45,{"$f":"IF(ISERROR(VLOOKUP(I160,Eje_Pilar!$C$2:$E$47,2,FALSE)),\" \",VLOOKUP(I160,Eje_Pilar!$C$2:$E$47,2,FALSE))","v":"Gobernanza e influencia local, regional e internacional"},{"$f":"IF(ISERROR(VLOOKUP(I160,Eje_Pilar!$C$2:$E$47,3,FALSE)),\" \",VLOOKUP(I160,Eje_Pilar!$C$2:$E$47,3,FALSE))","v":"Eje Transversal 4 Gobierno Legitimo, Fortalecimiento Local y Eficiencia"},1559,1015411877,"LUISA FERNANDA QUIROZ ",7949800,null,null,2,3246168,11195968,9672257,"2019-06-25","2019-07-05","2019-12-23",120,48.9,null,null,null,"x",null,0.86390538093713742,null,{"$f":"IF(SUMPRODUCT((A$14:A160=A160)*(B$14:B160=B160)*(C$14:C160=C160))>1,0,1)","v":1},"Contratos de prestación de servicios profesionales y de apoyo a la gestión","Contratación directa",{"$f":"IFERROR(VLOOKUP(F160,Tipo!$C$12:$C$27,1,FALSE),\"NO\")","v":"Prestación de servicios profesionales y de apoyo a la gestión, o para la ejecución de trabajos artísticos que sólo puedan encomendarse a determinadas personas naturales;"},"Inversión",45]
["148-2019",2019,"FDLBU-CD-115-2019","Contratos de prestación de servicios profesionales y de apoyo a la gestión","Contratación directa","Prestación de servicios profesionales y de apoyo a la gestión, o para la ejecución de trabajos artísticos que sólo puedan encomendarse a determinadas personas naturales;","CONTRATAR LOS SERVICIOS DE APOYO PARA EL FORTALECIMIENTO A LA GESTIÓN LOCAL DE PROCESOS INSTITUCIONALES Y SOCIALES DE INTERÉS PÚBLICO ARTICULADA POR EL FONDO DE DESARROLLO LOCAL DE BARRIOS UNIDOS EN COMPAÑÍA DE SECTORES ADMINISTRATIVOS DEL DISTRITO, INSTANCIAS Y ORGANIZACIONES SOCIALES EN LA LOCALIDAD","Inversión",45,{"$f":"IF(ISERROR(VLOOKUP(I161,Eje_Pilar!$C$2:$E$47,2,FALSE)),\" \",VLOOKUP(I161,Eje_Pilar!$C$2:$E$47,2,FALSE))","v":"Gobernanza e influencia local, regional e internacional"},{"$f":"IF(ISERROR(VLOOKUP(I161,Eje_Pilar!$C$2:$E$47,3,FALSE)),\" \",VLOOKUP(I161,Eje_Pilar!$C$2:$E$47,3,FALSE))","v":"Eje Transversal 4 Gobierno Legitimo, Fortalecimiento Local y Eficiencia"},1559,1007719376,"KAREN GISELL BERMÚDEZ RODRIGUEZ",7949800,null,null,2,3246168,11195968,9672257,"2019-06-25","2019-07-05","2019-12-23",120,48.9,null,null,null,"x",null,0.86390538093713742,null,{"$f":"IF(SUMPRODUCT((A$14:A161=A161)*(B$14:B161=B161)*(C$14:C161=C161))>1,0,1)","v":1},"Contratos de prestación de servicios profesionales y de apoyo a la gestión","Contratación directa",{"$f":"IFERROR(VLOOKUP(F161,Tipo!$C$12:$C$27,1,FALSE),\"NO\")","v":"Prestación de servicios profesionales y de apoyo a la gestión, o para la ejecución de trabajos artísticos que sólo puedan encomendarse a determinadas personas naturales;"},"Inversión",45]
["149-2019",2019,"FDLBU-CD-116-2019","Contratos de prestación de servicios profesionales y de apoyo a la gestión","Contratación directa","Prestación de servicios profesionales y de apoyo a la gestión, o para la ejecución de trabajos artísticos que sólo puedan encomendarse a determinadas personas naturales;","CONTRATAR LOS SERVICIOS DE APOYO PARA EL FORTALECIMIENTO A LA GESTIÓN LOCAL DE PROCESOS INSTITUCIONALES Y SOCIALES DE INTERÉS PÚBLICO ARTICULADA POR EL FONDO DE DESARROLLO LOCAL DE BARRIOS UNIDOS EN COMPAÑÍA DE SECTORES ADMINISTRATIVOS DEL DISTRITO, INSTANCIAS Y ORGANIZACIONES SOCIALES EN LA LOCALIDAD","Inversión",45,{"$f":"IF(ISERROR(VLOOKUP(I162,Eje_Pilar!$C$2:$E$47,2,FALSE)),\" \",VLOOKUP(I162,Eje_Pilar!$C$2:$E$47,2,FALSE))","v":"Gobernanza e influencia local, regional e internacional"},{"$f":"IF(ISERROR(VLOOKUP(I162,Eje_Pilar!$C$2:$E$47,3,FALSE)),\" \",VLOOKUP(I162,Eje_Pilar!$C$2:$E$47,3,FALSE))","v":"Eje Transversal 4 Gobierno Legitimo, Fortalecimiento Local y Eficiencia"},1559,1016058390,"PAOLA ANDREA SIERRA VACA",7949800,null,null,2,3246168,11195968,9672257,"2019-06-25","2019-07-05","2019-12-23",120,63.9,null,null,null,"x",null,0.86390538093713742,null,{"$f":"IF(SUMPRODUCT((A$14:A162=A162)*(B$14:B162=B162)*(C$14:C162=C162))>1,0,1)","v":1},"Contratos de prestación de servicios profesionales y de apoyo a la gestión","Contratación directa",{"$f":"IFERROR(VLOOKUP(F162,Tipo!$C$12:$C$27,1,FALSE),\"NO\")","v":"Prestación de servicios profesionales y de apoyo a la gestión, o para la ejecución de trabajos artísticos que sólo puedan encomendarse a determinadas personas naturales;"},"Inversión",45]
["150-2019",2019,"FDLBU-CD-117-2019","Contratos de prestación de servicios profesionales y de apoyo a la gestión","Contratación directa","Prestación de servicios profesionales y de apoyo a la gestión, o para la ejecución de trabajos artísticos que sólo puedan encomendarse a determinadas personas naturales;","PRESTAR LOS SERVICIOS DE APOYO EN EL ÁREA DE GESTIÓN DEL DESARROLLO LOCAL DE LA ALCALDÍA LOCAL DE BARRIOS UNIDOS EN EL OFICINA DE PLANEACIÓN, PARA LOGRAR EL CUMPLIMIENTO DE LAS METAS DEL PLAN DE DESARROLLO LOCAL DE LA VIGENCIA","Inversión",45,{"$f":"IF(ISERROR(VLOOKUP(I163,Eje_Pilar!$C$2:$E$47,2,FALSE)),\" \",VLOOKUP(I163,Eje_Pilar!$C$2:$E$47,2,FALSE))","v":"Gobernanza e influencia local, regional e internacional"},{"$f":"IF(ISERROR(VLOOKUP(I163,Eje_Pilar!$C$2:$E$47,3,FALSE)),\" \",VLOOKUP(I163,Eje_Pilar!$C$2:$E$47,3,FALSE))","v":"Eje Transversal 4 Gobierno Legitimo, Fortalecimiento Local y Eficiencia"},1559,6888023,"RODOLFO RAMÓN REYES GARCÉS ",13250000,null,null,null,0,13250000,13250000,"2019-06-25","2019-07-08","2019-11-07",120,0,null,null,null,"x",null,1,null,{"$f":"IF(SUMPRODUCT((A$14:A163=A163)*(B$14:B163=B163)*(C$14:C163=C163))>1,0,1)","v":1},"Contratos de prestación de servicios profesionales y de apoyo a la gestión","Contratación directa",{"$f":"IFERROR(VLOOKUP(F163,Tipo!$C$12:$C$27,1,FALSE),\"NO\")","v":"Prestación de servicios profesionales y de apoyo a la gestión, o para la ejecución de trabajos artísticos que sólo puedan encomendarse a determinadas personas naturales;"},"Inversión",45]
["151-2019",2019,"FDLBU-CD-118-2019","Contratos de prestación de servicios profesionales y de apoyo a la gestión","Contratación directa","Prestación de servicios profesionales y de apoyo a la gestión, o para la ejecución de trabajos artísticos que sólo puedan encomendarse a determinadas personas naturales;","CONTRATAR LOS SERVICIOS DE APOYO PARA EL FORTALECIMIENTO A LA GESTIÓN LOCAL DE PROCESOS INSTITUCIONALES Y SOCIALES DE INTERÉS PÚBLICO ARTICULADA POR EL FONDO DE DESARROLLO LOCAL DE BARRIOS UNIDOS EN COMPAÑÍA DE SECTORES ADMINISTRATIVOS DEL DISTRITO, INSTANCIAS Y ORGANIZACIONES SOCIALES EN LA LOCALIDAD","Inversión",45,{"$f":"IF(ISERROR(VLOOKUP(I164,Eje_Pilar!$C$2:$E$47,2,FALSE)),\" \",VLOOKUP(I164,Eje_Pilar!$C$2:$E$47,2,FALSE))","v":"Gobernanza e influencia local, regional e internacional"},{"$f":"IF(ISERROR(VLOOKUP(I164,Eje_Pilar!$C$2:$E$47,3,FALSE)),\" \",VLOOKUP(I164,Eje_Pilar!$C$2:$E$47,3,FALSE))","v":"Eje Transversal 4 Gobierno Legitimo, Fortalecimiento Local y Eficiencia"},1559,80038359,"JUAN ANDRES MARTINEZ MARTINEZ",7949800,null,null,2,3246168,11195968,9672257,"2019-06-25","2019-07-05","2019-12-23",120,48.9,null,null,null,"x",null,0.86390538093713742,null,{"$f":"IF(SUMPRODUCT((A$14:A164=A164)*(B$14:B164=B164)*(C$14:C164=C164))>1,0,1)","v":1},"Contratos de prestación de servicios profesionales y de apoyo a la gestión","Contratación directa",{"$f":"IFERROR(VLOOKUP(F164,Tipo!$C$12:$C$27,1,FALSE),\"NO\")","v":"Prestación de servicios profesionales y de apoyo a la gestión, o para la ejecución de trabajos artísticos que sólo puedan encomendarse a determinadas personas naturales;"},"Inversión",45]
["152-2019",2019,"FDLBU-CD-119-2019","Contratos de prestación de servicios profesionales y de apoyo a la gestión","Contratación directa","Prestación de servicios profesionales y de apoyo a la gestión, o para la ejecución de trabajos artísticos que sólo puedan encomendarse a determinadas personas naturales;","CONTRATAR LOS SERVICIOS DE APOYO PARA EL FORTALECIMIENTO A LA GESTIÓN LOCAL DE PROCESOS INSTITUCIONALES Y SOCIALES DE INTERÉS PÚBLICO ARTICULADA POR EL FONDO DE DESARROLLO LOCAL DE BARRIOS UNIDOS EN COMPAÑÍA DE SECTORES ADMINISTRATIVOS DEL DISTRITO, INSTANCIAS Y ORGANIZACIONES SOCIALES EN LA LOCALIDAD","Inversión",45,{"$f":"IF(ISERROR(VLOOKUP(I165,Eje_Pilar!$C$2:$E$47,2,FALSE)),\" \",VLOOKUP(I165,Eje_Pilar!$C$2:$E$47,2,FALSE))","v":"Gobernanza e influencia local, regional e internacional"},{"$f":"IF(ISERROR(VLOOKUP(I165,Eje_Pilar!$C$2:$E$47,3,FALSE)),\" \",VLOOKUP(I165,Eje_Pilar!$C$2:$E$47,3,FALSE))","v":"Eje Transversal 4 Gobierno Legitimo, Fortalecimiento Local y Eficiencia"},1559,1013653819,"JOSUE CALEB ORTIZ DAZA",7949800,null,null,2,3246168,11195968,9672257,"2019-06-25","2019-07-05","2019-12-23",120,48.9,null,null,null,"x",null,0.86390538093713742,null,{"$f":"IF(SUMPRODUCT((A$14:A165=A165)*(B$14:B165=B165)*(C$14:C165=C165))>1,0,1)","v":1},"Contratos de prestación de servicios profesionales y de apoyo a la gestión","Contratación directa",{"$f":"IFERROR(VLOOKUP(F165,Tipo!$C$12:$C$27,1,FALSE),\"NO\")","v":"Prestación de servicios profesionales y de apoyo a la gestión, o para la ejecución de trabajos artísticos que sólo puedan encomendarse a determinadas personas naturales;"},"Inversión",45]
["153-2019",2019,"FDLBU-CD-123-2019","Contratos de prestación de servicios profesionales y de apoyo a la gestión","Contratación directa","Prestación de servicios profesionales y de apoyo a la gestión, o para la ejecución de trabajos artísticos que sólo puedan encomendarse a determinadas personas naturales;","CONTRATAR LOS SERVICIOS DE APOYO PARA EL FORTALECIMIENTO A LA GESTIÓN LOCAL DE PROCESOS INSTITUCIONALES Y SOCIALES DE INTERÉS PÚBLICO ARTICULADA POR EL FONDO DE DESARROLLO LOCAL DE BARRIOS UNIDOS EN COMPAÑÍA DE SECTORES ADMINISTRATIVOS DEL DISTRITO, INSTANCIAS Y ORGANIZACIONES SOCIALES EN LA LOCALIDAD","Inversión",45,{"$f":"IF(ISERROR(VLOOKUP(I166,Eje_Pilar!$C$2:$E$47,2,FALSE)),\" \",VLOOKUP(I166,Eje_Pilar!$C$2:$E$47,2,FALSE))","v":"Gobernanza e influencia local, regional e internacional"},{"$f":"IF(ISERROR(VLOOKUP(I166,Eje_Pilar!$C$2:$E$47,3,FALSE)),\" \",VLOOKUP(I166,Eje_Pilar!$C$2:$E$47,3,FALSE))","v":"Eje Transversal 4 Gobierno Legitimo, Fortalecimiento Local y Eficiencia"},1559,51699723,"IRMA PÉREZ JAIMES",7949800,null,null,1,1987000,9936800,7618559,"2019-06-25","2019-07-05","2020-01-05",120,30,null,null,null,"x",null,0.76670145318412364,null,{"$f":"IF(SUMPRODUCT((A$14:A166=A166)*(B$14:B166=B166)*(C$14:C166=C166))>1,0,1)","v":1},"Contratos de prestación de servicios profesionales y de apoyo a la gestión","Contratación directa",{"$f":"IFERROR(VLOOKUP(F166,Tipo!$C$12:$C$27,1,FALSE),\"NO\")","v":"Prestación de servicios profesionales y de apoyo a la gestión, o para la ejecución de trabajos artísticos que sólo puedan encomendarse a determinadas personas naturales;"},"Inversión",45]
["154-2019",2019,"FDLBU-CD-125-2019","Contratos de prestación de servicios profesionales y de apoyo a la gestión","Contratación directa","Prestación de servicios profesionales y de apoyo a la gestión, o para la ejecución de trabajos artísticos que sólo puedan encomendarse a determinadas personas naturales;","PRESTAR LOS SERVICIOS DE APOYO EN EL ÁREA DE GESTIÓN DEL DESARROLLO LOCAL DE LA ALCALDÍA LOCAL DE BARRIOS UNIDOS EN EL OFICINA DE PLANEACIÓN, PARA LOGRAR EL CUMPLIMIENTO DE LAS METAS DEL PLAN DE DESARROLLO LOCAL DE LA VIGENCIA","Inversión",45,{"$f":"IF(ISERROR(VLOOKUP(I167,Eje_Pilar!$C$2:$E$47,2,FALSE)),\" \",VLOOKUP(I167,Eje_Pilar!$C$2:$E$47,2,FALSE))","v":"Gobernanza e influencia local, regional e internacional"},{"$f":"IF(ISERROR(VLOOKUP(I167,Eje_Pilar!$C$2:$E$47,3,FALSE)),\" \",VLOOKUP(I167,Eje_Pilar!$C$2:$E$47,3,FALSE))","v":"Eje Transversal 4 Gobierno Legitimo, Fortalecimiento Local y Eficiencia"},1559,80655986,"JOSÉ ALEXANDER CORTES RODRÍGUEZ",13250000,null,null,null,0,13250000,13250000,"2019-06-25","2019-07-08","2019-11-07",120,0,null,null,null,"x",null,1,null,{"$f":"IF(SUMPRODUCT((A$14:A167=A167)*(B$14:B167=B167)*(C$14:C167=C167))>1,0,1)","v":1},"Contratos de prestación de servicios profesionales y de apoyo a la gestión","Contratación directa",{"$f":"IFERROR(VLOOKUP(F167,Tipo!$C$12:$C$27,1,FALSE),\"NO\")","v":"Prestación de servicios profesionales y de apoyo a la gestión, o para la ejecución de trabajos artísticos que sólo puedan encomendarse a determinadas personas naturales;"},"Inversión",45]
["155-2019",2019,"FDLBU-CD-122-2019","Contratos de prestación de servicios profesionales y de apoyo a la gestión","Contratación directa","Prestación de servicios profesionales y de apoyo a la gestión, o para la ejecución de trabajos artísticos que sólo puedan encomendarse a determinadas personas naturales;","PRESTAR LOS SERVICIOS PROFESIONALES AL FONDO DE DESARROLLO DE ALCALDIA LOCAL DE BARRIOS UNIDOS PARA LA SUPERVISION, REVISIÓN, SEGUIMIENTO Y CUMPLIMIENTO DE LAS NORMAS QUE REGULAN LOS CONTRATOS SUSCRITOS POR ESTE, EN EL DESARROLLO DE LAS DIFERENTES ETAPAS PRECONTRACTUAL, CONTRACTUAL Y POSCONTRACTUAL","Inversión",45,{"$f":"IF(ISERROR(VLOOKUP(I168,Eje_Pilar!$C$2:$E$47,2,FALSE)),\" \",VLOOKUP(I168,Eje_Pilar!$C$2:$E$47,2,FALSE))","v":"Gobernanza e influencia local, regional e internacional"},{"$f":"IF(ISERROR(VLOOKUP(I168,Eje_Pilar!$C$2:$E$47,3,FALSE)),\" \",VLOOKUP(I168,Eje_Pilar!$C$2:$E$47,3,FALSE))","v":"Eje Transversal 4 Gobierno Legitimo, Fortalecimiento Local y Eficiencia"},1559,80235658,"EDILSON ALVEIRO ZABALETA CUELLAR",18000000,null,null,1,9000000,27000000,21450000,"2019-06-26","2019-07-08","2020-01-07",120,60,null,null,null,"x",null,0.7944444444444444,null,{"$f":"IF(SUMPRODUCT((A$14:A168=A168)*(B$14:B168=B168)*(C$14:C168=C168))>1,0,1)","v":1},"Contratos de prestación de servicios profesionales y de apoyo a la gestión","Contratación directa",{"$f":"IFERROR(VLOOKUP(F168,Tipo!$C$12:$C$27,1,FALSE),\"NO\")","v":"Prestación de servicios profesionales y de apoyo a la gestión, o para la ejecución de trabajos artísticos que sólo puedan encomendarse a determinadas personas naturales;"},"Inversión",45]
["156-2019",2019,"FDLBU-CD-124-2019","Contratos de prestación de servicios profesionales y de apoyo a la gestión","Contratación directa","Prestación de servicios profesionales y de apoyo a la gestión, o para la ejecución de trabajos artísticos que sólo puedan encomendarse a determinadas personas naturales;","CONTRATAR LOS SERVICIOS DE APOYO PARA EL FORTALECIMIENTO A LA GESTIÓN LOCAL DE PROCESOS INSTITUCIONALES Y SOCIALES DE INTERÉS PÚBLICO ARTICULADA POR EL FONDO DE DESARROLLO LOCAL DE BARRIOS UNIDOS EN COMPAÑÍA DE SECTORES ADMINISTRATIVOS DEL DISTRITO, INSTANCIAS Y ORGANIZACIONES SOCIALES EN LA LOCALIDAD","Inversión",45,{"$f":"IF(ISERROR(VLOOKUP(I169,Eje_Pilar!$C$2:$E$47,2,FALSE)),\" \",VLOOKUP(I169,Eje_Pilar!$C$2:$E$47,2,FALSE))","v":"Gobernanza e influencia local, regional e internacional"},{"$f":"IF(ISERROR(VLOOKUP(I169,Eje_Pilar!$C$2:$E$47,3,FALSE)),\" \",VLOOKUP(I169,Eje_Pilar!$C$2:$E$47,3,FALSE))","v":"Eje Transversal 4 Gobierno Legitimo, Fortalecimiento Local y Eficiencia"},1559,1032466636,"JORGE ANDRÉS DELGADO BOHÓRQUEZ",7949800,null,null,2,3246168,11195968,9672257,"2019-06-26","2019-07-05","2019-12-01",120,48.9,null,null,null,"x",null,0.86390538093713742,null,{"$f":"IF(SUMPRODUCT((A$14:A169=A169)*(B$14:B169=B169)*(C$14:C169=C169))>1,0,1)","v":1},"Contratos de prestación de servicios profesionales y de apoyo a la gestión","Contratación directa",{"$f":"IFERROR(VLOOKUP(F169,Tipo!$C$12:$C$27,1,FALSE),\"NO\")","v":"Prestación de servicios profesionales y de apoyo a la gestión, o para la ejecución de trabajos artísticos que sólo puedan encomendarse a determinadas personas naturales;"},"Inversión",45]
["157-2019",2019,"FDLBU-CD-126-2019","Contratos de prestación de servicios profesionales y de apoyo a la gestión","Contratación directa","Prestación de servicios profesionales y de apoyo a la gestión, o para la ejecución de trabajos artísticos que sólo puedan encomendarse a determinadas personas naturales;","PRESTAR SUS SERVICIOS PROFESIONALES APOYAR AL (LA) ALCALDE(SA) LOCAL EN LA PROMOCIÓN, ARTICULACIÓN, ACOMPAÑAMIENTO Y SEGUIMIENTO PARA LA ATENCIÓN Y PROTECCIÓN DE LOS ANIMALES DOMÉSTICOS Y SILVESTRES DE LA LOCALIDAD","Inversión",45,{"$f":"IF(ISERROR(VLOOKUP(I170,Eje_Pilar!$C$2:$E$47,2,FALSE)),\" \",VLOOKUP(I170,Eje_Pilar!$C$2:$E$47,2,FALSE))","v":"Gobernanza e influencia local, regional e internacional"},{"$f":"IF(ISERROR(VLOOKUP(I170,Eje_Pilar!$C$2:$E$47,3,FALSE)),\" \",VLOOKUP(I170,Eje_Pilar!$C$2:$E$47,3,FALSE))","v":"Eje Transversal 4 Gobierno Legitimo, Fortalecimiento Local y Eficiencia"},1559,35197692,"JULIANA PATIÑO PACHECO",18220000,null,null,1,9110000,27330000,21712167,"2019-06-26","2019-07-08","2020-01-07",120,60,null,null,null,"x",null,0.79444445664105379,null,{"$f":"IF(SUMPRODUCT((A$14:A170=A170)*(B$14:B170=B170)*(C$14:C170=C170))>1,0,1)","v":1},"Contratos de prestación de servicios profesionales y de apoyo a la gestión","Contratación directa",{"$f":"IFERROR(VLOOKUP(F170,Tipo!$C$12:$C$27,1,FALSE),\"NO\")","v":"Prestación de servicios profesionales y de apoyo a la gestión, o para la ejecución de trabajos artísticos que sólo puedan encomendarse a determinadas personas naturales;"},"Inversión",45]
["158-2019",2019,"FDLBU-CD-127-2019","Contratos de prestación de servicios profesionales y de apoyo a la gestión","Contratación directa","Prestación de servicios profesionales y de apoyo a la gestión, o para la ejecución de trabajos artísticos que sólo puedan encomendarse a determinadas personas naturales;","APOYAR TÉCNICAMENTE LAS DISTINTAS ETAPAS DE LOS PROCESOS DE COMPETENCIA DE LA ALCALDÍA LOCAL PARA LA DEPURACIÓN DE ACTUACIONES ADMINISTRATIVAS","Inversión",45,{"$f":"IF(ISERROR(VLOOKUP(I171,Eje_Pilar!$C$2:$E$47,2,FALSE)),\" \",VLOOKUP(I171,Eje_Pilar!$C$2:$E$47,2,FALSE))","v":"Gobernanza e influencia local, regional e internacional"},{"$f":"IF(ISERROR(VLOOKUP(I171,Eje_Pilar!$C$2:$E$47,3,FALSE)),\" \",VLOOKUP(I171,Eje_Pilar!$C$2:$E$47,3,FALSE))","v":"Eje Transversal 4 Gobierno Legitimo, Fortalecimiento Local y Eficiencia"},1559,79305606,"LUIS MARIA PARADA FONSECA ",20400000,null,null,2,7650000,28050000,24310000,"2019-06-26","2019-07-08","2019-12-22",120,45,null,null,null,"x",null,0.8666666666666667,null,{"$f":"IF(SUMPRODUCT((A$14:A171=A171)*(B$14:B171=B171)*(C$14:C171=C171))>1,0,1)","v":1},"Contratos de prestación de servicios profesionales y de apoyo a la gestión","Contratación directa",{"$f":"IFERROR(VLOOKUP(F171,Tipo!$C$12:$C$27,1,FALSE),\"NO\")","v":"Prestación de servicios profesionales y de apoyo a la gestión, o para la ejecución de trabajos artísticos que sólo puedan encomendarse a determinadas personas naturales;"},"Inversión",45]
["159-2019",2019,"FDLBU-CD-128-2019","Contratos de prestación de servicios profesionales y de apoyo a la gestión","Contratación directa","Prestación de servicios profesionales y de apoyo a la gestión, o para la ejecución de trabajos artísticos que sólo puedan encomendarse a determinadas personas naturales;","APOYAR TÉCNICAMENTE LAS DISTINTAS ETAPAS DE LOS PROCESOS DE COMPETENCIA DE LA ALCALDÍA LOCAL PARA LA DEPURACIÓN DE ACTUACIONES ADMINISTRATIVAS","Inversión",45,{"$f":"IF(ISERROR(VLOOKUP(I172,Eje_Pilar!$C$2:$E$47,2,FALSE)),\" \",VLOOKUP(I172,Eje_Pilar!$C$2:$E$47,2,FALSE))","v":"Gobernanza e influencia local, regional e internacional"},{"$f":"IF(ISERROR(VLOOKUP(I172,Eje_Pilar!$C$2:$E$47,3,FALSE)),\" \",VLOOKUP(I172,Eje_Pilar!$C$2:$E$47,3,FALSE))","v":"Eje Transversal 4 Gobierno Legitimo, Fortalecimiento Local y Eficiencia"},1559,52421810,"YHAMILA SALINAS RUANO",20400000,null,null,2,7650000,28050000,24310000,"2019-06-26","2019-07-08","2019-12-22",120,45,null,null,null,"x",null,0.8666666666666667,null,{"$f":"IF(SUMPRODUCT((A$14:A172=A172)*(B$14:B172=B172)*(C$14:C172=C172))>1,0,1)","v":1},"Contratos de prestación de servicios profesionales y de apoyo a la gestión","Contratación directa",{"$f":"IFERROR(VLOOKUP(F172,Tipo!$C$12:$C$27,1,FALSE),\"NO\")","v":"Prestación de servicios profesionales y de apoyo a la gestión, o para la ejecución de trabajos artísticos que sólo puedan encomendarse a determinadas personas naturales;"},"Inversión",45]
["160-2019",2019,"FDLBU-CD-130-2019","Contratos de prestación de servicios profesionales y de apoyo a la gestión","Contratación directa","Prestación de servicios profesionales y de apoyo a la gestión, o para la ejecución de trabajos artísticos que sólo puedan encomendarse a determinadas personas naturales;","CONTRATAR LOS SERVICIOS DE APOYO PARA EL FORTALECIMIENTO A LA GESTIÓN LOCAL DE PROCESOS INSTITUCIONALES Y SOCIALES DE INTERÉS PÚBLICO ARTICULADA POR EL FONDO DE DESARROLLO LOCAL DE BARRIOS UNIDOS EN COMPAÑÍA DE SECTORES ADMINISTRATIVOS DEL DISTRITO, INSTANCIAS Y ORGANIZACIONES SOCIALES EN LA LOCALIDAD","Inversión",45,{"$f":"IF(ISERROR(VLOOKUP(I173,Eje_Pilar!$C$2:$E$47,2,FALSE)),\" \",VLOOKUP(I173,Eje_Pilar!$C$2:$E$47,2,FALSE))","v":"Gobernanza e influencia local, regional e internacional"},{"$f":"IF(ISERROR(VLOOKUP(I173,Eje_Pilar!$C$2:$E$47,3,FALSE)),\" \",VLOOKUP(I173,Eje_Pilar!$C$2:$E$47,3,FALSE))","v":"Eje Transversal 4 Gobierno Legitimo, Fortalecimiento Local y Eficiencia"},1559,52782122,"ANDREA LIZETH POSADA MARTÍNEZ",7949800,null,null,2,3246168,11195968,9672257,"2019-06-26","2019-07-05","2019-12-23",120,48.9,null,null,null,"x",null,0.86390538093713742,null,{"$f":"IF(SUMPRODUCT((A$14:A173=A173)*(B$14:B173=B173)*(C$14:C173=C173))>1,0,1)","v":1},"Contratos de prestación de servicios profesionales y de apoyo a la gestión","Contratación directa",{"$f":"IFERROR(VLOOKUP(F173,Tipo!$C$12:$C$27,1,FALSE),\"NO\")","v":"Prestación de servicios profesionales y de apoyo a la gestión, o para la ejecución de trabajos artísticos que sólo puedan encomendarse a determinadas personas naturales;"},"Inversión",45]
["161-2019",2019,"FDLBU-CD-129-2019","Contratos de prestación de servicios profesionales y de apoyo a la gestión","Contratación directa","Prestación de servicios profesionales y de apoyo a la gestión, o para la ejecución de trabajos artísticos que sólo puedan encomendarse a determinadas personas naturales;","PRESTAR SERVICIOS PROFESIONALES PARA APOYAR AL DESPACHO DE LA ALCALDÍA LOCAL DE BARRIOS UNIDOS, EN LA REVISIÓN, CONTROL Y VIGILANCIA DE LOS DOCUMENTOS EMITIDOS POR LAS DIFERENTES DEPENDENCIAS DEL ÁREA DE GESTIÓN POLICIVA JURÍDICA Y DE GESTIÓN DEL DESARROLLO LOCAL, BRINDAR LINEAMIENTOS JURÍDICOS, EVALUAR Y ORIENTAR TEMAS PRIORITARIOS DEL DESPACHO DE LA ALCALDÍA LOCAL","Inversión",45,{"$f":"IF(ISERROR(VLOOKUP(I174,Eje_Pilar!$C$2:$E$47,2,FALSE)),\" \",VLOOKUP(I174,Eje_Pilar!$C$2:$E$47,2,FALSE))","v":"Gobernanza e influencia local, regional e internacional"},{"$f":"IF(ISERROR(VLOOKUP(I174,Eje_Pilar!$C$2:$E$47,3,FALSE)),\" \",VLOOKUP(I174,Eje_Pilar!$C$2:$E$47,3,FALSE))","v":"Eje Transversal 4 Gobierno Legitimo, Fortalecimiento Local y Eficiencia"},1559,80126559,"HERNAN DAVID OVALLE BRICEÑO",18220000,null,null,2,6832500,25052500,21712167,"2019-06-26","2019-07-08","2019-12-22",120,45,null,null,null,"x",null,0.86666667997205871,null,{"$f":"IF(SUMPRODUCT((A$14:A174=A174)*(B$14:B174=B174)*(C$14:C174=C174))>1,0,1)","v":1},"Contratos de prestación de servicios profesionales y de apoyo a la gestión","Contratación directa",{"$f":"IFERROR(VLOOKUP(F174,Tipo!$C$12:$C$27,1,FALSE),\"NO\")","v":"Prestación de servicios profesionales y de apoyo a la gestión, o para la ejecución de trabajos artísticos que sólo puedan encomendarse a determinadas personas naturales;"},"Inversión",45]
["162-2019",2019,"FDLBU-CD-132-2019","Contratos de prestación de servicios profesionales y de apoyo a la gestión","Contratación directa","Prestación de servicios profesionales y de apoyo a la gestión, o para la ejecución de trabajos artísticos que sólo puedan encomendarse a determinadas personas naturales;","PRESTAR SERVICIOS PROFESIONALES PARA APOYAR TÉCNICAMENTE LAS DISTINTAS ETAPAS DE LOS PROCESOS DE COMPETENCIA DE LA ALCALDÍA LOCAL PARA LA DEPURACIÓN DE ACTUACIONES ADMINISTRATIVAS ","Inversión",45,{"$f":"IF(ISERROR(VLOOKUP(I175,Eje_Pilar!$C$2:$E$47,2,FALSE)),\" \",VLOOKUP(I175,Eje_Pilar!$C$2:$E$47,2,FALSE))","v":"Gobernanza e influencia local, regional e internacional"},{"$f":"IF(ISERROR(VLOOKUP(I175,Eje_Pilar!$C$2:$E$47,3,FALSE)),\" \",VLOOKUP(I175,Eje_Pilar!$C$2:$E$47,3,FALSE))","v":"Eje Transversal 4 Gobierno Legitimo, Fortalecimiento Local y Eficiencia"},1559,1019045051,"CARLOS IVAN GARCIA QUINTERO",20400000,null,null,null,0,20400000,20400000,"2019-06-26","2019-07-08","2019-11-07",120,0,null,null,null,"x",null,1,null,{"$f":"IF(SUMPRODUCT((A$14:A175=A175)*(B$14:B175=B175)*(C$14:C175=C175))>1,0,1)","v":1},"Contratos de prestación de servicios profesionales y de apoyo a la gestión","Contratación directa",{"$f":"IFERROR(VLOOKUP(F175,Tipo!$C$12:$C$27,1,FALSE),\"NO\")","v":"Prestación de servicios profesionales y de apoyo a la gestión, o para la ejecución de trabajos artísticos que sólo puedan encomendarse a determinadas personas naturales;"},"Inversión",45]
["163-2019",2019,"FDLBU-CD-133-2019","Contratos de prestación de servicios profesionales y de apoyo a la gestión","Contratación directa","Prestación de servicios profesionales y de apoyo a la gestión, o para la ejecución de trabajos artísticos que sólo puedan encomendarse a determinadas personas naturales;","APOYAR LA GESTIÓN DOCUMENTAL DE LA ALCALDÍA LOCAL, ACOMPAÑANDO AL EQUIPO JURÍDICO DE DEPURACIÓN EN LAS LABORES OPERATIVAS QUE GENERA EL PROCESO DE IMPULSO DE LAS ACTUACIONES ADMINISTRATIVAS EXISTENTES EN LAS DIFERENTES ALCALDÍAS LOCALES ","Inversión",45,{"$f":"IF(ISERROR(VLOOKUP(I176,Eje_Pilar!$C$2:$E$47,2,FALSE)),\" \",VLOOKUP(I176,Eje_Pilar!$C$2:$E$47,2,FALSE))","v":"Gobernanza e influencia local, regional e internacional"},{"$f":"IF(ISERROR(VLOOKUP(I176,Eje_Pilar!$C$2:$E$47,3,FALSE)),\" \",VLOOKUP(I176,Eje_Pilar!$C$2:$E$47,3,FALSE))","v":"Eje Transversal 4 Gobierno Legitimo, Fortalecimiento Local y Eficiencia"},1559,1022953015,"ELIANA GRISEL CADENA CANO",7200000,null,null,1,1800000,9000000,8580000,"2019-06-26","2019-07-08","2019-12-07",120,30,null,null,null,"x",null,0.95333333333333337,null,{"$f":"IF(SUMPRODUCT((A$14:A176=A176)*(B$14:B176=B176)*(C$14:C176=C176))>1,0,1)","v":1},"Contratos de prestación de servicios profesionales y de apoyo a la gestión","Contratación directa",{"$f":"IFERROR(VLOOKUP(F176,Tipo!$C$12:$C$27,1,FALSE),\"NO\")","v":"Prestación de servicios profesionales y de apoyo a la gestión, o para la ejecución de trabajos artísticos que sólo puedan encomendarse a determinadas personas naturales;"},"Inversión",45]
["164-2019",2019,"FDLBU-CD-131-2019","Contratos de prestación de servicios profesionales y de apoyo a la gestión","Contratación directa","Prestación de servicios profesionales y de apoyo a la gestión, o para la ejecución de trabajos artísticos que sólo puedan encomendarse a determinadas personas naturales;","APOYAR AL ALCALDE LOCAL EN LA FORMULACIÓN, SEGUIMIENTO E IMPLEMENTACIÓN DE LA ESTRATEGIA LOCAL PARA LA TERMINACIÓN JURÍDICA DE LAS ACTUACIONES ADMINISTRATIVAS QUE CURSAN EN LA ALCALDÍA LOCAL","Inversión",45,{"$f":"IF(ISERROR(VLOOKUP(I177,Eje_Pilar!$C$2:$E$47,2,FALSE)),\" \",VLOOKUP(I177,Eje_Pilar!$C$2:$E$47,2,FALSE))","v":"Gobernanza e influencia local, regional e internacional"},{"$f":"IF(ISERROR(VLOOKUP(I177,Eje_Pilar!$C$2:$E$47,3,FALSE)),\" \",VLOOKUP(I177,Eje_Pilar!$C$2:$E$47,3,FALSE))","v":"Eje Transversal 4 Gobierno Legitimo, Fortalecimiento Local y Eficiencia"},1559,1030582824,"JUAN FELIPE GALINDO NIÑO",18220000,1,-14727833,null,0,3492167,3492167,"2019-06-26","2019-07-08","2019-07-31",120,0,null,null,null,"x",null,1,null,{"$f":"IF(SUMPRODUCT((A$14:A177=A177)*(B$14:B177=B177)*(C$14:C177=C177))>1,0,1)","v":1},"Contratos de prestación de servicios profesionales y de apoyo a la gestión","Contratación directa",{"$f":"IFERROR(VLOOKUP(F177,Tipo!$C$12:$C$27,1,FALSE),\"NO\")","v":"Prestación de servicios profesionales y de apoyo a la gestión, o para la ejecución de trabajos artísticos que sólo puedan encomendarse a determinadas personas naturales;"},"Inversión",45]
["165-2019",2019,"FDLBU-SASI-108-2019","Arrendamiento de bienes muebles","Selección abreviada","Subasta inversa ","CONTRATAR EL ARRENDAMIENTO DE EQUIPOS DE CÓMPUTO E IMPRESORAS MULTIFUNCIONALES CON DESTINO A LAS DIFERENTES DEPENDENCIAS DEL FONDO DE DESARROLLO DE BARRIOS UNIDOS CON EL FIN DE ATENDER LAS NECESIDADES TECNOLÓGICAS DEL MISMO, CON EL DEBIDO MANTENIMIENTO PREVENTIVO Y CORRECTIVO DE LOS EQUIPOS, ASÍ COMO EL SOPORTE Y LA ASISTENCIA TÉCNICA POR PARTE DEL CONTRATISTA","Funcionamiento",null,{"$f":"IF(ISERROR(VLOOKUP(I178,Eje_Pilar!$C$2:$E$47,2,FALSE)),\" \",VLOOKUP(I178,Eje_Pilar!$C$2:$E$47,2,FALSE))","v":" "},{"$f":"IF(ISERROR(VLOOKUP(I178,Eje_Pilar!$C$2:$E$47,3,FALSE)),\" \",VLOOKUP(I178,Eje_Pilar!$C$2:$E$47,3,FALSE))","v":" "},null,900171311,"TECHNOLOGY WORLD GROUP SAS",109163657.40000001,null,null,null,0,109163657.40000001,36387724,"2019-07-08","2019-07-26","2020-07-02",360,0,null,null,"x",null,null,0.3333318511550713,null,{"$f":"IF(SUMPRODUCT((A$14:A178=A178)*(B$14:B178=B178)*(C$14:C178=C178))>1,0,1)","v":1},"Arrendamiento de bienes muebles","Selección abreviada",{"$f":"IFERROR(VLOOKUP(F178,Tipo!$C$12:$C$27,1,FALSE),\"NO\")","v":"Subasta inversa "},"Funcionamiento","NO"]
["166-2019",2019,"FDLBU-MC-136-2019","Contratos de prestación de servicios","Contratación mínima cuantia","No aplica","REVISIÓN, INSPECCIÓN, MANTENIMIENTO Y RECARGA DE LOS EXTINTORES DEL FONDO DE DESARROLLO LOCAL BARRIOS UNIDOS QUE SE ENCUENTREN EN SUS INSTALACIONES O BAJO SU RESPONSABILIDAD","Funcionamiento",null,{"$f":"IF(ISERROR(VLOOKUP(I179,Eje_Pilar!$C$2:$E$47,2,FALSE)),\" \",VLOOKUP(I179,Eje_Pilar!$C$2:$E$47,2,FALSE))","v":" "},{"$f":"IF(ISERROR(VLOOKUP(I179,Eje_Pilar!$C$2:$E$47,3,FALSE)),\" \",VLOOKUP(I179,Eje_Pilar!$C$2:$E$47,3,FALSE))","v":" "},null,"79.462.159-1","LUIS GUIOVANNY JIMENEZ MORA propietario del establecimiento de comercio FABRICA DE EXTINTORES NACIONAL",1493000,null,null,null,0,1493000,1493000,"2019-07-29","2019-07-30","2019-09-29",60,0,null,null,null,"x",null,1,null,{"$f":"IF(SUMPRODUCT((A$14:A179=A179)*(B$14:B179=B179)*(C$14:C179=C179))>1,0,1)","v":1},"Contratos de prestación de servicios","Contratación mínima cuantia",{"$f":"IFERROR(VLOOKUP(F179,Tipo!$C$12:$C$27,1,FALSE),\"NO\")","v":"NO"},"Funcionamiento","NO"]
["167-2019",2019,"FDLBU-LP-111-2019","Contratos de prestación de servicios","Licitación pública","No aplica","PRESTAR SERVICIOS DE APOYO PARA EL FORTALECIMIENTO A LOS AGENTES CULTURALES DE LA LOCALIDAD EN PROCESOS DE FORMACIÓN Y CIRCULACIÓN QUE PROMUEVAN LAS PRÁCTICAS Y DIMENSIONES ARTÍSTICAS, CULTURALES Y TRADICIONALES DE LA LOCALIDAD DE BARRIOS UNIDOS","Inversión",11,{"$f":"IF(ISERROR(VLOOKUP(I180,Eje_Pilar!$C$2:$E$47,2,FALSE)),\" \",VLOOKUP(I180,Eje_Pilar!$C$2:$E$47,2,FALSE))","v":"Mejores oportunidades para el desarrollo a través de la cultura, la recreación y el deporte"},{"$f":"IF(ISERROR(VLOOKUP(I180,Eje_Pilar!$C$2:$E$47,3,FALSE)),\" \",VLOOKUP(I180,Eje_Pilar!$C$2:$E$47,3,FALSE))","v":"Pilar 1 Igualdad de Calidad de Vida"},791,"901.308.300-7","UNIÓN TEMPORAL ASOCIACIÓN LOGÍSTICA conformada por la ASOCIACIÓN DE HOGARES SI A LA VIDA con un porcentaje de participación del 50% y CARLOS ALBERTO PINZÓN MOLINA con un porcentaje de participación del 50% ",454487184,null,null,null,0,454487184,66969550,"2019-07-30","2019-08-02","2020-04-01",240,0,null,null,"x",null,null,0.14735189980626603,null,{"$f":"IF(SUMPRODUCT((A$14:A180=A180)*(B$14:B180=B180)*(C$14:C180=C180))>1,0,1)","v":1},"Contratos de prestación de servicios","Licitación pública",{"$f":"IFERROR(VLOOKUP(F180,Tipo!$C$12:$C$27,1,FALSE),\"NO\")","v":"NO"},"Inversión",11]
["168-2019",2019,"FDLBU-SASI-134-2019","Contratos de prestación de servicios","Selección abreviada","Subasta inversa ","PRESTACIÓN DEL SERVICIO DE VIGILANCIA Y SEGURIDAD PRIVADA PARA LAS INSTALA-CIONES DEL FONDO DE DESARROLLO LOCAL DE BARRIOS UNIDOS ","Funcionamiento",null,{"$f":"IF(ISERROR(VLOOKUP(I181,Eje_Pilar!$C$2:$E$47,2,FALSE)),\" \",VLOOKUP(I181,Eje_Pilar!$C$2:$E$47,2,FALSE))","v":" "},{"$f":"IF(ISERROR(VLOOKUP(I181,Eje_Pilar!$C$2:$E$47,3,FALSE)),\" \",VLOOKUP(I181,Eje_Pilar!$C$2:$E$47,3,FALSE))","v":" "},null,"891.502.104-5","COVISUR DE COLOMBIA LTDA",272259296.04009902,null,null,null,0,272259296.04009902,104870251,"2019-08-14","2019-08-18","2020-05-17",270,0,null,null,"x",null,null,0.38518519854159339,null,{"$f":"IF(SUMPRODUCT((A$14:A181=A181)*(B$14:B181=B181)*(C$14:C181=C181))>1,0,1)","v":1},"Contratos de prestación de servicios","Selección abreviada",{"$f":"IFERROR(VLOOKUP(F181,Tipo!$C$12:$C$27,1,FALSE),\"NO\")","v":"Subasta inversa "},"Funcionamiento","NO"]
["169-2019",2019,"FDLBU-MC-137-2019","Compraventa de bienes muebles","Contratación mínima cuantia","No aplica","CONTRATAR LOS SERVICIOS DE APOYO PARA LA REALIZACIÓN DEL FORO EDUCATIVO LOCAL DE BARRIOS UNIDOS","Inversión",45,{"$f":"IF(ISERROR(VLOOKUP(I182,Eje_Pilar!$C$2:$E$47,2,FALSE)),\" \",VLOOKUP(I182,Eje_Pilar!$C$2:$E$47,2,FALSE))","v":"Gobernanza e influencia local, regional e internacional"},{"$f":"IF(ISERROR(VLOOKUP(I182,Eje_Pilar!$C$2:$E$47,3,FALSE)),\" \",VLOOKUP(I182,Eje_Pilar!$C$2:$E$47,3,FALSE))","v":"Eje Transversal 4 Gobierno Legitimo, Fortalecimiento Local y Eficiencia"},1562,"900.810.120-6 ","PEOPLE SECURITY SAS ",6430000,null,null,1,900000,7330000,7330000,"2019-08-23","2019-08-23","2019-10-26",30,9.9000000000000021,null,null,null,"x",null,1,null,{"$f":"IF(SUMPRODUCT((A$14:A182=A182)*(B$14:B182=B182)*(C$14:C182=C182))>1,0,1)","v":1},"Compraventa de bienes muebles","Contratación mínima cuantia",{"$f":"IFERROR(VLOOKUP(F182,Tipo!$C$12:$C$27,1,FALSE),\"NO\")","v":"NO"},"Inversión",45]
["170-2019",2019,"FDLBU-LP-112-2019","Contratos de prestación de servicios","Licitación pública","No aplica","FORTALECER INSTANCIAS DE PARTICIPACIÓN,\nORGANIZACIONES Y EXPRESIONES SOCIALES MEDIANTE APOYO A INICIATIVAS CIUDADANAS Y LA FORMACIÓN EN TEMAS RELACIONADOS AL CONTROL SOCIAL\nEN LA LOCALIDAD DE BARRIOS UNIDOS","Inversión",45,{"$f":"IF(ISERROR(VLOOKUP(I183,Eje_Pilar!$C$2:$E$47,2,FALSE)),\" \",VLOOKUP(I183,Eje_Pilar!$C$2:$E$47,2,FALSE))","v":"Gobernanza e influencia local, regional e internacional"},{"$f":"IF(ISERROR(VLOOKUP(I183,Eje_Pilar!$C$2:$E$47,3,FALSE)),\" \",VLOOKUP(I183,Eje_Pilar!$C$2:$E$47,3,FALSE))","v":"Eje Transversal 4 Gobierno Legitimo, Fortalecimiento Local y Eficiencia"},1562,"900.059.551-6","CORPORACIÓN SOLUCIONES TÉCNICAS AGROPECUARIAS Y AMBIENTALES – SOTEA",233972186,null,null,null,0,233972186,24102733,"2019-08-29","2019-09-02","2020-04-01",210,0,null,null,"x",null,null,0.10301537722094882,null,{"$f":"IF(SUMPRODUCT((A$14:A183=A183)*(B$14:B183=B183)*(C$14:C183=C183))>1,0,1)","v":1},"Contratos de prestación de servicios","Licitación pública",{"$f":"IFERROR(VLOOKUP(F183,Tipo!$C$12:$C$27,1,FALSE),\"NO\")","v":"NO"},"Inversión",45]
["171-2019",2019,"FDLBU-SAMC-139-2019","Contratos de prestación de servicios","Selección abreviada","Selección abreviada por menor cuantía ","REALIZAR ACCIONES CON ENFOQUE INTEGRAL QUE FORTALEZCAN LA PROMOCIÓN DEL BUEN TRATO INFANTIL EN LA LOCALIDAD, EN EL MARCO DEL PROYECTO No. 1533","Inversión",2,{"$f":"IF(ISERROR(VLOOKUP(I184,Eje_Pilar!$C$2:$E$47,2,FALSE)),\" \",VLOOKUP(I184,Eje_Pilar!$C$2:$E$47,2,FALSE))","v":"Desarrollo integral desde la gestación hasta la adolescencia"},{"$f":"IF(ISERROR(VLOOKUP(I184,Eje_Pilar!$C$2:$E$47,3,FALSE)),\" \",VLOOKUP(I184,Eje_Pilar!$C$2:$E$47,3,FALSE))","v":"Pilar 1 Igualdad de Calidad de Vida"},1533,"900.018.217-5\n","FUNDACIÓN OTRO ROLLO SOCIAL ",95870684,null,null,null,0,95870684,42135877,"01/10/0219","2019-10-09","2020-03-18",90,0,null,null,"x",null,null,0.43950742022451827,null,{"$f":"IF(SUMPRODUCT((A$14:A184=A184)*(B$14:B184=B184)*(C$14:C184=C184))>1,0,1)","v":1},"Contratos de prestación de servicios","Selección abreviada",{"$f":"IFERROR(VLOOKUP(F184,Tipo!$C$12:$C$27,1,FALSE),\"NO\")","v":"Selección abreviada por menor cuantía "},"Inversión",2]
["172-2019",2019,"FDLBU-MC-141-2019","Contratos de prestación de servicios","Contratación mínima cuantia","No aplica","REALIZAR LA TOMA FÍSICA DE INVENTARIO Y EL AVALÚO TÉCNICO DE LOS BIENES MUEBLES E INMUEBLES DE PROPIEDAD Y/O A CARGO DEL FONDO DE DESARROLLO LOCAL DE BARRIOS UNIDOS, CON EL ALCANCE SEÑALADO PARA CADA TIPO DE BIEN","Inversión",45,{"$f":"IF(ISERROR(VLOOKUP(I185,Eje_Pilar!$C$2:$E$47,2,FALSE)),\" \",VLOOKUP(I185,Eje_Pilar!$C$2:$E$47,2,FALSE))","v":"Gobernanza e influencia local, regional e internacional"},{"$f":"IF(ISERROR(VLOOKUP(I185,Eje_Pilar!$C$2:$E$47,3,FALSE)),\" \",VLOOKUP(I185,Eje_Pilar!$C$2:$E$47,3,FALSE))","v":"Eje Transversal 4 Gobierno Legitimo, Fortalecimiento Local y Eficiencia"},1559,"19.214.464-2","LUIS EDUARDO CARVAJALINO SÁNCHEZ",4300000,null,null,null,0,4300000,0,"2019-10-02","2019-10-15","2019-12-30",75,0,null,null,null,"x",null,0,null,{"$f":"IF(SUMPRODUCT((A$14:A185=A185)*(B$14:B185=B185)*(C$14:C185=C185))>1,0,1)","v":1},"Contratos de prestación de servicios","Contratación mínima cuantia",{"$f":"IFERROR(VLOOKUP(F185,Tipo!$C$12:$C$27,1,FALSE),\"NO\")","v":"NO"},"Inversión",45]
["173-2019",2019,"FDLBU-MC-138-2019","Contratos de prestación de servicios","Contratación mínima cuantia","No aplica","MANTENIMIENTO PREVENTIVO Y CORRECTIVO DE LA PLANTA TELEFÓNICA Y LA RED DE VOZ DE LA ALCALDÍA LOCAL DE BARRIOS UNIDOS","Funcionamiento",null,{"$f":"IF(ISERROR(VLOOKUP(I186,Eje_Pilar!$C$2:$E$47,2,FALSE)),\" \",VLOOKUP(I186,Eje_Pilar!$C$2:$E$47,2,FALSE))","v":" "},{"$f":"IF(ISERROR(VLOOKUP(I186,Eje_Pilar!$C$2:$E$47,3,FALSE)),\" \",VLOOKUP(I186,Eje_Pilar!$C$2:$E$47,3,FALSE))","v":" "},null,"901.012.714-0","GAMA COMPAÑIA S.A.S.",6974000,null,null,null,0,6974000,0,"2019-10-17","2019-10-18","2020-08-17",300,0,null,null,"x",null,null,0,null,{"$f":"IF(SUMPRODUCT((A$14:A186=A186)*(B$14:B186=B186)*(C$14:C186=C186))>1,0,1)","v":1},"Contratos de prestación de servicios","Contratación mínima cuantia",{"$f":"IFERROR(VLOOKUP(F186,Tipo!$C$12:$C$27,1,FALSE),\"NO\")","v":"NO"},"Funcionamiento","NO"]
["174-2019",2019,"FDLBU-MC-142-2019","Suministro","Contratación mínima cuantia","No aplica","SUMINISTRAR A MONTO AGOTABLE LOS ELEMENTOS DE FERRETERÍA NECESARIOS PARA LAS REPARACIONES LOCATIVAS DE LAS INSTALACIONES Y DEMAS BIENES INMUEBLES DE LA ALCALDÍA LOCAL DE BARRIOS UNIDOS","Funcionamiento",null,{"$f":"IF(ISERROR(VLOOKUP(I187,Eje_Pilar!$C$2:$E$47,2,FALSE)),\" \",VLOOKUP(I187,Eje_Pilar!$C$2:$E$47,2,FALSE))","v":" "},{"$f":"IF(ISERROR(VLOOKUP(I187,Eje_Pilar!$C$2:$E$47,3,FALSE)),\" \",VLOOKUP(I187,Eje_Pilar!$C$2:$E$47,3,FALSE))","v":" "},null,"900.960.810-2","DIEGO CASTRO INDUSTRIA Y CONSTRUCCIÓN S.A.S",22000000,null,null,null,0,22000000,4567600,"2019-10-18","2019-10-24","2020-04-23",180,0,null,null,"x",null,null,0.20761818181818181,null,{"$f":"IF(SUMPRODUCT((A$14:A187=A187)*(B$14:B187=B187)*(C$14:C187=C187))>1,0,1)","v":1},"Suministro","Contratación mínima cuantia",{"$f":"IFERROR(VLOOKUP(F187,Tipo!$C$12:$C$27,1,FALSE),\"NO\")","v":"NO"},"Funcionamiento","NO"]
["175-2019",2019,"FDLBU-SASI-140-2019","Compraventa de bienes muebles","Selección abreviada","Subasta inversa ","DOTAR CON ELEMENTOS PEDAGOGICOS QUE FACILITEN EL DESARROLLO DE HABILIDADES Y CONOCIMIENTOS DE LOS NIÑOS Y LAS NIÑAS DE LOS JARDINES INFANTILES EN LA LOCALIDAD DE BARRIOS UNIDOS","Inversión",2,{"$f":"IF(ISERROR(VLOOKUP(I188,Eje_Pilar!$C$2:$E$47,2,FALSE)),\" \",VLOOKUP(I188,Eje_Pilar!$C$2:$E$47,2,FALSE))","v":"Desarrollo integral desde la gestación hasta la adolescencia"},{"$f":"IF(ISERROR(VLOOKUP(I188,Eje_Pilar!$C$2:$E$47,3,FALSE)),\" \",VLOOKUP(I188,Eje_Pilar!$C$2:$E$47,3,FALSE))","v":"Pilar 1 Igualdad de Calidad de Vida"},1533,"900.552.715-0","GRUPO EMPRESARIAL MADEX S.A.S.",278847342.92000002,null,null,null,0,278847342.92000002,0,"2019-10-22","2019-11-19","2020-02-18",90,0,null,null,"x",null,null,0,null,{"$f":"IF(SUMPRODUCT((A$14:A188=A188)*(B$14:B188=B188)*(C$14:C188=C188))>1,0,1)","v":1},"Compraventa de bienes muebles","Selección abreviada",{"$f":"IFERROR(VLOOKUP(F188,Tipo!$C$12:$C$27,1,FALSE),\"NO\")","v":"Subasta inversa "},"Inversión",2]
["176-2019",2019,"FDLBU-CD-144-2019","Contratos de prestación de servicios profesionales y de apoyo a la gestión","Contratación directa","Prestación de servicios profesionales y de apoyo a la gestión, o para la ejecución de trabajos artísticos que sólo puedan encomendarse a determinadas personas naturales;","PRESTAR LOS SERVICIOS DE APOYO EN EL ÁREA DE GESTIÓN DEL DESARROLLO LOCAL DE LA ALCALDÍA LOCAL DE BARRIOS UNIDOS EN EL OFICINA DE PLANEACIÓN, PARA LOGRAR EL CUMPLIMIENTO DE LAS METAS DEL PLAN DE DESARROLLO LOCAL DE LA VIGENCIA","Inversión",45,{"$f":"IF(ISERROR(VLOOKUP(I189,Eje_Pilar!$C$2:$E$47,2,FALSE)),\" \",VLOOKUP(I189,Eje_Pilar!$C$2:$E$47,2,FALSE))","v":"Gobernanza e influencia local, regional e internacional"},{"$f":"IF(ISERROR(VLOOKUP(I189,Eje_Pilar!$C$2:$E$47,3,FALSE)),\" \",VLOOKUP(I189,Eje_Pilar!$C$2:$E$47,3,FALSE))","v":"Eje Transversal 4 Gobierno Legitimo, Fortalecimiento Local y Eficiencia"},1559,52424617,"ZAYRA MERCEDES CASTILLO ACOSTA",7700000,null,null,1,3850000,11550000,3208333,"2019-11-06","2019-11-06","2020-02-05",60,30,null,null,"x",null,null,0.27777774891774892,null,{"$f":"IF(SUMPRODUCT((A$14:A189=A189)*(B$14:B189=B189)*(C$14:C189=C189))>1,0,1)","v":1},"Contratos de prestación de servicios profesionales y de apoyo a la gestión","Contratación directa",{"$f":"IFERROR(VLOOKUP(F189,Tipo!$C$12:$C$27,1,FALSE),\"NO\")","v":"Prestación de servicios profesionales y de apoyo a la gestión, o para la ejecución de trabajos artísticos que sólo puedan encomendarse a determinadas personas naturales;"},"Inversión",45]
["177-2019",2019,"FDLBU-CD-145-2019","Contratos de prestación de servicios profesionales y de apoyo a la gestión","Contratación directa","Prestación de servicios profesionales y de apoyo a la gestión, o para la ejecución de trabajos artísticos que sólo puedan encomendarse a determinadas personas naturales;","PRESTAR SUS SERVICIOS OROFESIONALES PARA APOYAR AL EQUIPO DE PRENSA Y COMUNICACIONES DE LA ALCALDÍA LOCAL EN LA REALIZACIÓN Y PUBLICACIÓN DE CONTENIDOS DE REDES SOCIALES Y CANALES DE DIVULGACIÓN DIGITAL (SITIO WEB) DE LA ALCALDÍA LOCAL","Inversión",45,{"$f":"IF(ISERROR(VLOOKUP(I190,Eje_Pilar!$C$2:$E$47,2,FALSE)),\" \",VLOOKUP(I190,Eje_Pilar!$C$2:$E$47,2,FALSE))","v":"Gobernanza e influencia local, regional e internacional"},{"$f":"IF(ISERROR(VLOOKUP(I190,Eje_Pilar!$C$2:$E$47,3,FALSE)),\" \",VLOOKUP(I190,Eje_Pilar!$C$2:$E$47,3,FALSE))","v":"Eje Transversal 4 Gobierno Legitimo, Fortalecimiento Local y Eficiencia"},1559,80221073,"JEISSON CAMILO URBINA MARTINEZ",9110000,null,null,1,3492166,12602166,3492167,"2019-11-08","2019-11-08","2020-01-30",60,23.1,null,null,"x",null,null,0.27710847484472112,null,{"$f":"IF(SUMPRODUCT((A$14:A190=A190)*(B$14:B190=B190)*(C$14:C190=C190))>1,0,1)","v":1},"Contratos de prestación de servicios profesionales y de apoyo a la gestión","Contratación directa",{"$f":"IFERROR(VLOOKUP(F190,Tipo!$C$12:$C$27,1,FALSE),\"NO\")","v":"Prestación de servicios profesionales y de apoyo a la gestión, o para la ejecución de trabajos artísticos que sólo puedan encomendarse a determinadas personas naturales;"},"Inversión",45]
["178-2019",2019,"FDLBU-CD-146-2019","Contratos de prestación de servicios profesionales y de apoyo a la gestión","Contratación directa","Prestación de servicios profesionales y de apoyo a la gestión, o para la ejecución de trabajos artísticos que sólo puedan encomendarse a determinadas personas naturales;","PRESTAR LOS SERVICIOS PROFESIONALES PARA APOYAR AL ÁREA GESTIÓN DEL DESARROLLO ADMINISTRATIVO Y FINANCIERO EN LOS ASUNTOS RELATIVOS A LA PLANEACIÓN LOCAL, ASÍ COMO EL APOYO A LA SUPERVISIÓN DE CONTRATOS SUSCRITOS POR LA ALCALDÍA LOCAL DE BARRIOS UNIDOS","Inversión",45,{"$f":"IF(ISERROR(VLOOKUP(I191,Eje_Pilar!$C$2:$E$47,2,FALSE)),\" \",VLOOKUP(I191,Eje_Pilar!$C$2:$E$47,2,FALSE))","v":"Gobernanza e influencia local, regional e internacional"},{"$f":"IF(ISERROR(VLOOKUP(I191,Eje_Pilar!$C$2:$E$47,3,FALSE)),\" \",VLOOKUP(I191,Eje_Pilar!$C$2:$E$47,3,FALSE))","v":"Eje Transversal 4 Gobierno Legitimo, Fortalecimiento Local y Eficiencia"},1559,1019028211,"LAURA CATALINA MARTÍNEZ CASTILLO",9110000,null,null,null,0,9110000,3492167,"2019-11-08","2019-11-08","2020-01-20",60,0,null,null,"x",null,null,0.38333336992316136,null,{"$f":"IF(SUMPRODUCT((A$14:A191=A191)*(B$14:B191=B191)*(C$14:C191=C191))>1,0,1)","v":1},"Contratos de prestación de servicios profesionales y de apoyo a la gestión","Contratación directa",{"$f":"IFERROR(VLOOKUP(F191,Tipo!$C$12:$C$27,1,FALSE),\"NO\")","v":"Prestación de servicios profesionales y de apoyo a la gestión, o para la ejecución de trabajos artísticos que sólo puedan encomendarse a determinadas personas naturales;"},"Inversión",45]
["180-2019",2019,"FDLBU-CD-148-2019","Contratos de prestación de servicios profesionales y de apoyo a la gestión","Contratación directa","Prestación de servicios profesionales y de apoyo a la gestión, o para la ejecución de trabajos artísticos que sólo puedan encomendarse a determinadas personas naturales;","PRESTAR SERVICIOS DE APOYO A LA GESTION PARA APOYAR LA GESTION DOCUMENTAL DE LA ALACALDIA LOCAL EN LA IMPLEMENTACION DE LOS PROCESOS DE CLASIFICACION, ORDENACION, SELECCION NATURAL, FOLIACION, IDENTIFICACION, LEVANTAMIENTO DE INVENTARIOS, ALMACENAMIENTO Y APLICACIÓN DE PROTOCOLOS DE ELIMINACIÓN Y TRANSFERENCIAS DOCUMENTALES","Inversión",45,{"$f":"IF(ISERROR(VLOOKUP(I192,Eje_Pilar!$C$2:$E$47,2,FALSE)),\" \",VLOOKUP(I192,Eje_Pilar!$C$2:$E$47,2,FALSE))","v":"Gobernanza e influencia local, regional e internacional"},{"$f":"IF(ISERROR(VLOOKUP(I192,Eje_Pilar!$C$2:$E$47,3,FALSE)),\" \",VLOOKUP(I192,Eje_Pilar!$C$2:$E$47,3,FALSE))","v":"Eje Transversal 4 Gobierno Legitimo, Fortalecimiento Local y Eficiencia"},1559,41778154,"LUZ MYRIAM PEÑA SANCHEZ",3300000,null,null,1,1613333,4913333,1173333,"2019-11-14","2019-11-15","2020-01-22",45,21.9,null,null,"x",null,null,0.2388059185078642,null,{"$f":"IF(SUMPRODUCT((A$14:A192=A192)*(B$14:B192=B192)*(C$14:C192=C192))>1,0,1)","v":1},"Contratos de prestación de servicios profesionales y de apoyo a la gestión","Contratación directa",{"$f":"IFERROR(VLOOKUP(F192,Tipo!$C$12:$C$27,1,FALSE),\"NO\")","v":"Prestación de servicios profesionales y de apoyo a la gestión, o para la ejecución de trabajos artísticos que sólo puedan encomendarse a determinadas personas naturales;"},"Inversión",45]
["181-2019",2019,"FDLBU-CD-149-2019","Contratos de prestación de servicios profesionales y de apoyo a la gestión","Contratación directa","Prestación de servicios profesionales y de apoyo a la gestión, o para la ejecución de trabajos artísticos que sólo puedan encomendarse a determinadas personas naturales;","PRESTAR SERVICIOS PROFESIONALES DE APOYO A LA OFICINA DE PRESUPUESTO DEL FONDO DE DESARROLLO LOCAL EN EL REGISTRO, ANÁLISIS Y GESTIÓN DE OBLIGACIONES POR PAGAR Y OTROS ASUNTOS QUE EN MATERIA DE PRESUPUESTO LOCAL LE SEAN DESIGNADOS","Inversión",45,{"$f":"IF(ISERROR(VLOOKUP(I193,Eje_Pilar!$C$2:$E$47,2,FALSE)),\" \",VLOOKUP(I193,Eje_Pilar!$C$2:$E$47,2,FALSE))","v":"Gobernanza e influencia local, regional e internacional"},{"$f":"IF(ISERROR(VLOOKUP(I193,Eje_Pilar!$C$2:$E$47,3,FALSE)),\" \",VLOOKUP(I193,Eje_Pilar!$C$2:$E$47,3,FALSE))","v":"Eje Transversal 4 Gobierno Legitimo, Fortalecimiento Local y Eficiencia"},1559,7320162,"JOSÉ RAÚL PINILLA CHILLÓN",9110000,null,null,1,2429333,11539333,2429333,"2019-11-15","2019-11-15","2020-01-30",60,15.899999999999995,null,null,"x",null,null,0.21052629298417855,null,{"$f":"IF(SUMPRODUCT((A$14:A193=A193)*(B$14:B193=B193)*(C$14:C193=C193))>1,0,1)","v":1},"Contratos de prestación de servicios profesionales y de apoyo a la gestión","Contratación directa",{"$f":"IFERROR(VLOOKUP(F193,Tipo!$C$12:$C$27,1,FALSE),\"NO\")","v":"Prestación de servicios profesionales y de apoyo a la gestión, o para la ejecución de trabajos artísticos que sólo puedan encomendarse a determinadas personas naturales;"},"Inversión",45]
["182-2019",2019,"FDLBU-CD-154-2019","Contratos de prestación de servicios profesionales y de apoyo a la gestión","Contratación directa","Prestación de servicios profesionales y de apoyo a la gestión, o para la ejecución de trabajos artísticos que sólo puedan encomendarse a determinadas personas naturales;","PRESTAR LOS SERVICIOS DE APOYO A LA GESTION DE CONDUCCIÓN DE LOS VEHICULOS  A VARGO DEL FONDO DE DESARROLLO LOZAL DE BARRIOS UNIDOS, ASI COMO APOYAR LA GESTIÓN ADMINISTRATIVA QUE DESIGNE EL SUPERVISOR","Inversión",45,{"$f":"IF(ISERROR(VLOOKUP(I194,Eje_Pilar!$C$2:$E$47,2,FALSE)),\" \",VLOOKUP(I194,Eje_Pilar!$C$2:$E$47,2,FALSE))","v":"Gobernanza e influencia local, regional e internacional"},{"$f":"IF(ISERROR(VLOOKUP(I194,Eje_Pilar!$C$2:$E$47,3,FALSE)),\" \",VLOOKUP(I194,Eje_Pilar!$C$2:$E$47,3,FALSE))","v":"Eje Transversal 4 Gobierno Legitimo, Fortalecimiento Local y Eficiencia"},1559,79501810,"CARLOS EDUARDO LOPEZ BRICEÑO",3300000,null,null,1,1613333.333333333,4913333.333333333,1173333,"2019-11-15","2019-11-15","2020-01-22",45,21.9,null,null,"x",null,null,0.23880590230664858,null,{"$f":"IF(SUMPRODUCT((A$14:A194=A194)*(B$14:B194=B194)*(C$14:C194=C194))>1,0,1)","v":1},"Contratos de prestación de servicios profesionales y de apoyo a la gestión","Contratación directa",{"$f":"IFERROR(VLOOKUP(F194,Tipo!$C$12:$C$27,1,FALSE),\"NO\")","v":"Prestación de servicios profesionales y de apoyo a la gestión, o para la ejecución de trabajos artísticos que sólo puedan encomendarse a determinadas personas naturales;"},"Inversión",45]
["183-2019",2019,"FDLBU-CD-155-2019","Contratos de prestación de servicios profesionales y de apoyo a la gestión","Contratación directa","Prestación de servicios profesionales y de apoyo a la gestión, o para la ejecución de trabajos artísticos que sólo puedan encomendarse a determinadas personas naturales;","PRESTAR LOS SERVICIOS DE APOYO A LA GESTION DE CONDUCCIÓN DE LOS VEHICULOS  A VARGO DEL FONDO DE DESARROLLO LOZAL DE BARRIOS UNIDOS, ASI COMO APOYAR LA GESTIÓN ADMINISTRATIVA QUE DESIGNE EL SUPERVISOR","Inversión",45,{"$f":"IF(ISERROR(VLOOKUP(I195,Eje_Pilar!$C$2:$E$47,2,FALSE)),\" \",VLOOKUP(I195,Eje_Pilar!$C$2:$E$47,2,FALSE))","v":"Gobernanza e influencia local, regional e internacional"},{"$f":"IF(ISERROR(VLOOKUP(I195,Eje_Pilar!$C$2:$E$47,3,FALSE)),\" \",VLOOKUP(I195,Eje_Pilar!$C$2:$E$47,3,FALSE))","v":"Eje Transversal 4 Gobierno Legitimo, Fortalecimiento Local y Eficiencia"},1559,8717340,"NELSON CARDENAS VALENCIA",3300000,null,null,1,1613333,4913333,1173333,"2019-11-15","2019-11-15","2020-01-22",45,21.9,null,null,"x",null,null,0.2388059185078642,null,{"$f":"IF(SUMPRODUCT((A$14:A195=A195)*(B$14:B195=B195)*(C$14:C195=C195))>1,0,1)","v":1},"Contratos de prestación de servicios profesionales y de apoyo a la gestión","Contratación directa",{"$f":"IFERROR(VLOOKUP(F195,Tipo!$C$12:$C$27,1,FALSE),\"NO\")","v":"Prestación de servicios profesionales y de apoyo a la gestión, o para la ejecución de trabajos artísticos que sólo puedan encomendarse a determinadas personas naturales;"},"Inversión",45]
["184-2019",2019,"FDLBU-CD-151","Contratos de prestación de servicios profesionales y de apoyo a la gestión","Contratación directa","Prestación de servicios profesionales y de apoyo a la gestión, o para la ejecución de trabajos artísticos que sólo puedan encomendarse a determinadas personas naturales;","PRESTAR SERVICIOS PROFESIONALES PARA APOYAR AL ÁREA GESTIÓN DEL DESARROLLO – ADMINISTRATIVO Y FINANCIERO EN LOS ASUNTOS RELATIVOS A LA PLANEACIÓN LOCAL, EN LA SUPERVISIÓN DE CONTRATOS SUSCRITOS POR LA ALCALDÍA LOCAL DE BARRIOS UNIDOS DIRIGIDOS AL OTORGAMIENTO DE AYUDAS TÉCNICAS Y LO RELACIONADO CON ASISTENCIA PERSONAL, MEJORAMIENTO DE LA CALIDAD DE VIDA Y PROMOCIÓN DEL BIENESTAR PARA PERSONAS CON DISCAPACIDAD O EN ESTADO DE VULNERABILIDAD","Inversión",3,{"$f":"IF(ISERROR(VLOOKUP(I196,Eje_Pilar!$C$2:$E$47,2,FALSE)),\" \",VLOOKUP(I196,Eje_Pilar!$C$2:$E$47,2,FALSE))","v":"Igualdad y autonomía para una Bogotá incluyente"},{"$f":"IF(ISERROR(VLOOKUP(I196,Eje_Pilar!$C$2:$E$47,3,FALSE)),\" \",VLOOKUP(I196,Eje_Pilar!$C$2:$E$47,3,FALSE))","v":"Pilar 1 Igualdad de Calidad de Vida"},1556,1026572572,"JUAN CARLOS SANCHEZ SOLANO",8400000,null,null,1,1820000,10220000,1820000,"2019-11-18","2019-11-18","2020-01-30",60,12.900000000000006,null,null,"x",null,null,0.17808219178082191,null,{"$f":"IF(SUMPRODUCT((A$14:A196=A196)*(B$14:B196=B196)*(C$14:C196=C196))>1,0,1)","v":1},"Contratos de prestación de servicios profesionales y de apoyo a la gestión","Contratación directa",{"$f":"IFERROR(VLOOKUP(F196,Tipo!$C$12:$C$27,1,FALSE),\"NO\")","v":"Prestación de servicios profesionales y de apoyo a la gestión, o para la ejecución de trabajos artísticos que sólo puedan encomendarse a determinadas personas naturales;"},"Inversión",3]
["185-2019",2019,"FDLBU-CD-157-2019","Contratos de prestación de servicios profesionales y de apoyo a la gestión","Contratación directa","Prestación de servicios profesionales y de apoyo a la gestión, o para la ejecución de trabajos artísticos que sólo puedan encomendarse a determinadas personas naturales;","PRESTAR SUS SERVICIOS PROFESIONALES PARA LA IMPLEMENTACION DE LAS ACCIONES Y LINEAMIENTOS TECNICOS SURTIDOS DEL PROGRAMA DE GFESTION DOCUMENTAL Y DEMAS INSTRUMENTOS TÉCNICOS ARCHIVISTICOS","Inversión",45,{"$f":"IF(ISERROR(VLOOKUP(I197,Eje_Pilar!$C$2:$E$47,2,FALSE)),\" \",VLOOKUP(I197,Eje_Pilar!$C$2:$E$47,2,FALSE))","v":"Gobernanza e influencia local, regional e internacional"},{"$f":"IF(ISERROR(VLOOKUP(I197,Eje_Pilar!$C$2:$E$47,3,FALSE)),\" \",VLOOKUP(I197,Eje_Pilar!$C$2:$E$47,3,FALSE))","v":"Eje Transversal 4 Gobierno Legitimo, Fortalecimiento Local y Eficiencia"},1559,52897368,"MÓNICA MARÍA NAVARRETE CRUZ",9110000,null,null,1,1366500,10476500,1366500,"2019-11-19","2019-11-22","2020-02-21",60,30,null,null,"x",null,null,0.13043478260869565,null,{"$f":"IF(SUMPRODUCT((A$14:A197=A197)*(B$14:B197=B197)*(C$14:C197=C197))>1,0,1)","v":1},"Contratos de prestación de servicios profesionales y de apoyo a la gestión","Contratación directa",{"$f":"IFERROR(VLOOKUP(F197,Tipo!$C$12:$C$27,1,FALSE),\"NO\")","v":"Prestación de servicios profesionales y de apoyo a la gestión, o para la ejecución de trabajos artísticos que sólo puedan encomendarse a determinadas personas naturales;"},"Inversión",45]
["186-2019",2019,"FDLBU-CD-153-2019","Contratos de prestación de servicios profesionales y de apoyo a la gestión","Contratación directa","Prestación de servicios profesionales y de apoyo a la gestión, o para la ejecución de trabajos artísticos que sólo puedan encomendarse a determinadas personas naturales;","PRESTAR SERVICIOS DE APOYO AL AREA DE GESTION DEL DESARROLLO ADMINISTRATIVA Y FINANCIERA EN LAS LABORES QUE REQUIERA LA JUNTA ADMINISTRADORA LOCAL DE BARRIOS UNIDOS COMO GRABACIÓN DE SESIONES, TRANSCRIPCION DE ACTAS Y ATENCIÓN A LA CIUDADANIA.","Inversión",45,{"$f":"IF(ISERROR(VLOOKUP(I198,Eje_Pilar!$C$2:$E$47,2,FALSE)),\" \",VLOOKUP(I198,Eje_Pilar!$C$2:$E$47,2,FALSE))","v":"Gobernanza e influencia local, regional e internacional"},{"$f":"IF(ISERROR(VLOOKUP(I198,Eje_Pilar!$C$2:$E$47,3,FALSE)),\" \",VLOOKUP(I198,Eje_Pilar!$C$2:$E$47,3,FALSE))","v":"Eje Transversal 4 Gobierno Legitimo, Fortalecimiento Local y Eficiencia"},1559,80246449,"DIEGO ANDRES SORA ",2200000,null,null,null,0,2200000,660000,"2019-11-19","2019-11-22","2019-12-21",30,0,null,null,null,"x",null,0.3,null,{"$f":"IF(SUMPRODUCT((A$14:A198=A198)*(B$14:B198=B198)*(C$14:C198=C198))>1,0,1)","v":1},"Contratos de prestación de servicios profesionales y de apoyo a la gestión","Contratación directa",{"$f":"IFERROR(VLOOKUP(F198,Tipo!$C$12:$C$27,1,FALSE),\"NO\")","v":"Prestación de servicios profesionales y de apoyo a la gestión, o para la ejecución de trabajos artísticos que sólo puedan encomendarse a determinadas personas naturales;"},"Inversión",45]
["187-2019",2019,"FDLBU-CD-159-2019","Contratos de prestación de servicios profesionales y de apoyo a la gestión","Contratación directa","Prestación de servicios profesionales y de apoyo a la gestión, o para la ejecución de trabajos artísticos que sólo puedan encomendarse a determinadas personas naturales;","APOYAR ADMINISTRATIVA Y ASISTENCIALMENTE A LAS INSPECCIONES DE POLICÍA DE LA LOCALIDAD","Inversión",45,{"$f":"IF(ISERROR(VLOOKUP(I199,Eje_Pilar!$C$2:$E$47,2,FALSE)),\" \",VLOOKUP(I199,Eje_Pilar!$C$2:$E$47,2,FALSE))","v":"Gobernanza e influencia local, regional e internacional"},{"$f":"IF(ISERROR(VLOOKUP(I199,Eje_Pilar!$C$2:$E$47,3,FALSE)),\" \",VLOOKUP(I199,Eje_Pilar!$C$2:$E$47,3,FALSE))","v":"Eje Transversal 4 Gobierno Legitimo, Fortalecimiento Local y Eficiencia"},1559,1019153538,"SERGIO ALEXANDER BLANCO BOLIVAR",1800000,null,null,1,900000,2700000,240000,"2019-11-25","2019-11-27","2020-01-11",30,15,null,null,null,"x",null,8.8888888888888892E-2,null,{"$f":"IF(SUMPRODUCT((A$14:A199=A199)*(B$14:B199=B199)*(C$14:C199=C199))>1,0,1)","v":1},"Contratos de prestación de servicios profesionales y de apoyo a la gestión","Contratación directa",{"$f":"IFERROR(VLOOKUP(F199,Tipo!$C$12:$C$27,1,FALSE),\"NO\")","v":"Prestación de servicios profesionales y de apoyo a la gestión, o para la ejecución de trabajos artísticos que sólo puedan encomendarse a determinadas personas naturales;"},"Inversión",45]
["188-2019",2019,"FDLBU-CD-158-2019","Contratos de prestación de servicios profesionales y de apoyo a la gestión","Contratación directa","Prestación de servicios profesionales y de apoyo a la gestión, o para la ejecución de trabajos artísticos que sólo puedan encomendarse a determinadas personas naturales;","APOYAR LA GESTIÓN DEL RIESGO, QUE PROMUEVA LAS ACCIONES REQUERIDAS PARA LA PREVENCIÓN Y ATENCIÓN DE EMERGENCIAS O EVENTOS GENERADOS POR LA MATERIALIZACIÓN DE LOS RIESGOS Y RESPONDA DE MANERA OPERATIVA E INMEDIATA ANTE LA OCURRENCIA DE SITUACIONES ADVERSAS EN TEMAS DE EMERGENCIAS EN LA LOCALIDAD.”","Inversión",45,{"$f":"IF(ISERROR(VLOOKUP(I200,Eje_Pilar!$C$2:$E$47,2,FALSE)),\" \",VLOOKUP(I200,Eje_Pilar!$C$2:$E$47,2,FALSE))","v":"Gobernanza e influencia local, regional e internacional"},{"$f":"IF(ISERROR(VLOOKUP(I200,Eje_Pilar!$C$2:$E$47,3,FALSE)),\" \",VLOOKUP(I200,Eje_Pilar!$C$2:$E$47,3,FALSE))","v":"Eje Transversal 4 Gobierno Legitimo, Fortalecimiento Local y Eficiencia"},1559,1110454618,"HERNAN CAMILO VALDES",9110000,null,null,null,0,9110000,911000,"2019-11-25","2019-11-25","2020-01-24",60,0,null,null,"x",null,null,0.1,null,{"$f":"IF(SUMPRODUCT((A$14:A200=A200)*(B$14:B200=B200)*(C$14:C200=C200))>1,0,1)","v":1},"Contratos de prestación de servicios profesionales y de apoyo a la gestión","Contratación directa",{"$f":"IFERROR(VLOOKUP(F200,Tipo!$C$12:$C$27,1,FALSE),\"NO\")","v":"Prestación de servicios profesionales y de apoyo a la gestión, o para la ejecución de trabajos artísticos que sólo puedan encomendarse a determinadas personas naturales;"},"Inversión",45]
["189-2019",2019,"FDLBU-CD-161-2019","Contratos de prestación de servicios profesionales y de apoyo a la gestión","Contratación directa","Prestación de servicios profesionales y de apoyo a la gestión, o para la ejecución de trabajos artísticos que sólo puedan encomendarse a determinadas personas naturales;","PRESTAR SUS SERVICIOS PROFESIONALES PARA APOYAR AL EQUIPO DE PRENSA Y COMUNICACIONES DE LA ALCALDÍA LOCAL MEDIANTE EL REGISTRO, LA EDICIÓN Y LA PRESENTACIÓN DE FOTOGRAFÍAS DE LOS ACONTECIMIENTOS, HECHOS Y EVENTOS DE LA ALCALDÍA LOCAL EN LOS MEDIOS DE COMUNICACIÓN, ESPECIALMENTE ESCRITOS, DIGITALES Y AUDIOVISUALES","Inversión",45,{"$f":"IF(ISERROR(VLOOKUP(I201,Eje_Pilar!$C$2:$E$47,2,FALSE)),\" \",VLOOKUP(I201,Eje_Pilar!$C$2:$E$47,2,FALSE))","v":"Gobernanza e influencia local, regional e internacional"},{"$f":"IF(ISERROR(VLOOKUP(I201,Eje_Pilar!$C$2:$E$47,3,FALSE)),\" \",VLOOKUP(I201,Eje_Pilar!$C$2:$E$47,3,FALSE))","v":"Eje Transversal 4 Gobierno Legitimo, Fortalecimiento Local y Eficiencia"},1559,1026260917,"MIGUEL FELIPE LOPEZ MENDEZ",4555000,null,null,null,0,4555000,911000,"2019-11-25","2019-11-25","2019-12-24",30,0,null,null,null,"x",null,0.2,null,{"$f":"IF(SUMPRODUCT((A$14:A201=A201)*(B$14:B201=B201)*(C$14:C201=C201))>1,0,1)","v":1},"Contratos de prestación de servicios profesionales y de apoyo a la gestión","Contratación directa",{"$f":"IFERROR(VLOOKUP(F201,Tipo!$C$12:$C$27,1,FALSE),\"NO\")","v":"Prestación de servicios profesionales y de apoyo a la gestión, o para la ejecución de trabajos artísticos que sólo puedan encomendarse a determinadas personas naturales;"},"Inversión",45]
["190-2019",2019,"FDLBU-CD-152-2019","Contratos de prestación de servicios profesionales y de apoyo a la gestión","Contratación directa","Prestación de servicios profesionales y de apoyo a la gestión, o para la ejecución de trabajos artísticos que sólo puedan encomendarse a determinadas personas naturales;","PRESTAR LOS SERVICIOS LOS SERVICIOS PROFESIONALES AL AREA DE GESTIÓN POLICIVA Y DESPACHO DEL ALCALDE,CON EL FIN DE CON SUJECCIÓN AL ORDEN DE LLEGADA SE ADELANTEN LOS PROCESOS O PROCEDIMIENTO CORRESPONDIENTES PARA EL TRÁMITE, AUXILIO Y DEVOLUCIÓN DE LAS COMISIONES  QUE EN VIRTUD DEL ARTICULO 37 Y SIGUIENTES DEL CODIGO GENERAL DEL PROCESO,SEAN DESIGNADAS POR LOS JUECES DE LA REPUBLICA Y QUE CORRESPONDAN  AL AMBITO TERRITORIAL DE ESTA LOCALIDAD.","Inversión",45,{"$f":"IF(ISERROR(VLOOKUP(I202,Eje_Pilar!$C$2:$E$47,2,FALSE)),\" \",VLOOKUP(I202,Eje_Pilar!$C$2:$E$47,2,FALSE))","v":"Gobernanza e influencia local, regional e internacional"},{"$f":"IF(ISERROR(VLOOKUP(I202,Eje_Pilar!$C$2:$E$47,3,FALSE)),\" \",VLOOKUP(I202,Eje_Pilar!$C$2:$E$47,3,FALSE))","v":"Eje Transversal 4 Gobierno Legitimo, Fortalecimiento Local y Eficiencia"},1559,79651493,"ALESANDRO SAAVEDRA RINCON",6832500,null,null,null,0,6832500,0,"2019-11-25","2019-12-17","2020-02-01",45,0,null,null,"x",null,null,0,null,{"$f":"IF(SUMPRODUCT((A$14:A202=A202)*(B$14:B202=B202)*(C$14:C202=C202))>1,0,1)","v":1},"Contratos de prestación de servicios profesionales y de apoyo a la gestión","Contratación directa",{"$f":"IFERROR(VLOOKUP(F202,Tipo!$C$12:$C$27,1,FALSE),\"NO\")","v":"Prestación de servicios profesionales y de apoyo a la gestión, o para la ejecución de trabajos artísticos que sólo puedan encomendarse a determinadas personas naturales;"},"Inversión",45]
["191-2019",2019,"FDLBU-CD-160-2019","Contratos de prestación de servicios profesionales y de apoyo a la gestión","Contratación directa","Prestación de servicios profesionales y de apoyo a la gestión, o para la ejecución de trabajos artísticos que sólo puedan encomendarse a determinadas personas naturales;","APOYAR JURIDICAMENTE LA EJECUCIÓN DE LAS ACCIONES REQUERIDAS PARA LA DEPURACIÓN DE LAS ACTUACIONES ADMINISTRATIVAS QUE CURSAN EN LA ALCALDIA LOCAL.","Inversión",45,{"$f":"IF(ISERROR(VLOOKUP(I203,Eje_Pilar!$C$2:$E$47,2,FALSE)),\" \",VLOOKUP(I203,Eje_Pilar!$C$2:$E$47,2,FALSE))","v":"Gobernanza e influencia local, regional e internacional"},{"$f":"IF(ISERROR(VLOOKUP(I203,Eje_Pilar!$C$2:$E$47,3,FALSE)),\" \",VLOOKUP(I203,Eje_Pilar!$C$2:$E$47,3,FALSE))","v":"Eje Transversal 4 Gobierno Legitimo, Fortalecimiento Local y Eficiencia"},1559,79297494,"WILLIAM JAVIER RIVERA MENDOZA",6832500,null,null,null,0,6832500,607333,"2019-11-25","2019-11-27","2020-01-11",45,0,null,null,"x",null,null,8.8888840102451516E-2,null,{"$f":"IF(SUMPRODUCT((A$14:A203=A203)*(B$14:B203=B203)*(C$14:C203=C203))>1,0,1)","v":1},"Contratos de prestación de servicios profesionales y de apoyo a la gestión","Contratación directa",{"$f":"IFERROR(VLOOKUP(F203,Tipo!$C$12:$C$27,1,FALSE),\"NO\")","v":"Prestación de servicios profesionales y de apoyo a la gestión, o para la ejecución de trabajos artísticos que sólo puedan encomendarse a determinadas personas naturales;"},"Inversión",45]
["192-2019",2019,"FDLBU-CD-163-2019","Contratos de prestación de servicios profesionales y de apoyo a la gestión","Contratación directa","Prestación de servicios profesionales y de apoyo a la gestión, o para la ejecución de trabajos artísticos que sólo puedan encomendarse a determinadas personas naturales;","APOYAR LA GESTION DOCUMENTAL DE LA ALCALDIA LOCAL, ACOMPAÑANDO AL EQUIPO JURIDICO DE DEPURACIÓN EN LAS LABORES OPERATIVAS QUE GENERA EL PROCESO DE IMPULSO DE LAS ACTUACIONES ADMINISTRATIVAS EXISTENTES EN LAS DIFERENTES ALCALDIAS LOCALES.","Inversión",45,{"$f":"IF(ISERROR(VLOOKUP(I204,Eje_Pilar!$C$2:$E$47,2,FALSE)),\" \",VLOOKUP(I204,Eje_Pilar!$C$2:$E$47,2,FALSE))","v":"Gobernanza e influencia local, regional e internacional"},{"$f":"IF(ISERROR(VLOOKUP(I204,Eje_Pilar!$C$2:$E$47,3,FALSE)),\" \",VLOOKUP(I204,Eje_Pilar!$C$2:$E$47,3,FALSE))","v":"Eje Transversal 4 Gobierno Legitimo, Fortalecimiento Local y Eficiencia"},1559,1022369331,"VIVIANA OTÁLORA GONZÁLEZ",3300000,null,null,null,0,3300000,0,"2019-11-28","2019-12-03","2020-01-17",45,0,null,null,"x",null,null,0,null,{"$f":"IF(SUMPRODUCT((A$14:A204=A204)*(B$14:B204=B204)*(C$14:C204=C204))>1,0,1)","v":1},"Contratos de prestación de servicios profesionales y de apoyo a la gestión","Contratación directa",{"$f":"IFERROR(VLOOKUP(F204,Tipo!$C$12:$C$27,1,FALSE),\"NO\")","v":"Prestación de servicios profesionales y de apoyo a la gestión, o para la ejecución de trabajos artísticos que sólo puedan encomendarse a determinadas personas naturales;"},"Inversión",45]
["193-2019",2019,"FDLBU-CD-164-2019","Contratos de prestación de servicios profesionales y de apoyo a la gestión","Contratación directa","Prestación de servicios profesionales y de apoyo a la gestión, o para la ejecución de trabajos artísticos que sólo puedan encomendarse a determinadas personas naturales;","APOYAR LA GESTION DOCUMENTAL DE LA ALCALDIA LOCAL, ACOMPAÑANDO AL EQUIPO JURIDICO DE DEPURACIÓN EN LAS LABORES OPERATIVAS QUE GENERA EL PROCESO DE IMPULSO DE LAS ACTUACIONES ADMINISTRATIVAS EXISTENTES EN LAS DIFERENTES ALCALDIAS LOCALES.","Inversión",45,{"$f":"IF(ISERROR(VLOOKUP(I205,Eje_Pilar!$C$2:$E$47,2,FALSE)),\" \",VLOOKUP(I205,Eje_Pilar!$C$2:$E$47,2,FALSE))","v":"Gobernanza e influencia local, regional e internacional"},{"$f":"IF(ISERROR(VLOOKUP(I205,Eje_Pilar!$C$2:$E$47,3,FALSE)),\" \",VLOOKUP(I205,Eje_Pilar!$C$2:$E$47,3,FALSE))","v":"Eje Transversal 4 Gobierno Legitimo, Fortalecimiento Local y Eficiencia"},1559,1090175302,"NEYLA JOSEFA BURGOS PÉREZ",3300000,null,null,null,0,3300000,0,"2019-11-29","2019-12-02","2020-01-16",45,0,null,null,"x",null,null,0,null,{"$f":"IF(SUMPRODUCT((A$14:A205=A205)*(B$14:B205=B205)*(C$14:C205=C205))>1,0,1)","v":1},"Contratos de prestación de servicios profesionales y de apoyo a la gestión","Contratación directa",{"$f":"IFERROR(VLOOKUP(F205,Tipo!$C$12:$C$27,1,FALSE),\"NO\")","v":"Prestación de servicios profesionales y de apoyo a la gestión, o para la ejecución de trabajos artísticos que sólo puedan encomendarse a determinadas personas naturales;"},"Inversión",45]
["194-2019",2019,"FDLBU-CD-165-2019","Contratos de prestación de servicios profesionales y de apoyo a la gestión","Contratación directa","Prestación de servicios profesionales y de apoyo a la gestión, o para la ejecución de trabajos artísticos que sólo puedan encomendarse a determinadas personas naturales;","PRESTAR SERVICIOS DE APOYO A LA GESTION PARA APOYAR LA GESTION DOCUMENTAL DE LA ALACALDIA LOCAL EN LA IMPLEMENTACION DE LOS PROCESOS DE CLASIFICACION, ORDENACION, SELECCION NATURAL, FOLIACION, IDENTIFICACION, LEVANTAMIENTO DE INVENTARIOS, ALMACENAMIENTO Y APLICACIÓN DE PROTOCOLOS DE ELIMINACIÓN Y TRANSFERENCIAS DOCUMENTALES","Inversión",45,{"$f":"IF(ISERROR(VLOOKUP(I206,Eje_Pilar!$C$2:$E$47,2,FALSE)),\" \",VLOOKUP(I206,Eje_Pilar!$C$2:$E$47,2,FALSE))","v":"Gobernanza e influencia local, regional e internacional"},{"$f":"IF(ISERROR(VLOOKUP(I206,Eje_Pilar!$C$2:$E$47,3,FALSE)),\" \",VLOOKUP(I206,Eje_Pilar!$C$2:$E$47,3,FALSE))","v":"Eje Transversal 4 Gobierno Legitimo, Fortalecimiento Local y Eficiencia"},1559,1100959714,"CINTYA ALEXANDRA GAMEZ PARRA",3300000,null,null,1,1246666,{"$f":"+O206+Q206+S206","v":4546666},0,"2019-11-26","2019-11-29","2020-01-30",45,17.099999999999994,null,null,"x",null,null,0,null,{"$f":"IF(SUMPRODUCT((A$14:A206=A206)*(B$14:B206=B206)*(C$14:C206=C206))>1,0,1)","v":1},"Contratos de prestación de servicios profesionales y de apoyo a la gestión","Contratación directa",{"$f":"IFERROR(VLOOKUP(F206,Tipo!$C$12:$C$27,1,FALSE),\"NO\")","v":"Prestación de servicios profesionales y de apoyo a la gestión, o para la ejecución de trabajos artísticos que sólo puedan encomendarse a determinadas personas naturales;"},"Inversión",45]
["195-2019",2019,"FDLBU-CD-162-2019","Contratos de prestación de servicios profesionales y de apoyo a la gestión","Contratación directa","Prestación de servicios profesionales y de apoyo a la gestión, o para la ejecución de trabajos artísticos que sólo puedan encomendarse a determinadas personas naturales;","PRESTAR APOYO ADMINISTRATIVO Y OPERATIVO  AL AREA DEL ALMACEN DE LA ALCALDIA LOCAL  DE BARRIOS UNIDOS. EN LOS PROCESOS DE CUIDADO, PROTECCION, ALMACENAMIENTO, TRASLADO Y ENTREGA DE BIENES DEL FONDO DE DESARROLLOLOCAL- DE ACUERDO A LOS PROCESOS Y PROCEDIMIENTOS VIGENTES.","Inversión",45,{"$f":"IF(ISERROR(VLOOKUP(I207,Eje_Pilar!$C$2:$E$47,2,FALSE)),\" \",VLOOKUP(I207,Eje_Pilar!$C$2:$E$47,2,FALSE))","v":"Gobernanza e influencia local, regional e internacional"},{"$f":"IF(ISERROR(VLOOKUP(I207,Eje_Pilar!$C$2:$E$47,3,FALSE)),\" \",VLOOKUP(I207,Eje_Pilar!$C$2:$E$47,3,FALSE))","v":"Eje Transversal 4 Gobierno Legitimo, Fortalecimiento Local y Eficiencia"},1559,1032397330,"SERGIO ERNESTO BUSTOS HERRERA ",4400000,null,null,null,0,4400000,0,"2019-11-27","2019-11-29","2020-01-28",60,0,null,null,"x",null,null,0,null,{"$f":"IF(SUMPRODUCT((A$14:A207=A207)*(B$14:B207=B207)*(C$14:C207=C207))>1,0,1)","v":1},"Contratos de prestación de servicios profesionales y de apoyo a la gestión","Contratación directa",{"$f":"IFERROR(VLOOKUP(F207,Tipo!$C$12:$C$27,1,FALSE),\"NO\")","v":"Prestación de servicios profesionales y de apoyo a la gestión, o para la ejecución de trabajos artísticos que sólo puedan encomendarse a determinadas personas naturales;"},"Inversión",45]
["196-2019",2019,"FDLBU-CD-166-2019","Contratos de prestación de servicios profesionales y de apoyo a la gestión","Contratación directa","Prestación de servicios profesionales y de apoyo a la gestión, o para la ejecución de trabajos artísticos que sólo puedan encomendarse a determinadas personas naturales;","APOYAR JURÍDICAMENTE LA EJECUCIÓN DE LAS ACCIONES REQUERIDAS PARA LA DEPURACIÓN DE LAS ACTUACIONES ADMINISTRATIVAS QUE CURSAN EN LA ALCALDÍA LOCAL ","Inversión",45,{"$f":"IF(ISERROR(VLOOKUP(I208,Eje_Pilar!$C$2:$E$47,2,FALSE)),\" \",VLOOKUP(I208,Eje_Pilar!$C$2:$E$47,2,FALSE))","v":"Gobernanza e influencia local, regional e internacional"},{"$f":"IF(ISERROR(VLOOKUP(I208,Eje_Pilar!$C$2:$E$47,3,FALSE)),\" \",VLOOKUP(I208,Eje_Pilar!$C$2:$E$47,3,FALSE))","v":"Eje Transversal 4 Gobierno Legitimo, Fortalecimiento Local y Eficiencia"},1559,1032376529,"LINA MARÍA ORTIZ CORTÁZAR",6832500,null,null,null,0,6832500,0,"2019-11-27","2019-11-29","2020-01-13",45,0,null,null,"x",null,null,{"$f":"IF(ISERROR(U208/T208),\"-\",(U208/T208))","v":0},null,{"$f":"IF(SUMPRODUCT((A$14:A208=A208)*(B$14:B208=B208)*(C$14:C208=C208))>1,0,1)","v":1},"Contratos de prestación de servicios profesionales y de apoyo a la gestión","Contratación directa",{"$f":"IFERROR(VLOOKUP(F208,Tipo!$C$12:$C$27,1,FALSE),\"NO\")","v":"Prestación de servicios profesionales y de apoyo a la gestión, o para la ejecución de trabajos artísticos que sólo puedan encomendarse a determinadas personas naturales;"},"Inversión",45]
["197-2019",2019,"FDLBU-CD-156-2019","Contratos de prestación de servicios profesionales y de apoyo a la gestión","Contratación directa","Prestación de servicios profesionales y de apoyo a la gestión, o para la ejecución de trabajos artísticos que sólo puedan encomendarse a determinadas personas naturales;","PRESTAR LOS SERVICIOS DE APOYO A LA GESTIÓN DE CONDUCCIÓN DE LOS VEHICULOS A CARGO DEL FONDO DE DESARROLLO LOCAL DE BARRIOS UNIDOS, ASI COMO APOYAR A LA GESTIÓN ADMINISTRATIVA QUE DESIGNE EL SUPERVISOR.","Inversión",45,{"$f":"IF(ISERROR(VLOOKUP(I209,Eje_Pilar!$C$2:$E$47,2,FALSE)),\" \",VLOOKUP(I209,Eje_Pilar!$C$2:$E$47,2,FALSE))","v":"Gobernanza e influencia local, regional e internacional"},{"$f":"IF(ISERROR(VLOOKUP(I209,Eje_Pilar!$C$2:$E$47,3,FALSE)),\" \",VLOOKUP(I209,Eje_Pilar!$C$2:$E$47,3,FALSE))","v":"Eje Transversal 4 Gobierno Legitimo, Fortalecimiento Local y Eficiencia"},1559,79435226,"ARMANDO PIRAMANRIQUE",3300000,null,null,null,0,3300000,0,"2019-11-29","2019-12-06","2020-01-20",45,0,null,null,"x",null,null,0,null,{"$f":"IF(SUMPRODUCT((A$14:A209=A209)*(B$14:B209=B209)*(C$14:C209=C209))>1,0,1)","v":1},"Contratos de prestación de servicios profesionales y de apoyo a la gestión","Contratación directa",{"$f":"IFERROR(VLOOKUP(F209,Tipo!$C$12:$C$27,1,FALSE),\"NO\")","v":"Prestación de servicios profesionales y de apoyo a la gestión, o para la ejecución de trabajos artísticos que sólo puedan encomendarse a determinadas personas naturales;"},"Inversión",45]
["198-2019",2019,"FDLBU-CD-170-2019","Contratos de prestación de servicios profesionales y de apoyo a la gestión","Contratación directa","Prestación de servicios profesionales y de apoyo a la gestión, o para la ejecución de trabajos artísticos que sólo puedan encomendarse a determinadas personas naturales;","APOYAR JURÍDICAMENTE LA EJECUCIÓN DE LAS ACCIONES REQUERIDAS PARA LA DEPURACIÓN DE LAS ACTUACIONES ADMINISTRATIVAS QUE CURSAN EN LA ALCALDÍA LOCAL ","Inversión",45,{"$f":"IF(ISERROR(VLOOKUP(I210,Eje_Pilar!$C$2:$E$47,2,FALSE)),\" \",VLOOKUP(I210,Eje_Pilar!$C$2:$E$47,2,FALSE))","v":"Gobernanza e influencia local, regional e internacional"},{"$f":"IF(ISERROR(VLOOKUP(I210,Eje_Pilar!$C$2:$E$47,3,FALSE)),\" \",VLOOKUP(I210,Eje_Pilar!$C$2:$E$47,3,FALSE))","v":"Eje Transversal 4 Gobierno Legitimo, Fortalecimiento Local y Eficiencia"},1559,35195802,"ADRIANA LILIANA CARDENAS VILLALOBOS",6832500,null,null,null,0,6832500,0,"2019-11-29","2019-12-03","2020-01-17",45,0,null,null,"x",null,null,0,null,{"$f":"IF(SUMPRODUCT((A$14:A210=A210)*(B$14:B210=B210)*(C$14:C210=C210))>1,0,1)","v":1},"Contratos de prestación de servicios profesionales y de apoyo a la gestión","Contratación directa",{"$f":"IFERROR(VLOOKUP(F210,Tipo!$C$12:$C$27,1,FALSE),\"NO\")","v":"Prestación de servicios profesionales y de apoyo a la gestión, o para la ejecución de trabajos artísticos que sólo puedan encomendarse a determinadas personas naturales;"},"Inversión",45]
["199-2019",2019,"FDLBU-CD-171-2019","Contratos de prestación de servicios profesionales y de apoyo a la gestión","Contratación directa","Prestación de servicios profesionales y de apoyo a la gestión, o para la ejecución de trabajos artísticos que sólo puedan encomendarse a determinadas personas naturales;","APOYAR JURÍDICAMENTE LA EJECUCIÓN DE LAS ACCIONES REQUERIDAS PARA LA DEPURACIÓN DE LAS ACTUACIONES ADMINISTRATIVAS QUE CURSAN EN LA ALCALDÍA LOCAL ","Inversión",45,{"$f":"IF(ISERROR(VLOOKUP(I211,Eje_Pilar!$C$2:$E$47,2,FALSE)),\" \",VLOOKUP(I211,Eje_Pilar!$C$2:$E$47,2,FALSE))","v":"Gobernanza e influencia local, regional e internacional"},{"$f":"IF(ISERROR(VLOOKUP(I211,Eje_Pilar!$C$2:$E$47,3,FALSE)),\" \",VLOOKUP(I211,Eje_Pilar!$C$2:$E$47,3,FALSE))","v":"Eje Transversal 4 Gobierno Legitimo, Fortalecimiento Local y Eficiencia"},1559,1015420645,"JUAN CARLOS PANTANO",4555000,null,null,null,0,4555000,0,"2019-11-29","2019-12-05","2020-01-04",30,0,null,null,null,"x",null,0,null,{"$f":"IF(SUMPRODUCT((A$14:A211=A211)*(B$14:B211=B211)*(C$14:C211=C211))>1,0,1)","v":1},"Contratos de prestación de servicios profesionales y de apoyo a la gestión","Contratación directa",{"$f":"IFERROR(VLOOKUP(F211,Tipo!$C$12:$C$27,1,FALSE),\"NO\")","v":"Prestación de servicios profesionales y de apoyo a la gestión, o para la ejecución de trabajos artísticos que sólo puedan encomendarse a determinadas personas naturales;"},"Inversión",45]
["1999-2019",2019,"N/A","Contratos interadministrativos","Contratación directa","Contratos interadministrativos","COFINANCIAR LA DOTACIÓN TECNOLÓGICA DE INSTITUCIONES EDUCATIVAS DEL DISTRITO CAPITAL","Inversión",7,{"$f":"IF(ISERROR(VLOOKUP(I212,Eje_Pilar!$C$2:$E$47,2,FALSE)),\" \",VLOOKUP(I212,Eje_Pilar!$C$2:$E$47,2,FALSE))","v":"Inclusión educativa para la equidad"},{"$f":"IF(ISERROR(VLOOKUP(I212,Eje_Pilar!$C$2:$E$47,3,FALSE)),\" \",VLOOKUP(I212,Eje_Pilar!$C$2:$E$47,3,FALSE))","v":"Pilar 1 Igualdad de Calidad de Vida"},1552,"899.999.061-9","SECRETARÍA DE EDUCACIÓN DEL DISTRITO Y\nFDL BARRIOS UNIDOS, FDL USAQUÉN, FDL CHAPINERO, FDL SAN CRISTOBAL, FDL TUNJUELITO, FDL KENNEDY, FDL BOSA, FDL SUBA, FDL MÁRTIRES, FDL ANTONIO NARIÑO, FDL PUENT ARANDA, FDL RAFAEL URIBE URIBE, FDL CIUDAD BOLIVAR, FDL SUMAPAZ, FDL SANTA FE, FDL FONTIBÓN",400000000,null,null,null,0,400000000,0,"2019-05-08","2019-09-03","2020-03-29",null,0,null,null,"x",null,null,0,null,{"$f":"IF(SUMPRODUCT((A$14:A212=A212)*(B$14:B212=B212)*(C$14:C212=C212))>1,0,1)","v":1},"Contratos interadministrativos","Contratación directa",{"$f":"IFERROR(VLOOKUP(F212,Tipo!$C$12:$C$27,1,FALSE),\"NO\")","v":"Contratos interadministrativos"},"Inversión",7]
["200-2019",2019,"FDLBU-CD-166-2019","Contratos de prestación de servicios profesionales y de apoyo a la gestión","Contratación directa","Prestación de servicios profesionales y de apoyo a la gestión, o para la ejecución de trabajos artísticos que sólo puedan encomendarse a determinadas personas naturales;","PRESTAR LOS SERVICIOS PROFESIONALES PARA APOYAR EL AREA DE GESTIÓN DEL DESARROLLO-ADMINISTRATIVO  Y FINANCIERO, EN LOS ASUNTOS RELACIONADOS CON EL DESARROLLO DE LA GESTION CONTRACTUAL PARA LA ADQUISICIÓN DE RECURSOS.","Inversión",45,{"$f":"IF(ISERROR(VLOOKUP(I213,Eje_Pilar!$C$2:$E$47,2,FALSE)),\" \",VLOOKUP(I213,Eje_Pilar!$C$2:$E$47,2,FALSE))","v":"Gobernanza e influencia local, regional e internacional"},{"$f":"IF(ISERROR(VLOOKUP(I213,Eje_Pilar!$C$2:$E$47,3,FALSE)),\" \",VLOOKUP(I213,Eje_Pilar!$C$2:$E$47,3,FALSE))","v":"Eje Transversal 4 Gobierno Legitimo, Fortalecimiento Local y Eficiencia"},1559,74301698,"JUAN CARLOS VALCARCEL SUAREZ",6600000,null,null,null,0,6600000,0,"2019-11-29","2019-11-29","2020-01-13",45,0,null,null,null,"x",null,0,null,{"$f":"IF(SUMPRODUCT((A$14:A213=A213)*(B$14:B213=B213)*(C$14:C213=C213))>1,0,1)","v":1},"Contratos de prestación de servicios profesionales y de apoyo a la gestión","Contratación directa",{"$f":"IFERROR(VLOOKUP(F213,Tipo!$C$12:$C$27,1,FALSE),\"NO\")","v":"Prestación de servicios profesionales y de apoyo a la gestión, o para la ejecución de trabajos artísticos que sólo puedan encomendarse a determinadas personas naturales;"},"Inversión",45]
["201-2019",2019,"FDLBU-CD-173-2019","Contratos de prestación de servicios profesionales y de apoyo a la gestión","Contratación directa","Prestación de servicios profesionales y de apoyo a la gestión, o para la ejecución de trabajos artísticos que sólo puedan encomendarse a determinadas personas naturales;","PRESTAR SERVICIOS DE APOYO A LA GESTION PARA APOYAR LA GESTION DOCUMENTAL DE LA ALACALDIA LOCAL EN LA IMPLEMENTACION DE LOS PROCESOS DE CLASIFICACION, ORDENACION, SELECCION NATURAL, FOLIACION, IDENTIFICACION, LEVANTAMIENTO DE INVENTARIOS, ALMACENAMIENTO Y APLICACIÓN DE PROTOCOLOS DE ELIMINACIÓN Y TRANSFERENCIAS DOCUMENTALES","Inversión",45,{"$f":"IF(ISERROR(VLOOKUP(I214,Eje_Pilar!$C$2:$E$47,2,FALSE)),\" \",VLOOKUP(I214,Eje_Pilar!$C$2:$E$47,2,FALSE))","v":"Gobernanza e influencia local, regional e internacional"},{"$f":"IF(ISERROR(VLOOKUP(I214,Eje_Pilar!$C$2:$E$47,3,FALSE)),\" \",VLOOKUP(I214,Eje_Pilar!$C$2:$E$47,3,FALSE))","v":"Eje Transversal 4 Gobierno Legitimo, Fortalecimiento Local y Eficiencia"},1559,"79.881.055\n \n79.500.585","JUAN CARLOS PINEDA SANCHEZ\n\nCEDIO A \n\nRICARDO ALVARADO PEÑA",3300000,null,null,null,0,3300000,0,"2019-12-02","2019-12-20","2020-02-04",45,0,null,null,"x",null,null,0,null,{"$f":"IF(SUMPRODUCT((A$14:A214=A214)*(B$14:B214=B214)*(C$14:C214=C214))>1,0,1)","v":1},{"$f":"IFERROR(VLOOKUP(D214,tipo,1,FALSE),\"NO\")","v":"Contratos de prestación de servicios profesionales y de apoyo a la gestión"},{"$f":"IFERROR(VLOOKUP(E214,modal,1,FALSE),\"NO\")","v":"Contratación directa"},{"$f":"IFERROR(VLOOKUP(F214,Tipo!$C$12:$C$27,1,FALSE),\"NO\")","v":"Prestación de servicios profesionales y de apoyo a la gestión, o para la ejecución de trabajos artísticos que sólo puedan encomendarse a determinadas personas naturales;"},{"$f":"IFERROR(VLOOKUP(H214,afectacion,1,FALSE),\"NO\")","v":"Inversión"},{"$f":"IFERROR(VLOOKUP(I214,programa,1,FALSE),\"NO\")","v":45}]
["202-2019",2019,"FDLBU-CD-174-2019","Contratos de prestación de servicios profesionales y de apoyo a la gestión","Contratación directa","Prestación de servicios profesionales y de apoyo a la gestión, o para la ejecución de trabajos artísticos que sólo puedan encomendarse a determinadas personas naturales;","APOYAR JURIDICAMENTE A LA EJECUCIÓN DE LAS ACCIONES REQUERIDAS PARA LA DEPURACIÓN DE LAS ACTUACIONES ADMINISTRATIVAS QUE CURSAN EN LA ALCALDIA LOCAL.","Inversión",45,{"$f":"IF(ISERROR(VLOOKUP(I215,Eje_Pilar!$C$2:$E$47,2,FALSE)),\" \",VLOOKUP(I215,Eje_Pilar!$C$2:$E$47,2,FALSE))","v":"Gobernanza e influencia local, regional e internacional"},{"$f":"IF(ISERROR(VLOOKUP(I215,Eje_Pilar!$C$2:$E$47,3,FALSE)),\" \",VLOOKUP(I215,Eje_Pilar!$C$2:$E$47,3,FALSE))","v":"Eje Transversal 4 Gobierno Legitimo, Fortalecimiento Local y Eficiencia"},1559,1094247295,"JHON EMMANUEL GOMEZ PORTILLA",4555000,null,null,null,null,4555000,0,"2019-12-04","2019-12-09","2020-01-08",30,0,null,null,null,"x",null,0,null,{"$f":"IF(SUMPRODUCT((A$14:A215=A215)*(B$14:B215=B215)*(C$14:C215=C215))>1,0,1)","v":1},"Contratos de prestación de servicios profesionales y de apoyo a la gestión","Contratación directa",{"$f":"IFERROR(VLOOKUP(F215,Tipo!$C$12:$C$27,1,FALSE),\"NO\")","v":"Prestación de servicios profesionales y de apoyo a la gestión, o para la ejecución de trabajos artísticos que sólo puedan encomendarse a determinadas personas naturales;"},"Inversión",45]
["203-2019",2019,"FDLBU-CD-167-2019","Contratos de prestación de servicios profesionales y de apoyo a la gestión","Contratación directa","Prestación de servicios profesionales y de apoyo a la gestión, o para la ejecución de trabajos artísticos que sólo puedan encomendarse a determinadas personas naturales;","APOYAR JURÍDICAMENTE LA EJECUCIÓN DE LAS ACCIONES REQUERIDAS PARA LA DEPURACIÓN DE LAS ACTUACIONES ADMINISTRATIVAS QUE CURSAN EN LA ALCALDÍA LOCAL ","Inversión",45,{"$f":"IF(ISERROR(VLOOKUP(I216,Eje_Pilar!$C$2:$E$47,2,FALSE)),\" \",VLOOKUP(I216,Eje_Pilar!$C$2:$E$47,2,FALSE))","v":"Gobernanza e influencia local, regional e internacional"},{"$f":"IF(ISERROR(VLOOKUP(I216,Eje_Pilar!$C$2:$E$47,3,FALSE)),\" \",VLOOKUP(I216,Eje_Pilar!$C$2:$E$47,3,FALSE))","v":"Eje Transversal 4 Gobierno Legitimo, Fortalecimiento Local y Eficiencia"},1559,1019026658,"MARCELA ORTIZ ROLDAN",6832500,null,null,null,0,6832500,0,"2019-12-03","2019-12-04","2020-01-18",45,0,null,null,"x",null,null,0,null,{"$f":"IF(SUMPRODUCT((A$14:A216=A216)*(B$14:B216=B216)*(C$14:C216=C216))>1,0,1)","v":1},"Contratos de prestación de servicios profesionales y de apoyo a la gestión","Contratación directa",{"$f":"IFERROR(VLOOKUP(F216,Tipo!$C$12:$C$27,1,FALSE),\"NO\")","v":"Prestación de servicios profesionales y de apoyo a la gestión, o para la ejecución de trabajos artísticos que sólo puedan encomendarse a determinadas personas naturales;"},"Inversión",45]
["204-2019",2019,"FDLBU-CD-166-2019","Contratos de prestación de servicios profesionales y de apoyo a la gestión","Contratación directa","Prestación de servicios profesionales y de apoyo a la gestión, o para la ejecución de trabajos artísticos que sólo puedan encomendarse a determinadas personas naturales;","PRESTAR LOS SERVICIOS PROFESIONALES PARA APOYAR EL AREA DE GESTIÓN DEL DESARROLLO-ADMINISTRATIVO  Y FINANCIERO, EN LOS ASUNTOS RELACIONADOS CON EL DESARROLLO DE LA GESTION CONTRACTUAL PARA LA ADQUISICIÓN DE RECURSOS.","Inversión",45,{"$f":"IF(ISERROR(VLOOKUP(I217,Eje_Pilar!$C$2:$E$47,2,FALSE)),\" \",VLOOKUP(I217,Eje_Pilar!$C$2:$E$47,2,FALSE))","v":"Gobernanza e influencia local, regional e internacional"},{"$f":"IF(ISERROR(VLOOKUP(I217,Eje_Pilar!$C$2:$E$47,3,FALSE)),\" \",VLOOKUP(I217,Eje_Pilar!$C$2:$E$47,3,FALSE))","v":"Eje Transversal 4 Gobierno Legitimo, Fortalecimiento Local y Eficiencia"},1559,52747720,"ADRIANA NATALY CALVO PEÑA",6600000,null,null,null,0,6600000,0,"2019-12-03","2019-12-03","2020-01-17",45,0,null,null,"x",null,null,0,null,{"$f":"IF(SUMPRODUCT((A$14:A217=A217)*(B$14:B217=B217)*(C$14:C217=C217))>1,0,1)","v":1},"Contratos de prestación de servicios profesionales y de apoyo a la gestión","Contratación directa",{"$f":"IFERROR(VLOOKUP(F217,Tipo!$C$12:$C$27,1,FALSE),\"NO\")","v":"Prestación de servicios profesionales y de apoyo a la gestión, o para la ejecución de trabajos artísticos que sólo puedan encomendarse a determinadas personas naturales;"},"Inversión",45]
["205-2019",2019,"FDLBU-CD-175-2019","Contratos de prestación de servicios profesionales y de apoyo a la gestión","Contratación directa","Prestación de servicios profesionales y de apoyo a la gestión, o para la ejecución de trabajos artísticos que sólo puedan encomendarse a determinadas personas naturales;","APOYAR TECNICAMENTE LAS DISTINTAS ETAPAS DE LOS PROCESOS DE COMPETENCIA DE LAS INSPECCIONES DE POLICIA DE LA LOCALIDAD , SEGUN REPARTO ","Inversión",45,{"$f":"IF(ISERROR(VLOOKUP(I218,Eje_Pilar!$C$2:$E$47,2,FALSE)),\" \",VLOOKUP(I218,Eje_Pilar!$C$2:$E$47,2,FALSE))","v":"Gobernanza e influencia local, regional e internacional"},{"$f":"IF(ISERROR(VLOOKUP(I218,Eje_Pilar!$C$2:$E$47,3,FALSE)),\" \",VLOOKUP(I218,Eje_Pilar!$C$2:$E$47,3,FALSE))","v":"Eje Transversal 4 Gobierno Legitimo, Fortalecimiento Local y Eficiencia"},1559,19274869,"HIPOLITO ACOSTA FORERO",8074500,null,null,null,0,8074500,0,"2019-12-03","2019-12-04","2020-01-18",45,0,null,null,"x",null,null,0,null,{"$f":"IF(SUMPRODUCT((A$14:A218=A218)*(B$14:B218=B218)*(C$14:C218=C218))>1,0,1)","v":1},"Contratos de prestación de servicios profesionales y de apoyo a la gestión","Contratación directa",{"$f":"IFERROR(VLOOKUP(F218,Tipo!$C$12:$C$27,1,FALSE),\"NO\")","v":"Prestación de servicios profesionales y de apoyo a la gestión, o para la ejecución de trabajos artísticos que sólo puedan encomendarse a determinadas personas naturales;"},"Inversión",45]
["206-2019",2019,"FDLBU-CD-176-2019","Contratos de prestación de servicios profesionales y de apoyo a la gestión","Contratación directa","Prestación de servicios profesionales y de apoyo a la gestión, o para la ejecución de trabajos artísticos que sólo puedan encomendarse a determinadas personas naturales;","APOYAR TECNICAMENTE LAS DISTINTAS ETAPAS DE LOS PROCESOS DE COMPETENCIA DE LAS INSPECCIONES DE POLICIA DE LA LOCALIDAD , SEGUN REPARTO ","Inversión",45,{"$f":"IF(ISERROR(VLOOKUP(I219,Eje_Pilar!$C$2:$E$47,2,FALSE)),\" \",VLOOKUP(I219,Eje_Pilar!$C$2:$E$47,2,FALSE))","v":"Gobernanza e influencia local, regional e internacional"},{"$f":"IF(ISERROR(VLOOKUP(I219,Eje_Pilar!$C$2:$E$47,3,FALSE)),\" \",VLOOKUP(I219,Eje_Pilar!$C$2:$E$47,3,FALSE))","v":"Eje Transversal 4 Gobierno Legitimo, Fortalecimiento Local y Eficiencia"},1559,52352454,"FABIOLA RODRÍGUEZ CARREÑO",8074500,null,null,null,0,8074500,0,"2019-12-04","2019-12-11","2020-01-25",45,0,null,null,"x",null,null,0,null,{"$f":"IF(SUMPRODUCT((A$14:A219=A219)*(B$14:B219=B219)*(C$14:C219=C219))>1,0,1)","v":1},"Contratos de prestación de servicios profesionales y de apoyo a la gestión","Contratación directa",{"$f":"IFERROR(VLOOKUP(F219,Tipo!$C$12:$C$27,1,FALSE),\"NO\")","v":"Prestación de servicios profesionales y de apoyo a la gestión, o para la ejecución de trabajos artísticos que sólo puedan encomendarse a determinadas personas naturales;"},"Inversión",45]
["209-2019",2019,"FDLBU-CD-179-2019","Contratos de prestación de servicios profesionales y de apoyo a la gestión","Contratación directa","Prestación de servicios profesionales y de apoyo a la gestión, o para la ejecución de trabajos artísticos que sólo puedan encomendarse a determinadas personas naturales;","APOYAR ADMINISTRATIVA Y ASISTENCIALMENTE A LAS INSPECCIONES DE POLICÍA DE LA LOCALIDAD","Inversión",45,{"$f":"IF(ISERROR(VLOOKUP(I220,Eje_Pilar!$C$2:$E$47,2,FALSE)),\" \",VLOOKUP(I220,Eje_Pilar!$C$2:$E$47,2,FALSE))","v":"Gobernanza e influencia local, regional e internacional"},{"$f":"IF(ISERROR(VLOOKUP(I220,Eje_Pilar!$C$2:$E$47,3,FALSE)),\" \",VLOOKUP(I220,Eje_Pilar!$C$2:$E$47,3,FALSE))","v":"Eje Transversal 4 Gobierno Legitimo, Fortalecimiento Local y Eficiencia"},1559,79796296,"EDGAR CORTES TORRES",1800000,null,null,null,0,1800000,null,"2019-12-10","2019-12-13","2019-01-12",30,0,null,null,null,"x",null,0,null,{"$f":"IF(SUMPRODUCT((A$14:A220=A220)*(B$14:B220=B220)*(C$14:C220=C220))>1,0,1)","v":1},"Contratos de prestación de servicios profesionales y de apoyo a la gestión","Contratación directa",{"$f":"IFERROR(VLOOKUP(F220,Tipo!$C$12:$C$27,1,FALSE),\"NO\")","v":"Prestación de servicios profesionales y de apoyo a la gestión, o para la ejecución de trabajos artísticos que sólo puedan encomendarse a determinadas personas naturales;"},"Inversión",45]
["211-2019",2019,"FDLBU-CD-181-2019","Contratos de prestación de servicios profesionales y de apoyo a la gestión","Contratación directa","Prestación de servicios profesionales y de apoyo a la gestión, o para la ejecución de trabajos artísticos que sólo puedan encomendarse a determinadas personas naturales;","APOYAR JURÍDICAMENTE LA EJECUCIÓN DE LAS ACCIONES REQUERIDAS PARA LA DEPURACIÓN DE LAS ACTUACIONES ADMINISTRATIVAS QUE CURSAN EN LA ALCALDÍA LOCAL ","Inversión",45,{"$f":"IF(ISERROR(VLOOKUP(I221,Eje_Pilar!$C$2:$E$47,2,FALSE)),\" \",VLOOKUP(I221,Eje_Pilar!$C$2:$E$47,2,FALSE))","v":"Gobernanza e influencia local, regional e internacional"},{"$f":"IF(ISERROR(VLOOKUP(I221,Eje_Pilar!$C$2:$E$47,3,FALSE)),\" \",VLOOKUP(I221,Eje_Pilar!$C$2:$E$47,3,FALSE))","v":"Eje Transversal 4 Gobierno Legitimo, Fortalecimiento Local y Eficiencia"},1559,80761043,"CARLOS ANDRES MERIZALDE RUSINQUE ",4555000,null,null,null,0,4555000,null,"2019-12-06","2019-12-13","2020-01-12",30,0,null,null,null,"x",null,0,null,{"$f":"IF(SUMPRODUCT((A$14:A221=A221)*(B$14:B221=B221)*(C$14:C221=C221))>1,0,1)","v":1},"Contratos de prestación de servicios profesionales y de apoyo a la gestión","Contratación directa",{"$f":"IFERROR(VLOOKUP(F221,Tipo!$C$12:$C$27,1,FALSE),\"NO\")","v":"Prestación de servicios profesionales y de apoyo a la gestión, o para la ejecución de trabajos artísticos que sólo puedan encomendarse a determinadas personas naturales;"},"Inversión",45]
["212-2019",2019,"FDLBU-CD-182-2019","Contratos de prestación de servicios profesionales y de apoyo a la gestión","Contratación directa","Prestación de servicios profesionales y de apoyo a la gestión, o para la ejecución de trabajos artísticos que sólo puedan encomendarse a determinadas personas naturales;","APOYAR LA GESTIÓN DOCUMENTAL DE LA ALCALDÍA LOCAL, ACOMPAÑANDO AL EQUIPO JURÍDICO DE DEPURACIÓN EN LAS LABORES OPERATIVAS QUE GENERA EL PROCESO DE IMPULSO DE LAS ACTUACIONES ADMINISTRATIVAS EXISTENTES EN LAS DIFERENTES ALCALDÍAS LOCALES","Inversión",45,{"$f":"IF(ISERROR(VLOOKUP(I222,Eje_Pilar!$C$2:$E$47,2,FALSE)),\" \",VLOOKUP(I222,Eje_Pilar!$C$2:$E$47,2,FALSE))","v":"Gobernanza e influencia local, regional e internacional"},{"$f":"IF(ISERROR(VLOOKUP(I222,Eje_Pilar!$C$2:$E$47,3,FALSE)),\" \",VLOOKUP(I222,Eje_Pilar!$C$2:$E$47,3,FALSE))","v":"Eje Transversal 4 Gobierno Legitimo, Fortalecimiento Local y Eficiencia"},1559,1022953015,"ELIANA GRISEL CADENA CANO",5400000,null,null,null,0,5400000,0,"2019-12-06","2019-12-08","2020-03-07",90,0,null,null,"x",null,null,0,null,{"$f":"IF(SUMPRODUCT((A$14:A222=A222)*(B$14:B222=B222)*(C$14:C222=C222))>1,0,1)","v":1},"Contratos de prestación de servicios profesionales y de apoyo a la gestión","Contratación directa",{"$f":"IFERROR(VLOOKUP(F222,Tipo!$C$12:$C$27,1,FALSE),\"NO\")","v":"Prestación de servicios profesionales y de apoyo a la gestión, o para la ejecución de trabajos artísticos que sólo puedan encomendarse a determinadas personas naturales;"},"Inversión",45]
["213-2019",2019,"FDLBU-CD-183-2019","Contratos de prestación de servicios profesionales y de apoyo a la gestión","Contratación directa","Prestación de servicios profesionales y de apoyo a la gestión, o para la ejecución de trabajos artísticos que sólo puedan encomendarse a determinadas personas naturales;","PRESTAR SUS SERVICIOS PROFESIONALES PARA APOYAR AL EQUIPO DE PRENSA Y COMUNICACIONES DE LA ALCALDÍA LOCAL EN LA REALIZACIÓN DE PRODUCTOS Y PIEZAS DIGITALES, IMPRESAS Y PUBLICITARIAS DE GRAN FORMATO Y DE ANIMACIÓN GRÁFICA, ASÍ COMO APOYAR LA PRODUCCIÓN Y MONTAJE DE","Inversión",45,{"$f":"IF(ISERROR(VLOOKUP(I223,Eje_Pilar!$C$2:$E$47,2,FALSE)),\" \",VLOOKUP(I223,Eje_Pilar!$C$2:$E$47,2,FALSE))","v":"Gobernanza e influencia local, regional e internacional"},{"$f":"IF(ISERROR(VLOOKUP(I223,Eje_Pilar!$C$2:$E$47,3,FALSE)),\" \",VLOOKUP(I223,Eje_Pilar!$C$2:$E$47,3,FALSE))","v":"Eje Transversal 4 Gobierno Legitimo, Fortalecimiento Local y Eficiencia"},1559,52088099,"HEYZEL MELO",4555000,null,null,null,0,4555000,null,"2019-01-10","2019-12-13","2020-01-30",30,0,null,null,"x",null,null,0,null,{"$f":"IF(SUMPRODUCT((A$14:A223=A223)*(B$14:B223=B223)*(C$14:C223=C223))>1,0,1)","v":1},"Contratos de prestación de servicios profesionales y de apoyo a la gestión","Contratación directa",{"$f":"IFERROR(VLOOKUP(F223,Tipo!$C$12:$C$27,1,FALSE),\"NO\")","v":"Prestación de servicios profesionales y de apoyo a la gestión, o para la ejecución de trabajos artísticos que sólo puedan encomendarse a determinadas personas naturales;"},"Inversión",45]
["214-2019",2019,"FDLBU-CD-185-2019","Contratos de prestación de servicios profesionales y de apoyo a la gestión","Contratación directa","Prestación de servicios profesionales y de apoyo a la gestión, o para la ejecución de trabajos artísticos que sólo puedan encomendarse a determinadas personas naturales;","APOYAR TECNICAMENTE LAS DISTINTAS ETAPAS DE LOS PREOCESOS DE COMPETENCIA DE LA ALCALDIA LOCAL PARA LA DEPEURACION DE ACTUACIONES ADMINISTRATIVAS","Inversión",45,{"$f":"IF(ISERROR(VLOOKUP(I224,Eje_Pilar!$C$2:$E$47,2,FALSE)),\" \",VLOOKUP(I224,Eje_Pilar!$C$2:$E$47,2,FALSE))","v":"Gobernanza e influencia local, regional e internacional"},{"$f":"IF(ISERROR(VLOOKUP(I224,Eje_Pilar!$C$2:$E$47,3,FALSE)),\" \",VLOOKUP(I224,Eje_Pilar!$C$2:$E$47,3,FALSE))","v":"Eje Transversal 4 Gobierno Legitimo, Fortalecimiento Local y Eficiencia"},1559,1010205046,"GINNA MILENA CEPEDA VELASCO",6832500,null,null,null,0,6832500,0,"2019-12-10","2019-12-12","2020-01-26",45,0,null,null,"x",null,null,0,null,{"$f":"IF(SUMPRODUCT((A$14:A224=A224)*(B$14:B224=B224)*(C$14:C224=C224))>1,0,1)","v":1},"Contratos de prestación de servicios profesionales y de apoyo a la gestión","Contratación directa",{"$f":"IFERROR(VLOOKUP(F224,Tipo!$C$12:$C$27,1,FALSE),\"NO\")","v":"Prestación de servicios profesionales y de apoyo a la gestión, o para la ejecución de trabajos artísticos que sólo puedan encomendarse a determinadas personas naturales;"},"Inversión",45]
["215-2019",2019,"FDLBU-CD-186-2019","Contratos de prestación de servicios profesionales y de apoyo a la gestión","Contratación directa","Prestación de servicios profesionales y de apoyo a la gestión, o para la ejecución de trabajos artísticos que sólo puedan encomendarse a determinadas personas naturales;","APOYAR TECNICAMENTE LAS DISTINTAS ETAPAS DE LOS PREOCESOS DE COMPETENCIA DE LA ALCALDIA LOCAL PARA LA DEPEURACION DE ACTUACIONES ADMINISTRATIVAS","Inversión",45,{"$f":"IF(ISERROR(VLOOKUP(I225,Eje_Pilar!$C$2:$E$47,2,FALSE)),\" \",VLOOKUP(I225,Eje_Pilar!$C$2:$E$47,2,FALSE))","v":"Gobernanza e influencia local, regional e internacional"},{"$f":"IF(ISERROR(VLOOKUP(I225,Eje_Pilar!$C$2:$E$47,3,FALSE)),\" \",VLOOKUP(I225,Eje_Pilar!$C$2:$E$47,3,FALSE))","v":"Eje Transversal 4 Gobierno Legitimo, Fortalecimiento Local y Eficiencia"},1559,1019045051,"CARLOS IVAN GARCIA QUINTERO",6832500,null,null,null,0,6832500,0,"2019-12-10","2019-12-12","2020-01-26",45,0,null,null,"x",null,null,0,null,{"$f":"IF(SUMPRODUCT((A$14:A225=A225)*(B$14:B225=B225)*(C$14:C225=C225))>1,0,1)","v":1},"Contratos de prestación de servicios profesionales y de apoyo a la gestión","Contratación directa",{"$f":"IFERROR(VLOOKUP(F225,Tipo!$C$12:$C$27,1,FALSE),\"NO\")","v":"Prestación de servicios profesionales y de apoyo a la gestión, o para la ejecución de trabajos artísticos que sólo puedan encomendarse a determinadas personas naturales;"},"Inversión",45]
["216-2019",2019,"FDLBU-CD-216-2019","Contratos de prestación de servicios profesionales y de apoyo a la gestión","Contratación directa","Prestación de servicios profesionales y de apoyo a la gestión, o para la ejecución de trabajos artísticos que sólo puedan encomendarse a determinadas personas naturales;","APOYAR JURÍDICAMENTE LA EJECUCIÓN DE LAS ACCIONES REQUERIDAS PARA EL TRAMITE E IMPULSO PROCESAL DE LAS ACTUACIONES CONTRAVENCIONALES Y/O QUERELLAS QUE CURSEN EN LAS INSPECCIONES DE POLICIA DE LA LOCALIDAD","Inversión",45,{"$f":"IF(ISERROR(VLOOKUP(I226,Eje_Pilar!$C$2:$E$47,2,FALSE)),\" \",VLOOKUP(I226,Eje_Pilar!$C$2:$E$47,2,FALSE))","v":"Gobernanza e influencia local, regional e internacional"},{"$f":"IF(ISERROR(VLOOKUP(I226,Eje_Pilar!$C$2:$E$47,3,FALSE)),\" \",VLOOKUP(I226,Eje_Pilar!$C$2:$E$47,3,FALSE))","v":"Eje Transversal 4 Gobierno Legitimo, Fortalecimiento Local y Eficiencia"},1559,9533924,"OSCAR RODOLFO LOPEZ RODRÍGUEZ ",9110000,null,null,null,0,9110000,0,"2019-12-11","2019-12-11","2020-02-10",60,0,null,null,"x",null,null,0,null,{"$f":"IF(SUMPRODUCT((A$14:A226=A226)*(B$14:B226=B226)*(C$14:C226=C226))>1,0,1)","v":1},"Contratos de prestación de servicios profesionales y de apoyo a la gestión","Contratación directa",{"$f":"IFERROR(VLOOKUP(F226,Tipo!$C$12:$C$27,1,FALSE),\"NO\")","v":"Prestación de servicios profesionales y de apoyo a la gestión, o para la ejecución de trabajos artísticos que sólo puedan encomendarse a determinadas personas naturales;"},"Inversión",45]
["217-2019",2019,"FDLBU-187-2019","Contratos de prestación de servicios profesionales y de apoyo a la gestión","Contratación directa","Prestación de servicios profesionales y de apoyo a la gestión, o para la ejecución de trabajos artísticos que sólo puedan encomendarse a determinadas personas naturales;","APOYAR JURÍDICAMENTE LA EJECUCIÓN DE LAS ACCIONES REQUERIDAS PARA EL TRAMITE E IMPULSO PROCESAL DE LAS ACTUACIONES CONTRAVENCIONALES Y/O QUERELLAS QUE CURSEN EN LAS INSPECCIONES DE POLICIA DE LA LOCALIDAD","Inversión",45,{"$f":"IF(ISERROR(VLOOKUP(I227,Eje_Pilar!$C$2:$E$47,2,FALSE)),\" \",VLOOKUP(I227,Eje_Pilar!$C$2:$E$47,2,FALSE))","v":"Gobernanza e influencia local, regional e internacional"},{"$f":"IF(ISERROR(VLOOKUP(I227,Eje_Pilar!$C$2:$E$47,3,FALSE)),\" \",VLOOKUP(I227,Eje_Pilar!$C$2:$E$47,3,FALSE))","v":"Eje Transversal 4 Gobierno Legitimo, Fortalecimiento Local y Eficiencia"},1559,51994040,"CONSUELO DEL MILAGRO CHAVARRO PULIDO",9110000,null,null,null,0,9110000,0,"2019-12-11","2019-02-11","2020-02-10",60,0,null,null,"x",null,null,0,null,{"$f":"IF(SUMPRODUCT((A$14:A227=A227)*(B$14:B227=B227)*(C$14:C227=C227))>1,0,1)","v":1},"Contratos de prestación de servicios profesionales y de apoyo a la gestión","Contratación directa",{"$f":"IFERROR(VLOOKUP(F227,Tipo!$C$12:$C$27,1,FALSE),\"NO\")","v":"Prestación de servicios profesionales y de apoyo a la gestión, o para la ejecución de trabajos artísticos que sólo puedan encomendarse a determinadas personas naturales;"},"Inversión",45]
["218-2019",2019,"FDLBU-CD-187-2019","Contratos de prestación de servicios profesionales y de apoyo a la gestión","Contratación directa","Prestación de servicios profesionales y de apoyo a la gestión, o para la ejecución de trabajos artísticos que sólo puedan encomendarse a determinadas personas naturales;","APOYAR ADMINISTRATIVA Y ASISTENCIALMENTE A LAS INSPECCIONES DE POLICÍA DE LA LOCALIDAD","Inversión",45,{"$f":"IF(ISERROR(VLOOKUP(I228,Eje_Pilar!$C$2:$E$47,2,FALSE)),\" \",VLOOKUP(I228,Eje_Pilar!$C$2:$E$47,2,FALSE))","v":"Gobernanza e influencia local, regional e internacional"},{"$f":"IF(ISERROR(VLOOKUP(I228,Eje_Pilar!$C$2:$E$47,3,FALSE)),\" \",VLOOKUP(I228,Eje_Pilar!$C$2:$E$47,3,FALSE))","v":"Eje Transversal 4 Gobierno Legitimo, Fortalecimiento Local y Eficiencia"},1559,1030679535,"ANDRES FELIPE HERNANDEZ GARCIA ",1800000,null,null,null,0,1800000,0,"2019-12-11","2019-12-13","2020-01-12",30,0,null,null,null,"x",null,0,null,{"$f":"IF(SUMPRODUCT((A$14:A228=A228)*(B$14:B228=B228)*(C$14:C228=C228))>1,0,1)","v":1},"Contratos de prestación de servicios profesionales y de apoyo a la gestión","Contratación directa",{"$f":"IFERROR(VLOOKUP(F228,Tipo!$C$12:$C$27,1,FALSE),\"NO\")","v":"Prestación de servicios profesionales y de apoyo a la gestión, o para la ejecución de trabajos artísticos que sólo puedan encomendarse a determinadas personas naturales;"},"Inversión",45]
["219-2019",2019,"FDLBU-CD-189-2019","Contratos de prestación de servicios profesionales y de apoyo a la gestión","Contratación directa","Prestación de servicios profesionales y de apoyo a la gestión, o para la ejecución de trabajos artísticos que sólo puedan encomendarse a determinadas personas naturales;","PRESTAR SERVICIOS DE APOYO PROFESIONAL, CON CONOCIMIENTO EN NORMAS INTERNACIONALES DE INFORMACION FINANCIERA PARA ADELANTAR LAS ACTIVIDADES QUE DEN CUMPLIMINETO A PROCEDIMIENTOS, ADMINISTRATIVOS Y CONTABLES APLICABLES EN EL NUEVO MARCO NORMATIVO CONTABLE","Inversión",45,{"$f":"IF(ISERROR(VLOOKUP(I229,Eje_Pilar!$C$2:$E$47,2,FALSE)),\" \",VLOOKUP(I229,Eje_Pilar!$C$2:$E$47,2,FALSE))","v":"Gobernanza e influencia local, regional e internacional"},{"$f":"IF(ISERROR(VLOOKUP(I229,Eje_Pilar!$C$2:$E$47,3,FALSE)),\" \",VLOOKUP(I229,Eje_Pilar!$C$2:$E$47,3,FALSE))","v":"Eje Transversal 4 Gobierno Legitimo, Fortalecimiento Local y Eficiencia"},1559,79484752,"DIEGO FERNANDO ANGULO",4555000,null,null,null,0,4555000,0,"2019-12-11","2019-12-24","2020-01-23",30,0,null,null,"x",null,null,0,null,{"$f":"IF(SUMPRODUCT((A$14:A229=A229)*(B$14:B229=B229)*(C$14:C229=C229))>1,0,1)","v":1},"Contratos de prestación de servicios profesionales y de apoyo a la gestión","Contratación directa",{"$f":"IFERROR(VLOOKUP(F229,Tipo!$C$12:$C$27,1,FALSE),\"NO\")","v":"Prestación de servicios profesionales y de apoyo a la gestión, o para la ejecución de trabajos artísticos que sólo puedan encomendarse a determinadas personas naturales;"},"Inversión",45]
["220-2019",2019,"FDLBU-CD-190-2019","Contratos de prestación de servicios profesionales y de apoyo a la gestión","Contratación directa","Prestación de servicios profesionales y de apoyo a la gestión, o para la ejecución de trabajos artísticos que sólo puedan encomendarse a determinadas personas naturales;","PRESTAR SERVICIOS DE APOYO EN LA OFICINA DE ATENCION A LA CIUDADANIA DE LA ALCALDIA LOCAL DE BARRIOS UNIDOS, EN EL SEGUIMIENTO DE LAS SOLICITUDES, REQUERIMIENTOS Y DERECHOS DE PETICION RADICADOS POR PARTE DE LA COMUNIDAD Y LAS DEMAS ACTIVIDADES PROPIAS EN EL TEMA QUE ASÍ SE REQUIERAN","Inversión",45,{"$f":"IF(ISERROR(VLOOKUP(I230,Eje_Pilar!$C$2:$E$47,2,FALSE)),\" \",VLOOKUP(I230,Eje_Pilar!$C$2:$E$47,2,FALSE))","v":"Gobernanza e influencia local, regional e internacional"},{"$f":"IF(ISERROR(VLOOKUP(I230,Eje_Pilar!$C$2:$E$47,3,FALSE)),\" \",VLOOKUP(I230,Eje_Pilar!$C$2:$E$47,3,FALSE))","v":"Eje Transversal 4 Gobierno Legitimo, Fortalecimiento Local y Eficiencia"},1559,1026250874,"LINA  MARÍA PAEZ BOGOYA",3400000,null,null,null,0,3400000,0,"2019-12-11","2019-12-11","2020-02-10",60,0,null,null,null,"x",null,0,null,{"$f":"IF(SUMPRODUCT((A$14:A230=A230)*(B$14:B230=B230)*(C$14:C230=C230))>1,0,1)","v":1},"Contratos de prestación de servicios profesionales y de apoyo a la gestión","Contratación directa",{"$f":"IFERROR(VLOOKUP(F230,Tipo!$C$12:$C$27,1,FALSE),\"NO\")","v":"Prestación de servicios profesionales y de apoyo a la gestión, o para la ejecución de trabajos artísticos que sólo puedan encomendarse a determinadas personas naturales;"},"Inversión",45]
["221-2019",2019,"FDLBU-CD-188-2019","Contratos de prestación de servicios profesionales y de apoyo a la gestión","Contratación directa","Prestación de servicios profesionales y de apoyo a la gestión, o para la ejecución de trabajos artísticos que sólo puedan encomendarse a determinadas personas naturales;","PRESTAR SERVICIOS DE APOYO A LA GESTION PARA APOYAR LA GESTION DOCUMENTAL DE LA ALACALDIA LOCAL EN LA IMPLEMENTACION DE LOS PROCESOS DE CLASIFICACION, ORDENACION, SELECCION NATURAL, FOLIACION, IDENTIFICACION, LEVANTAMIENTO DE INVENTARIOS, ALMACENAMIENTO Y APLICACIÓN DE PROTOCOLOS DE ELIMINACIÓN Y TRANSFERENCIAS DOCUMENTALES","Inversión",45,{"$f":"IF(ISERROR(VLOOKUP(I231,Eje_Pilar!$C$2:$E$47,2,FALSE)),\" \",VLOOKUP(I231,Eje_Pilar!$C$2:$E$47,2,FALSE))","v":"Gobernanza e influencia local, regional e internacional"},{"$f":"IF(ISERROR(VLOOKUP(I231,Eje_Pilar!$C$2:$E$47,3,FALSE)),\" \",VLOOKUP(I231,Eje_Pilar!$C$2:$E$47,3,FALSE))","v":"Eje Transversal 4 Gobierno Legitimo, Fortalecimiento Local y Eficiencia"},1559,7300621,"MANUEL ARTURO MATEUS",3300000,null,null,null,0,3300000,0,"2019-12-12","2019-12-16","2020-01-30",45,0,null,null,"x",null,null,0,null,{"$f":"IF(SUMPRODUCT((A$14:A231=A231)*(B$14:B231=B231)*(C$14:C231=C231))>1,0,1)","v":1},"Contratos de prestación de servicios profesionales y de apoyo a la gestión","Contratación directa",{"$f":"IFERROR(VLOOKUP(F231,Tipo!$C$12:$C$27,1,FALSE),\"NO\")","v":"Prestación de servicios profesionales y de apoyo a la gestión, o para la ejecución de trabajos artísticos que sólo puedan encomendarse a determinadas personas naturales;"},"Inversión",45]
["222-2019",2019,"FDLBU-CD-191-2019","Contratos de prestación de servicios profesionales y de apoyo a la gestión","Contratación directa","Prestación de servicios profesionales y de apoyo a la gestión, o para la ejecución de trabajos artísticos que sólo puedan encomendarse a determinadas personas naturales;","APOYAR JURIDICAMENTE A LA EJECUCIÓN DE LAS ACCIONES REQUERIDAS PARA LA DEPURACIÓN DE LAS ACTUACIONES ADMINISTRATIVAS QUE CURSAN EN LA ALCALDIA LOCAL.","Inversión",45,{"$f":"IF(ISERROR(VLOOKUP(I232,Eje_Pilar!$C$2:$E$47,2,FALSE)),\" \",VLOOKUP(I232,Eje_Pilar!$C$2:$E$47,2,FALSE))","v":"Gobernanza e influencia local, regional e internacional"},{"$f":"IF(ISERROR(VLOOKUP(I232,Eje_Pilar!$C$2:$E$47,3,FALSE)),\" \",VLOOKUP(I232,Eje_Pilar!$C$2:$E$47,3,FALSE))","v":"Eje Transversal 4 Gobierno Legitimo, Fortalecimiento Local y Eficiencia"},1559,1000269976,"                                                                                                                               KAREN LORENA MARIN CALDERON                                                                                                                                                                                                                                                                                                                               ",4555000,null,null,null,0,4555000,0,"2019-12-12","2019-12-12","2020-01-11",30,0,null,null,null,"x",null,0,null,{"$f":"IF(SUMPRODUCT((A$14:A232=A232)*(B$14:B232=B232)*(C$14:C232=C232))>1,0,1)","v":1},"Contratos de prestación de servicios profesionales y de apoyo a la gestión","Contratación directa",{"$f":"IFERROR(VLOOKUP(F232,Tipo!$C$12:$C$27,1,FALSE),\"NO\")","v":"Prestación de servicios profesionales y de apoyo a la gestión, o para la ejecución de trabajos artísticos que sólo puedan encomendarse a determinadas personas naturales;"},"Inversión",45]
["223-2019",2019,"FDLBU-CD-192-2019-APARECE EN SECOP CON PROCESO No. FDLBU-CD-223-2019","Contratos de prestación de servicios profesionales y de apoyo a la gestión","Contratación directa","Prestación de servicios profesionales y de apoyo a la gestión, o para la ejecución de trabajos artísticos que sólo puedan encomendarse a determinadas personas naturales;","APOYAR JURIDICAMENTE A LA EJECUCIÓN DE LAS ACCIONES REQUERIDAS PARA EL TRAMITE E IMPULSO PROCESAL DE LAS ACCIONES CONTRAVENCIONALES Y/O REQUERIDAS QUE CURSEN EN LAS INSPECCIONES DE POLICA DE LA LOCALIDAD ","Inversión",45,{"$f":"IF(ISERROR(VLOOKUP(I233,Eje_Pilar!$C$2:$E$47,2,FALSE)),\" \",VLOOKUP(I233,Eje_Pilar!$C$2:$E$47,2,FALSE))","v":"Gobernanza e influencia local, regional e internacional"},{"$f":"IF(ISERROR(VLOOKUP(I233,Eje_Pilar!$C$2:$E$47,3,FALSE)),\" \",VLOOKUP(I233,Eje_Pilar!$C$2:$E$47,3,FALSE))","v":"Eje Transversal 4 Gobierno Legitimo, Fortalecimiento Local y Eficiencia"},1559,53159645,"DIANA PAOLA GONZALEZ MURILLO",9110000,null,null,null,0,9110000,0,"2019-12-16","2019-12-17","2020-02-16",60,0,null,null,"x",null,null,0,null,{"$f":"IF(SUMPRODUCT((A$14:A233=A233)*(B$14:B233=B233)*(C$14:C233=C233))>1,0,1)","v":1},"Contratos de prestación de servicios profesionales y de apoyo a la gestión","Contratación directa",{"$f":"IFERROR(VLOOKUP(F233,Tipo!$C$12:$C$27,1,FALSE),\"NO\")","v":"Prestación de servicios profesionales y de apoyo a la gestión, o para la ejecución de trabajos artísticos que sólo puedan encomendarse a determinadas personas naturales;"},"Inversión",45]
["224-2019",2019,"FDLBU-CD-180-2019","Contratos de prestación de servicios profesionales y de apoyo a la gestión","Contratación directa","Prestación de servicios profesionales y de apoyo a la gestión, o para la ejecución de trabajos artísticos que sólo puedan encomendarse a determinadas personas naturales;","APOYAR JURÍDICAMENTE LA EJECUCIÓN DE LAS ACCIONES REQUERIDAS PARA EL TRÁMITE E IMPULSO PROCESAL DE LAS ACTUACIONES CONTRAVENCIONALES Y/O QUERELLAS QUE CURSEN EN LAS INSPECCIONES DE POLICÍA DE LA LOCALIDAD","Inversión",45,{"$f":"IF(ISERROR(VLOOKUP(I234,Eje_Pilar!$C$2:$E$47,2,FALSE)),\" \",VLOOKUP(I234,Eje_Pilar!$C$2:$E$47,2,FALSE))","v":"Gobernanza e influencia local, regional e internacional"},{"$f":"IF(ISERROR(VLOOKUP(I234,Eje_Pilar!$C$2:$E$47,3,FALSE)),\" \",VLOOKUP(I234,Eje_Pilar!$C$2:$E$47,3,FALSE))","v":"Eje Transversal 4 Gobierno Legitimo, Fortalecimiento Local y Eficiencia"},1559,80845552,"JHON FABIAN OLAYA",9110000,null,null,null,0,9110000,0,"2019-12-12","2019-12-18","2020-02-17",60,0,null,null,"x",null,null,0,null,{"$f":"IF(SUMPRODUCT((A$14:A234=A234)*(B$14:B234=B234)*(C$14:C234=C234))>1,0,1)","v":1},"Contratos de prestación de servicios profesionales y de apoyo a la gestión","Contratación directa",{"$f":"IFERROR(VLOOKUP(F234,Tipo!$C$12:$C$27,1,FALSE),\"NO\")","v":"Prestación de servicios profesionales y de apoyo a la gestión, o para la ejecución de trabajos artísticos que sólo puedan encomendarse a determinadas personas naturales;"},"Inversión",45]
["225-2019",2019,"FDLBU-CD-147-2019","Contratos interadministrativos","Contratación directa","Contratos interadministrativos","CONTRATAR EL SERVICIO DE MENSAJERÍA ESPECIALIZADA Y/O EXPRESA PARA LA ALCALDÍA LOCAL DE BARRIOS UNIDOS","Funcionamiento","No aplica",{"$f":"IF(ISERROR(VLOOKUP(I235,Eje_Pilar!$C$2:$E$47,2,FALSE)),\" \",VLOOKUP(I235,Eje_Pilar!$C$2:$E$47,2,FALSE))","v":" "},{"$f":"IF(ISERROR(VLOOKUP(I235,Eje_Pilar!$C$2:$E$47,3,FALSE)),\" \",VLOOKUP(I235,Eje_Pilar!$C$2:$E$47,3,FALSE))","v":" "},null,"900.062.917-9","SERVICIOS POSTALES NACIONALES S.A",79785197,null,null,null,0,79785197,0,"2019-12-16",null,null,360,0,null,"x",null,null,null,0,null,{"$f":"IF(SUMPRODUCT((A$14:A235=A235)*(B$14:B235=B235)*(C$14:C235=C235))>1,0,1)","v":1},"Contratos interadministrativos","Contratación directa",{"$f":"IFERROR(VLOOKUP(F235,Tipo!$C$12:$C$27,1,FALSE),\"NO\")","v":"Contratos interadministrativos"},"Funcionamiento","NO"]
["226-2019",2019,"FDLBU-CD-195-2019","Contratos de prestación de servicios profesionales y de apoyo a la gestión","Contratación directa","Prestación de servicios profesionales y de apoyo a la gestión, o para la ejecución de trabajos artísticos que sólo puedan encomendarse a determinadas personas naturales;","APOYAR JURÍDICAMENTE LA EJECUCIÓN DE LAS ACCIONES REQUERIDAS PARA LA DEPURACIÓN DE LAS ACTUACIONES ADMINISTRATIVAS QUE CURSAN EN LA ALCALDÍA LOCAL","Inversión",45,{"$f":"IF(ISERROR(VLOOKUP(I236,Eje_Pilar!$C$2:$E$47,2,FALSE)),\" \",VLOOKUP(I236,Eje_Pilar!$C$2:$E$47,2,FALSE))","v":"Gobernanza e influencia local, regional e internacional"},{"$f":"IF(ISERROR(VLOOKUP(I236,Eje_Pilar!$C$2:$E$47,3,FALSE)),\" \",VLOOKUP(I236,Eje_Pilar!$C$2:$E$47,3,FALSE))","v":"Eje Transversal 4 Gobierno Legitimo, Fortalecimiento Local y Eficiencia"},1559,52731958,"MERLY JOHANNA GARCÍA LÓPEZ",4555000,null,null,null,0,4555000,0,"2019-12-16","2019-12-18","2020-01-17",30,0,null,null,"x",null,null,0,null,{"$f":"IF(SUMPRODUCT((A$14:A236=A236)*(B$14:B236=B236)*(C$14:C236=C236))>1,0,1)","v":1},"Contratos de prestación de servicios profesionales y de apoyo a la gestión","Contratación directa",{"$f":"IFERROR(VLOOKUP(F236,Tipo!$C$12:$C$27,1,FALSE),\"NO\")","v":"Prestación de servicios profesionales y de apoyo a la gestión, o para la ejecución de trabajos artísticos que sólo puedan encomendarse a determinadas personas naturales;"},"Inversión",45]
["227-2019",2019,"FDLBU-CD-198-2019","Contratos de prestación de servicios profesionales y de apoyo a la gestión","Contratación directa","Prestación de servicios profesionales y de apoyo a la gestión, o para la ejecución de trabajos artísticos que sólo puedan encomendarse a determinadas personas naturales;","APOYAR JURÍDICAMENTE LA EJECUCIÓN DE LAS ACCIONES REQUERIDAS PARA LA DEPURACIÓN DE LAS ACTUACIONES ADMINISTRATIVAS QUE CURSAN EN LA ALCALDÍA LOCAL","Inversión",45,{"$f":"IF(ISERROR(VLOOKUP(I237,Eje_Pilar!$C$2:$E$47,2,FALSE)),\" \",VLOOKUP(I237,Eje_Pilar!$C$2:$E$47,2,FALSE))","v":"Gobernanza e influencia local, regional e internacional"},{"$f":"IF(ISERROR(VLOOKUP(I237,Eje_Pilar!$C$2:$E$47,3,FALSE)),\" \",VLOOKUP(I237,Eje_Pilar!$C$2:$E$47,3,FALSE))","v":"Eje Transversal 4 Gobierno Legitimo, Fortalecimiento Local y Eficiencia"},1559,52727999,"SANDRA ROCIO CAICEDO MONTAÑO",4555000,null,null,null,0,4555000,0,"2019-12-16","2019-12-19","2020-01-18",30,0,null,null,"x",null,null,0,null,{"$f":"IF(SUMPRODUCT((A$14:A237=A237)*(B$14:B237=B237)*(C$14:C237=C237))>1,0,1)","v":1},"Contratos de prestación de servicios profesionales y de apoyo a la gestión","Contratación directa",{"$f":"IFERROR(VLOOKUP(F237,Tipo!$C$12:$C$27,1,FALSE),\"NO\")","v":"Prestación de servicios profesionales y de apoyo a la gestión, o para la ejecución de trabajos artísticos que sólo puedan encomendarse a determinadas personas naturales;"},"Inversión",45]
["228-2019",2019,"FDLBU-CD-196-2019","Contratos de prestación de servicios profesionales y de apoyo a la gestión","Contratación directa","Prestación de servicios profesionales y de apoyo a la gestión, o para la ejecución de trabajos artísticos que sólo puedan encomendarse a determinadas personas naturales;","APOYAR JURÍDICAMENTE LA EJECUCIÓN DE LAS ACCIONES REQUERIDAS PARA LA DEPURACIÓN DE LAS ACTUACIONES ADMINISTRATIVAS QUE CURSAN EN LA ALCALDÍA LOCAL","Inversión",45,{"$f":"IF(ISERROR(VLOOKUP(I238,Eje_Pilar!$C$2:$E$47,2,FALSE)),\" \",VLOOKUP(I238,Eje_Pilar!$C$2:$E$47,2,FALSE))","v":"Gobernanza e influencia local, regional e internacional"},{"$f":"IF(ISERROR(VLOOKUP(I238,Eje_Pilar!$C$2:$E$47,3,FALSE)),\" \",VLOOKUP(I238,Eje_Pilar!$C$2:$E$47,3,FALSE))","v":"Eje Transversal 4 Gobierno Legitimo, Fortalecimiento Local y Eficiencia"},1559,52196889,"SANDRA MARINA GUTIERREZ FLOREZ",4555000,null,null,null,0,4555000,0,"2019-12-17","2019-12-18","2020-01-17",30,0,null,null,"x",null,null,0,null,{"$f":"IF(SUMPRODUCT((A$14:A238=A238)*(B$14:B238=B238)*(C$14:C238=C238))>1,0,1)","v":1},"Contratos de prestación de servicios profesionales y de apoyo a la gestión","Contratación directa",{"$f":"IFERROR(VLOOKUP(F238,Tipo!$C$12:$C$27,1,FALSE),\"NO\")","v":"Prestación de servicios profesionales y de apoyo a la gestión, o para la ejecución de trabajos artísticos que sólo puedan encomendarse a determinadas personas naturales;"},"Inversión",45]
["229-2019",2019,"FDLBU-CD-197-2019","Contratos de prestación de servicios profesionales y de apoyo a la gestión","Contratación directa","Prestación de servicios profesionales y de apoyo a la gestión, o para la ejecución de trabajos artísticos que sólo puedan encomendarse a determinadas personas naturales;","APOYAR JURÍDICAMENTE LA EJECUCIÓN DE LAS ACCIONES REQUERIDAS PARA LA DEPURACIÓN DE LAS ACTUACIONES ADMINISTRATIVAS QUE CURSAN EN LA ALCALDÍA LOCAL","Inversión",45,{"$f":"IF(ISERROR(VLOOKUP(I239,Eje_Pilar!$C$2:$E$47,2,FALSE)),\" \",VLOOKUP(I239,Eje_Pilar!$C$2:$E$47,2,FALSE))","v":"Gobernanza e influencia local, regional e internacional"},{"$f":"IF(ISERROR(VLOOKUP(I239,Eje_Pilar!$C$2:$E$47,3,FALSE)),\" \",VLOOKUP(I239,Eje_Pilar!$C$2:$E$47,3,FALSE))","v":"Eje Transversal 4 Gobierno Legitimo, Fortalecimiento Local y Eficiencia"},1559,80740127,"EDWIN JAVIER CIFUENTES VILLAMIZAR",4555000,null,null,null,0,4555000,0,"2019-12-17","2019-12-23","2020-01-22",30,0,null,null,"x",null,null,0,null,{"$f":"IF(SUMPRODUCT((A$14:A239=A239)*(B$14:B239=B239)*(C$14:C239=C239))>1,0,1)","v":1},"Contratos de prestación de servicios profesionales y de apoyo a la gestión","Contratación directa",{"$f":"IFERROR(VLOOKUP(F239,Tipo!$C$12:$C$27,1,FALSE),\"NO\")","v":"Prestación de servicios profesionales y de apoyo a la gestión, o para la ejecución de trabajos artísticos que sólo puedan encomendarse a determinadas personas naturales;"},"Inversión",45]
["230-2019",2019,"FDLBU-CD-184-2019","Contratos de prestación de servicios profesionales y de apoyo a la gestión","Contratación directa","Prestación de servicios profesionales y de apoyo a la gestión, o para la ejecución de trabajos artísticos que sólo puedan encomendarse a determinadas personas naturales;","PRESTAR SERVICIOS DE APOYO EN LAS LABORES DE LA\nDEPENDENCIA AL CONTADOR (A) DEL FONDO DE DESARROLLO LOCAL DE BARRIOS UNIDOS\n(FDLBU) EN LOS TRAMITES, MANEJO CONTABLE Y DE ARCHIVO EN FORMA PERMANENTE EN EL\nDESARROLLO DEL PROCESO DE CONSOLIDACIÓN DE INFORMACIÓN DEL SISTEMA CONTABLE Y\nFINANCIERO","Inversión",45,{"$f":"IF(ISERROR(VLOOKUP(I240,Eje_Pilar!$C$2:$E$47,2,FALSE)),\" \",VLOOKUP(I240,Eje_Pilar!$C$2:$E$47,2,FALSE))","v":"Gobernanza e influencia local, regional e internacional"},{"$f":"IF(ISERROR(VLOOKUP(I240,Eje_Pilar!$C$2:$E$47,3,FALSE)),\" \",VLOOKUP(I240,Eje_Pilar!$C$2:$E$47,3,FALSE))","v":"Eje Transversal 4 Gobierno Legitimo, Fortalecimiento Local y Eficiencia"},1559,19346335,"PEDRO JESUS SANCHEZ MOLINA",3320000,null,null,1,1660000,4980000,0,"2019-12-17","2019-12-18","2020-12-17",30,0,null,null,"x",null,null,0,null,{"$f":"IF(SUMPRODUCT((A$14:A240=A240)*(B$14:B240=B240)*(C$14:C240=C240))>1,0,1)","v":1},"Contratos de prestación de servicios profesionales y de apoyo a la gestión","Contratación directa",{"$f":"IFERROR(VLOOKUP(F240,Tipo!$C$12:$C$27,1,FALSE),\"NO\")","v":"Prestación de servicios profesionales y de apoyo a la gestión, o para la ejecución de trabajos artísticos que sólo puedan encomendarse a determinadas personas naturales;"},"Inversión",45]
["231-2019",2019,"FDLBU-CD-199-2019","Contratos de prestación de servicios profesionales y de apoyo a la gestión","Contratación directa","Prestación de servicios profesionales y de apoyo a la gestión, o para la ejecución de trabajos artísticos que sólo puedan encomendarse a determinadas personas naturales;","PRESTAR LOS SERVICIOS DE APOYO EN EL ÁREA DE GESTIÓN DEL DESARROLLO LOCAL DE LA ALCALDÍA LOCAL DE BARRIOS UNIDOS EN LA OFICINA DE PLANEACIÓN, PARA LOGRAR EL CUMPUMIENTO DE LAS METAS DEL PLAN DE DESARROLLO LOCAL DE LA VIGENCIA","Inversión",45,{"$f":"IF(ISERROR(VLOOKUP(I241,Eje_Pilar!$C$2:$E$47,2,FALSE)),\" \",VLOOKUP(I241,Eje_Pilar!$C$2:$E$47,2,FALSE))","v":"Gobernanza e influencia local, regional e internacional"},{"$f":"IF(ISERROR(VLOOKUP(I241,Eje_Pilar!$C$2:$E$47,3,FALSE)),\" \",VLOOKUP(I241,Eje_Pilar!$C$2:$E$47,3,FALSE))","v":"Eje Transversal 4 Gobierno Legitimo, Fortalecimiento Local y Eficiencia"},1559,6888023,"RODOLFO RAMON REYES GARCES",3000000,null,null,null,0,3000000,0,"2019-12-18","2019-12-20","2020-01-19",30,0,null,null,"x",null,null,0,null,{"$f":"IF(SUMPRODUCT((A$14:A241=A241)*(B$14:B241=B241)*(C$14:C241=C241))>1,0,1)","v":1},"Contratos de prestación de servicios profesionales y de apoyo a la gestión","Contratación directa",{"$f":"IFERROR(VLOOKUP(F241,Tipo!$C$12:$C$27,1,FALSE),\"NO\")","v":"Prestación de servicios profesionales y de apoyo a la gestión, o para la ejecución de trabajos artísticos que sólo puedan encomendarse a determinadas personas naturales;"},"Inversión",45]
["232-2019",2019,"FDLBU-CD-200-2019","Contratos de prestación de servicios profesionales y de apoyo a la gestión","Contratación directa","Prestación de servicios profesionales y de apoyo a la gestión, o para la ejecución de trabajos artísticos que sólo puedan encomendarse a determinadas personas naturales;","PRESTAR LOS SERVICIOS DE APOYO EN EL ÁREA DE GESTIÓN DEL DESARROLLO LOCAL DE LA ALCALDÍA LOCAL DE BARRIOS UNIDOS EN LA OFICINA DE PLANEACIÓN, PARA LOGRAR EL CUMPUMIENTO DE LAS METAS DEL PLAN DE DESARROLLO LOCAL DE LA VIGENCIA","Inversión",45,{"$f":"IF(ISERROR(VLOOKUP(I242,Eje_Pilar!$C$2:$E$47,2,FALSE)),\" \",VLOOKUP(I242,Eje_Pilar!$C$2:$E$47,2,FALSE))","v":"Gobernanza e influencia local, regional e internacional"},{"$f":"IF(ISERROR(VLOOKUP(I242,Eje_Pilar!$C$2:$E$47,3,FALSE)),\" \",VLOOKUP(I242,Eje_Pilar!$C$2:$E$47,3,FALSE))","v":"Eje Transversal 4 Gobierno Legitimo, Fortalecimiento Local y Eficiencia"},1559,80655986,"JOSE ALEXANDER CORTES RODRIGUEZ",3000000,null,null,null,0,3000000,0,"2019-12-18","2019-12-26","2020-01-25",30,0,null,null,"x",null,null,0,null,{"$f":"IF(SUMPRODUCT((A$14:A242=A242)*(B$14:B242=B242)*(C$14:C242=C242))>1,0,1)","v":1},"Contratos de prestación de servicios profesionales y de apoyo a la gestión","Contratación directa",{"$f":"IFERROR(VLOOKUP(F242,Tipo!$C$12:$C$27,1,FALSE),\"NO\")","v":"Prestación de servicios profesionales y de apoyo a la gestión, o para la ejecución de trabajos artísticos que sólo puedan encomendarse a determinadas personas naturales;"},"Inversión",45]
["233-2019",2019,"FDLBU-CD-202-2019","Contratos de prestación de servicios profesionales y de apoyo a la gestión","Contratación directa","Prestación de servicios profesionales y de apoyo a la gestión, o para la ejecución de trabajos artísticos que sólo puedan encomendarse a determinadas personas naturales;","PRESTAR SUS SERVICIOS PROFESIONALES PARA APOYAR LA FORMULACIÓN, GESTIÓN Y SEGUIMIENTO DE ACTIVIDADES ENFOCADAS A LA GESTIÓN AMBIENTAL EXTERNA, ENCAMINADAS A LA MITIGACIÓN DE LOS DIFERENTES IMPACTOS AMBIENTALES Y LA CONSERVACIÓN DE LOS RECURSOS NATURALES DE LA LOCALIDAD","Inversión",38,{"$f":"IF(ISERROR(VLOOKUP(I243,Eje_Pilar!$C$2:$E$47,2,FALSE)),\" \",VLOOKUP(I243,Eje_Pilar!$C$2:$E$47,2,FALSE))","v":"Recuperación y manejo de la Estructura Ecológica Principal"},{"$f":"IF(ISERROR(VLOOKUP(I243,Eje_Pilar!$C$2:$E$47,3,FALSE)),\" \",VLOOKUP(I243,Eje_Pilar!$C$2:$E$47,3,FALSE))","v":"Eje Transversal 3 Sostenibilidad Ambiental basada en la eficiencia energética"},1532,51713042,"MARTHA ESPERENZA MARTINEZ RODRIGUEZ",4555000,1,null,null,0,4555000,0,"2019-12-23","2020-01-02","2020-02-01",30,0,null,null,"x",null,null,0,null,{"$f":"IF(SUMPRODUCT((A$14:A243=A243)*(B$14:B243=B243)*(C$14:C243=C243))>1,0,1)","v":1},"Contratos de prestación de servicios profesionales y de apoyo a la gestión","Contratación directa",{"$f":"IFERROR(VLOOKUP(F243,Tipo!$C$12:$C$27,1,FALSE),\"NO\")","v":"Prestación de servicios profesionales y de apoyo a la gestión, o para la ejecución de trabajos artísticos que sólo puedan encomendarse a determinadas personas naturales;"},"Inversión",38]
["234-2019",2019,"FDLBU-CD-203-2019","Contratos de prestación de servicios profesionales y de apoyo a la gestión","Contratación directa","Prestación de servicios profesionales y de apoyo a la gestión, o para la ejecución de trabajos artísticos que sólo puedan encomendarse a determinadas personas naturales;","PRESTAR LOS SERVICIOS PROFESIONALES PARA APOYAR EL ÁREA DE GESTIÓN DEL DESARROLLO – ADMINISTRATIVO Y FINANCIERO, EN LOS ASUNTOS RELACIONADOS CON EL DESARROLLO DE LA GESTIÓN CONTRACTUAL PARA LA ADQUISICIÓN DE RECURSOS, ASÍ COMO DE LOS OTROS ASUNTOS JURÍDICOS REQUERIDOS EN EL DESARROLLO DE LA GESTIÓN DEL FONDO DE DESARROLLO LOCAL, DESCRITOS POR LA SECRETARÍA DISTRITAL DE GOBIERNO Y LAS NORMAS APLICABLES SOBRE LA MATERIA.","Inversión",45,{"$f":"IF(ISERROR(VLOOKUP(I244,Eje_Pilar!$C$2:$E$47,2,FALSE)),\" \",VLOOKUP(I244,Eje_Pilar!$C$2:$E$47,2,FALSE))","v":"Gobernanza e influencia local, regional e internacional"},{"$f":"IF(ISERROR(VLOOKUP(I244,Eje_Pilar!$C$2:$E$47,3,FALSE)),\" \",VLOOKUP(I244,Eje_Pilar!$C$2:$E$47,3,FALSE))","v":"Eje Transversal 4 Gobierno Legitimo, Fortalecimiento Local y Eficiencia"},1559,1032448800,"CESAR ALEJANDRO MORALES PACHECO",9000000,null,null,null,0,9000000,0,"2019-12-26","2019-12-26","2020-02-09",45,0,null,null,"x",null,null,0,null,{"$f":"IF(SUMPRODUCT((A$14:A244=A244)*(B$14:B244=B244)*(C$14:C244=C244))>1,0,1)","v":1},"Contratos de prestación de servicios profesionales y de apoyo a la gestión","Contratación directa",{"$f":"IFERROR(VLOOKUP(F244,Tipo!$C$12:$C$27,1,FALSE),\"NO\")","v":"Prestación de servicios profesionales y de apoyo a la gestión, o para la ejecución de trabajos artísticos que sólo puedan encomendarse a determinadas personas naturales;"},"Inversión",45]
["235-2019",2019,"FDLBU-CD-201-2019","Contratos de prestación de servicios profesionales y de apoyo a la gestión","Contratación directa","Prestación de servicios profesionales y de apoyo a la gestión, o para la ejecución de trabajos artísticos que sólo puedan encomendarse a determinadas personas naturales;","APOYAR ADMINISTRATIVA Y ASISTENCIALMENTE A LAS INSPECCIONES DE POLICIA DE LA LOCALIDAD","Inversión",45,{"$f":"IF(ISERROR(VLOOKUP(I245,Eje_Pilar!$C$2:$E$47,2,FALSE)),\" \",VLOOKUP(I245,Eje_Pilar!$C$2:$E$47,2,FALSE))","v":"Gobernanza e influencia local, regional e internacional"},{"$f":"IF(ISERROR(VLOOKUP(I245,Eje_Pilar!$C$2:$E$47,3,FALSE)),\" \",VLOOKUP(I245,Eje_Pilar!$C$2:$E$47,3,FALSE))","v":"Eje Transversal 4 Gobierno Legitimo, Fortalecimiento Local y Eficiencia"},1559,1012402193,"BRIGITT PAOLA CARDENAS SOTO",1800000,null,null,null,0,1800000,0,"2019-12-23","2019-12-24","2020-01-23",30,0,null,null,"x",null,null,0,null,{"$f":"IF(SUMPRODUCT((A$14:A245=A245)*(B$14:B245=B245)*(C$14:C245=C245))>1,0,1)","v":1},"Contratos de prestación de servicios profesionales y de apoyo a la gestión","Contratación directa",{"$f":"IFERROR(VLOOKUP(F245,Tipo!$C$12:$C$27,1,FALSE),\"NO\")","v":"Prestación de servicios profesionales y de apoyo a la gestión, o para la ejecución de trabajos artísticos que sólo puedan encomendarse a determinadas personas naturales;"},"Inversión",45]
["236-2019",2019,"FDLBU-CD-204-2019","Contratos de prestación de servicios profesionales y de apoyo a la gestión","Contratación directa","Prestación de servicios profesionales y de apoyo a la gestión, o para la ejecución de trabajos artísticos que sólo puedan encomendarse a determinadas personas naturales;","APOYAR ADMINISTRATIVA Y ASISTENCIALMENTE A LAS INSPECCIONES DE POLICÍA DE LA LOCALIDAD","Inversión",45,{"$f":"IF(ISERROR(VLOOKUP(I246,Eje_Pilar!$C$2:$E$47,2,FALSE)),\" \",VLOOKUP(I246,Eje_Pilar!$C$2:$E$47,2,FALSE))","v":"Gobernanza e influencia local, regional e internacional"},{"$f":"IF(ISERROR(VLOOKUP(I246,Eje_Pilar!$C$2:$E$47,3,FALSE)),\" \",VLOOKUP(I246,Eje_Pilar!$C$2:$E$47,3,FALSE))","v":"Eje Transversal 4 Gobierno Legitimo, Fortalecimiento Local y Eficiencia"},1559,1026266286,"BRAYAN ALEXANDER GARCÍA RIOS",3600000,null,null,null,0,3600000,0,"2019-12-26","2019-12-27","2020-01-26",60,0,null,null,"x",null,null,0,null,{"$f":"IF(SUMPRODUCT((A$14:A246=A246)*(B$14:B246=B246)*(C$14:C246=C246))>1,0,1)","v":1},"Contratos de prestación de servicios profesionales y de apoyo a la gestión","Contratación directa",{"$f":"IFERROR(VLOOKUP(F246,Tipo!$C$12:$C$27,1,FALSE),\"NO\")","v":"Prestación de servicios profesionales y de apoyo a la gestión, o para la ejecución de trabajos artísticos que sólo puedan encomendarse a determinadas personas naturales;"},"Inversión",45]
["237-2019",2019,"FDLBU-CD-194-2019","Contratos de prestación de servicios profesionales y de apoyo a la gestión","Contratación directa","Prestación de servicios profesionales y de apoyo a la gestión, o para la ejecución de trabajos artísticos que sólo puedan encomendarse a determinadas personas naturales;","APOYAR ADMINISTRATIVA Y ASISTENCIALMENTE A LAS INSPECCIONES DE POLICÍA DE LA LOCALIDAD","Inversión",45,{"$f":"IF(ISERROR(VLOOKUP(I247,Eje_Pilar!$C$2:$E$47,2,FALSE)),\" \",VLOOKUP(I247,Eje_Pilar!$C$2:$E$47,2,FALSE))","v":"Gobernanza e influencia local, regional e internacional"},{"$f":"IF(ISERROR(VLOOKUP(I247,Eje_Pilar!$C$2:$E$47,3,FALSE)),\" \",VLOOKUP(I247,Eje_Pilar!$C$2:$E$47,3,FALSE))","v":"Eje Transversal 4 Gobierno Legitimo, Fortalecimiento Local y Eficiencia"},1559,52703945,"MONICA ELIZABETH BLANCO",1800000,null,null,null,0,1800000,0,"2019-12-23","2019-12-23","2020-02-01",30,0,null,null,"x",null,null,0,null,{"$f":"IF(SUMPRODUCT((A$14:A247=A247)*(B$14:B247=B247)*(C$14:C247=C247))>1,0,1)","v":1},"Contratos de prestación de servicios profesionales y de apoyo a la gestión","Contratación directa",{"$f":"IFERROR(VLOOKUP(F247,Tipo!$C$12:$C$27,1,FALSE),\"NO\")","v":"Prestación de servicios profesionales y de apoyo a la gestión, o para la ejecución de trabajos artísticos que sólo puedan encomendarse a determinadas personas naturales;"},"Inversión",45]
["238-2019",2019,"FDLBU-CD-205-2019","Contratos de prestación de servicios profesionales y de apoyo a la gestión","Contratación directa","Prestación de servicios profesionales y de apoyo a la gestión, o para la ejecución de trabajos artísticos que sólo puedan encomendarse a determinadas personas naturales;","PRESTAR LOS SERVICIOS PROFESIONALES A LA ALCALDÍA LOCAL DE BARRIOS UNIDOS EN LA ADMINISTRACIÓN DE LA RED DE VOZ Y DATOS, EN LA ACTUALIZACIÓN Y SOPORTE CON LAS TECNOLOGÍAS Y SISTEMAS DE INFORMACIÓN, ASÍ COMO EL APOYO A LA SUPERVISIÓN DE LOS CONTRATOS QUE TIENEN RELACIÓN CON SOPORTES TECNOLÓGICOS Y TEMAS RELACIONADOS","Inversión",45,{"$f":"IF(ISERROR(VLOOKUP(I248,Eje_Pilar!$C$2:$E$47,2,FALSE)),\" \",VLOOKUP(I248,Eje_Pilar!$C$2:$E$47,2,FALSE))","v":"Gobernanza e influencia local, regional e internacional"},{"$f":"IF(ISERROR(VLOOKUP(I248,Eje_Pilar!$C$2:$E$47,3,FALSE)),\" \",VLOOKUP(I248,Eje_Pilar!$C$2:$E$47,3,FALSE))","v":"Eje Transversal 4 Gobierno Legitimo, Fortalecimiento Local y Eficiencia"},1559,19430488,"JUAN FRANCISCO BRICEÑO CASTAÑEDA",9110000,null,null,null,0,9110000,0,"2019-12-27","2019-12-27","2020-02-26",60,0,null,null,"x",null,null,0,null,{"$f":"IF(SUMPRODUCT((A$14:A248=A248)*(B$14:B248=B248)*(C$14:C248=C248))>1,0,1)","v":1},"Contratos de prestación de servicios profesionales y de apoyo a la gestión","Contratación directa",{"$f":"IFERROR(VLOOKUP(F248,Tipo!$C$12:$C$27,1,FALSE),\"NO\")","v":"Prestación de servicios profesionales y de apoyo a la gestión, o para la ejecución de trabajos artísticos que sólo puedan encomendarse a determinadas personas naturales;"},"Inversión",45]
["239-2019",2019,"FDLBU-CD-206-2019","Contratos de prestación de servicios profesionales y de apoyo a la gestión","Contratación directa","Prestación de servicios profesionales y de apoyo a la gestión, o para la ejecución de trabajos artísticos que sólo puedan encomendarse a determinadas personas naturales;","APOYAR ADMINISTRATIVA Y ASISTENCIALMENTE A LAS INSPECCIONES DE POLICÍA DE LA LOCALIDAD","Inversión",45,{"$f":"IF(ISERROR(VLOOKUP(I249,Eje_Pilar!$C$2:$E$47,2,FALSE)),\" \",VLOOKUP(I249,Eje_Pilar!$C$2:$E$47,2,FALSE))","v":"Gobernanza e influencia local, regional e internacional"},{"$f":"IF(ISERROR(VLOOKUP(I249,Eje_Pilar!$C$2:$E$47,3,FALSE)),\" \",VLOOKUP(I249,Eje_Pilar!$C$2:$E$47,3,FALSE))","v":"Eje Transversal 4 Gobierno Legitimo, Fortalecimiento Local y Eficiencia"},1559,53053874,"ANDREA MARYURI GOMEZ GORDILLO",3600000,null,null,null,0,3600000,0,"2019-12-27","2020-01-02","2020-03-01",60,0,null,null,"x",null,null,0,null,{"$f":"IF(SUMPRODUCT((A$14:A249=A249)*(B$14:B249=B249)*(C$14:C249=C249))>1,0,1)","v":1},"Contratos de prestación de servicios profesionales y de apoyo a la gestión","Contratación directa",{"$f":"IFERROR(VLOOKUP(F249,Tipo!$C$12:$C$27,1,FALSE),\"NO\")","v":"Prestación de servicios profesionales y de apoyo a la gestión, o para la ejecución de trabajos artísticos que sólo puedan encomendarse a determinadas personas naturales;"},"Inversión",45]
["240-2019",2019,"FDLBU-CD-207-2019","Contratos de prestación de servicios profesionales y de apoyo a la gestión","Contratación directa","Prestación de servicios profesionales y de apoyo a la gestión, o para la ejecución de trabajos artísticos que sólo puedan encomendarse a determinadas personas naturales;","PRESTAR SERVICIOS PROFESIONALES ESPECIALIZADOS EN EL ÁREA DE GESTIÓN DEL DESARROLLO, PARA LIDERAR LA FORMULACIÓN, SEGUIMIENTOY EVALUACIÓN DE POLÍTICAS, PLANES, PROGRAMAS Y PROYECTOS DE DESARROLLO LOCAL, PARA EL CUMPLIMIENTO DE LAS METAS DEL PLAN DE DESARROLLO LOCAL DE BARRIOS UNIDOS","Inversión",45,{"$f":"IF(ISERROR(VLOOKUP(I250,Eje_Pilar!$C$2:$E$47,2,FALSE)),\" \",VLOOKUP(I250,Eje_Pilar!$C$2:$E$47,2,FALSE))","v":"Gobernanza e influencia local, regional e internacional"},{"$f":"IF(ISERROR(VLOOKUP(I250,Eje_Pilar!$C$2:$E$47,3,FALSE)),\" \",VLOOKUP(I250,Eje_Pilar!$C$2:$E$47,3,FALSE))","v":"Eje Transversal 4 Gobierno Legitimo, Fortalecimiento Local y Eficiencia"},1559,1032433077,"OSCAR ALFONSO MONTEALEGRE HERRERA",10558500,null,null,null,0,10558500,0,"2019-12-27","2019-12-27","2020-02-11",45,0,null,null,"x",null,null,0,null,{"$f":"IF(SUMPRODUCT((A$14:A250=A250)*(B$14:B250=B250)*(C$14:C250=C250))>1,0,1)","v":1},"Contratos de prestación de servicios profesionales y de apoyo a la gestión","Contratación directa",{"$f":"IFERROR(VLOOKUP(F250,Tipo!$C$12:$C$27,1,FALSE),\"NO\")","v":"Prestación de servicios profesionales y de apoyo a la gestión, o para la ejecución de trabajos artísticos que sólo puedan encomendarse a determinadas personas naturales;"},"Inversión",45]
["241-2019",2019,"FDLBU-LP-143-2019","Obra pública","Licitación pública","No aplica","EJECUTAR A MONTO AGOTABLE Y A PRECIOS UNITARIOS SIN FORMULA DE AJUSTE, LAS OBRAS Y ACTIVIDADES PARA LA CONSERVACIÓN DE LA MALLA VIAL LOCAL, INTERMEDIA Y ESPACIO PÚBLICO DE LA LOCALIDAD DE BARRIOS UNIDOS EL CUAL INCLUYE APROPIACIÓN DE LOS DISEÑOS EXISTENTES, DIAGNÓSTICO, ESTUDIOS Y DISEÑOS PARA CONSERVACIÓN, MANTENIMIENTOS, REHABILITACIÓN, RECONSTRUCCIÓN, ACCIONES DE MOVILIDAD, ATENCIÓN DE EMERGENCIAS Y LAS DEMÁS ACTIVIDADES QUE SE DETALLAN EN LOS ANEXOS TÉCNICOS.","Inversión",18,{"$f":"IF(ISERROR(VLOOKUP(I251,Eje_Pilar!$C$2:$E$47,2,FALSE)),\" \",VLOOKUP(I251,Eje_Pilar!$C$2:$E$47,2,FALSE))","v":"Mejor movilidad para todos"},{"$f":"IF(ISERROR(VLOOKUP(I251,Eje_Pilar!$C$2:$E$47,3,FALSE)),\" \",VLOOKUP(I251,Eje_Pilar!$C$2:$E$47,3,FALSE))","v":"Pilar 2 Democracía Urbana"},1561,901351050,"CONSORCIO BARRIOS UNIDOS 2020",7770000000,null,null,null,0,7770000000,0,"2019-12-27",null,null,240,0,null,"x",null,null,null,0,null,{"$f":"IF(SUMPRODUCT((A$14:A251=A251)*(B$14:B251=B251)*(C$14:C251=C251))>1,0,1)","v":1},"Obra pública","Licitación pública",{"$f":"IFERROR(VLOOKUP(F251,Tipo!$C$12:$C$27,1,FALSE),\"NO\")","v":"NO"},"Inversión",18]
["242-2019",2019,"FDLBU-169-2019","Interventoría","Concurso de méritos","No aplica","EJECUTAR LA INTERVENTORÍA TÉCNICA, ADMINISTRATIVA, LEGAL, FINAN-CIERA, CONTABLE, SOCIAL, AMBIENTAL Y DE SEGURIDAD Y SALUD EN EL TRABAJO AL CONTRATO DE OBRA QUE RESULTE DEL PROCESO FDLBU-LP-143-2019.","Inversión",18,{"$f":"IF(ISERROR(VLOOKUP(I252,Eje_Pilar!$C$2:$E$47,2,FALSE)),\" \",VLOOKUP(I252,Eje_Pilar!$C$2:$E$47,2,FALSE))","v":"Mejor movilidad para todos"},{"$f":"IF(ISERROR(VLOOKUP(I252,Eje_Pilar!$C$2:$E$47,3,FALSE)),\" \",VLOOKUP(I252,Eje_Pilar!$C$2:$E$47,3,FALSE))","v":"Pilar 2 Democracía Urbana"},1561,900107376,"INTERVENTORIA Y CONSTRUCIVILES S.A.S.",766436856,null,null,null,0,766436856,0,"2019-12-26",null,null,240,0,null,"x",null,null,null,0,null,{"$f":"IF(SUMPRODUCT((A$14:A252=A252)*(B$14:B252=B252)*(C$14:C252=C252))>1,0,1)","v":1},"Interventoría","Concurso de méritos",{"$f":"IFERROR(VLOOKUP(F252,Tipo!$C$12:$C$27,1,FALSE),\"NO\")","v":"NO"},"Inversión",18]
["243-2019",2019,"FDLBU-CD-150-2019","Contratos de prestación de servicios profesionales y de apoyo a la gestión","Contratación directa","Prestación de servicios profesionales y de apoyo a la gestión, o para la ejecución de trabajos artísticos que sólo puedan encomendarse a determinadas personas naturales;","PRESTAR SUS SERVICIOS PROFESIONALES PARA APOYAR TÉCNICAMENTE A LOS RESPONSABLES E INTEGRANTES DE LOS PROCESOS EN LA IMPLEMENTACIÓN DE HERRAMIENTAS DE GESTIÓN, SIGUIENDO LOS LINEAMIENTOS METODOLÓGICOS ESTABLECIDOS POR LA OFICINA ASESORA DE PLANEACIÓN  DE LA SECRETARIA DISTRITAL DE GOBIERNO.","Inversión",45,{"$f":"IF(ISERROR(VLOOKUP(I253,Eje_Pilar!$C$2:$E$47,2,FALSE)),\" \",VLOOKUP(I253,Eje_Pilar!$C$2:$E$47,2,FALSE))","v":"Gobernanza e influencia local, regional e internacional"},{"$f":"IF(ISERROR(VLOOKUP(I253,Eje_Pilar!$C$2:$E$47,3,FALSE)),\" \",VLOOKUP(I253,Eje_Pilar!$C$2:$E$47,3,FALSE))","v":"Eje Transversal 4 Gobierno Legitimo, Fortalecimiento Local y Eficiencia"},1559,1010212894,"PATRICIA LAURA GUTIERREZ BELLO",9110000,null,null,null,0,9110000,0,"2019-12-30","2020-01-02","2020-03-01",60,0,null,null,"x",null,null,0,null,{"$f":"IF(SUMPRODUCT((A$14:A253=A253)*(B$14:B253=B253)*(C$14:C253=C253))>1,0,1)","v":1},"Contratos de prestación de servicios profesionales y de apoyo a la gestión","Contratación directa",{"$f":"IFERROR(VLOOKUP(F253,Tipo!$C$12:$C$27,1,FALSE),\"NO\")","v":"Prestación de servicios profesionales y de apoyo a la gestión, o para la ejecución de trabajos artísticos que sólo puedan encomendarse a determinadas personas naturales;"},"Inversión",45]
["244-2019",2019,"FDLBU-CD-208-2019","Contratos de prestación de servicios profesionales y de apoyo a la gestión","Contratación directa","Prestación de servicios profesionales y de apoyo a la gestión, o para la ejecución de trabajos artísticos que sólo puedan encomendarse a determinadas personas naturales;","PRESTAR LOS SERVICIOS PROFESIONALES PARA APOYAR AL ÁREA GESTIÓN DEL DESARROLLO – ADMINISTRATIVO Y FINANCIERO EN LOS ASUNTOS RELATIVOS A LA PLANEACIÓN LOCAL, ASÍ COMO EL APOYO A LA SUPERVISIÓN DE CONTRATOS SUSCRITOS POR LA ALCALDÍA LOCAL DE BARRIOS UNIDOS","Inversión",45,{"$f":"IF(ISERROR(VLOOKUP(I254,Eje_Pilar!$C$2:$E$47,2,FALSE)),\" \",VLOOKUP(I254,Eje_Pilar!$C$2:$E$47,2,FALSE))","v":"Gobernanza e influencia local, regional e internacional"},{"$f":"IF(ISERROR(VLOOKUP(I254,Eje_Pilar!$C$2:$E$47,3,FALSE)),\" \",VLOOKUP(I254,Eje_Pilar!$C$2:$E$47,3,FALSE))","v":"Eje Transversal 4 Gobierno Legitimo, Fortalecimiento Local y Eficiencia"},1559,79733402,"ANDRES MAURICIO SARMIENTO MASMELA",6750000,null,null,null,0,6750000,0,"2019-12-30","2020-01-02","2020-02-01",30,0,null,null,"x",null,null,0,null,{"$f":"IF(SUMPRODUCT((A$14:A254=A254)*(B$14:B254=B254)*(C$14:C254=C254))>1,0,1)","v":1},"Contratos de prestación de servicios profesionales y de apoyo a la gestión","Contratación directa",{"$f":"IFERROR(VLOOKUP(F254,Tipo!$C$12:$C$27,1,FALSE),\"NO\")","v":"Prestación de servicios profesionales y de apoyo a la gestión, o para la ejecución de trabajos artísticos que sólo puedan encomendarse a determinadas personas naturales;"},"Inversión",45]
["245-2019",2019,"FDLBU-CD-209-2019","Contratos de prestación de servicios profesionales y de apoyo a la gestión","Contratación directa","Prestación de servicios profesionales y de apoyo a la gestión, o para la ejecución de trabajos artísticos que sólo puedan encomendarse a determinadas personas naturales;","APOYAR ADMINISTRATIVA Y ASISTENCIALMENTE A LAS INSPECCIONES DE POLICÍA DE LA LOCALIDAD","Inversión",45,{"$f":"IF(ISERROR(VLOOKUP(I255,Eje_Pilar!$C$2:$E$47,2,FALSE)),\" \",VLOOKUP(I255,Eje_Pilar!$C$2:$E$47,2,FALSE))","v":"Gobernanza e influencia local, regional e internacional"},{"$f":"IF(ISERROR(VLOOKUP(I255,Eje_Pilar!$C$2:$E$47,3,FALSE)),\" \",VLOOKUP(I255,Eje_Pilar!$C$2:$E$47,3,FALSE))","v":"Eje Transversal 4 Gobierno Legitimo, Fortalecimiento Local y Eficiencia"},1559,53134156,"SAMIR ANDREA CORAL BAQUERO",3600000,null,null,null,0,3600000,0,"2019-12-30","2020-01-03","2020-03-02",60,0,null,null,"x",null,null,0,null,{"$f":"IF(SUMPRODUCT((A$14:A255=A255)*(B$14:B255=B255)*(C$14:C255=C255))>1,0,1)","v":1},"Contratos de prestación de servicios profesionales y de apoyo a la gestión","Contratación directa",{"$f":"IFERROR(VLOOKUP(F255,Tipo!$C$12:$C$27,1,FALSE),\"NO\")","v":"Prestación de servicios profesionales y de apoyo a la gestión, o para la ejecución de trabajos artísticos que sólo puedan encomendarse a determinadas personas naturales;"},"Inversión",45]
["246-2019",2019,"FDLBU-CD-210-2019","Contratos de prestación de servicios profesionales y de apoyo a la gestión","Contratación directa","Prestación de servicios profesionales y de apoyo a la gestión, o para la ejecución de trabajos artísticos que sólo puedan encomendarse a determinadas personas naturales;","APOYAR ADMINISTRATIVA Y ASISTENCIALMENTE A LAS INSPECCIONES DE POLICÍA DE LA LOCALIDAD","Inversión",45,{"$f":"IF(ISERROR(VLOOKUP(I256,Eje_Pilar!$C$2:$E$47,2,FALSE)),\" \",VLOOKUP(I256,Eje_Pilar!$C$2:$E$47,2,FALSE))","v":"Gobernanza e influencia local, regional e internacional"},{"$f":"IF(ISERROR(VLOOKUP(I256,Eje_Pilar!$C$2:$E$47,3,FALSE)),\" \",VLOOKUP(I256,Eje_Pilar!$C$2:$E$47,3,FALSE))","v":"Eje Transversal 4 Gobierno Legitimo, Fortalecimiento Local y Eficiencia"},1559,1014288451,"LEIDY VANESSA GUERRA GONZALEZ ",3600000,null,null,null,0,3600000,0,"2019-12-30","2020-01-03","2020-03-02",60,0,null,null,"x",null,null,0,null,{"$f":"IF(SUMPRODUCT((A$14:A256=A256)*(B$14:B256=B256)*(C$14:C256=C256))>1,0,1)","v":1},"Contratos de prestación de servicios profesionales y de apoyo a la gestión","Contratación directa",{"$f":"IFERROR(VLOOKUP(F256,Tipo!$C$12:$C$27,1,FALSE),\"NO\")","v":"Prestación de servicios profesionales y de apoyo a la gestión, o para la ejecución de trabajos artísticos que sólo puedan encomendarse a determinadas personas naturales;"},"Inversión",45]
["247-2019",2019,"FDLBU-CD-211-2019","Contratos de prestación de servicios profesionales y de apoyo a la gestión","Contratación directa","Prestación de servicios profesionales y de apoyo a la gestión, o para la ejecución de trabajos artísticos que sólo puedan encomendarse a determinadas personas naturales;","PRESTAR SUS SERVICIOS PROFESIONALES PARA APOYAR TÉCNICAMENTE A LOS RESPONSABLES E INTEGRANTES DE LOS PROCESOS EN LA IMPLEMENTACIÓN DE HERRAMIENTAS DE GESTIÓN, SIGUIENDO LOS LINEAMIENOS METODOLÓGICOS ESTABLECIDOS POR LA OFICINA ASESORA DE PLANEACIÓN DE LA SECRETARIA DISTRITAL DE GOBIERNO","Inversión",45,{"$f":"IF(ISERROR(VLOOKUP(I257,Eje_Pilar!$C$2:$E$47,2,FALSE)),\" \",VLOOKUP(I257,Eje_Pilar!$C$2:$E$47,2,FALSE))","v":"Gobernanza e influencia local, regional e internacional"},{"$f":"IF(ISERROR(VLOOKUP(I257,Eje_Pilar!$C$2:$E$47,3,FALSE)),\" \",VLOOKUP(I257,Eje_Pilar!$C$2:$E$47,3,FALSE))","v":"Eje Transversal 4 Gobierno Legitimo, Fortalecimiento Local y Eficiencia"},1559,52422505,"NAYIBE RODRIGUEZ MARTINEZ",10200000,null,null,null,0,10200000,0,"2019-12-30","2020-01-02","2020-03-01",60,0,null,null,"x",null,null,0,null,{"$f":"IF(SUMPRODUCT((A$14:A257=A257)*(B$14:B257=B257)*(C$14:C257=C257))>1,0,1)","v":1},"Contratos de prestación de servicios profesionales y de apoyo a la gestión","Contratación directa",{"$f":"IFERROR(VLOOKUP(F257,Tipo!$C$12:$C$27,1,FALSE),\"NO\")","v":"Prestación de servicios profesionales y de apoyo a la gestión, o para la ejecución de trabajos artísticos que sólo puedan encomendarse a determinadas personas naturales;"},"Inversión",45]
["248-2019",2019,"FDLBU-CD-212-2019","Contratos de prestación de servicios profesionales y de apoyo a la gestión","Contratación directa","Prestación de servicios profesionales y de apoyo a la gestión, o para la ejecución de trabajos artísticos que sólo puedan encomendarse a determinadas personas naturales;","PRESTAR SERVICIOS DE APOYO AL ÁREA DE GESTIÓN DEL DESARROLLO ADMINISTRATIVA Y FINANCIERA EN LAS LABORES QUE REQUIERA LA JUNTA ADMINISTRADORA LOCAL DE BARRIOS UNIDOS COMO GRABACIÓN DE SESIONES, TRANSCRIPCIÓN DE ACTAS Y ATENCIÓN A LA CIUDADANÍA","Inversión",45,{"$f":"IF(ISERROR(VLOOKUP(I258,Eje_Pilar!$C$2:$E$47,2,FALSE)),\" \",VLOOKUP(I258,Eje_Pilar!$C$2:$E$47,2,FALSE))","v":"Gobernanza e influencia local, regional e internacional"},{"$f":"IF(ISERROR(VLOOKUP(I258,Eje_Pilar!$C$2:$E$47,3,FALSE)),\" \",VLOOKUP(I258,Eje_Pilar!$C$2:$E$47,3,FALSE))","v":"Eje Transversal 4 Gobierno Legitimo, Fortalecimiento Local y Eficiencia"},1559,80246449,"DIEGO ANDRES SORA CORTES",4400000,null,null,null,0,4400000,0,"2019-12-30","2020-01-02","2020-03-01",60,0,null,null,"x",null,null,0,null,{"$f":"IF(SUMPRODUCT((A$14:A258=A258)*(B$14:B258=B258)*(C$14:C258=C258))>1,0,1)","v":1},"Contratos de prestación de servicios profesionales y de apoyo a la gestión","Contratación directa",{"$f":"IFERROR(VLOOKUP(F258,Tipo!$C$12:$C$27,1,FALSE),\"NO\")","v":"Prestación de servicios profesionales y de apoyo a la gestión, o para la ejecución de trabajos artísticos que sólo puedan encomendarse a determinadas personas naturales;"},"Inversión",45]
["37311-2019",2019,"69180-2019","Suministro","Selección abreviada","Acuerdo marco de precios ","PRESTAR EL SERVICIO DE ASEO Y CAFETERÍA INCLUIDO: RECURSO HUMANO, MAQUINARIA Y EQUIPOS NECESARIOS PARA EL DESARROLLO DEL PROCESO, ADEMÁS DEL SUMINISTRO DE INSUMOS PARA LAS DIFERENTES SEDES DE LA ALCALDÍA LOCAL DE BARRIOS UNIDOS, INCLUIDA LA JUNTA ADMINISTRADORA LOCAL","Funcionamiento","No aplica",{"$f":"IF(ISERROR(VLOOKUP(I259,Eje_Pilar!$C$2:$E$47,2,FALSE)),\" \",VLOOKUP(I259,Eje_Pilar!$C$2:$E$47,2,FALSE))","v":" "},{"$f":"IF(ISERROR(VLOOKUP(I259,Eje_Pilar!$C$2:$E$47,3,FALSE)),\" \",VLOOKUP(I259,Eje_Pilar!$C$2:$E$47,3,FALSE))","v":" "},null,"860.067.479-2","SERVIASEO S.A.",145710413.59,null,null,null,0,145710413.59,73318838,"2019-04-22","2019-04-22","2020-04-21",360,0,null,null,"x",null,null,0.5031818673324514,null,{"$f":"IF(SUMPRODUCT((A$14:A259=A259)*(B$14:B259=B259)*(C$14:C259=C259))>1,0,1)","v":1},"Suministro","Selección abreviada",{"$f":"IFERROR(VLOOKUP(F259,Tipo!$C$12:$C$27,1,FALSE),\"NO\")","v":"Acuerdo marco de precios "},"Funcionamiento","NO"]
["38589-2019",2019,"70792-2019","Arrendamiento de bienes muebles","Selección abreviada","Acuerdo marco de precios ","CONTRATAR EL SERVICIO DE LICENCIAMIENTO OFFICE 365 (E1 y E3) PARA LOS EQUIPOS DE COMPUTO DEL FONDO DE DESARROLLO LOCAL DE BARRIOS UNIDOS","Funcionamiento","No aplica",{"$f":"IF(ISERROR(VLOOKUP(I260,Eje_Pilar!$C$2:$E$47,2,FALSE)),\" \",VLOOKUP(I260,Eje_Pilar!$C$2:$E$47,2,FALSE))","v":" "},{"$f":"IF(ISERROR(VLOOKUP(I260,Eje_Pilar!$C$2:$E$47,3,FALSE)),\" \",VLOOKUP(I260,Eje_Pilar!$C$2:$E$47,3,FALSE))","v":" "},null,"900.884.399-0","UNION TEMPORAL SOFT-IG",44986121.670000002,null,null,null,0,44986121.670000002,44986122,"2019-06-10","2019-06-10","2020-06-09",360,0,null,null,"x",null,null,1.0000000073355957,null,{"$f":"IF(SUMPRODUCT((A$14:A260=A260)*(B$14:B260=B260)*(C$14:C260=C260))>1,0,1)","v":1},"Arrendamiento de bienes muebles","Selección abreviada",{"$f":"IFERROR(VLOOKUP(F260,Tipo!$C$12:$C$27,1,FALSE),\"NO\")","v":"Acuerdo marco de precios "},"Funcionamiento","NO"]
["39038-2019",2019,"72004-2019","Compraventa de bienes muebles","Selección abreviada","Acuerdo marco de precios ","ADQUISICIÓN DE MOTOCICLETAS Y VEHÍCULOS PARA EL FONDO DE DESARROLLO LOCAL DE BARRIOS PARA FORTALECER LAS ACCIONES DE SEGURIDAD EN LAS LOCALIDADES DE BOGOTÁ DISTRITO CAPITAL","Inversión",19,{"$f":"IF(ISERROR(VLOOKUP(I261,Eje_Pilar!$C$2:$E$47,2,FALSE)),\" \",VLOOKUP(I261,Eje_Pilar!$C$2:$E$47,2,FALSE))","v":"Seguridad y convivencia para todos"},{"$f":"IF(ISERROR(VLOOKUP(I261,Eje_Pilar!$C$2:$E$47,3,FALSE)),\" \",VLOOKUP(I261,Eje_Pilar!$C$2:$E$47,3,FALSE))","v":"Pilar 3 Construcción de Comunidad y Cultura Ciudadana"},1563,"890.301.886-1","FANALCA S.A.",134603400,null,null,null,0,134603400,134603400,"2019-06-28","2019-06-28","2019-09-27",90,0,null,null,null,"x",null,1,null,{"$f":"IF(SUMPRODUCT((A$14:A261=A261)*(B$14:B261=B261)*(C$14:C261=C261))>1,0,1)","v":1},"Compraventa de bienes muebles","Selección abreviada",{"$f":"IFERROR(VLOOKUP(F261,Tipo!$C$12:$C$27,1,FALSE),\"NO\")","v":"Acuerdo marco de precios "},"Inversión",19]
["44146-2019",2019,"74939-2019","Compraventa de bienes muebles","Selección abreviada","Acuerdo marco de precios ","ADQUISICIÓN DE VEHICULOS PARA EL FONDO DE DESARROLLO LOCAL DE BARRIOS UNIDOS EN VIRTUD DEL ACUERDO MARCO DE PRECIOS CCE-312-1-AMP-2015, PARA FORTALECER LAS ACCIONES DE SEGURIDAD EN LAS LOCALIDADES DE BOGOTÁ DISTRITO CAPITAL","Inversión",19,{"$f":"IF(ISERROR(VLOOKUP(I262,Eje_Pilar!$C$2:$E$47,2,FALSE)),\" \",VLOOKUP(I262,Eje_Pilar!$C$2:$E$47,2,FALSE))","v":"Seguridad y convivencia para todos"},{"$f":"IF(ISERROR(VLOOKUP(I262,Eje_Pilar!$C$2:$E$47,3,FALSE)),\" \",VLOOKUP(I262,Eje_Pilar!$C$2:$E$47,3,FALSE))","v":"Pilar 3 Construcción de Comunidad y Cultura Ciudadana"},1563,"860.025.792-3","RENAULT SOCIEDAD DE FABRICACIÓN DE AUTOMOTORES S.A.S.",355657890,null,null,null,0,355657890,0,"2019-12-27","2019-12-27","2020-02-26",60,0,null,null,"x",null,null,0,null,{"$f":"IF(SUMPRODUCT((A$14:A262=A262)*(B$14:B262=B262)*(C$14:C262=C262))>1,0,1)","v":1},"Compraventa de bienes muebles","Selección abreviada",{"$f":"IFERROR(VLOOKUP(F262,Tipo!$C$12:$C$27,1,FALSE),\"NO\")","v":"Acuerdo marco de precios "},"Inversión",19]
["089-2017",2017,"FDLBU-LP-087-2017","Obra pública","Licitación pública","No aplica","CONTRATAR MEDIANTE EL SISTEMA DE PRECIOS UNITARIOS FIJOS, LA CONSTRUCCIÓN, EL SUMINISTRO E INSTALACIÓN DE MOBILIARIO URBANO, ASÍ COMO EL MANTENIMIENTO DE AL INFRAESTRUCTURA FÍSICA DE LOS PARQUES VECINALES Y DE BOLSILLO DE LA LOCALIDAD DE BARRIOS UNIDOS","Inversión",17,{"$f":"IF(ISERROR(VLOOKUP(I263,Eje_Pilar!$C$2:$E$47,2,FALSE)),\" \",VLOOKUP(I263,Eje_Pilar!$C$2:$E$47,2,FALSE))","v":"Espacio público, derecho de todos"},{"$f":"IF(ISERROR(VLOOKUP(I263,Eje_Pilar!$C$2:$E$47,3,FALSE)),\" \",VLOOKUP(I263,Eje_Pilar!$C$2:$E$47,3,FALSE))","v":"Pilar 2 Democracía Urbana"},1558,9011411169,"CONSORCIO URBANO DISTRITAL ",null,null,null,1,1253294658,1253294658,739114945,"2017-12-27","2018-08-01","2019-11-04",210,120,null,null,null,"X",null,0.58973756911999864,null,{"$f":"IF(SUMPRODUCT((A$14:A263=A263)*(B$14:B263=B263)*(C$14:C263=C263))>1,0,1)","v":1},"Obra pública","Licitación pública",{"$f":"IFERROR(VLOOKUP(F263,Tipo!$C$12:$C$27,1,FALSE),\"NO\")","v":"NO"},"Inversión",17]
["094-2017",2017,"FDLBU-LP-083-2017","Obra pública","Licitación pública","No aplica","COMPLEMENTACIÓN Y/O ACTUALIZACIÓN Y/O AJUSTES DE DISEÑOS Y REHABILITACIÓN Y/O RECONSTRUCCIÓN DE LA MALLA VIAL Y EL ESPACIO PÚBLICO ASOCIADO DE LA LOCALIDAD DE BARRIOS UNIDOS","Inversión",17,{"$f":"IF(ISERROR(VLOOKUP(I264,Eje_Pilar!$C$2:$E$47,2,FALSE)),\" \",VLOOKUP(I264,Eje_Pilar!$C$2:$E$47,2,FALSE))","v":"Espacio público, derecho de todos"},{"$f":"IF(ISERROR(VLOOKUP(I264,Eje_Pilar!$C$2:$E$47,3,FALSE)),\" \",VLOOKUP(I264,Eje_Pilar!$C$2:$E$47,3,FALSE))","v":"Pilar 2 Democracía Urbana"},1561,9011418370,"CONSORCIO PARQUES IE 2017",null,null,null,1,1695000000,1695000000,750435765,"2017-12-26","2018-04-04","2019-05-27",180,135,null,null,null,"X",null,0.44273496460176992,null,{"$f":"IF(SUMPRODUCT((A$14:A264=A264)*(B$14:B264=B264)*(C$14:C264=C264))>1,0,1)","v":1},"Obra pública","Licitación pública",{"$f":"IFERROR(VLOOKUP(F264,Tipo!$C$12:$C$27,1,FALSE),\"NO\")","v":"NO"},"Inversión",17]
["128-2018",2018,"FDLBU-PMC-091-2018","Contratos de prestación de servicios","Contratación mínima cuantia","No aplica","CONTRATAR EL SERVICIO DE MENSAJERIA ESPECIALIZADA Y/O EXPRESA PARA LA ALCALDIA LOCAL DE BARRIOS UNIDOS","Funcionamiento","No aplica",{"$f":"IF(ISERROR(VLOOKUP(I265,Eje_Pilar!$C$2:$E$47,2,FALSE)),\" \",VLOOKUP(I265,Eje_Pilar!$C$2:$E$47,2,FALSE))","v":" "},{"$f":"IF(ISERROR(VLOOKUP(I265,Eje_Pilar!$C$2:$E$47,3,FALSE)),\" \",VLOOKUP(I265,Eje_Pilar!$C$2:$E$47,3,FALSE))","v":" "},0,9001193905,"ALAS DE COLOMBIA EXPRESS S.A.S.",null,1,-699,1,9983166,9982467,9982467,"2018-09-27","2018-09-28","2019-05-27",120,120,null,null,null,"X",null,1,null,{"$f":"IF(SUMPRODUCT((A$14:A265=A265)*(B$14:B265=B265)*(C$14:C265=C265))>1,0,1)","v":1},"Contratos de prestación de servicios","Contratación mínima cuantia",{"$f":"IFERROR(VLOOKUP(F265,Tipo!$C$12:$C$27,1,FALSE),\"NO\")","v":"NO"},"Funcionamiento","NO"]
["169-2018",2018,"FDLBU-SAMC-101-2018","Seguros","Selección abreviada","Selección abreviada por menor cuantía ","CONTRATAR LOS SEGUROS QUE AMPAREN LOS INTERESES PATRIMONIALES ACTUALES Y FUTUROS, ASÍ COMO LOS BIENES DEL FONDO DE DESARROLLO LOCAL DE BARRIOS UNIDOS QUE ESTÉN BAJO SU RESPONSABILIDAD Y CUSTODIA Y AQUELLOS QUE SEAN ADQUIRIDOS PARA DESARROLLAR LAS FUNCIONES INHERENTES A SU ACTIVIDAD, ASÍ COMO LA EXPEDICIÓN DE CUALQUIER OTRA PÓLIZA DE SEGUROS QUE REQUIERA LA ENTIDAD EN EL DESARROLLO DE SU ACTIVIDAD.","Funcionamiento","No aplica",{"$f":"IF(ISERROR(VLOOKUP(I266,Eje_Pilar!$C$2:$E$47,2,FALSE)),\" \",VLOOKUP(I266,Eje_Pilar!$C$2:$E$47,2,FALSE))","v":" "},{"$f":"IF(ISERROR(VLOOKUP(I266,Eje_Pilar!$C$2:$E$47,3,FALSE)),\" \",VLOOKUP(I266,Eje_Pilar!$C$2:$E$47,3,FALSE))","v":" "},0,8600024002,"LA PREVISORA COMPAÑÍA DE SEGUROS ",null,null,null,1,41528903,41528903,0,"2018-11-08","2018-11-13","2020-07-11",406,195,null,null,"X",null,null,0,null,{"$f":"IF(SUMPRODUCT((A$14:A266=A266)*(B$14:B266=B266)*(C$14:C266=C266))>1,0,1)","v":1},"Seguros","Selección abreviada",{"$f":"IFERROR(VLOOKUP(F266,Tipo!$C$12:$C$27,1,FALSE),\"NO\")","v":"Selección abreviada por menor cuantía "},"Funcionamiento","NO"]
["28776-2018",2018,"49213-2018","Arrendamiento de bienes muebles","Selección abreviada","Acuerdo marco de precios ","ARRENDAMIENTO DE EQUIPOS TECNOLOGICOS Y PERIFERICOS A TRAVES DE LA MODALIDAD DE ACUERDO MARCO DE PRECIOS","Funcionamiento","No aplica",{"$f":"IF(ISERROR(VLOOKUP(I267,Eje_Pilar!$C$2:$E$47,2,FALSE)),\" \",VLOOKUP(I267,Eje_Pilar!$C$2:$E$47,2,FALSE))","v":" "},{"$f":"IF(ISERROR(VLOOKUP(I267,Eje_Pilar!$C$2:$E$47,3,FALSE)),\" \",VLOOKUP(I267,Eje_Pilar!$C$2:$E$47,3,FALSE))","v":" "},0,8300013381,"SUMIMAS S.A.S.",null,null,null,1,3687375,3687375,3686468,"2018-05-29","2018-05-29","2019-07-25",360,60,null,null,null,"X",null,0.99975402556018844,null,{"$f":"IF(SUMPRODUCT((A$14:A267=A267)*(B$14:B267=B267)*(C$14:C267=C267))>1,0,1)","v":1},"Arrendamiento de bienes muebles","Selección abreviada",{"$f":"IFERROR(VLOOKUP(F267,Tipo!$C$12:$C$27,1,FALSE),\"NO\")","v":"Acuerdo marco de precios "},"Funcionamiento","NO"]
["92-2018",2018,"FDLBU-SASI-058-2018","Contratos de prestación de servicios","Selección abreviada","Subasta inversa ","PRESTACION DEL SERVICIO DE VIGILANCIA Y SEGURIDAD PRIVADA PARA LAS INSTALACIONES DEL FONDO DEL DESARROLLO LOCAL DE BARRIOS UNIDOS","Funcionamiento",null,{"$f":"IF(ISERROR(VLOOKUP(I268,Eje_Pilar!$C$2:$E$47,2,FALSE)),\" \",VLOOKUP(I268,Eje_Pilar!$C$2:$E$47,2,FALSE))","v":" "},{"$f":"IF(ISERROR(VLOOKUP(I268,Eje_Pilar!$C$2:$E$47,3,FALSE)),\" \",VLOOKUP(I268,Eje_Pilar!$C$2:$E$47,3,FALSE))","v":" "},null,8002485410,"SEGURIDAD DIGITAL LTDA",null,1,-4976078,2,82712664,77736586,77736586,"2018-06-14","2018-06-18","2019-08-17",360,60,null,null,null,null,"X",1,null,{"$f":"IF(SUMPRODUCT((A$14:A268=A268)*(B$14:B268=B268)*(C$14:C268=C268))>1,0,1)","v":1},"Contratos de prestación de servicios","Selección abreviada",{"$f":"IFERROR(VLOOKUP(F268,Tipo!$C$12:$C$27,1,FALSE),\"NO\")","v":"Subasta inversa "},"Funcionamiento","NO"]
["89-2018",2018,"FDLBU-CM-054-2018","Interventoría","Concurso de méritos","No aplica","REALIZAR LA INTERVENTORÍA TÉCNICA, ADMINISTRATIVA, LEGAL, FINANCIERA, SOCIAL, AMBIENTAL Y S&SO, AL CONTRATO DE OBRA PÚBLICA No 089-2017 – FONDO DE DESARROLLO LOCAL DE BARRIOS UNIDOS","Inversión",17,{"$f":"IF(ISERROR(VLOOKUP(I269,Eje_Pilar!$C$2:$E$47,2,FALSE)),\" \",VLOOKUP(I269,Eje_Pilar!$C$2:$E$47,2,FALSE))","v":"Espacio público, derecho de todos"},{"$f":"IF(ISERROR(VLOOKUP(I269,Eje_Pilar!$C$2:$E$47,3,FALSE)),\" \",VLOOKUP(I269,Eje_Pilar!$C$2:$E$47,3,FALSE))","v":"Pilar 2 Democracía Urbana"},1558,9009166084,"GAVINCO INGENIEROS CONSULTORES S.A.S",null,null,null,1,220739909,220739909,144444237,"2018-05-24","2018-08-01","2019-11-04",210,150,null,null,null,"x",null,0.65436394195487324,null,{"$f":"IF(SUMPRODUCT((A$14:A269=A269)*(B$14:B269=B269)*(C$14:C269=C269))>1,0,1)","v":1},"Interventoría","Concurso de méritos",{"$f":"IFERROR(VLOOKUP(F269,Tipo!$C$12:$C$27,1,FALSE),\"NO\")","v":"NO"},"Inversión",17]
["001-2018",2018,"FDLBU-CM-092-2018","Interventoría","Concurso de méritos","No aplica","REALIZAR LA INTERVENTORÍA TÉCNICA, ADMINISTRATIVA, LEGAL, FINANCIERA, SOCIAL, AMBIENTAL Y S&SO, AL CONTRATO DE OBRA PÚBLICA DERIVADO DE LA LICITACIÓN No. FDLBU-LP-083-2017","Inversión",18,{"$f":"IF(ISERROR(VLOOKUP(I270,Eje_Pilar!$C$2:$E$47,2,FALSE)),\" \",VLOOKUP(I270,Eje_Pilar!$C$2:$E$47,2,FALSE))","v":"Mejor movilidad para todos"},{"$f":"IF(ISERROR(VLOOKUP(I270,Eje_Pilar!$C$2:$E$47,3,FALSE)),\" \",VLOOKUP(I270,Eje_Pilar!$C$2:$E$47,3,FALSE))","v":"Pilar 2 Democracía Urbana"},1561,90114450857,"CONSORCIO INTERVIAL BU ",null,null,null,1,120000000,{"$f":"+O270+Q270+S270","v":120000000},45588474,"2018-01-04","2018-04-04","2019-05-27",180,105,null,null,null,"X",null,0.37990394999999999,null,{"$f":"IF(SUMPRODUCT((A$14:A270=A270)*(B$14:B270=B270)*(C$14:C270=C270))>1,0,1)","v":1},"Interventoría","Concurso de méritos",{"$f":"IFERROR(VLOOKUP(F270,Tipo!$C$12:$C$27,1,FALSE),\"NO\")","v":"NO"},"Inversión",18]
["104-2018",2018,"FEDLBU-CD-075-2018","Contratos de prestación de servicios profesionales y de apoyo a la gestión","Contratación directa","Prestación de servicios profesionales y de apoyo a la gestión, o para la ejecución de trabajos artísticos que sólo puedan encomendarse a determinadas personas naturales;","PRESTAR LOS SERVICIOS PROFESIONALES ESPECIALIZADOS EN EL AREA DE GESTION DEL DESARROLLO, PARA LIDERAR EJECUCION Y SEGUIMIENTO DE LOS DIFERENTES PROYECTOS DE INVERSION Y CONTRATOS DEL AREA DE GESTION DEL DESARROLLO LOCAL INFRAESTRUCTURA DE LA LOCALIDAD DE BARRIOS UNIDOS","Inversión",18,{"$f":"IF(ISERROR(VLOOKUP(I271,Eje_Pilar!$C$2:$E$47,2,FALSE)),\" \",VLOOKUP(I271,Eje_Pilar!$C$2:$E$47,2,FALSE))","v":"Mejor movilidad para todos"},{"$f":"IF(ISERROR(VLOOKUP(I271,Eje_Pilar!$C$2:$E$47,3,FALSE)),\" \",VLOOKUP(I271,Eje_Pilar!$C$2:$E$47,3,FALSE))","v":"Pilar 2 Democracía Urbana"},1561,1020761303,"KARLO FERNANDEZ CALA CEDIÓ A WALTER EDISSON CHAVARRO ACUÑA",null,null,null,1,2100003,2100003,2100003,"2018-08-24","2018-08-24","2019-01-24",128,21,null,null,null,"X",null,1,null,{"$f":"IF(SUMPRODUCT((A$14:A271=A271)*(B$14:B271=B271)*(C$14:C271=C271))>1,0,1)","v":1},"Contratos de prestación de servicios profesionales y de apoyo a la gestión","Contratación directa",{"$f":"IFERROR(VLOOKUP(F271,Tipo!$C$12:$C$27,1,FALSE),\"NO\")","v":"Prestación de servicios profesionales y de apoyo a la gestión, o para la ejecución de trabajos artísticos que sólo puedan encomendarse a determinadas personas naturales;"},"Inversión",18]
["006-2018",2018,"FDLBU-CD-0006-2018","Contratos de prestación de servicios profesionales y de apoyo a la gestión","Contratación directa","Prestación de servicios profesionales y de apoyo a la gestión, o para la ejecución de trabajos artísticos que sólo puedan encomendarse a determinadas personas naturales;","PRESTAR CON PLENA AUTONOMÍA TÉCNICA, ADMINISTRATIVA Y FINANCIERA SUS SERVICIOS DE APOYO A LA GESTIÓN, PARA LA REVISIÓN, ORGANIZACIÓN, ACTUALIZACIÓN, TRANSFERENCIA Y DEMÁS ACTIVIDADES Y FUNCIONES RELACIONADAS CON EL ARCHIVO DE DOCUMENTOS DE LA ALCALDÍA LOCAL DE BARRIOS UNIDOS","Inversión",45,{"$f":"IF(ISERROR(VLOOKUP(I272,Eje_Pilar!$C$2:$E$47,2,FALSE)),\" \",VLOOKUP(I272,Eje_Pilar!$C$2:$E$47,2,FALSE))","v":"Gobernanza e influencia local, regional e internacional"},{"$f":"IF(ISERROR(VLOOKUP(I272,Eje_Pilar!$C$2:$E$47,3,FALSE)),\" \",VLOOKUP(I272,Eje_Pilar!$C$2:$E$47,3,FALSE))","v":"Eje Transversal 4 Gobierno Legitimo, Fortalecimiento Local y Eficiencia"},1559,41778154,"LUZ MYRIAM PEÑA SANCHÉZ",null,null,null,1,933324,933324,933324,"2018-01-22","2018-01-24","2019-01-25",270,102,null,null,null,"X",null,{"$f":"IF(ISERROR(U272/T272),\"-\",(U272/T272))","v":1},null,{"$f":"IF(SUMPRODUCT((A$14:A272=A272)*(B$14:B272=B272)*(C$14:C272=C272))>1,0,1)","v":1},"Contratos de prestación de servicios profesionales y de apoyo a la gestión","Contratación directa",{"$f":"IFERROR(VLOOKUP(F272,Tipo!$C$12:$C$27,1,FALSE),\"NO\")","v":"Prestación de servicios profesionales y de apoyo a la gestión, o para la ejecución de trabajos artísticos que sólo puedan encomendarse a determinadas personas naturales;"},"Inversión",45]
["010-2018",2018,"FDLBU-CD-005-2018","Contratos de prestación de servicios profesionales y de apoyo a la gestión","Contratación directa","Prestación de servicios profesionales y de apoyo a la gestión, o para la ejecución de trabajos artísticos que sólo puedan encomendarse a determinadas personas naturales;","APOYAR JURÍDICAMENTE LA EJECUCIÓN DE LAS ACCIONES REQUERIDAS PARA LA DEPURACIÓN DE LAS ACTUACIONES ADMINISTRATIVAS QUE CURSAN EN LA ALCALDÍA LOCAL.","Inversión",45,{"$f":"IF(ISERROR(VLOOKUP(I273,Eje_Pilar!$C$2:$E$47,2,FALSE)),\" \",VLOOKUP(I273,Eje_Pilar!$C$2:$E$47,2,FALSE))","v":"Gobernanza e influencia local, regional e internacional"},{"$f":"IF(ISERROR(VLOOKUP(I273,Eje_Pilar!$C$2:$E$47,3,FALSE)),\" \",VLOOKUP(I273,Eje_Pilar!$C$2:$E$47,3,FALSE))","v":"Eje Transversal 4 Gobierno Legitimo, Fortalecimiento Local y Eficiencia"},1559,52196889,"SANDRA MARINA GUTIERREZ FLOREZ ",null,null,null,1,2100000,2100000,2100000,"2018-01-22","2018-01-23","2019-01-25",270,64,null,null,null,"X",null,1,null,{"$f":"IF(SUMPRODUCT((A$14:A273=A273)*(B$14:B273=B273)*(C$14:C273=C273))>1,0,1)","v":1},"Contratos de prestación de servicios profesionales y de apoyo a la gestión","Contratación directa",{"$f":"IFERROR(VLOOKUP(F273,Tipo!$C$12:$C$27,1,FALSE),\"NO\")","v":"Prestación de servicios profesionales y de apoyo a la gestión, o para la ejecución de trabajos artísticos que sólo puedan encomendarse a determinadas personas naturales;"},"Inversión",45]
["015-2018",2018,"FDLBU-CD-012-2018","Contratos de prestación de servicios profesionales y de apoyo a la gestión","Contratación directa","Prestación de servicios profesionales y de apoyo a la gestión, o para la ejecución de trabajos artísticos que sólo puedan encomendarse a determinadas personas naturales;","SERVICIOS DE APOYO A LA GESTIÓN PARA LA REVISIÓN, ORGANIZACIÓN ACTUALIZACIÓN, TRANSFERENCIA Y DEMÁS ACTIVIDADES Y FUNCIONES RELACIONADAS CON EL ARCHIVO DE DOCUMENTOS DE LA ALCALDÍA LOCAL DE BARRIOS UNIDOS.","Inversión",45,{"$f":"IF(ISERROR(VLOOKUP(I274,Eje_Pilar!$C$2:$E$47,2,FALSE)),\" \",VLOOKUP(I274,Eje_Pilar!$C$2:$E$47,2,FALSE))","v":"Gobernanza e influencia local, regional e internacional"},{"$f":"IF(ISERROR(VLOOKUP(I274,Eje_Pilar!$C$2:$E$47,3,FALSE)),\" \",VLOOKUP(I274,Eje_Pilar!$C$2:$E$47,3,FALSE))","v":"Eje Transversal 4 Gobierno Legitimo, Fortalecimiento Local y Eficiencia"},1559,1100959714,"CINTYA ALEXANDRA GAMEZ PARRA ",null,null,null,1,866679,866679,866679,"2018-01-23","2018-01-24","2019-01-25",270,93,null,null,null,"X",null,1,null,{"$f":"IF(SUMPRODUCT((A$14:A274=A274)*(B$14:B274=B274)*(C$14:C274=C274))>1,0,1)","v":1},"Contratos de prestación de servicios profesionales y de apoyo a la gestión","Contratación directa",{"$f":"IFERROR(VLOOKUP(F274,Tipo!$C$12:$C$27,1,FALSE),\"NO\")","v":"Prestación de servicios profesionales y de apoyo a la gestión, o para la ejecución de trabajos artísticos que sólo puedan encomendarse a determinadas personas naturales;"},"Inversión",45]
["17-2018",2018,"FDLBU-CD-013-2018","Contratos de prestación de servicios profesionales y de apoyo a la gestión","Contratación directa","Prestación de servicios profesionales y de apoyo a la gestión, o para la ejecución de trabajos artísticos que sólo puedan encomendarse a determinadas personas naturales;","PRESTAR LOS SERVICIOS DE APOYO A LA GESTIÓN DE CONDUCCIÓN DE LOS VEHÍCULOS A CARGO DEL FONDO DE DESARROLLO LOCAL DE BARRIOS UNIDOS, ASÍ COMO APOYAR LA GESTIÓN ADMINISTRATIVA QUE DESIGNE EL SUPERVISOR.","Inversión",45,{"$f":"IF(ISERROR(VLOOKUP(I275,Eje_Pilar!$C$2:$E$47,2,FALSE)),\" \",VLOOKUP(I275,Eje_Pilar!$C$2:$E$47,2,FALSE))","v":"Gobernanza e influencia local, regional e internacional"},{"$f":"IF(ISERROR(VLOOKUP(I275,Eje_Pilar!$C$2:$E$47,3,FALSE)),\" \",VLOOKUP(I275,Eje_Pilar!$C$2:$E$47,3,FALSE))","v":"Eje Transversal 4 Gobierno Legitimo, Fortalecimiento Local y Eficiencia"},1559,7321025,"WILLINTON ORTIZ ALARCON ",null,null,null,1,1173335,1173335,1173335,"2018-01-23","2018-01-24","2019-01-25",270,93,null,null,null,"X",null,1,null,{"$f":"IF(SUMPRODUCT((A$14:A275=A275)*(B$14:B275=B275)*(C$14:C275=C275))>1,0,1)","v":1},"Contratos de prestación de servicios profesionales y de apoyo a la gestión","Contratación directa",{"$f":"IFERROR(VLOOKUP(F275,Tipo!$C$12:$C$27,1,FALSE),\"NO\")","v":"Prestación de servicios profesionales y de apoyo a la gestión, o para la ejecución de trabajos artísticos que sólo puedan encomendarse a determinadas personas naturales;"},"Inversión",45]
["019-2018",2018,"FDLBU-CD-016-2018","Contratos de prestación de servicios profesionales y de apoyo a la gestión","Contratación directa","Prestación de servicios profesionales y de apoyo a la gestión, o para la ejecución de trabajos artísticos que sólo puedan encomendarse a determinadas personas naturales;","PRESTAR LOS SERVICIOS PROFESIONALES AL FONDO DE DESARROLLO LOCAL ¿ ALCALDÍA LOCAL DE BARRIOS UNIDOS, PARA LA ASESORÍA, REVISIÓN, SEGUIMIENTO Y CUMPLIMIENTO DE LAS NORMAS QUE REGULAN LOS CONTRATOS SUSCRITOS POR ESTE, EN EL DESARROLLO DE LAS DIFERENTES ETAPAS PRE-CONTRACTUAL, CONTRACTUAL Y POST-CONTRACTUAL. ","Inversión",45,{"$f":"IF(ISERROR(VLOOKUP(I276,Eje_Pilar!$C$2:$E$47,2,FALSE)),\" \",VLOOKUP(I276,Eje_Pilar!$C$2:$E$47,2,FALSE))","v":"Gobernanza e influencia local, regional e internacional"},{"$f":"IF(ISERROR(VLOOKUP(I276,Eje_Pilar!$C$2:$E$47,3,FALSE)),\" \",VLOOKUP(I276,Eje_Pilar!$C$2:$E$47,3,FALSE))","v":"Eje Transversal 4 Gobierno Legitimo, Fortalecimiento Local y Eficiencia"},1559,52517812,"ADRIANA MONTEALEGRE RIAÑO ",null,null,null,1,2500000,2500000,2500000,"2018-01-24","2018-01-24","2019-01-21",240,118,null,null,null,"X",null,1,null,{"$f":"IF(SUMPRODUCT((A$14:A276=A276)*(B$14:B276=B276)*(C$14:C276=C276))>1,0,1)","v":1},"Contratos de prestación de servicios profesionales y de apoyo a la gestión","Contratación directa",{"$f":"IFERROR(VLOOKUP(F276,Tipo!$C$12:$C$27,1,FALSE),\"NO\")","v":"Prestación de servicios profesionales y de apoyo a la gestión, o para la ejecución de trabajos artísticos que sólo puedan encomendarse a determinadas personas naturales;"},"Inversión",45]
["81-2018",2018,"FDLBU-CD-020-2018","Contratos de prestación de servicios profesionales y de apoyo a la gestión","Contratación directa","Prestación de servicios profesionales y de apoyo a la gestión, o para la ejecución de trabajos artísticos que sólo puedan encomendarse a determinadas personas naturales;","APOYAR EN LAS LABORES DE LA DEPENDENCIA AL CONTADOR (A) DEL FONDO DE DESARROLLO LOCAL DE BARRIOS UNIDOS (FDLBU) EN LOS TRAMITES, MANEJO CONTABLE Y DE ARCHIVO EN FORMA PERMANENTE EN EL DESARROLLO DEL PROCESO DE CONSOLIDACIÓN DE INFORMACIÓN DEL SISTEMA CONTABLE Y FINANCIERO. SEGUN CONTRATO DE PRESTACION DE SERVICIOS DE APOYO A LA GESTION N°081 DE 2018","Inversión",45,{"$f":"IF(ISERROR(VLOOKUP(I277,Eje_Pilar!$C$2:$E$47,2,FALSE)),\" \",VLOOKUP(I277,Eje_Pilar!$C$2:$E$47,2,FALSE))","v":"Gobernanza e influencia local, regional e internacional"},{"$f":"IF(ISERROR(VLOOKUP(I277,Eje_Pilar!$C$2:$E$47,3,FALSE)),\" \",VLOOKUP(I277,Eje_Pilar!$C$2:$E$47,3,FALSE))","v":"Eje Transversal 4 Gobierno Legitimo, Fortalecimiento Local y Eficiencia"},1559,19346335,"PEDRO JESUS SANCHEZ MOLINA",null,null,null,1,1493324,1493324,1493324,"2018-01-26","2019-01-29","2019-01-25",240,131,null,null,null,"X",null,1,null,{"$f":"IF(SUMPRODUCT((A$14:A277=A277)*(B$14:B277=B277)*(C$14:C277=C277))>1,0,1)","v":1},"Contratos de prestación de servicios profesionales y de apoyo a la gestión","Contratación directa",{"$f":"IFERROR(VLOOKUP(F277,Tipo!$C$12:$C$27,1,FALSE),\"NO\")","v":"Prestación de servicios profesionales y de apoyo a la gestión, o para la ejecución de trabajos artísticos que sólo puedan encomendarse a determinadas personas naturales;"},"Inversión",45]
["106-2018",2018,"FDLBU-CD-077-2018","Contratos de prestación de servicios profesionales y de apoyo a la gestión","Contratación directa","Prestación de servicios profesionales y de apoyo a la gestión, o para la ejecución de trabajos artísticos que sólo puedan encomendarse a determinadas personas naturales;","PRESTAR LOS SERVICIOS PROFESIONALES AL FONDO DE DESARROLLO LOCAL DE BARRIOS UNIDOS, PARA LA REVISIÓN Y SEGUIMIENTO DE LOS TRAMITES JURIDICOS Y CONTRACTUALES QUE SURJAN EN EL DESPACHO DE LA ALCALDIA O QUE SE ENCUENTRE A CARGO DEL ORDENDOR DEL GASTO DEL FONDO.","Inversión",45,{"$f":"IF(ISERROR(VLOOKUP(I278,Eje_Pilar!$C$2:$E$47,2,FALSE)),\" \",VLOOKUP(I278,Eje_Pilar!$C$2:$E$47,2,FALSE))","v":"Gobernanza e influencia local, regional e internacional"},{"$f":"IF(ISERROR(VLOOKUP(I278,Eje_Pilar!$C$2:$E$47,3,FALSE)),\" \",VLOOKUP(I278,Eje_Pilar!$C$2:$E$47,3,FALSE))","v":"Eje Transversal 4 Gobierno Legitimo, Fortalecimiento Local y Eficiencia"},1559,52705855,"XIMENA LOMBANA RIAÑO \n",null,null,null,1,2216660,2216660,2216660,"2018-08-30","2018-09-13","2019-01-21",123,20,null,null,null,"X",null,1,null,{"$f":"IF(SUMPRODUCT((A$14:A278=A278)*(B$14:B278=B278)*(C$14:C278=C278))>1,0,1)","v":1},{"$f":"IFERROR(VLOOKUP(D278,tipo,1,FALSE),\"NO\")","v":"Contratos de prestación de servicios profesionales y de apoyo a la gestión"},{"$f":"IFERROR(VLOOKUP(E278,modal,1,FALSE),\"NO\")","v":"Contratación directa"},{"$f":"IFERROR(VLOOKUP(F278,Tipo!$C$12:$C$27,1,FALSE),\"NO\")","v":"Prestación de servicios profesionales y de apoyo a la gestión, o para la ejecución de trabajos artísticos que sólo puedan encomendarse a determinadas personas naturales;"},{"$f":"IFERROR(VLOOKUP(H278,afectacion,1,FALSE),\"NO\")","v":"Inversión"},{"$f":"IFERROR(VLOOKUP(I278,programa,1,FALSE),\"NO\")","v":45}]
["109-2018",2018,"FDLBU-CD-078-2018","Contratos de prestación de servicios profesionales y de apoyo a la gestión","Contratación directa","Prestación de servicios profesionales y de apoyo a la gestión, o para la ejecución de trabajos artísticos que sólo puedan encomendarse a determinadas personas naturales;","APOYAR JURIDICAMENTE LA EJECUCION DE LAS ACCIONES REQUERIDAS PARA LA DEPURACION DE LAS ACTUACIONES ADMINISTRATIVAS QUE CURSAN EN LA ALCALDIA LOCAL","Inversión",45,{"$f":"IF(ISERROR(VLOOKUP(I279,Eje_Pilar!$C$2:$E$47,2,FALSE)),\" \",VLOOKUP(I279,Eje_Pilar!$C$2:$E$47,2,FALSE))","v":"Gobernanza e influencia local, regional e internacional"},{"$f":"IF(ISERROR(VLOOKUP(I279,Eje_Pilar!$C$2:$E$47,3,FALSE)),\" \",VLOOKUP(I279,Eje_Pilar!$C$2:$E$47,3,FALSE))","v":"Eje Transversal 4 Gobierno Legitimo, Fortalecimiento Local y Eficiencia"},1559,1032376529,"LINA MARIA ORTIZ CORTAZAR ",null,null,null,1,2100000,2100000,2100000,"2018-09-03","2018-09-04","2019-01-25",123,25,null,null,null,"X",null,1,null,{"$f":"IF(SUMPRODUCT((A$14:A279=A279)*(B$14:B279=B279)*(C$14:C279=C279))>1,0,1)","v":1},"Contratos de prestación de servicios profesionales y de apoyo a la gestión","Contratación directa",{"$f":"IFERROR(VLOOKUP(F279,Tipo!$C$12:$C$27,1,FALSE),\"NO\")","v":"Prestación de servicios profesionales y de apoyo a la gestión, o para la ejecución de trabajos artísticos que sólo puedan encomendarse a determinadas personas naturales;"},"Inversión",45]
["112-2018",2018,"FDLBU-CD-081-218","Contratos de prestación de servicios profesionales y de apoyo a la gestión","Contratación directa","Prestación de servicios profesionales y de apoyo a la gestión, o para la ejecución de trabajos artísticos que sólo puedan encomendarse a determinadas personas naturales;","PRESTAR LOS SERVICIOS PROFESIONALES DE APOYO A LA OFICINA DE PRESUPUESTO DEL FONDO DE DESARROLLO LOCAL EN EL REGISTRO, ANALISIS Y GESTIÓN DE OBLIGACIONES POR PAGAR Y OTROS ASUNTOS QUE EN MATERIA DE PRESUPUESTO LOCAL LE SEAN ASIGNADOS","Inversión",45,{"$f":"IF(ISERROR(VLOOKUP(I280,Eje_Pilar!$C$2:$E$47,2,FALSE)),\" \",VLOOKUP(I280,Eje_Pilar!$C$2:$E$47,2,FALSE))","v":"Gobernanza e influencia local, regional e internacional"},{"$f":"IF(ISERROR(VLOOKUP(I280,Eje_Pilar!$C$2:$E$47,3,FALSE)),\" \",VLOOKUP(I280,Eje_Pilar!$C$2:$E$47,3,FALSE))","v":"Eje Transversal 4 Gobierno Legitimo, Fortalecimiento Local y Eficiencia"},1559,7320162,"JOSE RAUL PINILLA CHILLON ",null,null,null,1,2100000,2100000,2100000,"2018-09-06","2018-09-07","2019-01-25",120,25,null,null,null,"X",null,1,null,{"$f":"IF(SUMPRODUCT((A$14:A280=A280)*(B$14:B280=B280)*(C$14:C280=C280))>1,0,1)","v":1},"Contratos de prestación de servicios profesionales y de apoyo a la gestión","Contratación directa",{"$f":"IFERROR(VLOOKUP(F280,Tipo!$C$12:$C$27,1,FALSE),\"NO\")","v":"Prestación de servicios profesionales y de apoyo a la gestión, o para la ejecución de trabajos artísticos que sólo puedan encomendarse a determinadas personas naturales;"},"Inversión",45]
["120-2018",2018,"FDLBU-CD-087-2018","Contratos de prestación de servicios profesionales y de apoyo a la gestión","Contratación directa","Prestación de servicios profesionales y de apoyo a la gestión, o para la ejecución de trabajos artísticos que sólo puedan encomendarse a determinadas personas naturales;","APOYAR JURIDICAMENTE LA EJECUCION DE LAS ACCIONES REQUERIDAS PARA LA DEPURACION DE LAS ACTUACIONES ADMINISTRATIVAS QUE CURSAN EN LA ALCALDIA LOCAL","Inversión",45,{"$f":"IF(ISERROR(VLOOKUP(I281,Eje_Pilar!$C$2:$E$47,2,FALSE)),\" \",VLOOKUP(I281,Eje_Pilar!$C$2:$E$47,2,FALSE))","v":"Gobernanza e influencia local, regional e internacional"},{"$f":"IF(ISERROR(VLOOKUP(I281,Eje_Pilar!$C$2:$E$47,3,FALSE)),\" \",VLOOKUP(I281,Eje_Pilar!$C$2:$E$47,3,FALSE))","v":"Eje Transversal 4 Gobierno Legitimo, Fortalecimiento Local y Eficiencia"},1559,52731958,"MERLY JOHANA GARCIA LOPEZ",null,null,null,1,2566662,2566662,2566662,"2018-09-12","2018-09-17","2019-01-25",120,25,null,null,null,"X",null,1,null,{"$f":"IF(SUMPRODUCT((A$14:A281=A281)*(B$14:B281=B281)*(C$14:C281=C281))>1,0,1)","v":1},"Contratos de prestación de servicios profesionales y de apoyo a la gestión","Contratación directa",{"$f":"IFERROR(VLOOKUP(F281,Tipo!$C$12:$C$27,1,FALSE),\"NO\")","v":"Prestación de servicios profesionales y de apoyo a la gestión, o para la ejecución de trabajos artísticos que sólo puedan encomendarse a determinadas personas naturales;"},"Inversión",45]
["132-2018",2018,"FDLBU-CD-096-2018","Contratos de prestación de servicios profesionales y de apoyo a la gestión","Contratación directa","Prestación de servicios profesionales y de apoyo a la gestión, o para la ejecución de trabajos artísticos que sólo puedan encomendarse a determinadas personas naturales;","APOYAR JURIDICAMENTE LA EJECUCION DE LAS ACCIONES REQUERIDAS PARA LA DEPURACION DE LAS ACTUACIONES ADMINISTRATIVAS QUE CURSAN EN LA ALCALDIA LOCAL","Inversión",45,{"$f":"IF(ISERROR(VLOOKUP(I282,Eje_Pilar!$C$2:$E$47,2,FALSE)),\" \",VLOOKUP(I282,Eje_Pilar!$C$2:$E$47,2,FALSE))","v":"Gobernanza e influencia local, regional e internacional"},{"$f":"IF(ISERROR(VLOOKUP(I282,Eje_Pilar!$C$2:$E$47,3,FALSE)),\" \",VLOOKUP(I282,Eje_Pilar!$C$2:$E$47,3,FALSE))","v":"Eje Transversal 4 Gobierno Legitimo, Fortalecimiento Local y Eficiencia"},1559,1090457719,"YEXULY YOJANA NIETO FLOREZ ",null,null,null,1,2100000,2100000,2100000,"2018-09-26","2018-01-01","2019-01-25",105,25,null,null,null,"X",null,1,null,{"$f":"IF(SUMPRODUCT((A$14:A282=A282)*(B$14:B282=B282)*(C$14:C282=C282))>1,0,1)","v":1},"Contratos de prestación de servicios profesionales y de apoyo a la gestión","Contratación directa",{"$f":"IFERROR(VLOOKUP(F282,Tipo!$C$12:$C$27,1,FALSE),\"NO\")","v":"Prestación de servicios profesionales y de apoyo a la gestión, o para la ejecución de trabajos artísticos que sólo puedan encomendarse a determinadas personas naturales;"},"Inversión",45]
["148-2018",2018,"FDLBU-CD-116-2018","Contratos de prestación de servicios profesionales y de apoyo a la gestión","Contratación directa","Prestación de servicios profesionales y de apoyo a la gestión, o para la ejecución de trabajos artísticos que sólo puedan encomendarse a determinadas personas naturales;","SERVICIOS DE APOYO A LA GESTION, PARA LA REVISION, ORGANIZACIÓN, ACTUALIZACIÓN, TRANSFERENCIA Y DEMAS ACTIDADES RELACIONADAS CON EL ARCHIVO DE DOCUMENTOS DE LA ALCALDIA LOCAL DE BARRIOS UNIDOS","Inversión",45,{"$f":"IF(ISERROR(VLOOKUP(I283,Eje_Pilar!$C$2:$E$47,2,FALSE)),\" \",VLOOKUP(I283,Eje_Pilar!$C$2:$E$47,2,FALSE))","v":"Gobernanza e influencia local, regional e internacional"},{"$f":"IF(ISERROR(VLOOKUP(I283,Eje_Pilar!$C$2:$E$47,3,FALSE)),\" \",VLOOKUP(I283,Eje_Pilar!$C$2:$E$47,3,FALSE))","v":"Eje Transversal 4 Gobierno Legitimo, Fortalecimiento Local y Eficiencia"},1559,1136886122,"JUAN JOSE QUINTERO FONSECA ",null,null,null,1,1026662,1026662,1026662,"2018-10-25","2018-10-26","2019-01-25",68,25,null,null,null,"X",null,1,null,{"$f":"IF(SUMPRODUCT((A$14:A283=A283)*(B$14:B283=B283)*(C$14:C283=C283))>1,0,1)","v":1},"Contratos de prestación de servicios profesionales y de apoyo a la gestión","Contratación directa",{"$f":"IFERROR(VLOOKUP(F283,Tipo!$C$12:$C$27,1,FALSE),\"NO\")","v":"Prestación de servicios profesionales y de apoyo a la gestión, o para la ejecución de trabajos artísticos que sólo puedan encomendarse a determinadas personas naturales;"},"Inversión",45]
["154-2018",2018,"FDLBU-CD-118-2018","Contratos de prestación de servicios profesionales y de apoyo a la gestión","Contratación directa","Prestación de servicios profesionales y de apoyo a la gestión, o para la ejecución de trabajos artísticos que sólo puedan encomendarse a determinadas personas naturales;","SERVICIOS DE APOYO A LA GESTION, PARA LA REVISION, ORGANIZACIÓN, ACTUALIZACIÓN, TRANSFERENCIA Y DEMAS ACTIDADES RELACIONADAS CON EL ARCHIVO DE DOCUMENTOS DE LA ALCALDIA LOCAL DE BARRIOS UNIDOS","Inversión",45,{"$f":"IF(ISERROR(VLOOKUP(I284,Eje_Pilar!$C$2:$E$47,2,FALSE)),\" \",VLOOKUP(I284,Eje_Pilar!$C$2:$E$47,2,FALSE))","v":"Gobernanza e influencia local, regional e internacional"},{"$f":"IF(ISERROR(VLOOKUP(I284,Eje_Pilar!$C$2:$E$47,3,FALSE)),\" \",VLOOKUP(I284,Eje_Pilar!$C$2:$E$47,3,FALSE))","v":"Eje Transversal 4 Gobierno Legitimo, Fortalecimiento Local y Eficiencia"},1559,52897368,"MONICA MARIA NAVARRETE CRUZ ",null,null,null,1,2100000,2100000,2100000,"2018-10-31","2018-11-01","2019-01-25",60,25,null,null,null,"X",null,1,null,{"$f":"IF(SUMPRODUCT((A$14:A284=A284)*(B$14:B284=B284)*(C$14:C284=C284))>1,0,1)","v":1},"Contratos de prestación de servicios profesionales y de apoyo a la gestión","Contratación directa",{"$f":"IFERROR(VLOOKUP(F284,Tipo!$C$12:$C$27,1,FALSE),\"NO\")","v":"Prestación de servicios profesionales y de apoyo a la gestión, o para la ejecución de trabajos artísticos que sólo puedan encomendarse a determinadas personas naturales;"},"Inversión",45]
["159-2018",2018,"FDLBU-CD-124-2018","Contratos de prestación de servicios profesionales y de apoyo a la gestión","Contratación directa","Prestación de servicios profesionales y de apoyo a la gestión, o para la ejecución de trabajos artísticos que sólo puedan encomendarse a determinadas personas naturales;","PRESTAR SERVICIOS DE APOYO A LA GESTIÓN DE CONDUCCIÓN DE LOS VEHÍCULOS A CARGO DEL FONDO DE DESARROLLO LOCAL DE BARRIOS UNIDOS, ASÍ COMO APOYAR LA GESTIÓN ADMINISTRATIVA QUE DESIGNE EL SUPERVISOR.","Inversión",45,{"$f":"IF(ISERROR(VLOOKUP(I285,Eje_Pilar!$C$2:$E$47,2,FALSE)),\" \",VLOOKUP(I285,Eje_Pilar!$C$2:$E$47,2,FALSE))","v":"Gobernanza e influencia local, regional e internacional"},{"$f":"IF(ISERROR(VLOOKUP(I285,Eje_Pilar!$C$2:$E$47,3,FALSE)),\" \",VLOOKUP(I285,Eje_Pilar!$C$2:$E$47,3,FALSE))","v":"Eje Transversal 4 Gobierno Legitimo, Fortalecimiento Local y Eficiencia"},1559,8717340,"NELSON CARDENAS VALENCIA",null,null,null,1,660012,660012,660012,"2018-11-01","2018-11-10","2018-01-25",56,25,null,null,null,"X",null,1,null,{"$f":"IF(SUMPRODUCT((A$14:A285=A285)*(B$14:B285=B285)*(C$14:C285=C285))>1,0,1)","v":1},"Contratos de prestación de servicios profesionales y de apoyo a la gestión","Contratación directa",{"$f":"IFERROR(VLOOKUP(F285,Tipo!$C$12:$C$27,1,FALSE),\"NO\")","v":"Prestación de servicios profesionales y de apoyo a la gestión, o para la ejecución de trabajos artísticos que sólo puedan encomendarse a determinadas personas naturales;"},"Inversión",45]
["165-2018",2018,"FDLBU-CD-124-2018","Contratos de prestación de servicios profesionales y de apoyo a la gestión","Contratación directa","Prestación de servicios profesionales y de apoyo a la gestión, o para la ejecución de trabajos artísticos que sólo puedan encomendarse a determinadas personas naturales;","PRESTAR SERVICIOS DE APOYO A LA GESTIÓN DE CONDUCCIÓN DE LOS VEHÍCULOS A CARGO DEL FONDO DE DESARROLLO LOCAL DE BARRIOS UNIDOS, ASÍ COMO APOYAR LA GESTIÓN ADMINISTRATIVA QUE DESIGNE EL SUPERVISOR.","Inversión",45,{"$f":"IF(ISERROR(VLOOKUP(I286,Eje_Pilar!$C$2:$E$47,2,FALSE)),\" \",VLOOKUP(I286,Eje_Pilar!$C$2:$E$47,2,FALSE))","v":"Gobernanza e influencia local, regional e internacional"},{"$f":"IF(ISERROR(VLOOKUP(I286,Eje_Pilar!$C$2:$E$47,3,FALSE)),\" \",VLOOKUP(I286,Eje_Pilar!$C$2:$E$47,3,FALSE))","v":"Eje Transversal 4 Gobierno Legitimo, Fortalecimiento Local y Eficiencia"},1559,79501810,"CARLOS EDUARDO LOPEZ BRICEÑO",null,null,null,1,660012,660012,660012,"2018-11-09","2018-11-10","2018-01-25",56,25,null,null,null,"X",null,1,null,{"$f":"IF(SUMPRODUCT((A$14:A286=A286)*(B$14:B286=B286)*(C$14:C286=C286))>1,0,1)","v":1},"Contratos de prestación de servicios profesionales y de apoyo a la gestión","Contratación directa",{"$f":"IFERROR(VLOOKUP(F286,Tipo!$C$12:$C$27,1,FALSE),\"NO\")","v":"Prestación de servicios profesionales y de apoyo a la gestión, o para la ejecución de trabajos artísticos que sólo puedan encomendarse a determinadas personas naturales;"},"Inversión",45]
["125-2018",2018,"FDLBU-LP-071-2018","Contratos de prestación de servicios","Licitación pública","No aplica","FORTALECER INSTANCIAS DE PARTICIPACIÓN, ORGANIZACIONES, EXPRESIONES SOCIALES CIUDADANAS Y BRINDAR FORMACIÓN EN TEMAS DE CONTROL SOCIAL EN LA LOCALIDAD DE BARRIOS UNIDOS","Inversión",45,{"$f":"IF(ISERROR(VLOOKUP(I287,Eje_Pilar!$C$2:$E$47,2,FALSE)),\" \",VLOOKUP(I287,Eje_Pilar!$C$2:$E$47,2,FALSE))","v":"Gobernanza e influencia local, regional e internacional"},{"$f":"IF(ISERROR(VLOOKUP(I287,Eje_Pilar!$C$2:$E$47,3,FALSE)),\" \",VLOOKUP(I287,Eje_Pilar!$C$2:$E$47,3,FALSE))","v":"Eje Transversal 4 Gobierno Legitimo, Fortalecimiento Local y Eficiencia"},1562,900206910,"CORPORACION PUNTOS CARDINALES",null,1,-3109243,2,3109243,0,0,"2018-09-20","2018-10-04","2019-04-15",120,70,null,null,null,"x",null,"-",null,{"$f":"IF(SUMPRODUCT((A$14:A287=A287)*(B$14:B287=B287)*(C$14:C287=C287))>1,0,1)","v":1},"Contratos de prestación de servicios","Licitación pública",{"$f":"IFERROR(VLOOKUP(F287,Tipo!$C$12:$C$27,1,FALSE),\"NO\")","v":"NO"},"Inversión",45]
[3262019,2019,null,"Contratos interadministrativos","Contratación directa","Contratos interadministrativos","Resolución No 326 de 2019 \"Por medio de la cual se ordena el gasto y pago correspondiente al proyecto 1556 'apoyo dirigido a la población vulnerable adulto mayor y con discapacidad de la localidad´componente: Subsidio C Vigencia 2019\"","Inversión",3,{"$f":"IF(ISERROR(VLOOKUP(I288,Eje_Pilar!$C$2:$E$47,2,FALSE)),\" \",VLOOKUP(I288,Eje_Pilar!$C$2:$E$47,2,FALSE))","v":"Igualdad y autonomía para una Bogotá incluyente"},{"$f":"IF(ISERROR(VLOOKUP(I288,Eje_Pilar!$C$2:$E$47,3,FALSE)),\" \",VLOOKUP(I288,Eje_Pilar!$C$2:$E$47,3,FALSE))","v":"Pilar 1 Igualdad de Calidad de Vida"},1556,860066942,"CAJA DE COMPENSACION FAMILIAR - COMPENSAR",467280000,null,null,null,null,467280000,386415000,null,null,null,null,null,null,null,null,null,null,0.82694530046224957,null,{"$f":"IF(SUMPRODUCT((A$14:A288=A288)*(B$14:B288=B288)*(C$14:C288=C288))>1,0,1)","v":1},"Contratos interadministrativos","Contratación directa",{"$f":"IFERROR(VLOOKUP(F288,Tipo!$C$12:$C$27,1,FALSE),\"NO\")","v":"Contratos interadministrativos"},"Inversión",3]
[3272019,2019,null,"Contratos interadministrativos","Contratación directa","Contratos interadministrativos","Resolución 327 de 2019 \"Por medio de la cual se ordena el gasto y pago de los COSTOS OPERATIVOS correspondientes a los que se causen en desarrollo del Convenio MARCO DE ASOCIACION No. 4002 DEL 19 DE DICIEMBRE DE 2011, celebrado entre la SECRETARIA DE INTEGRACION SOCIAL -SDIS-, EL FONDO DE DESARROLLO LOCAL DE BARRIOS UNIDOS y la Caja de Compensación Familiar COMPENSAR en el marco del proyecto 1556  'apoyo dirigido a la población vulenrable adulto mayor y con discapacidad de la localidad'. Componente: Subsidio C vignecia 2019´","Inversión",3,{"$f":"IF(ISERROR(VLOOKUP(I289,Eje_Pilar!$C$2:$E$47,2,FALSE)),\" \",VLOOKUP(I289,Eje_Pilar!$C$2:$E$47,2,FALSE))","v":"Igualdad y autonomía para una Bogotá incluyente"},{"$f":"IF(ISERROR(VLOOKUP(I289,Eje_Pilar!$C$2:$E$47,3,FALSE)),\" \",VLOOKUP(I289,Eje_Pilar!$C$2:$E$47,3,FALSE))","v":"Pilar 1 Igualdad de Calidad de Vida"},1556,860066942,"CAJA DE COMPENSACION FAMILIAR - COMPENSAR",7200000,null,null,null,null,7200000,2828312,null,null,null,null,null,null,null,null,null,null,0.39282111111111112,null,{"$f":"IF(SUMPRODUCT((A$14:A289=A289)*(B$14:B289=B289)*(C$14:C289=C289))>1,0,1)","v":1},"Contratos interadministrativos","Contratación directa",{"$f":"IFERROR(VLOOKUP(F289,Tipo!$C$12:$C$27,1,FALSE),\"NO\")","v":"Contratos interadministrativos"},"Inversión",3]
[3982019,2019,null,"Contratos interadministrativos","Contratación directa","Contratos interadministrativos","Resolución 398 de 2019 \"Por medio de la cual se modifica la Resolución No. 326 de 2019 que ordena el gasto y pago correspondiente al proyecto 1556 'apoyo dirigido a la población vulenrable adulto mayor y con discapacidad de la localidad'. Componente: Subsidio C vignecia 2019\"","Inversión",3,{"$f":"IF(ISERROR(VLOOKUP(I290,Eje_Pilar!$C$2:$E$47,2,FALSE)),\" \",VLOOKUP(I290,Eje_Pilar!$C$2:$E$47,2,FALSE))","v":"Igualdad y autonomía para una Bogotá incluyente"},{"$f":"IF(ISERROR(VLOOKUP(I290,Eje_Pilar!$C$2:$E$47,3,FALSE)),\" \",VLOOKUP(I290,Eje_Pilar!$C$2:$E$47,3,FALSE))","v":"Pilar 1 Igualdad de Calidad de Vida"},1556,860066942,"CAJA DE COMPENSACION FAMILIAR - COMPENSAR",16225000,null,null,null,null,16225000,null,null,null,null,null,null,null,null,null,null,null,0,null,{"$f":"IF(SUMPRODUCT((A$14:A290=A290)*(B$14:B290=B290)*(C$14:C290=C290))>1,0,1)","v":1},"Contratos interadministrativos","Contratación directa",{"$f":"IFERROR(VLOOKUP(F290,Tipo!$C$12:$C$27,1,FALSE),\"NO\")","v":"Contratos interadministrativos"},"Inversión",3]
[20,2019,null,"Contratos interadministrativos","Contratación directa","Contratos interadministrativos","Resolución 20 de 2019 \"Por medio de la cual se ordena el gasto y pago de los COSTOS OPERATIVOS correspondientes a los que se causen en desarrollo del Convenio MARCO DE ASOCIACION No. 4002 DEL 19 DE DICIEMBRE DE 2011, celebrado entre la SECRETARIA DE INTEGRACION SOCIAL -SDIS-, EL FONDO DE DESARROLLO LOCAL DE BARRIOS UNIDOS y la Caja de Compensación Familiar COMPENSAR en el marco del proyecto 1556  'apoyo dirigido a la población vulenrable adulto mayor y con discapacidad de la localidad'. Componente: Subsidio C vignecia 2019´","Inversión",3,{"$f":"IF(ISERROR(VLOOKUP(I291,Eje_Pilar!$C$2:$E$47,2,FALSE)),\" \",VLOOKUP(I291,Eje_Pilar!$C$2:$E$47,2,FALSE))","v":"Igualdad y autonomía para una Bogotá incluyente"},{"$f":"IF(ISERROR(VLOOKUP(I291,Eje_Pilar!$C$2:$E$47,3,FALSE)),\" \",VLOOKUP(I291,Eje_Pilar!$C$2:$E$47,3,FALSE))","v":"Pilar 1 Igualdad de Calidad de Vida"},1556,860066942,"CAJA DE COMPENSACION FAMILIAR - COMPENSAR",7200000,null,null,null,null,7200000,5549466,null,null,null,null,null,null,null,null,null,null,0.77075916666666666,null,{"$f":"IF(SUMPRODUCT((A$14:A291=A291)*(B$14:B291=B291)*(C$14:C291=C291))>1,0,1)","v":1},"Contratos interadministrativos","Contratación directa",{"$f":"IFERROR(VLOOKUP(F291,Tipo!$C$12:$C$27,1,FALSE),\"NO\")","v":"Contratos interadministrativos"},"Inversión",3]
[192019,2019,null,"Contratos interadministrativos","Contratación directa","Contratos interadministrativos","Resolución 019 de 2019 \"Por medio de la cual se ordena el gasto y pago correspondiente al Proyecto 1556 \"APOYO DIRIGIDO A LA POBLACIÓN VULNERABLE ADULTO MAYOR Y CON DISCAPACIDAD DE LA LOCALIDAD\". Componente: SUBSIDIO TIPO C\" Vigencia 2019 ","Inversión",3,{"$f":"IF(ISERROR(VLOOKUP(I292,Eje_Pilar!$C$2:$E$47,2,FALSE)),\" \",VLOOKUP(I292,Eje_Pilar!$C$2:$E$47,2,FALSE))","v":"Igualdad y autonomía para una Bogotá incluyente"},{"$f":"IF(ISERROR(VLOOKUP(I292,Eje_Pilar!$C$2:$E$47,3,FALSE)),\" \",VLOOKUP(I292,Eje_Pilar!$C$2:$E$47,3,FALSE))","v":"Pilar 1 Igualdad de Calidad de Vida"},1556,860066942,"CAJA DE COMPENSACION FAMILIAR - COMPENSAR",467280000,1,-9360000,null,null,457920000,457920000,null,null,null,null,null,null,null,null,null,null,1,null,{"$f":"IF(SUMPRODUCT((A$14:A292=A292)*(B$14:B292=B292)*(C$14:C292=C292))>1,0,1)","v":1},"Contratos interadministrativos","Contratación directa",{"$f":"IFERROR(VLOOKUP(F292,Tipo!$C$12:$C$27,1,FALSE),\"NO\")","v":"Contratos interadministrativos"},"Inversión",3]
[432,2019,null,"Otros gastos",null,null,"CDP PARA PAGO CERTIFICADO DE PERITAJE SEGUN RESOLUCION 432 DEL 28 DE OCTUBRE DE 2019.","Inversión",19,{"$f":"IF(ISERROR(VLOOKUP(I293,Eje_Pilar!$C$2:$E$47,2,FALSE)),\" \",VLOOKUP(I293,Eje_Pilar!$C$2:$E$47,2,FALSE))","v":"Seguridad y convivencia para todos"},{"$f":"IF(ISERROR(VLOOKUP(I293,Eje_Pilar!$C$2:$E$47,3,FALSE)),\" \",VLOOKUP(I293,Eje_Pilar!$C$2:$E$47,3,FALSE))","v":"Pilar 3 Construcción de Comunidad y Cultura Ciudadana"},1563,800141338,"DIRECCION DE INVESTIGACION CRIMINAL E INTERPOL",110415,null,null,null,null,110415,110415,null,null,null,null,null,null,null,null,null,null,1,null,{"$f":"IF(SUMPRODUCT((A$14:A293=A293)*(B$14:B293=B293)*(C$14:C293=C293))>1,0,1)","v":1},"Otros gastos","NO",{"$f":"IFERROR(VLOOKUP(F293,Tipo!$C$12:$C$27,1,FALSE),\"NO\")","v":"NO"},"Inversión",19]
[null,2019,null,"Otros gastos",null,null,null,"Inversión",45,{"$f":"IF(ISERROR(VLOOKUP(I294,Eje_Pilar!$C$2:$E$47,2,FALSE)),\" \",VLOOKUP(I294,Eje_Pilar!$C$2:$E$47,2,FALSE))","v":"Gobernanza e influencia local, regional e internacional"},{"$f":"IF(ISERROR(VLOOKUP(I294,Eje_Pilar!$C$2:$E$47,3,FALSE)),\" \",VLOOKUP(I294,Eje_Pilar!$C$2:$E$47,3,FALSE))","v":"Eje Transversal 4 Gobierno Legitimo, Fortalecimiento Local y Eficiencia"},1559,860011153,"POSITIVA COMPAÑIA DE SEGUROS SA",3722100,null,null,null,null,3722100,3722100,null,null,null,null,null,null,null,null,null,null,1,null,{"$f":"IF(SUMPRODUCT((A$14:A294=A294)*(B$14:B294=B294)*(C$14:C294=C294))>1,0,1)","v":1},"Otros gastos","NO",{"$f":"IFERROR(VLOOKUP(F294,Tipo!$C$12:$C$27,1,FALSE),\"NO\")","v":"NO"},"Inversión",45]
[null,2019,null,"Otros gastos",null,null,null,"Inversión",45,{"$f":"IF(ISERROR(VLOOKUP(I295,Eje_Pilar!$C$2:$E$47,2,FALSE)),\" \",VLOOKUP(I295,Eje_Pilar!$C$2:$E$47,2,FALSE))","v":"Gobernanza e influencia local, regional e internacional"},{"$f":"IF(ISERROR(VLOOKUP(I295,Eje_Pilar!$C$2:$E$47,3,FALSE)),\" \",VLOOKUP(I295,Eje_Pilar!$C$2:$E$47,3,FALSE))","v":"Eje Transversal 4 Gobierno Legitimo, Fortalecimiento Local y Eficiencia"},1559,830037248,"CODENSA S. A. ESP",10305782,null,null,null,null,10305782,10305782,null,null,null,null,null,null,null,null,null,null,1,null,{"$f":"IF(SUMPRODUCT((A$14:A295=A295)*(B$14:B295=B295)*(C$14:C295=C295))>1,0,1)","v":0},"Otros gastos","NO",{"$f":"IFERROR(VLOOKUP(F295,Tipo!$C$12:$C$27,1,FALSE),\"NO\")","v":"NO"},"Inversión",45]
[null,2019,null,"Otros gastos",null,null,null,"Inversión",45,{"$f":"IF(ISERROR(VLOOKUP(I296,Eje_Pilar!$C$2:$E$47,2,FALSE)),\" \",VLOOKUP(I296,Eje_Pilar!$C$2:$E$47,2,FALSE))","v":"Gobernanza e influencia local, regional e internacional"},{"$f":"IF(ISERROR(VLOOKUP(I296,Eje_Pilar!$C$2:$E$47,3,FALSE)),\" \",VLOOKUP(I296,Eje_Pilar!$C$2:$E$47,3,FALSE))","v":"Eje Transversal 4 Gobierno Legitimo, Fortalecimiento Local y Eficiencia"},1559,901144843,"BOGOTA LIMPIA S.A.S. E.S.P.",432470,null,null,null,null,432470,432470,null,null,null,null,null,null,null,null,null,null,1,null,{"$f":"IF(SUMPRODUCT((A$14:A296=A296)*(B$14:B296=B296)*(C$14:C296=C296))>1,0,1)","v":0},"Otros gastos","NO",{"$f":"IFERROR(VLOOKUP(F296,Tipo!$C$12:$C$27,1,FALSE),\"NO\")","v":"NO"},"Inversión",45]
[null,2019,null,"Otros gastos",null,null,null,"Inversión",45,{"$f":"IF(ISERROR(VLOOKUP(I297,Eje_Pilar!$C$2:$E$47,2,FALSE)),\" \",VLOOKUP(I297,Eje_Pilar!$C$2:$E$47,2,FALSE))","v":"Gobernanza e influencia local, regional e internacional"},{"$f":"IF(ISERROR(VLOOKUP(I297,Eje_Pilar!$C$2:$E$47,3,FALSE)),\" \",VLOOKUP(I297,Eje_Pilar!$C$2:$E$47,3,FALSE))","v":"Eje Transversal 4 Gobierno Legitimo, Fortalecimiento Local y Eficiencia"},1559,899999094,"EMPRESA DE ACUEDUCTO Y ALCANTARILLADO DE BOGOTA ESP",1799427,null,null,null,null,1799427,1799427,null,null,null,null,null,null,null,null,null,null,1,null,{"$f":"IF(SUMPRODUCT((A$14:A297=A297)*(B$14:B297=B297)*(C$14:C297=C297))>1,0,1)","v":0},"Otros gastos","NO",{"$f":"IFERROR(VLOOKUP(F297,Tipo!$C$12:$C$27,1,FALSE),\"NO\")","v":"NO"},"Inversión",45]
[null,2019,null,"Otros gastos",null,null,"CDP PARA LOS HONORARIOS DE LOS 9 EDILES DE LA LOCALIDAD DE BARRIOS UNIDOS CORRESPONDIENTE A LA VIGENCIA 2019, 12 MESES, 20 SESIONES. CORRESPONDIENTE AL EDIL CARLOS JAVIER CASTILLO CABRERA.","Funcionamiento",null,{"$f":"IF(ISERROR(VLOOKUP(I298,Eje_Pilar!$C$2:$E$47,2,FALSE)),\" \",VLOOKUP(I298,Eje_Pilar!$C$2:$E$47,2,FALSE))","v":" "},{"$f":"IF(ISERROR(VLOOKUP(I298,Eje_Pilar!$C$2:$E$47,3,FALSE)),\" \",VLOOKUP(I298,Eje_Pilar!$C$2:$E$47,3,FALSE))","v":" "},null,9,"EDILES",768137726,null,null,null,null,768137726,768137726,null,null,null,null,null,null,null,null,null,null,1,null,{"$f":"IF(SUMPRODUCT((A$14:A298=A298)*(B$14:B298=B298)*(C$14:C298=C298))>1,0,1)","v":0},"Otros gastos","NO",{"$f":"IFERROR(VLOOKUP(F298,Tipo!$C$12:$C$27,1,FALSE),\"NO\")","v":"NO"},"Funcionamiento","NO"]
[null,2019,null,"Otros gastos",null,null,"CDP PARA PAGO DEL SERVICIO PUBLICO DE ACUEDUCTO SEDE ALCALDIA LOCAL SEGUN CUENTA CONTRATO 11614871 Y FACTURA 30268570113 CORRESPONDIENTE AL PERIODO ENTE EL 10 DE MAYO Y EL 09 DE JULIO DE 2019.","Funcionamiento",null,{"$f":"IF(ISERROR(VLOOKUP(I299,Eje_Pilar!$C$2:$E$47,2,FALSE)),\" \",VLOOKUP(I299,Eje_Pilar!$C$2:$E$47,2,FALSE))","v":" "},{"$f":"IF(ISERROR(VLOOKUP(I299,Eje_Pilar!$C$2:$E$47,3,FALSE)),\" \",VLOOKUP(I299,Eje_Pilar!$C$2:$E$47,3,FALSE))","v":" "},null,899999094,"EMPRESA DE ACUEDUCTO Y ALCANTARILLADO DE BOGOTA ESP",5138423,null,null,null,null,5138423,5138423,null,null,null,null,null,null,null,null,null,null,1,null,{"$f":"IF(SUMPRODUCT((A$14:A299=A299)*(B$14:B299=B299)*(C$14:C299=C299))>1,0,1)","v":0},"Otros gastos","NO",{"$f":"IFERROR(VLOOKUP(F299,Tipo!$C$12:$C$27,1,FALSE),\"NO\")","v":"NO"},"Funcionamiento","NO"]
[null,2019,null,"Otros gastos",null,null,"CDP PARA RECONOCIMIENTO SALUD DE LOS EDILES VIGENCIA 2019. DOCE MESES. LOCALIDAD BARRIOS UNIDOS. 9 EDILES. CORRESPONDIENTE AL EDIL ALEXIS GARCIA BELTRAN","Funcionamiento",null,{"$f":"IF(ISERROR(VLOOKUP(I300,Eje_Pilar!$C$2:$E$47,2,FALSE)),\" \",VLOOKUP(I300,Eje_Pilar!$C$2:$E$47,2,FALSE))","v":" "},{"$f":"IF(ISERROR(VLOOKUP(I300,Eje_Pilar!$C$2:$E$47,3,FALSE)),\" \",VLOOKUP(I300,Eje_Pilar!$C$2:$E$47,3,FALSE))","v":" "},null,830113831,"ALIANSALUD ENTIDAD PROMOTORA DE SALUD S.A",10678800,null,null,null,null,10678800,10678800,null,null,null,null,null,null,null,null,null,null,1,null,{"$f":"IF(SUMPRODUCT((A$14:A300=A300)*(B$14:B300=B300)*(C$14:C300=C300))>1,0,1)","v":0},"Otros gastos","NO",{"$f":"IFERROR(VLOOKUP(F300,Tipo!$C$12:$C$27,1,FALSE),\"NO\")","v":"NO"},"Funcionamiento","NO"]
[null,2019,null,"Otros gastos",null,null,"CDP PARA RECONOCIMIENTO SALUD DE LOS EDILES VIGENCIA 2019. DOCE MESES. LOCALIDAD BARRIOS UNIDOS. 9 EDILES. CORRESPONDIENTE AL EDIL ALEXIS GARCIA BELTRAN","Funcionamiento",null,{"$f":"IF(ISERROR(VLOOKUP(I301,Eje_Pilar!$C$2:$E$47,2,FALSE)),\" \",VLOOKUP(I301,Eje_Pilar!$C$2:$E$47,2,FALSE))","v":" "},{"$f":"IF(ISERROR(VLOOKUP(I301,Eje_Pilar!$C$2:$E$47,3,FALSE)),\" \",VLOOKUP(I301,Eje_Pilar!$C$2:$E$47,3,FALSE))","v":" "},null,800130907,"SALUD TOTAL ENTIDAD PROMOTORA DE SALUD DEL REGIMEN CONTRIBUTIVO Y DEL REGIMEN SUBSIDIADO S.A.",10678800,null,null,null,null,10678800,10678800,null,null,null,null,null,null,null,null,null,null,1,null,{"$f":"IF(SUMPRODUCT((A$14:A301=A301)*(B$14:B301=B301)*(C$14:C301=C301))>1,0,1)","v":0},"Otros gastos","NO",{"$f":"IFERROR(VLOOKUP(F301,Tipo!$C$12:$C$27,1,FALSE),\"NO\")","v":"NO"},"Funcionamiento","NO"]
[null,2019,null,"Otros gastos",null,null,"CDP PARA RECONOCIMIENTO SALUD DE LOS EDILES VIGENCIA 2019. DOCE MESES. LOCALIDAD BARRIOS UNIDOS. 9 EDILES. CORRESPONDIENTE AL EDIL ALEXIS GARCIA BELTRAN","Funcionamiento",null,{"$f":"IF(ISERROR(VLOOKUP(I302,Eje_Pilar!$C$2:$E$47,2,FALSE)),\" \",VLOOKUP(I302,Eje_Pilar!$C$2:$E$47,2,FALSE))","v":" "},{"$f":"IF(ISERROR(VLOOKUP(I302,Eje_Pilar!$C$2:$E$47,3,FALSE)),\" \",VLOOKUP(I302,Eje_Pilar!$C$2:$E$47,3,FALSE))","v":" "},null,830003564,"ENTIDAD PROMOTORA DE SALUD FAMISANAR CAFAM COLSUBSIDIO LIMITADA",8988000,1,-89000,null,null,8899000,8899000,null,null,null,null,null,null,null,null,null,null,1,null,{"$f":"IF(SUMPRODUCT((A$14:A302=A302)*(B$14:B302=B302)*(C$14:C302=C302))>1,0,1)","v":0},"Otros gastos","NO",{"$f":"IFERROR(VLOOKUP(F302,Tipo!$C$12:$C$27,1,FALSE),\"NO\")","v":"NO"},"Funcionamiento","NO"]
[null,2019,null,"Otros gastos",null,null,"CDP PARA RECONOCIMIENTO SALUD DE LOS EDILES VIGENCIA 2019. DOCE MESES. LOCALIDAD BARRIOS UNIDOS. 9 EDILES. CORRESPONDIENTE AL EDIL ALEXIS GARCIA BELTRAN","Funcionamiento",null,{"$f":"IF(ISERROR(VLOOKUP(I303,Eje_Pilar!$C$2:$E$47,2,FALSE)),\" \",VLOOKUP(I303,Eje_Pilar!$C$2:$E$47,2,FALSE))","v":" "},{"$f":"IF(ISERROR(VLOOKUP(I303,Eje_Pilar!$C$2:$E$47,3,FALSE)),\" \",VLOOKUP(I303,Eje_Pilar!$C$2:$E$47,3,FALSE))","v":" "},null,800251440,"ENTIDAD PROMOTORA DE SALUD SANITAS S.A.",10678800,1,-8988000,null,null,1690800,1690800,null,null,null,null,null,null,null,null,null,null,1,null,{"$f":"IF(SUMPRODUCT((A$14:A303=A303)*(B$14:B303=B303)*(C$14:C303=C303))>1,0,1)","v":0},"Otros gastos","NO",{"$f":"IFERROR(VLOOKUP(F303,Tipo!$C$12:$C$27,1,FALSE),\"NO\")","v":"NO"},"Funcionamiento","NO"]
[null,2019,null,"Otros gastos",null,null,"CDP PARA RECONOCIMIENTO SALUD DE LOS EDILES VIGENCIA 2019. DOCE MESES. LOCALIDAD BARRIOS UNIDOS. 9 EDILES. CORRESPONDIENTE AL EDIL ALEXIS GARCIA BELTRAN","Funcionamiento",null,{"$f":"IF(ISERROR(VLOOKUP(I304,Eje_Pilar!$C$2:$E$47,2,FALSE)),\" \",VLOOKUP(I304,Eje_Pilar!$C$2:$E$47,2,FALSE))","v":" "},{"$f":"IF(ISERROR(VLOOKUP(I304,Eje_Pilar!$C$2:$E$47,3,FALSE)),\" \",VLOOKUP(I304,Eje_Pilar!$C$2:$E$47,3,FALSE))","v":" "},null,860066942,"CAJA DE COMPENSACION FAMILIAR - COMPENSAR",42715200,null,null,null,null,42715200,42715200,null,null,null,null,null,null,null,null,null,null,1,null,{"$f":"IF(SUMPRODUCT((A$14:A304=A304)*(B$14:B304=B304)*(C$14:C304=C304))>1,0,1)","v":0},"Otros gastos","NO",{"$f":"IFERROR(VLOOKUP(F304,Tipo!$C$12:$C$27,1,FALSE),\"NO\")","v":"NO"},"Funcionamiento","NO"]
[null,2019,null,"Otros gastos",null,null,"CDP PARA RECONOCIMIENTO SALUD DE LOS EDILES VIGENCIA 2019. DOCE MESES. LOCALIDAD BARRIOS UNIDOS. 9 EDILES. CORRESPONDIENTE AL EDIL ALEXIS GARCIA BELTRAN","Funcionamiento",null,{"$f":"IF(ISERROR(VLOOKUP(I305,Eje_Pilar!$C$2:$E$47,2,FALSE)),\" \",VLOOKUP(I305,Eje_Pilar!$C$2:$E$47,2,FALSE))","v":" "},{"$f":"IF(ISERROR(VLOOKUP(I305,Eje_Pilar!$C$2:$E$47,3,FALSE)),\" \",VLOOKUP(I305,Eje_Pilar!$C$2:$E$47,3,FALSE))","v":" "},null,805000427,"COOMEVA ENTIDAD PROMOTORA DE SALUD S.A. - COOMEVA E.P.S. S.A.",10678800,null,null,null,null,10678800,10678800,null,null,null,null,null,null,null,null,null,null,1,null,{"$f":"IF(SUMPRODUCT((A$14:A305=A305)*(B$14:B305=B305)*(C$14:C305=C305))>1,0,1)","v":0},"Otros gastos","NO",{"$f":"IFERROR(VLOOKUP(F305,Tipo!$C$12:$C$27,1,FALSE),\"NO\")","v":"NO"},"Funcionamiento","NO"]
[null,2019,null,"Otros gastos",null,null,"CDP PARA RECONOCIMIENTO SALUD DE LOS EDILES VIGENCIA 2019. DOCE MESES. LOCALIDAD BARRIOS UNIDOS. 9 EDILES. CORRESPONDIENTE AL EDIL ALEXIS GARCIA BELTRAN","Funcionamiento",null,{"$f":"IF(ISERROR(VLOOKUP(I306,Eje_Pilar!$C$2:$E$47,2,FALSE)),\" \",VLOOKUP(I306,Eje_Pilar!$C$2:$E$47,2,FALSE))","v":" "},{"$f":"IF(ISERROR(VLOOKUP(I306,Eje_Pilar!$C$2:$E$47,3,FALSE)),\" \",VLOOKUP(I306,Eje_Pilar!$C$2:$E$47,3,FALSE))","v":" "},null,830003564,"ENTIDAD PROMOTORA DE SALUD FAMISANAR CAFAM COLSUBSIDIO LIMITADA",10678800,null,null,null,null,10678800,10678800,null,null,null,null,null,null,null,null,null,null,1,null,{"$f":"IF(SUMPRODUCT((A$14:A306=A306)*(B$14:B306=B306)*(C$14:C306=C306))>1,0,1)","v":0},"Otros gastos","NO",{"$f":"IFERROR(VLOOKUP(F306,Tipo!$C$12:$C$27,1,FALSE),\"NO\")","v":"NO"},"Funcionamiento","NO"]
[null,2019,null,"Otros gastos",null,null,"CDP PARA PAGO DEL SERVICIO PUBLICO DE TELEFONIA CORRESPONDIENTE AL PERIODO ENTRE EL 01 DE FEBRERO Y EL 28 DE FEBRERO. SEGUN FACTURA  000264443412","Funcionamiento",null,{"$f":"IF(ISERROR(VLOOKUP(I307,Eje_Pilar!$C$2:$E$47,2,FALSE)),\" \",VLOOKUP(I307,Eje_Pilar!$C$2:$E$47,2,FALSE))","v":" "},{"$f":"IF(ISERROR(VLOOKUP(I307,Eje_Pilar!$C$2:$E$47,3,FALSE)),\" \",VLOOKUP(I307,Eje_Pilar!$C$2:$E$47,3,FALSE))","v":" "},null,899999115,"EMPRESA DE TELECOMUNICACIONES DE BOGOTA SA ESP",19500000,1,-7337320,null,null,12162680,12162680,null,null,null,null,null,null,null,null,null,null,1,null,{"$f":"IF(SUMPRODUCT((A$14:A307=A307)*(B$14:B307=B307)*(C$14:C307=C307))>1,0,1)","v":0},"Otros gastos","NO",{"$f":"IFERROR(VLOOKUP(F307,Tipo!$C$12:$C$27,1,FALSE),\"NO\")","v":"NO"},"Funcionamiento","NO"]
[null,2019,null,"Otros gastos",null,null,"CDP PARA PAGO DE SERVICIO PUBLICO DE ENERGIA SEGUN CUENTA CONTRATO 07623994 CORRESPONDIENTE AL PERIODO ENTRE 12 DE ABRIL AL 15 DE MAYO DE 2019. SEGUN FACTURA 5509705565","Funcionamiento",null,{"$f":"IF(ISERROR(VLOOKUP(I308,Eje_Pilar!$C$2:$E$47,2,FALSE)),\" \",VLOOKUP(I308,Eje_Pilar!$C$2:$E$47,2,FALSE))","v":" "},{"$f":"IF(ISERROR(VLOOKUP(I308,Eje_Pilar!$C$2:$E$47,3,FALSE)),\" \",VLOOKUP(I308,Eje_Pilar!$C$2:$E$47,3,FALSE))","v":" "},null,830037248,"CODENSA S. A. ESP",35302172,1,-63430,null,null,{"$f":"+O308+Q308+S308","v":35238742},35238742,null,null,null,null,null,null,null,null,null,null,{"$f":"IF(ISERROR(U308/T308),\"-\",(U308/T308))","v":1},null,{"$f":"IF(SUMPRODUCT((A$14:A308=A308)*(B$14:B307=#REF!)*(C$14:C307=#REF!))>1,0,1)","v":{"$error":"#REF!"}},{"$f":"IFERROR(VLOOKUP(#REF!,tipo,1,FALSE),\"NO\")","v":"NO"},"NO",{"$f":"IFERROR(VLOOKUP(F308,Tipo!$C$12:$C$27,1,FALSE),\"NO\")","v":"NO"},"Funcionamiento","NO"]
[null,2019,null,"Otros gastos",null,null,"CDP PARA PAGO DEL SERVICIO PUBLICO DE ASEO SEDE ALCALDIA LOCAL PARA LA VIGENCIA 2019. SEGUN CUENTA CONTRATO N°12192753 CORRESPONDIENTE AL PERIODO ENTRE EL 01 DE JULIO AL 31 DE AGOSTO DE 2019. SEGUN FACTURA 22197879","Funcionamiento",null,{"$f":"IF(ISERROR(VLOOKUP(I309,Eje_Pilar!$C$2:$E$47,2,FALSE)),\" \",VLOOKUP(I309,Eje_Pilar!$C$2:$E$47,2,FALSE))","v":" "},{"$f":"IF(ISERROR(VLOOKUP(I309,Eje_Pilar!$C$2:$E$47,3,FALSE)),\" \",VLOOKUP(I309,Eje_Pilar!$C$2:$E$47,3,FALSE))","v":" "},null,901144843,"BOGOTA LIMPIA S.A.S. E.S.P.",2580246,1,-778530,null,null,{"$f":"+O309+Q309+S309","v":1801716},1801716,null,null,null,null,null,null,null,null,null,null,{"$f":"IF(ISERROR(U309/T309),\"-\",(U309/T309))","v":1},null,{"$f":"IF(SUMPRODUCT((A$14:A309=A309)*(B$14:B308=B308)*(C$14:C308=C308))>1,0,1)","v":{"$error":"#N/A"}},{"$f":"IFERROR(VLOOKUP(D308,tipo,1,FALSE),\"NO\")","v":"Otros gastos"},"NO",{"$f":"IFERROR(VLOOKUP(F309,Tipo!$C$12:$C$27,1,FALSE),\"NO\")","v":"NO"},"Funcionamiento","NO"]
["92-2018",2018,"FDLBU-SASI-058-2018","Contratos de prestación de servicios","Selección abreviada","Subasta inversa ","PRESTACION DEL SERVICIO DE VIGILANCIA Y SEGURIDAD PRIVADA PARA LAS INSTALACIONES DEL FONDO DEL DESARROLLO LOCAL DE BARRIOS UNIDOS","Inversión",45,{"$f":"IF(ISERROR(VLOOKUP(I310,Eje_Pilar!$C$2:$E$47,2,FALSE)),\" \",VLOOKUP(I310,Eje_Pilar!$C$2:$E$47,2,FALSE))","v":"Gobernanza e influencia local, regional e internacional"},{"$f":"IF(ISERROR(VLOOKUP(I310,Eje_Pilar!$C$2:$E$47,3,FALSE)),\" \",VLOOKUP(I310,Eje_Pilar!$C$2:$E$47,3,FALSE))","v":"Eje Transversal 4 Gobierno Legitimo, Fortalecimiento Local y Eficiencia"},1559,8002485410,"SEGURIDAD DIGITAL LTDA",null,null,null,null,4140585,{"$f":"+O310+Q310+S293","v":0},4140585,"2018-06-14","2018-06-18","2019-08-17",360,60,null,null,null,null,"X",{"$f":"IF(ISERROR(U310/T310),\"-\",(U310/T310))","v":"-"},null,{"$f":"IF(SUMPRODUCT((A$14:A310=A310)*(B$14:B309=B309)*(C$14:C309=C309))>1,0,1)","v":{"$error":"#N/A"}},{"$f":"IFERROR(VLOOKUP(D309,tipo,1,FALSE),\"NO\")","v":"Otros gastos"},"Selección abreviada",{"$f":"IFERROR(VLOOKUP(F310,Tipo!$C$12:$C$27,1,FALSE),\"NO\")","v":"Subasta inversa "},"Inversión",45]
[null,null,null,null,null,null,null,null,null,{"$f":"IF(ISERROR(VLOOKUP(I311,Eje_Pilar!$C$2:$E$47,2,FALSE)),\" \",VLOOKUP(I311,Eje_Pilar!$C$2:$E$47,2,FALSE))","v":" "},{"$f":"IF(ISERROR(VLOOKUP(I311,Eje_Pilar!$C$2:$E$47,3,FALSE)),\" \",VLOOKUP(I311,Eje_Pilar!$C$2:$E$47,3,FALSE))","v":" "},null,null,null,null,null,null,null,null,{"$f":"+O311+Q311+S294","v":0},null,null,null,null,null,null,null,null,null,null,null,"-",null,{"$f":"IF(SUMPRODUCT((A$14:A311=A311)*(B$14:B311=B311)*(C$14:C311=C311))>1,0,1)","v":1},"NO","NO",{"$f":"IFERROR(VLOOKUP(F311,Tipo!$C$12:$C$27,1,FALSE),\"NO\")","v":"NO"},"NO","NO"]
[null,null,null,null,null,null,null,null,null,{"$f":"IF(ISERROR(VLOOKUP(I312,Eje_Pilar!$C$2:$E$47,2,FALSE)),\" \",VLOOKUP(I312,Eje_Pilar!$C$2:$E$47,2,FALSE))","v":" "},{"$f":"IF(ISERROR(VLOOKUP(I312,Eje_Pilar!$C$2:$E$47,3,FALSE)),\" \",VLOOKUP(I312,Eje_Pilar!$C$2:$E$47,3,FALSE))","v":" "},null,null,null,null,null,null,null,null,0,null,null,null,null,null,null,null,null,null,null,null,"-",null,{"$f":"IF(SUMPRODUCT((A$14:A312=A312)*(B$14:B312=B312)*(C$14:C312=C312))>1,0,1)","v":0},"NO","NO",{"$f":"IFERROR(VLOOKUP(F312,Tipo!$C$12:$C$27,1,FALSE),\"NO\")","v":"NO"},"NO","NO"]
[null,null,null,null,null,null,null,null,null,{"$f":"IF(ISERROR(VLOOKUP(I313,Eje_Pilar!$C$2:$E$47,2,FALSE)),\" \",VLOOKUP(I313,Eje_Pilar!$C$2:$E$47,2,FALSE))","v":" "},{"$f":"IF(ISERROR(VLOOKUP(I313,Eje_Pilar!$C$2:$E$47,3,FALSE)),\" \",VLOOKUP(I313,Eje_Pilar!$C$2:$E$47,3,FALSE))","v":" "},null,null,null,null,null,null,null,null,0,null,null,null,null,null,null,null,null,null,null,null,"-",null,{"$f":"IF(SUMPRODUCT((A$14:A313=A313)*(B$14:B313=B313)*(C$14:C313=C313))>1,0,1)","v":0},"NO","NO",{"$f":"IFERROR(VLOOKUP(F313,Tipo!$C$12:$C$27,1,FALSE),\"NO\")","v":"NO"},"NO","NO"]
[null,null,null,null,null,null,null,null,null,{"$f":"IF(ISERROR(VLOOKUP(I314,Eje_Pilar!$C$2:$E$47,2,FALSE)),\" \",VLOOKUP(I314,Eje_Pilar!$C$2:$E$47,2,FALSE))","v":" "},{"$f":"IF(ISERROR(VLOOKUP(I314,Eje_Pilar!$C$2:$E$47,3,FALSE)),\" \",VLOOKUP(I314,Eje_Pilar!$C$2:$E$47,3,FALSE))","v":" "},null,null,null,null,null,null,null,null,0,null,null,null,null,null,null,null,null,null,null,null,"-",null,{"$f":"IF(SUMPRODUCT((A$14:A314=A314)*(B$14:B314=B314)*(C$14:C314=C314))>1,0,1)","v":0},"NO","NO",{"$f":"IFERROR(VLOOKUP(F314,Tipo!$C$12:$C$27,1,FALSE),\"NO\")","v":"NO"},"NO","NO"]
[null,null,null,null,null,null,null,null,null,{"$f":"IF(ISERROR(VLOOKUP(I315,Eje_Pilar!$C$2:$E$47,2,FALSE)),\" \",VLOOKUP(I315,Eje_Pilar!$C$2:$E$47,2,FALSE))","v":" "},{"$f":"IF(ISERROR(VLOOKUP(I315,Eje_Pilar!$C$2:$E$47,3,FALSE)),\" \",VLOOKUP(I315,Eje_Pilar!$C$2:$E$47,3,FALSE))","v":" "},null,null,null,null,null,null,null,null,0,null,null,null,null,null,null,null,null,null,null,null,"-",null,{"$f":"IF(SUMPRODUCT((A$14:A315=A315)*(B$14:B315=B315)*(C$14:C315=C315))>1,0,1)","v":0},"NO","NO",{"$f":"IFERROR(VLOOKUP(F315,Tipo!$C$12:$C$27,1,FALSE),\"NO\")","v":"NO"},"NO","NO"]
[null,null,null,null,null,null,null,null,null,{"$f":"IF(ISERROR(VLOOKUP(I316,Eje_Pilar!$C$2:$E$47,2,FALSE)),\" \",VLOOKUP(I316,Eje_Pilar!$C$2:$E$47,2,FALSE))","v":" "},{"$f":"IF(ISERROR(VLOOKUP(I316,Eje_Pilar!$C$2:$E$47,3,FALSE)),\" \",VLOOKUP(I316,Eje_Pilar!$C$2:$E$47,3,FALSE))","v":" "},null,null,null,null,null,null,null,null,0,null,null,null,null,null,null,null,null,null,null,null,"-",null,{"$f":"IF(SUMPRODUCT((A$14:A316=A316)*(B$14:B316=B316)*(C$14:C316=C316))>1,0,1)","v":0},"NO","NO",{"$f":"IFERROR(VLOOKUP(F316,Tipo!$C$12:$C$27,1,FALSE),\"NO\")","v":"NO"},"NO","NO"]
[null,null,null,null,null,null,null,null,null,{"$f":"IF(ISERROR(VLOOKUP(I317,Eje_Pilar!$C$2:$E$47,2,FALSE)),\" \",VLOOKUP(I317,Eje_Pilar!$C$2:$E$47,2,FALSE))","v":" "},{"$f":"IF(ISERROR(VLOOKUP(I317,Eje_Pilar!$C$2:$E$47,3,FALSE)),\" \",VLOOKUP(I317,Eje_Pilar!$C$2:$E$47,3,FALSE))","v":" "},null,null,null,null,null,null,null,null,0,null,null,null,null,null,null,null,null,null,null,null,"-",null,{"$f":"IF(SUMPRODUCT((A$14:A317=A317)*(B$14:B317=B317)*(C$14:C317=C317))>1,0,1)","v":0},"NO","NO",{"$f":"IFERROR(VLOOKUP(F317,Tipo!$C$12:$C$27,1,FALSE),\"NO\")","v":"NO"},"NO","NO"]
[null,null,null,null,null,null,null,null,null,{"$f":"IF(ISERROR(VLOOKUP(I318,Eje_Pilar!$C$2:$E$47,2,FALSE)),\" \",VLOOKUP(I318,Eje_Pilar!$C$2:$E$47,2,FALSE))","v":" "},{"$f":"IF(ISERROR(VLOOKUP(I318,Eje_Pilar!$C$2:$E$47,3,FALSE)),\" \",VLOOKUP(I318,Eje_Pilar!$C$2:$E$47,3,FALSE))","v":" "},null,null,null,null,null,null,null,null,0,null,null,null,null,null,null,null,null,null,null,null,"-",null,{"$f":"IF(SUMPRODUCT((A$14:A318=A318)*(B$14:B318=B318)*(C$14:C318=C318))>1,0,1)","v":0},"NO","NO",{"$f":"IFERROR(VLOOKUP(F318,Tipo!$C$12:$C$27,1,FALSE),\"NO\")","v":"NO"},"NO","NO"]
[null,null,null,null,null,null,null,null,null,{"$f":"IF(ISERROR(VLOOKUP(I319,Eje_Pilar!$C$2:$E$47,2,FALSE)),\" \",VLOOKUP(I319,Eje_Pilar!$C$2:$E$47,2,FALSE))","v":" "},{"$f":"IF(ISERROR(VLOOKUP(I319,Eje_Pilar!$C$2:$E$47,3,FALSE)),\" \",VLOOKUP(I319,Eje_Pilar!$C$2:$E$47,3,FALSE))","v":" "},null,null,null,null,null,null,null,null,0,null,null,null,null,null,null,null,null,null,null,null,"-",null,{"$f":"IF(SUMPRODUCT((A$14:A319=A319)*(B$14:B319=B319)*(C$14:C319=C319))>1,0,1)","v":0},"NO","NO",{"$f":"IFERROR(VLOOKUP(F319,Tipo!$C$12:$C$27,1,FALSE),\"NO\")","v":"NO"},"NO","NO"]
[null,null,null,null,null,null,null,null,null,{"$f":"IF(ISERROR(VLOOKUP(I320,Eje_Pilar!$C$2:$E$47,2,FALSE)),\" \",VLOOKUP(I320,Eje_Pilar!$C$2:$E$47,2,FALSE))","v":" "},{"$f":"IF(ISERROR(VLOOKUP(I320,Eje_Pilar!$C$2:$E$47,3,FALSE)),\" \",VLOOKUP(I320,Eje_Pilar!$C$2:$E$47,3,FALSE))","v":" "},null,null,null,null,null,null,null,null,0,null,null,null,null,null,null,null,null,null,null,null,"-",null,{"$f":"IF(SUMPRODUCT((A$14:A320=A320)*(B$14:B320=B320)*(C$14:C320=C320))>1,0,1)","v":0},"NO","NO",{"$f":"IFERROR(VLOOKUP(F320,Tipo!$C$12:$C$27,1,FALSE),\"NO\")","v":"NO"},"NO","NO"]
[null,null,null,null,null,null,null,null,null,{"$f":"IF(ISERROR(VLOOKUP(I321,Eje_Pilar!$C$2:$E$47,2,FALSE)),\" \",VLOOKUP(I321,Eje_Pilar!$C$2:$E$47,2,FALSE))","v":" "},{"$f":"IF(ISERROR(VLOOKUP(I321,Eje_Pilar!$C$2:$E$47,3,FALSE)),\" \",VLOOKUP(I321,Eje_Pilar!$C$2:$E$47,3,FALSE))","v":" "},null,null,null,null,null,null,null,null,0,null,null,null,null,null,null,null,null,null,null,null,"-",null,{"$f":"IF(SUMPRODUCT((A$14:A321=A321)*(B$14:B321=B321)*(C$14:C321=C321))>1,0,1)","v":0},"NO","NO",{"$f":"IFERROR(VLOOKUP(F321,Tipo!$C$12:$C$27,1,FALSE),\"NO\")","v":"NO"},"NO","NO"]
[null,null,null,null,null,null,null,null,null,{"$f":"IF(ISERROR(VLOOKUP(I322,Eje_Pilar!$C$2:$E$47,2,FALSE)),\" \",VLOOKUP(I322,Eje_Pilar!$C$2:$E$47,2,FALSE))","v":" "},{"$f":"IF(ISERROR(VLOOKUP(I322,Eje_Pilar!$C$2:$E$47,3,FALSE)),\" \",VLOOKUP(I322,Eje_Pilar!$C$2:$E$47,3,FALSE))","v":" "},null,null,null,null,null,null,null,null,0,null,null,null,null,null,null,null,null,null,null,null,"-",null,{"$f":"IF(SUMPRODUCT((A$14:A322=A322)*(B$14:B322=B322)*(C$14:C322=C322))>1,0,1)","v":0},"NO","NO",{"$f":"IFERROR(VLOOKUP(F322,Tipo!$C$12:$C$27,1,FALSE),\"NO\")","v":"NO"},"NO","NO"]
[null,null,null,null,null,null,null,null,null,{"$f":"IF(ISERROR(VLOOKUP(I323,Eje_Pilar!$C$2:$E$47,2,FALSE)),\" \",VLOOKUP(I323,Eje_Pilar!$C$2:$E$47,2,FALSE))","v":" "},{"$f":"IF(ISERROR(VLOOKUP(I323,Eje_Pilar!$C$2:$E$47,3,FALSE)),\" \",VLOOKUP(I323,Eje_Pilar!$C$2:$E$47,3,FALSE))","v":" "},null,null,null,null,null,null,null,null,0,null,null,null,null,null,null,null,null,null,null,null,"-",null,{"$f":"IF(SUMPRODUCT((A$14:A323=A323)*(B$14:B323=B323)*(C$14:C323=C323))>1,0,1)","v":0},"NO","NO",{"$f":"IFERROR(VLOOKUP(F323,Tipo!$C$12:$C$27,1,FALSE),\"NO\")","v":"NO"},"NO","NO"]
[null,null,null,null,null,null,null,null,null,{"$f":"IF(ISERROR(VLOOKUP(I324,Eje_Pilar!$C$2:$E$47,2,FALSE)),\" \",VLOOKUP(I324,Eje_Pilar!$C$2:$E$47,2,FALSE))","v":" "},{"$f":"IF(ISERROR(VLOOKUP(I324,Eje_Pilar!$C$2:$E$47,3,FALSE)),\" \",VLOOKUP(I324,Eje_Pilar!$C$2:$E$47,3,FALSE))","v":" "},null,null,null,null,null,null,null,null,0,null,null,null,null,null,null,null,null,null,null,null,"-",null,{"$f":"IF(SUMPRODUCT((A$14:A324=A324)*(B$14:B324=B324)*(C$14:C324=C324))>1,0,1)","v":0},"NO","NO",{"$f":"IFERROR(VLOOKUP(F324,Tipo!$C$12:$C$27,1,FALSE),\"NO\")","v":"NO"},"NO","NO"]
[null,null,null,null,null,null,null,null,null,{"$f":"IF(ISERROR(VLOOKUP(I325,Eje_Pilar!$C$2:$E$47,2,FALSE)),\" \",VLOOKUP(I325,Eje_Pilar!$C$2:$E$47,2,FALSE))","v":" "},{"$f":"IF(ISERROR(VLOOKUP(I325,Eje_Pilar!$C$2:$E$47,3,FALSE)),\" \",VLOOKUP(I325,Eje_Pilar!$C$2:$E$47,3,FALSE))","v":" "},null,null,null,null,null,null,null,null,0,null,null,null,null,null,null,null,null,null,null,null,"-",null,{"$f":"IF(SUMPRODUCT((A$14:A325=A325)*(B$14:B325=B325)*(C$14:C325=C325))>1,0,1)","v":0},"NO","NO",{"$f":"IFERROR(VLOOKUP(F325,Tipo!$C$12:$C$27,1,FALSE),\"NO\")","v":"NO"},"NO","NO"]
[null,null,null,null,null,null,null,null,null,{"$f":"IF(ISERROR(VLOOKUP(I326,Eje_Pilar!$C$2:$E$47,2,FALSE)),\" \",VLOOKUP(I326,Eje_Pilar!$C$2:$E$47,2,FALSE))","v":" "},{"$f":"IF(ISERROR(VLOOKUP(I326,Eje_Pilar!$C$2:$E$47,3,FALSE)),\" \",VLOOKUP(I326,Eje_Pilar!$C$2:$E$47,3,FALSE))","v":" "},null,null,null,null,null,null,null,null,0,null,null,null,null,null,null,null,null,null,null,null,"-",null,{"$f":"IF(SUMPRODUCT((A$14:A326=A326)*(B$14:B326=B326)*(C$14:C326=C326))>1,0,1)","v":0},"NO","NO",{"$f":"IFERROR(VLOOKUP(F326,Tipo!$C$12:$C$27,1,FALSE),\"NO\")","v":"NO"},"NO","NO"]
[null,null,null,null,null,null,null,null,null,{"$f":"IF(ISERROR(VLOOKUP(I327,Eje_Pilar!$C$2:$E$47,2,FALSE)),\" \",VLOOKUP(I327,Eje_Pilar!$C$2:$E$47,2,FALSE))","v":" "},{"$f":"IF(ISERROR(VLOOKUP(I327,Eje_Pilar!$C$2:$E$47,3,FALSE)),\" \",VLOOKUP(I327,Eje_Pilar!$C$2:$E$47,3,FALSE))","v":" "},null,null,null,null,null,null,null,null,4140585,null,null,null,null,null,null,null,null,null,null,null,0,null,{"$f":"IF(SUMPRODUCT((A$14:A327=A327)*(B$14:B327=B327)*(C$14:C327=C327))>1,0,1)","v":0},"NO","NO",{"$f":"IFERROR(VLOOKUP(F327,Tipo!$C$12:$C$27,1,FALSE),\"NO\")","v":"NO"},"NO","NO"]
[null,null,null,null,null,null,null,null,null,{"$f":"IF(ISERROR(VLOOKUP(I328,Eje_Pilar!$C$2:$E$47,2,FALSE)),\" \",VLOOKUP(I328,Eje_Pilar!$C$2:$E$47,2,FALSE))","v":" "},{"$f":"IF(ISERROR(VLOOKUP(I328,Eje_Pilar!$C$2:$E$47,3,FALSE)),\" \",VLOOKUP(I328,Eje_Pilar!$C$2:$E$47,3,FALSE))","v":" "},null,null,null,null,null,null,null,null,{"$f":"+O328+Q328+S328","v":0},null,null,null,null,null,null,null,null,null,null,null,"-",null,{"$f":"IF(SUMPRODUCT((A$14:A328=A328)*(B$14:B328=B328)*(C$14:C328=C328))>1,0,1)","v":0},"NO","NO",{"$f":"IFERROR(VLOOKUP(F328,Tipo!$C$12:$C$27,1,FALSE),\"NO\")","v":"NO"},"NO","NO"]
[null,null,null,null,null,null,null,null,null,{"$f":"IF(ISERROR(VLOOKUP(I329,Eje_Pilar!$C$2:$E$47,2,FALSE)),\" \",VLOOKUP(I329,Eje_Pilar!$C$2:$E$47,2,FALSE))","v":" "},{"$f":"IF(ISERROR(VLOOKUP(I329,Eje_Pilar!$C$2:$E$47,3,FALSE)),\" \",VLOOKUP(I329,Eje_Pilar!$C$2:$E$47,3,FALSE))","v":" "},null,null,null,null,null,null,null,null,0,null,null,null,null,null,null,null,null,null,null,null,"-",null,{"$f":"IF(SUMPRODUCT((A$14:A329=A329)*(B$14:B329=B329)*(C$14:C329=C329))>1,0,1)","v":0},"NO","NO",{"$f":"IFERROR(VLOOKUP(F329,Tipo!$C$12:$C$27,1,FALSE),\"NO\")","v":"NO"},"NO","NO"]
[null,null,null,null,null,null,null,null,null,{"$f":"IF(ISERROR(VLOOKUP(I330,Eje_Pilar!$C$2:$E$47,2,FALSE)),\" \",VLOOKUP(I330,Eje_Pilar!$C$2:$E$47,2,FALSE))","v":" "},{"$f":"IF(ISERROR(VLOOKUP(I330,Eje_Pilar!$C$2:$E$47,3,FALSE)),\" \",VLOOKUP(I330,Eje_Pilar!$C$2:$E$47,3,FALSE))","v":" "},null,null,null,null,null,null,null,null,0,null,null,null,null,null,null,null,null,null,null,null,"-",null,{"$f":"IF(SUMPRODUCT((A$14:A330=A330)*(B$14:B330=B330)*(C$14:C330=C330))>1,0,1)","v":0},"NO","NO",{"$f":"IFERROR(VLOOKUP(F330,Tipo!$C$12:$C$27,1,FALSE),\"NO\")","v":"NO"},"NO","NO"]
[null,null,null,null,null,null,null,null,null,{"$f":"IF(ISERROR(VLOOKUP(I331,Eje_Pilar!$C$2:$E$47,2,FALSE)),\" \",VLOOKUP(I331,Eje_Pilar!$C$2:$E$47,2,FALSE))","v":" "},{"$f":"IF(ISERROR(VLOOKUP(I331,Eje_Pilar!$C$2:$E$47,3,FALSE)),\" \",VLOOKUP(I331,Eje_Pilar!$C$2:$E$47,3,FALSE))","v":" "},null,null,null,null,null,null,null,null,0,null,null,null,null,null,null,null,null,null,null,null,"-",null,{"$f":"IF(SUMPRODUCT((A$14:A331=A331)*(B$14:B331=B331)*(C$14:C331=C331))>1,0,1)","v":0},"NO","NO",{"$f":"IFERROR(VLOOKUP(F331,Tipo!$C$12:$C$27,1,FALSE),\"NO\")","v":"NO"},"NO","NO"]
[null,null,null,null,null,null,null,null,null,{"$f":"IF(ISERROR(VLOOKUP(I332,Eje_Pilar!$C$2:$E$47,2,FALSE)),\" \",VLOOKUP(I332,Eje_Pilar!$C$2:$E$47,2,FALSE))","v":" "},{"$f":"IF(ISERROR(VLOOKUP(I332,Eje_Pilar!$C$2:$E$47,3,FALSE)),\" \",VLOOKUP(I332,Eje_Pilar!$C$2:$E$47,3,FALSE))","v":" "},null,null,null,null,null,null,null,null,0,null,null,null,null,null,null,null,null,null,null,null,"-",null,{"$f":"IF(SUMPRODUCT((A$14:A332=A332)*(B$14:B332=B332)*(C$14:C332=C332))>1,0,1)","v":0},"NO","NO",{"$f":"IFERROR(VLOOKUP(F332,Tipo!$C$12:$C$27,1,FALSE),\"NO\")","v":"NO"},"NO","NO"]
[null,null,null,null,null,null,null,null,null,{"$f":"IF(ISERROR(VLOOKUP(I333,Eje_Pilar!$C$2:$E$47,2,FALSE)),\" \",VLOOKUP(I333,Eje_Pilar!$C$2:$E$47,2,FALSE))","v":" "},{"$f":"IF(ISERROR(VLOOKUP(I333,Eje_Pilar!$C$2:$E$47,3,FALSE)),\" \",VLOOKUP(I333,Eje_Pilar!$C$2:$E$47,3,FALSE))","v":" "},null,null,null,null,null,null,null,null,0,null,null,null,null,null,null,null,null,null,null,null,"-",null,{"$f":"IF(SUMPRODUCT((A$14:A333=A333)*(B$14:B333=B333)*(C$14:C333=C333))>1,0,1)","v":0},"NO","NO",{"$f":"IFERROR(VLOOKUP(F333,Tipo!$C$12:$C$27,1,FALSE),\"NO\")","v":"NO"},"NO","NO"]
[null,null,null,null,null,null,null,null,null,{"$f":"IF(ISERROR(VLOOKUP(I334,Eje_Pilar!$C$2:$E$47,2,FALSE)),\" \",VLOOKUP(I334,Eje_Pilar!$C$2:$E$47,2,FALSE))","v":" "},{"$f":"IF(ISERROR(VLOOKUP(I334,Eje_Pilar!$C$2:$E$47,3,FALSE)),\" \",VLOOKUP(I334,Eje_Pilar!$C$2:$E$47,3,FALSE))","v":" "},null,null,null,null,null,null,null,null,0,null,null,null,null,null,null,null,null,null,null,null,"-",null,{"$f":"IF(SUMPRODUCT((A$14:A334=A334)*(B$14:B334=B334)*(C$14:C334=C334))>1,0,1)","v":0},"NO","NO",{"$f":"IFERROR(VLOOKUP(F334,Tipo!$C$12:$C$27,1,FALSE),\"NO\")","v":"NO"},"NO","NO"]
[null,null,null,null,null,null,null,null,null,{"$f":"IF(ISERROR(VLOOKUP(I335,Eje_Pilar!$C$2:$E$47,2,FALSE)),\" \",VLOOKUP(I335,Eje_Pilar!$C$2:$E$47,2,FALSE))","v":" "},{"$f":"IF(ISERROR(VLOOKUP(I335,Eje_Pilar!$C$2:$E$47,3,FALSE)),\" \",VLOOKUP(I335,Eje_Pilar!$C$2:$E$47,3,FALSE))","v":" "},null,null,null,null,null,null,null,null,0,null,null,null,null,null,null,null,null,null,null,null,"-",null,{"$f":"IF(SUMPRODUCT((A$14:A335=A335)*(B$14:B335=B335)*(C$14:C335=C335))>1,0,1)","v":0},"NO","NO",{"$f":"IFERROR(VLOOKUP(F335,Tipo!$C$12:$C$27,1,FALSE),\"NO\")","v":"NO"},"NO","NO"]
[null,null,null,null,null,null,null,null,null,{"$f":"IF(ISERROR(VLOOKUP(I336,Eje_Pilar!$C$2:$E$47,2,FALSE)),\" \",VLOOKUP(I336,Eje_Pilar!$C$2:$E$47,2,FALSE))","v":" "},{"$f":"IF(ISERROR(VLOOKUP(I336,Eje_Pilar!$C$2:$E$47,3,FALSE)),\" \",VLOOKUP(I336,Eje_Pilar!$C$2:$E$47,3,FALSE))","v":" "},null,null,null,null,null,null,null,null,0,null,null,null,null,null,null,null,null,null,null,null,{"$f":"IF(ISERROR(U336/T336),\"-\",(U336/T336))","v":"-"},null,{"$f":"IF(SUMPRODUCT((A$14:A336=A336)*(B$14:B336=B336)*(C$14:C336=C336))>1,0,1)","v":0},"NO","NO",{"$f":"IFERROR(VLOOKUP(F336,Tipo!$C$12:$C$27,1,FALSE),\"NO\")","v":"NO"},"NO","NO"]
[null,null,null,null,null,null,null,null,null,{"$f":"IF(ISERROR(VLOOKUP(I337,Eje_Pilar!$C$2:$E$47,2,FALSE)),\" \",VLOOKUP(I337,Eje_Pilar!$C$2:$E$47,2,FALSE))","v":" "},{"$f":"IF(ISERROR(VLOOKUP(I337,Eje_Pilar!$C$2:$E$47,3,FALSE)),\" \",VLOOKUP(I337,Eje_Pilar!$C$2:$E$47,3,FALSE))","v":" "},null,null,null,null,null,null,null,null,{"$f":"+O337+Q337+S337","v":0},null,null,null,null,null,null,null,null,null,null,null,"-",null,{"$f":"IF(SUMPRODUCT((A$14:A337=A337)*(B$14:B337=B337)*(C$14:C337=C337))>1,0,1)","v":0},{"$f":"IFERROR(VLOOKUP(D337,tipo,1,FALSE),\"NO\")","v":"NO"},{"$f":"IFERROR(VLOOKUP(E337,modal,1,FALSE),\"NO\")","v":"NO"},{"$f":"IFERROR(VLOOKUP(F337,Tipo!$C$12:$C$27,1,FALSE),\"NO\")","v":"NO"},{"$f":"IFERROR(VLOOKUP(H337,afectacion,1,FALSE),\"NO\")","v":"NO"},{"$f":"IFERROR(VLOOKUP(I337,programa,1,FALSE),\"NO\")","v":"NO"}]
[null,null,null,null,null,null,null,null,null,{"$f":"IF(ISERROR(VLOOKUP(I338,Eje_Pilar!$C$2:$E$47,2,FALSE)),\" \",VLOOKUP(I338,Eje_Pilar!$C$2:$E$47,2,FALSE))","v":" "},{"$f":"IF(ISERROR(VLOOKUP(I338,Eje_Pilar!$C$2:$E$47,3,FALSE)),\" \",VLOOKUP(I338,Eje_Pilar!$C$2:$E$47,3,FALSE))","v":" "},null,null,null,null,null,null,null,null,0,null,null,null,null,null,null,null,null,null,null,null,"-",null,{"$f":"IF(SUMPRODUCT((A$14:A338=A338)*(B$14:B338=B338)*(C$14:C338=C338))>1,0,1)","v":0},"NO","NO",{"$f":"IFERROR(VLOOKUP(F338,Tipo!$C$12:$C$27,1,FALSE),\"NO\")","v":"NO"},"NO","NO"]
[null,null,null,null,null,null,null,null,null,{"$f":"IF(ISERROR(VLOOKUP(I339,Eje_Pilar!$C$2:$E$47,2,FALSE)),\" \",VLOOKUP(I339,Eje_Pilar!$C$2:$E$47,2,FALSE))","v":" "},{"$f":"IF(ISERROR(VLOOKUP(I339,Eje_Pilar!$C$2:$E$47,3,FALSE)),\" \",VLOOKUP(I339,Eje_Pilar!$C$2:$E$47,3,FALSE))","v":" "},null,null,null,null,null,null,null,null,0,null,null,null,null,null,null,null,null,null,null,null,"-",null,{"$f":"IF(SUMPRODUCT((A$14:A339=A339)*(B$14:B339=B339)*(C$14:C339=C339))>1,0,1)","v":0},"NO","NO",{"$f":"IFERROR(VLOOKUP(F339,Tipo!$C$12:$C$27,1,FALSE),\"NO\")","v":"NO"},"NO","NO"]
[null,null,null,null,null,null,null,null,null,{"$f":"IF(ISERROR(VLOOKUP(I340,Eje_Pilar!$C$2:$E$47,2,FALSE)),\" \",VLOOKUP(I340,Eje_Pilar!$C$2:$E$47,2,FALSE))","v":" "},{"$f":"IF(ISERROR(VLOOKUP(I340,Eje_Pilar!$C$2:$E$47,3,FALSE)),\" \",VLOOKUP(I340,Eje_Pilar!$C$2:$E$47,3,FALSE))","v":" "},null,null,null,null,null,null,null,null,0,null,null,null,null,null,null,null,null,null,null,null,"-",null,{"$f":"IF(SUMPRODUCT((A$14:A340=A340)*(B$14:B340=B340)*(C$14:C340=C340))>1,0,1)","v":0},"NO","NO",{"$f":"IFERROR(VLOOKUP(F340,Tipo!$C$12:$C$27,1,FALSE),\"NO\")","v":"NO"},"NO","NO"]
[null,null,null,null,null,null,null,null,null,{"$f":"IF(ISERROR(VLOOKUP(I341,Eje_Pilar!$C$2:$E$47,2,FALSE)),\" \",VLOOKUP(I341,Eje_Pilar!$C$2:$E$47,2,FALSE))","v":" "},{"$f":"IF(ISERROR(VLOOKUP(I341,Eje_Pilar!$C$2:$E$47,3,FALSE)),\" \",VLOOKUP(I341,Eje_Pilar!$C$2:$E$47,3,FALSE))","v":" "},null,null,null,null,null,null,null,null,0,null,null,null,null,null,null,null,null,null,null,null,"-",null,{"$f":"IF(SUMPRODUCT((A$14:A341=A341)*(B$14:B341=B341)*(C$14:C341=C341))>1,0,1)","v":0},"NO","NO",{"$f":"IFERROR(VLOOKUP(F341,Tipo!$C$12:$C$27,1,FALSE),\"NO\")","v":"NO"},"NO","NO"]
[null,null,null,null,null,null,null,null,null,{"$f":"IF(ISERROR(VLOOKUP(I342,Eje_Pilar!$C$2:$E$47,2,FALSE)),\" \",VLOOKUP(I342,Eje_Pilar!$C$2:$E$47,2,FALSE))","v":" "},{"$f":"IF(ISERROR(VLOOKUP(I342,Eje_Pilar!$C$2:$E$47,3,FALSE)),\" \",VLOOKUP(I342,Eje_Pilar!$C$2:$E$47,3,FALSE))","v":" "},null,null,null,null,null,null,null,null,0,null,null,null,null,null,null,null,null,null,null,null,"-",null,{"$f":"IF(SUMPRODUCT((A$14:A342=A342)*(B$14:B342=B342)*(C$14:C342=C342))>1,0,1)","v":0},"NO","NO",{"$f":"IFERROR(VLOOKUP(F342,Tipo!$C$12:$C$27,1,FALSE),\"NO\")","v":"NO"},"NO","NO"]
[null,null,null,null,null,null,null,null,null,{"$f":"IF(ISERROR(VLOOKUP(I343,Eje_Pilar!$C$2:$E$47,2,FALSE)),\" \",VLOOKUP(I343,Eje_Pilar!$C$2:$E$47,2,FALSE))","v":" "},{"$f":"IF(ISERROR(VLOOKUP(I343,Eje_Pilar!$C$2:$E$47,3,FALSE)),\" \",VLOOKUP(I343,Eje_Pilar!$C$2:$E$47,3,FALSE))","v":" "},null,null,null,null,null,null,null,null,0,null,null,null,null,null,null,null,null,null,null,null,"-",null,{"$f":"IF(SUMPRODUCT((A$14:A343=A343)*(B$14:B343=B343)*(C$14:C343=C343))>1,0,1)","v":0},"NO","NO",{"$f":"IFERROR(VLOOKUP(F343,Tipo!$C$12:$C$27,1,FALSE),\"NO\")","v":"NO"},"NO","NO"]
[null,null,null,null,null,null,null,null,null,{"$f":"IF(ISERROR(VLOOKUP(I344,Eje_Pilar!$C$2:$E$47,2,FALSE)),\" \",VLOOKUP(I344,Eje_Pilar!$C$2:$E$47,2,FALSE))","v":" "},{"$f":"IF(ISERROR(VLOOKUP(I344,Eje_Pilar!$C$2:$E$47,3,FALSE)),\" \",VLOOKUP(I344,Eje_Pilar!$C$2:$E$47,3,FALSE))","v":" "},null,null,null,null,null,null,null,null,0,null,null,null,null,null,null,null,null,null,null,null,"-",null,{"$f":"IF(SUMPRODUCT((A$14:A344=A344)*(B$14:B344=B344)*(C$14:C344=C344))>1,0,1)","v":0},"NO","NO",{"$f":"IFERROR(VLOOKUP(F344,Tipo!$C$12:$C$27,1,FALSE),\"NO\")","v":"NO"},"NO","NO"]
[null,null,null,null,null,null,null,null,null,{"$f":"IF(ISERROR(VLOOKUP(I345,Eje_Pilar!$C$2:$E$47,2,FALSE)),\" \",VLOOKUP(I345,Eje_Pilar!$C$2:$E$47,2,FALSE))","v":" "},{"$f":"IF(ISERROR(VLOOKUP(I345,Eje_Pilar!$C$2:$E$47,3,FALSE)),\" \",VLOOKUP(I345,Eje_Pilar!$C$2:$E$47,3,FALSE))","v":" "},null,null,null,null,null,null,null,null,0,null,null,null,null,null,null,null,null,null,null,null,"-",null,{"$f":"IF(SUMPRODUCT((A$14:A345=A345)*(B$14:B345=B345)*(C$14:C345=C345))>1,0,1)","v":0},"NO","NO",{"$f":"IFERROR(VLOOKUP(F345,Tipo!$C$12:$C$27,1,FALSE),\"NO\")","v":"NO"},"NO","NO"]
[null,null,null,null,null,null,null,null,null,{"$f":"IF(ISERROR(VLOOKUP(I346,Eje_Pilar!$C$2:$E$47,2,FALSE)),\" \",VLOOKUP(I346,Eje_Pilar!$C$2:$E$47,2,FALSE))","v":" "},{"$f":"IF(ISERROR(VLOOKUP(I346,Eje_Pilar!$C$2:$E$47,3,FALSE)),\" \",VLOOKUP(I346,Eje_Pilar!$C$2:$E$47,3,FALSE))","v":" "},null,null,null,null,null,null,null,null,0,null,null,null,null,null,null,null,null,null,null,null,"-",null,{"$f":"IF(SUMPRODUCT((A$14:A346=A346)*(B$14:B346=B346)*(C$14:C346=C346))>1,0,1)","v":0},"NO","NO",{"$f":"IFERROR(VLOOKUP(F346,Tipo!$C$12:$C$27,1,FALSE),\"NO\")","v":"NO"},"NO","NO"]
[null,null,null,null,null,null,null,null,null,{"$f":"IF(ISERROR(VLOOKUP(I347,Eje_Pilar!$C$2:$E$47,2,FALSE)),\" \",VLOOKUP(I347,Eje_Pilar!$C$2:$E$47,2,FALSE))","v":" "},{"$f":"IF(ISERROR(VLOOKUP(I347,Eje_Pilar!$C$2:$E$47,3,FALSE)),\" \",VLOOKUP(I347,Eje_Pilar!$C$2:$E$47,3,FALSE))","v":" "},null,null,null,null,null,null,null,null,0,null,null,null,null,null,null,null,null,null,null,null,"-",null,{"$f":"IF(SUMPRODUCT((A$14:A347=A347)*(B$14:B347=B347)*(C$14:C347=C347))>1,0,1)","v":0},"NO","NO",{"$f":"IFERROR(VLOOKUP(F347,Tipo!$C$12:$C$27,1,FALSE),\"NO\")","v":"NO"},"NO","NO"]
[null,null,null,null,null,null,null,null,null,{"$f":"IF(ISERROR(VLOOKUP(I348,Eje_Pilar!$C$2:$E$47,2,FALSE)),\" \",VLOOKUP(I348,Eje_Pilar!$C$2:$E$47,2,FALSE))","v":" "},{"$f":"IF(ISERROR(VLOOKUP(I348,Eje_Pilar!$C$2:$E$47,3,FALSE)),\" \",VLOOKUP(I348,Eje_Pilar!$C$2:$E$47,3,FALSE))","v":" "},null,null,null,null,null,null,null,null,0,null,null,null,null,null,null,null,null,null,null,null,"-",null,{"$f":"IF(SUMPRODUCT((A$14:A348=A348)*(B$14:B348=B348)*(C$14:C348=C348))>1,0,1)","v":0},"NO","NO",{"$f":"IFERROR(VLOOKUP(F348,Tipo!$C$12:$C$27,1,FALSE),\"NO\")","v":"NO"},"NO","NO"]
[null,null,null,null,null,null,null,null,null,{"$f":"IF(ISERROR(VLOOKUP(I349,Eje_Pilar!$C$2:$E$47,2,FALSE)),\" \",VLOOKUP(I349,Eje_Pilar!$C$2:$E$47,2,FALSE))","v":" "},{"$f":"IF(ISERROR(VLOOKUP(I349,Eje_Pilar!$C$2:$E$47,3,FALSE)),\" \",VLOOKUP(I349,Eje_Pilar!$C$2:$E$47,3,FALSE))","v":" "},null,null,null,null,null,null,null,null,0,null,null,null,null,null,null,null,null,null,null,null,"-",null,{"$f":"IF(SUMPRODUCT((A$14:A349=A349)*(B$14:B349=B349)*(C$14:C349=C349))>1,0,1)","v":0},"NO","NO",{"$f":"IFERROR(VLOOKUP(F349,Tipo!$C$12:$C$27,1,FALSE),\"NO\")","v":"NO"},"NO","NO"]
[null,null,null,null,null,null,null,null,null,{"$f":"IF(ISERROR(VLOOKUP(I350,Eje_Pilar!$C$2:$E$47,2,FALSE)),\" \",VLOOKUP(I350,Eje_Pilar!$C$2:$E$47,2,FALSE))","v":" "},{"$f":"IF(ISERROR(VLOOKUP(I350,Eje_Pilar!$C$2:$E$47,3,FALSE)),\" \",VLOOKUP(I350,Eje_Pilar!$C$2:$E$47,3,FALSE))","v":" "},null,null,null,null,null,null,null,null,0,null,null,null,null,null,null,null,null,null,null,null,"-",null,{"$f":"IF(SUMPRODUCT((A$14:A350=A350)*(B$14:B350=B350)*(C$14:C350=C350))>1,0,1)","v":0},"NO","NO",{"$f":"IFERROR(VLOOKUP(F350,Tipo!$C$12:$C$27,1,FALSE),\"NO\")","v":"NO"},"NO","NO"]
[null,null,null,null,null,null,null,null,null,{"$f":"IF(ISERROR(VLOOKUP(I351,Eje_Pilar!$C$2:$E$47,2,FALSE)),\" \",VLOOKUP(I351,Eje_Pilar!$C$2:$E$47,2,FALSE))","v":" "},{"$f":"IF(ISERROR(VLOOKUP(I351,Eje_Pilar!$C$2:$E$47,3,FALSE)),\" \",VLOOKUP(I351,Eje_Pilar!$C$2:$E$47,3,FALSE))","v":" "},null,null,null,null,null,null,null,null,0,null,null,null,null,null,null,null,null,null,null,null,"-",null,{"$f":"IF(SUMPRODUCT((A$14:A351=A351)*(B$14:B351=B351)*(C$14:C351=C351))>1,0,1)","v":0},"NO","NO",{"$f":"IFERROR(VLOOKUP(F351,Tipo!$C$12:$C$27,1,FALSE),\"NO\")","v":"NO"},"NO","NO"]
[null,null,null,null,null,null,null,null,null,{"$f":"IF(ISERROR(VLOOKUP(I352,Eje_Pilar!$C$2:$E$47,2,FALSE)),\" \",VLOOKUP(I352,Eje_Pilar!$C$2:$E$47,2,FALSE))","v":" "},{"$f":"IF(ISERROR(VLOOKUP(I352,Eje_Pilar!$C$2:$E$47,3,FALSE)),\" \",VLOOKUP(I352,Eje_Pilar!$C$2:$E$47,3,FALSE))","v":" "},null,null,null,null,null,null,null,null,0,null,null,null,null,null,null,null,null,null,null,null,"-",null,{"$f":"IF(SUMPRODUCT((A$14:A352=A352)*(B$14:B352=B352)*(C$14:C352=C352))>1,0,1)","v":0},"NO","NO",{"$f":"IFERROR(VLOOKUP(F352,Tipo!$C$12:$C$27,1,FALSE),\"NO\")","v":"NO"},"NO","NO"]
[null,null,null,null,null,null,null,null,null,{"$f":"IF(ISERROR(VLOOKUP(I353,Eje_Pilar!$C$2:$E$47,2,FALSE)),\" \",VLOOKUP(I353,Eje_Pilar!$C$2:$E$47,2,FALSE))","v":" "},{"$f":"IF(ISERROR(VLOOKUP(I353,Eje_Pilar!$C$2:$E$47,3,FALSE)),\" \",VLOOKUP(I353,Eje_Pilar!$C$2:$E$47,3,FALSE))","v":" "},null,null,null,null,null,null,null,null,0,null,null,null,null,null,null,null,null,null,null,null,"-",null,{"$f":"IF(SUMPRODUCT((A$14:A353=A353)*(B$14:B353=B353)*(C$14:C353=C353))>1,0,1)","v":0},"NO","NO",{"$f":"IFERROR(VLOOKUP(F353,Tipo!$C$12:$C$27,1,FALSE),\"NO\")","v":"NO"},"NO","NO"]
[null,null,null,null,null,null,null,null,null,{"$f":"IF(ISERROR(VLOOKUP(I354,Eje_Pilar!$C$2:$E$47,2,FALSE)),\" \",VLOOKUP(I354,Eje_Pilar!$C$2:$E$47,2,FALSE))","v":" "},{"$f":"IF(ISERROR(VLOOKUP(I354,Eje_Pilar!$C$2:$E$47,3,FALSE)),\" \",VLOOKUP(I354,Eje_Pilar!$C$2:$E$47,3,FALSE))","v":" "},null,null,null,null,null,null,null,null,0,null,null,null,null,null,null,null,null,null,null,null,"-",null,{"$f":"IF(SUMPRODUCT((A$14:A354=A354)*(B$14:B354=B354)*(C$14:C354=C354))>1,0,1)","v":0},"NO","NO",{"$f":"IFERROR(VLOOKUP(F354,Tipo!$C$12:$C$27,1,FALSE),\"NO\")","v":"NO"},"NO","NO"]
[null,null,null,null,null,null,null,null,null,{"$f":"IF(ISERROR(VLOOKUP(I355,Eje_Pilar!$C$2:$E$47,2,FALSE)),\" \",VLOOKUP(I355,Eje_Pilar!$C$2:$E$47,2,FALSE))","v":" "},{"$f":"IF(ISERROR(VLOOKUP(I355,Eje_Pilar!$C$2:$E$47,3,FALSE)),\" \",VLOOKUP(I355,Eje_Pilar!$C$2:$E$47,3,FALSE))","v":" "},null,null,null,null,null,null,null,null,0,null,null,null,null,null,null,null,null,null,null,null,"-",null,{"$f":"IF(SUMPRODUCT((A$14:A355=A355)*(B$14:B355=B355)*(C$14:C355=C355))>1,0,1)","v":0},"NO","NO",{"$f":"IFERROR(VLOOKUP(F355,Tipo!$C$12:$C$27,1,FALSE),\"NO\")","v":"NO"},"NO","NO"]
[null,null,null,null,null,null,null,null,null,{"$f":"IF(ISERROR(VLOOKUP(I356,Eje_Pilar!$C$2:$E$47,2,FALSE)),\" \",VLOOKUP(I356,Eje_Pilar!$C$2:$E$47,2,FALSE))","v":" "},{"$f":"IF(ISERROR(VLOOKUP(I356,Eje_Pilar!$C$2:$E$47,3,FALSE)),\" \",VLOOKUP(I356,Eje_Pilar!$C$2:$E$47,3,FALSE))","v":" "},null,null,null,null,null,null,null,null,0,null,null,null,null,null,null,null,null,null,null,null,"-",null,{"$f":"IF(SUMPRODUCT((A$14:A356=A356)*(B$14:B356=B356)*(C$14:C356=C356))>1,0,1)","v":0},"NO","NO",{"$f":"IFERROR(VLOOKUP(F356,Tipo!$C$12:$C$27,1,FALSE),\"NO\")","v":"NO"},"NO","NO"]
[null,null,null,null,null,null,null,null,null,{"$f":"IF(ISERROR(VLOOKUP(I357,Eje_Pilar!$C$2:$E$47,2,FALSE)),\" \",VLOOKUP(I357,Eje_Pilar!$C$2:$E$47,2,FALSE))","v":" "},{"$f":"IF(ISERROR(VLOOKUP(I357,Eje_Pilar!$C$2:$E$47,3,FALSE)),\" \",VLOOKUP(I357,Eje_Pilar!$C$2:$E$47,3,FALSE))","v":" "},null,null,null,null,null,null,null,null,0,null,null,null,null,null,null,null,null,null,null,null,"-",null,{"$f":"IF(SUMPRODUCT((A$14:A357=A357)*(B$14:B357=B357)*(C$14:C357=C357))>1,0,1)","v":0},"NO","NO",{"$f":"IFERROR(VLOOKUP(F357,Tipo!$C$12:$C$27,1,FALSE),\"NO\")","v":"NO"},"NO","NO"]
[null,null,null,null,null,null,null,null,null,{"$f":"IF(ISERROR(VLOOKUP(I358,Eje_Pilar!$C$2:$E$47,2,FALSE)),\" \",VLOOKUP(I358,Eje_Pilar!$C$2:$E$47,2,FALSE))","v":" "},{"$f":"IF(ISERROR(VLOOKUP(I358,Eje_Pilar!$C$2:$E$47,3,FALSE)),\" \",VLOOKUP(I358,Eje_Pilar!$C$2:$E$47,3,FALSE))","v":" "},null,null,null,null,null,null,null,null,0,null,null,null,null,null,null,null,null,null,null,null,"-",null,{"$f":"IF(SUMPRODUCT((A$14:A358=A358)*(B$14:B358=B358)*(C$14:C358=C358))>1,0,1)","v":0},"NO","NO",{"$f":"IFERROR(VLOOKUP(F358,Tipo!$C$12:$C$27,1,FALSE),\"NO\")","v":"NO"},"NO","NO"]
[null,null,null,null,null,null,null,null,null,{"$f":"IF(ISERROR(VLOOKUP(I359,Eje_Pilar!$C$2:$E$47,2,FALSE)),\" \",VLOOKUP(I359,Eje_Pilar!$C$2:$E$47,2,FALSE))","v":" "},{"$f":"IF(ISERROR(VLOOKUP(I359,Eje_Pilar!$C$2:$E$47,3,FALSE)),\" \",VLOOKUP(I359,Eje_Pilar!$C$2:$E$47,3,FALSE))","v":" "},null,null,null,null,null,null,null,null,0,null,null,null,null,null,null,null,null,null,null,null,"-",null,{"$f":"IF(SUMPRODUCT((A$14:A359=A359)*(B$14:B359=B359)*(C$14:C359=C359))>1,0,1)","v":0},"NO","NO",{"$f":"IFERROR(VLOOKUP(F359,Tipo!$C$12:$C$27,1,FALSE),\"NO\")","v":"NO"},"NO","NO"]
[null,null,null,null,null,null,null,null,null,{"$f":"IF(ISERROR(VLOOKUP(I360,Eje_Pilar!$C$2:$E$47,2,FALSE)),\" \",VLOOKUP(I360,Eje_Pilar!$C$2:$E$47,2,FALSE))","v":" "},{"$f":"IF(ISERROR(VLOOKUP(I360,Eje_Pilar!$C$2:$E$47,3,FALSE)),\" \",VLOOKUP(I360,Eje_Pilar!$C$2:$E$47,3,FALSE))","v":" "},null,null,null,null,null,null,null,null,0,null,null,null,null,null,null,null,null,null,null,null,"-",null,{"$f":"IF(SUMPRODUCT((A$14:A360=A360)*(B$14:B360=B360)*(C$14:C360=C360))>1,0,1)","v":0},"NO","NO",{"$f":"IFERROR(VLOOKUP(F360,Tipo!$C$12:$C$27,1,FALSE),\"NO\")","v":"NO"},"NO","NO"]
[null,null,null,null,null,null,null,null,null,{"$f":"IF(ISERROR(VLOOKUP(I361,Eje_Pilar!$C$2:$E$47,2,FALSE)),\" \",VLOOKUP(I361,Eje_Pilar!$C$2:$E$47,2,FALSE))","v":" "},{"$f":"IF(ISERROR(VLOOKUP(I361,Eje_Pilar!$C$2:$E$47,3,FALSE)),\" \",VLOOKUP(I361,Eje_Pilar!$C$2:$E$47,3,FALSE))","v":" "},null,null,null,null,null,null,null,null,0,null,null,null,null,null,null,null,null,null,null,null,"-",null,{"$f":"IF(SUMPRODUCT((A$14:A361=A361)*(B$14:B361=B361)*(C$14:C361=C361))>1,0,1)","v":0},"NO","NO",{"$f":"IFERROR(VLOOKUP(F361,Tipo!$C$12:$C$27,1,FALSE),\"NO\")","v":"NO"},"NO","NO"]
[null,null,null,null,null,null,null,null,null,{"$f":"IF(ISERROR(VLOOKUP(I362,Eje_Pilar!$C$2:$E$47,2,FALSE)),\" \",VLOOKUP(I362,Eje_Pilar!$C$2:$E$47,2,FALSE))","v":" "},{"$f":"IF(ISERROR(VLOOKUP(I362,Eje_Pilar!$C$2:$E$47,3,FALSE)),\" \",VLOOKUP(I362,Eje_Pilar!$C$2:$E$47,3,FALSE))","v":" "},null,null,null,null,null,null,null,null,0,null,null,null,null,null,null,null,null,null,null,null,"-",null,{"$f":"IF(SUMPRODUCT((A$14:A362=A362)*(B$14:B362=B362)*(C$14:C362=C362))>1,0,1)","v":0},"NO","NO",{"$f":"IFERROR(VLOOKUP(F362,Tipo!$C$12:$C$27,1,FALSE),\"NO\")","v":"NO"},"NO","NO"]
[null,null,null,null,null,null,null,null,null,{"$f":"IF(ISERROR(VLOOKUP(I363,Eje_Pilar!$C$2:$E$47,2,FALSE)),\" \",VLOOKUP(I363,Eje_Pilar!$C$2:$E$47,2,FALSE))","v":" "},{"$f":"IF(ISERROR(VLOOKUP(I363,Eje_Pilar!$C$2:$E$47,3,FALSE)),\" \",VLOOKUP(I363,Eje_Pilar!$C$2:$E$47,3,FALSE))","v":" "},null,null,null,null,null,null,null,null,0,null,null,null,null,null,null,null,null,null,null,null,"-",null,{"$f":"IF(SUMPRODUCT((A$14:A363=A363)*(B$14:B363=B363)*(C$14:C363=C363))>1,0,1)","v":0},"NO","NO",{"$f":"IFERROR(VLOOKUP(F363,Tipo!$C$12:$C$27,1,FALSE),\"NO\")","v":"NO"},"NO","NO"]
[null,null,null,null,null,null,null,null,null,{"$f":"IF(ISERROR(VLOOKUP(I364,Eje_Pilar!$C$2:$E$47,2,FALSE)),\" \",VLOOKUP(I364,Eje_Pilar!$C$2:$E$47,2,FALSE))","v":" "},{"$f":"IF(ISERROR(VLOOKUP(I364,Eje_Pilar!$C$2:$E$47,3,FALSE)),\" \",VLOOKUP(I364,Eje_Pilar!$C$2:$E$47,3,FALSE))","v":" "},null,null,null,null,null,null,null,null,0,null,null,null,null,null,null,null,null,null,null,null,"-",null,{"$f":"IF(SUMPRODUCT((A$14:A364=A364)*(B$14:B364=B364)*(C$14:C364=C364))>1,0,1)","v":0},"NO","NO",{"$f":"IFERROR(VLOOKUP(F364,Tipo!$C$12:$C$27,1,FALSE),\"NO\")","v":"NO"},"NO","NO"]
[null,null,null,null,null,null,null,null,null,{"$f":"IF(ISERROR(VLOOKUP(I365,Eje_Pilar!$C$2:$E$47,2,FALSE)),\" \",VLOOKUP(I365,Eje_Pilar!$C$2:$E$47,2,FALSE))","v":" "},{"$f":"IF(ISERROR(VLOOKUP(I365,Eje_Pilar!$C$2:$E$47,3,FALSE)),\" \",VLOOKUP(I365,Eje_Pilar!$C$2:$E$47,3,FALSE))","v":" "},null,null,null,null,null,null,null,null,0,null,null,null,null,null,null,null,null,null,null,null,"-",null,{"$f":"IF(SUMPRODUCT((A$14:A365=A365)*(B$14:B365=B365)*(C$14:C365=C365))>1,0,1)","v":0},"NO","NO",{"$f":"IFERROR(VLOOKUP(F365,Tipo!$C$12:$C$27,1,FALSE),\"NO\")","v":"NO"},"NO","NO"]
[null,null,null,null,null,null,null,null,null,{"$f":"IF(ISERROR(VLOOKUP(I366,Eje_Pilar!$C$2:$E$47,2,FALSE)),\" \",VLOOKUP(I366,Eje_Pilar!$C$2:$E$47,2,FALSE))","v":" "},{"$f":"IF(ISERROR(VLOOKUP(I366,Eje_Pilar!$C$2:$E$47,3,FALSE)),\" \",VLOOKUP(I366,Eje_Pilar!$C$2:$E$47,3,FALSE))","v":" "},null,null,null,null,null,null,null,null,0,null,null,null,null,null,null,null,null,null,null,null,"-",null,{"$f":"IF(SUMPRODUCT((A$14:A366=A366)*(B$14:B366=B366)*(C$14:C366=C366))>1,0,1)","v":0},"NO","NO",{"$f":"IFERROR(VLOOKUP(F366,Tipo!$C$12:$C$27,1,FALSE),\"NO\")","v":"NO"},"NO","NO"]
[null,null,null,null,null,null,null,null,null,{"$f":"IF(ISERROR(VLOOKUP(I367,Eje_Pilar!$C$2:$E$47,2,FALSE)),\" \",VLOOKUP(I367,Eje_Pilar!$C$2:$E$47,2,FALSE))","v":" "},{"$f":"IF(ISERROR(VLOOKUP(I367,Eje_Pilar!$C$2:$E$47,3,FALSE)),\" \",VLOOKUP(I367,Eje_Pilar!$C$2:$E$47,3,FALSE))","v":" "},null,null,null,null,null,null,null,null,0,null,null,null,null,null,null,null,null,null,null,null,"-",null,{"$f":"IF(SUMPRODUCT((A$14:A367=A367)*(B$14:B367=B367)*(C$14:C367=C367))>1,0,1)","v":0},"NO","NO",{"$f":"IFERROR(VLOOKUP(F367,Tipo!$C$12:$C$27,1,FALSE),\"NO\")","v":"NO"},"NO","NO"]
[null,null,null,null,null,null,null,null,null,{"$f":"IF(ISERROR(VLOOKUP(I368,Eje_Pilar!$C$2:$E$47,2,FALSE)),\" \",VLOOKUP(I368,Eje_Pilar!$C$2:$E$47,2,FALSE))","v":" "},{"$f":"IF(ISERROR(VLOOKUP(I368,Eje_Pilar!$C$2:$E$47,3,FALSE)),\" \",VLOOKUP(I368,Eje_Pilar!$C$2:$E$47,3,FALSE))","v":" "},null,null,null,null,null,null,null,null,0,null,null,null,null,null,null,null,null,null,null,null,"-",null,{"$f":"IF(SUMPRODUCT((A$14:A368=A368)*(B$14:B368=B368)*(C$14:C368=C368))>1,0,1)","v":0},"NO","NO",{"$f":"IFERROR(VLOOKUP(F368,Tipo!$C$12:$C$27,1,FALSE),\"NO\")","v":"NO"},"NO","NO"]
[null,null,null,null,null,null,null,null,null,{"$f":"IF(ISERROR(VLOOKUP(I369,Eje_Pilar!$C$2:$E$47,2,FALSE)),\" \",VLOOKUP(I369,Eje_Pilar!$C$2:$E$47,2,FALSE))","v":" "},{"$f":"IF(ISERROR(VLOOKUP(I369,Eje_Pilar!$C$2:$E$47,3,FALSE)),\" \",VLOOKUP(I369,Eje_Pilar!$C$2:$E$47,3,FALSE))","v":" "},null,null,null,null,null,null,null,null,0,null,null,null,null,null,null,null,null,null,null,null,"-",null,{"$f":"IF(SUMPRODUCT((A$14:A369=A369)*(B$14:B369=B369)*(C$14:C369=C369))>1,0,1)","v":0},"NO","NO",{"$f":"IFERROR(VLOOKUP(F369,Tipo!$C$12:$C$27,1,FALSE),\"NO\")","v":"NO"},"NO","NO"]
[null,null,null,null,null,null,null,null,null,{"$f":"IF(ISERROR(VLOOKUP(I370,Eje_Pilar!$C$2:$E$47,2,FALSE)),\" \",VLOOKUP(I370,Eje_Pilar!$C$2:$E$47,2,FALSE))","v":" "},{"$f":"IF(ISERROR(VLOOKUP(I370,Eje_Pilar!$C$2:$E$47,3,FALSE)),\" \",VLOOKUP(I370,Eje_Pilar!$C$2:$E$47,3,FALSE))","v":" "},null,null,null,null,null,null,null,null,{"$f":"+O370+Q370+S370","v":0},null,null,null,null,null,null,null,null,null,null,null,"-",null,{"$f":"IF(SUMPRODUCT((A$14:A370=A370)*(B$14:B370=B370)*(C$14:C370=C370))>1,0,1)","v":0},{"$f":"IFERROR(VLOOKUP(D370,tipo,1,FALSE),\"NO\")","v":"NO"},{"$f":"IFERROR(VLOOKUP(E370,modal,1,FALSE),\"NO\")","v":"NO"},{"$f":"IFERROR(VLOOKUP(F370,Tipo!$C$12:$C$27,1,FALSE),\"NO\")","v":"NO"},{"$f":"IFERROR(VLOOKUP(H370,afectacion,1,FALSE),\"NO\")","v":"NO"},{"$f":"IFERROR(VLOOKUP(I370,programa,1,FALSE),\"NO\")","v":"NO"}]
[null,null,null,null,null,null,null,null,null,{"$f":"IF(ISERROR(VLOOKUP(I371,Eje_Pilar!$C$2:$E$47,2,FALSE)),\" \",VLOOKUP(I371,Eje_Pilar!$C$2:$E$47,2,FALSE))","v":" "},{"$f":"IF(ISERROR(VLOOKUP(I371,Eje_Pilar!$C$2:$E$47,3,FALSE)),\" \",VLOOKUP(I371,Eje_Pilar!$C$2:$E$47,3,FALSE))","v":" "},null,null,null,null,null,null,null,null,{"$f":"+O371+Q371+S371","v":0},null,null,null,null,null,null,null,null,null,null,null,"-",null,{"$f":"IF(SUMPRODUCT((A$14:A371=A371)*(B$14:B371=B371)*(C$14:C371=C371))>1,0,1)","v":0},{"$f":"IFERROR(VLOOKUP(D371,tipo,1,FALSE),\"NO\")","v":"NO"},{"$f":"IFERROR(VLOOKUP(E371,modal,1,FALSE),\"NO\")","v":"NO"},{"$f":"IFERROR(VLOOKUP(F371,Tipo!$C$12:$C$27,1,FALSE),\"NO\")","v":"NO"},{"$f":"IFERROR(VLOOKUP(H371,afectacion,1,FALSE),\"NO\")","v":"NO"},{"$f":"IFERROR(VLOOKUP(I371,programa,1,FALSE),\"NO\")","v":"NO"}]
[null,null,null,null,null,null,null,null,null,{"$f":"IF(ISERROR(VLOOKUP(I372,Eje_Pilar!$C$2:$E$47,2,FALSE)),\" \",VLOOKUP(I372,Eje_Pilar!$C$2:$E$47,2,FALSE))","v":" "},{"$f":"IF(ISERROR(VLOOKUP(I372,Eje_Pilar!$C$2:$E$47,3,FALSE)),\" \",VLOOKUP(I372,Eje_Pilar!$C$2:$E$47,3,FALSE))","v":" "},null,null,null,null,null,null,null,null,0,null,null,null,null,null,null,null,null,null,null,null,"-",null,{"$f":"IF(SUMPRODUCT((A$14:A372=A372)*(B$14:B372=B372)*(C$14:C372=C372))>1,0,1)","v":0},"NO","NO",{"$f":"IFERROR(VLOOKUP(F372,Tipo!$C$12:$C$27,1,FALSE),\"NO\")","v":"NO"},"NO","NO"]
[null,null,null,null,null,null,null,null,null,{"$f":"IF(ISERROR(VLOOKUP(I373,Eje_Pilar!$C$2:$E$47,2,FALSE)),\" \",VLOOKUP(I373,Eje_Pilar!$C$2:$E$47,2,FALSE))","v":" "},{"$f":"IF(ISERROR(VLOOKUP(I373,Eje_Pilar!$C$2:$E$47,3,FALSE)),\" \",VLOOKUP(I373,Eje_Pilar!$C$2:$E$47,3,FALSE))","v":" "},null,null,null,null,null,null,null,null,0,null,null,null,null,null,null,null,null,null,null,null,"-",null,{"$f":"IF(SUMPRODUCT((A$14:A373=A373)*(B$14:B373=B373)*(C$14:C373=C373))>1,0,1)","v":0},"NO","NO",{"$f":"IFERROR(VLOOKUP(F373,Tipo!$C$12:$C$27,1,FALSE),\"NO\")","v":"NO"},"NO","NO"]
[null,null,null,null,null,null,null,null,null,{"$f":"IF(ISERROR(VLOOKUP(I374,Eje_Pilar!$C$2:$E$47,2,FALSE)),\" \",VLOOKUP(I374,Eje_Pilar!$C$2:$E$47,2,FALSE))","v":" "},{"$f":"IF(ISERROR(VLOOKUP(I374,Eje_Pilar!$C$2:$E$47,3,FALSE)),\" \",VLOOKUP(I374,Eje_Pilar!$C$2:$E$47,3,FALSE))","v":" "},null,null,null,null,null,null,null,null,0,null,null,null,null,null,null,null,null,null,null,null,"-",null,{"$f":"IF(SUMPRODUCT((A$14:A374=A374)*(B$14:B374=B374)*(C$14:C374=C374))>1,0,1)","v":0},"NO","NO",{"$f":"IFERROR(VLOOKUP(F374,Tipo!$C$12:$C$27,1,FALSE),\"NO\")","v":"NO"},"NO","NO"]
[null,null,null,null,null,null,null,null,null,{"$f":"IF(ISERROR(VLOOKUP(I375,Eje_Pilar!$C$2:$E$47,2,FALSE)),\" \",VLOOKUP(I375,Eje_Pilar!$C$2:$E$47,2,FALSE))","v":" "},{"$f":"IF(ISERROR(VLOOKUP(I375,Eje_Pilar!$C$2:$E$47,3,FALSE)),\" \",VLOOKUP(I375,Eje_Pilar!$C$2:$E$47,3,FALSE))","v":" "},null,null,null,null,null,null,null,null,0,null,null,null,null,null,null,null,null,null,null,null,"-",null,{"$f":"IF(SUMPRODUCT((A$14:A375=A375)*(B$14:B375=B375)*(C$14:C375=C375))>1,0,1)","v":0},"NO","NO",{"$f":"IFERROR(VLOOKUP(F375,Tipo!$C$12:$C$27,1,FALSE),\"NO\")","v":"NO"},"NO","NO"]
[null,null,null,null,null,null,null,null,null,{"$f":"IF(ISERROR(VLOOKUP(I376,Eje_Pilar!$C$2:$E$47,2,FALSE)),\" \",VLOOKUP(I376,Eje_Pilar!$C$2:$E$47,2,FALSE))","v":" "},{"$f":"IF(ISERROR(VLOOKUP(I376,Eje_Pilar!$C$2:$E$47,3,FALSE)),\" \",VLOOKUP(I376,Eje_Pilar!$C$2:$E$47,3,FALSE))","v":" "},null,null,null,null,null,null,null,null,0,null,null,null,null,null,null,null,null,null,null,null,"-",null,{"$f":"IF(SUMPRODUCT((A$14:A376=A376)*(B$14:B376=B376)*(C$14:C376=C376))>1,0,1)","v":0},"NO","NO",{"$f":"IFERROR(VLOOKUP(F376,Tipo!$C$12:$C$27,1,FALSE),\"NO\")","v":"NO"},"NO","NO"]
[null,null,null,null,null,null,null,null,null,{"$f":"IF(ISERROR(VLOOKUP(I377,Eje_Pilar!$C$2:$E$47,2,FALSE)),\" \",VLOOKUP(I377,Eje_Pilar!$C$2:$E$47,2,FALSE))","v":" "},{"$f":"IF(ISERROR(VLOOKUP(I377,Eje_Pilar!$C$2:$E$47,3,FALSE)),\" \",VLOOKUP(I377,Eje_Pilar!$C$2:$E$47,3,FALSE))","v":" "},null,null,null,null,null,null,null,null,0,null,null,null,null,null,null,null,null,null,null,null,"-",null,{"$f":"IF(SUMPRODUCT((A$14:A377=A377)*(B$14:B377=B377)*(C$14:C377=C377))>1,0,1)","v":0},"NO","NO",{"$f":"IFERROR(VLOOKUP(F377,Tipo!$C$12:$C$27,1,FALSE),\"NO\")","v":"NO"},"NO","NO"]
[null,null,null,null,null,null,null,null,null,{"$f":"IF(ISERROR(VLOOKUP(I378,Eje_Pilar!$C$2:$E$47,2,FALSE)),\" \",VLOOKUP(I378,Eje_Pilar!$C$2:$E$47,2,FALSE))","v":" "},{"$f":"IF(ISERROR(VLOOKUP(I378,Eje_Pilar!$C$2:$E$47,3,FALSE)),\" \",VLOOKUP(I378,Eje_Pilar!$C$2:$E$47,3,FALSE))","v":" "},null,null,null,null,null,null,null,null,0,null,null,null,null,null,null,null,null,null,null,null,"-",null,{"$f":"IF(SUMPRODUCT((A$14:A378=A378)*(B$14:B378=B378)*(C$14:C378=C378))>1,0,1)","v":0},"NO","NO",{"$f":"IFERROR(VLOOKUP(F378,Tipo!$C$12:$C$27,1,FALSE),\"NO\")","v":"NO"},"NO","NO"]
[null,null,null,null,null,null,null,null,null,{"$f":"IF(ISERROR(VLOOKUP(I379,Eje_Pilar!$C$2:$E$47,2,FALSE)),\" \",VLOOKUP(I379,Eje_Pilar!$C$2:$E$47,2,FALSE))","v":" "},{"$f":"IF(ISERROR(VLOOKUP(I379,Eje_Pilar!$C$2:$E$47,3,FALSE)),\" \",VLOOKUP(I379,Eje_Pilar!$C$2:$E$47,3,FALSE))","v":" "},null,null,null,null,null,null,null,null,0,null,null,null,null,null,null,null,null,null,null,null,"-",null,{"$f":"IF(SUMPRODUCT((A$14:A379=A379)*(B$14:B379=B379)*(C$14:C379=C379))>1,0,1)","v":0},"NO","NO",{"$f":"IFERROR(VLOOKUP(F379,Tipo!$C$12:$C$27,1,FALSE),\"NO\")","v":"NO"},"NO","NO"]
[null,null,null,null,null,null,null,null,null,{"$f":"IF(ISERROR(VLOOKUP(I380,Eje_Pilar!$C$2:$E$47,2,FALSE)),\" \",VLOOKUP(I380,Eje_Pilar!$C$2:$E$47,2,FALSE))","v":" "},{"$f":"IF(ISERROR(VLOOKUP(I380,Eje_Pilar!$C$2:$E$47,3,FALSE)),\" \",VLOOKUP(I380,Eje_Pilar!$C$2:$E$47,3,FALSE))","v":" "},null,null,null,null,null,null,null,null,0,null,null,null,null,null,null,null,null,null,null,null,"-",null,{"$f":"IF(SUMPRODUCT((A$14:A380=A380)*(B$14:B380=B380)*(C$14:C380=C380))>1,0,1)","v":0},"NO","NO",{"$f":"IFERROR(VLOOKUP(F380,Tipo!$C$12:$C$27,1,FALSE),\"NO\")","v":"NO"},"NO","NO"]
[null,null,null,null,null,null,null,null,null,{"$f":"IF(ISERROR(VLOOKUP(I381,Eje_Pilar!$C$2:$E$47,2,FALSE)),\" \",VLOOKUP(I381,Eje_Pilar!$C$2:$E$47,2,FALSE))","v":" "},{"$f":"IF(ISERROR(VLOOKUP(I381,Eje_Pilar!$C$2:$E$47,3,FALSE)),\" \",VLOOKUP(I381,Eje_Pilar!$C$2:$E$47,3,FALSE))","v":" "},null,null,null,null,null,null,null,null,0,null,null,null,null,null,null,null,null,null,null,null,"-",null,{"$f":"IF(SUMPRODUCT((A$14:A381=A381)*(B$14:B381=B381)*(C$14:C381=C381))>1,0,1)","v":0},"NO","NO",{"$f":"IFERROR(VLOOKUP(F381,Tipo!$C$12:$C$27,1,FALSE),\"NO\")","v":"NO"},"NO","NO"]
[null,null,null,null,null,null,null,null,null,{"$f":"IF(ISERROR(VLOOKUP(I382,Eje_Pilar!$C$2:$E$47,2,FALSE)),\" \",VLOOKUP(I382,Eje_Pilar!$C$2:$E$47,2,FALSE))","v":" "},{"$f":"IF(ISERROR(VLOOKUP(I382,Eje_Pilar!$C$2:$E$47,3,FALSE)),\" \",VLOOKUP(I382,Eje_Pilar!$C$2:$E$47,3,FALSE))","v":" "},null,null,null,null,null,null,null,null,0,null,null,null,null,null,null,null,null,null,null,null,"-",null,{"$f":"IF(SUMPRODUCT((A$14:A382=A382)*(B$14:B382=B382)*(C$14:C382=C382))>1,0,1)","v":0},"NO","NO",{"$f":"IFERROR(VLOOKUP(F382,Tipo!$C$12:$C$27,1,FALSE),\"NO\")","v":"NO"},"NO","NO"]
[null,null,null,null,null,null,null,null,null,{"$f":"IF(ISERROR(VLOOKUP(I383,Eje_Pilar!$C$2:$E$47,2,FALSE)),\" \",VLOOKUP(I383,Eje_Pilar!$C$2:$E$47,2,FALSE))","v":" "},{"$f":"IF(ISERROR(VLOOKUP(I383,Eje_Pilar!$C$2:$E$47,3,FALSE)),\" \",VLOOKUP(I383,Eje_Pilar!$C$2:$E$47,3,FALSE))","v":" "},null,null,null,null,null,null,null,null,0,null,null,null,null,null,null,null,null,null,null,null,"-",null,{"$f":"IF(SUMPRODUCT((A$14:A383=A383)*(B$14:B383=B383)*(C$14:C383=C383))>1,0,1)","v":0},"NO","NO",{"$f":"IFERROR(VLOOKUP(F383,Tipo!$C$12:$C$27,1,FALSE),\"NO\")","v":"NO"},"NO","NO"]
[null,null,null,null,null,null,null,null,null,{"$f":"IF(ISERROR(VLOOKUP(I384,Eje_Pilar!$C$2:$E$47,2,FALSE)),\" \",VLOOKUP(I384,Eje_Pilar!$C$2:$E$47,2,FALSE))","v":" "},{"$f":"IF(ISERROR(VLOOKUP(I384,Eje_Pilar!$C$2:$E$47,3,FALSE)),\" \",VLOOKUP(I384,Eje_Pilar!$C$2:$E$47,3,FALSE))","v":" "},null,null,null,null,null,null,null,null,0,null,null,null,null,null,null,null,null,null,null,null,"-",null,{"$f":"IF(SUMPRODUCT((A$14:A384=A384)*(B$14:B384=B384)*(C$14:C384=C384))>1,0,1)","v":0},"NO","NO",{"$f":"IFERROR(VLOOKUP(F384,Tipo!$C$12:$C$27,1,FALSE),\"NO\")","v":"NO"},"NO","NO"]
[null,null,null,null,null,null,null,null,null,{"$f":"IF(ISERROR(VLOOKUP(I385,Eje_Pilar!$C$2:$E$47,2,FALSE)),\" \",VLOOKUP(I385,Eje_Pilar!$C$2:$E$47,2,FALSE))","v":" "},{"$f":"IF(ISERROR(VLOOKUP(I385,Eje_Pilar!$C$2:$E$47,3,FALSE)),\" \",VLOOKUP(I385,Eje_Pilar!$C$2:$E$47,3,FALSE))","v":" "},null,null,null,null,null,null,null,null,0,null,null,null,null,null,null,null,null,null,null,null,"-",null,{"$f":"IF(SUMPRODUCT((A$14:A385=A385)*(B$14:B385=B385)*(C$14:C385=C385))>1,0,1)","v":0},"NO","NO",{"$f":"IFERROR(VLOOKUP(F385,Tipo!$C$12:$C$27,1,FALSE),\"NO\")","v":"NO"},"NO","NO"]
[null,null,null,null,null,null,null,null,null,{"$f":"IF(ISERROR(VLOOKUP(I386,Eje_Pilar!$C$2:$E$47,2,FALSE)),\" \",VLOOKUP(I386,Eje_Pilar!$C$2:$E$47,2,FALSE))","v":" "},{"$f":"IF(ISERROR(VLOOKUP(I386,Eje_Pilar!$C$2:$E$47,3,FALSE)),\" \",VLOOKUP(I386,Eje_Pilar!$C$2:$E$47,3,FALSE))","v":" "},null,null,null,null,null,null,null,null,0,null,null,null,null,null,null,null,null,null,null,null,"-",null,{"$f":"IF(SUMPRODUCT((A$14:A386=A386)*(B$14:B386=B386)*(C$14:C386=C386))>1,0,1)","v":0},"NO","NO",{"$f":"IFERROR(VLOOKUP(F386,Tipo!$C$12:$C$27,1,FALSE),\"NO\")","v":"NO"},"NO","NO"]
[null,null,null,null,null,null,null,null,null,{"$f":"IF(ISERROR(VLOOKUP(I387,Eje_Pilar!$C$2:$E$47,2,FALSE)),\" \",VLOOKUP(I387,Eje_Pilar!$C$2:$E$47,2,FALSE))","v":" "},{"$f":"IF(ISERROR(VLOOKUP(I387,Eje_Pilar!$C$2:$E$47,3,FALSE)),\" \",VLOOKUP(I387,Eje_Pilar!$C$2:$E$47,3,FALSE))","v":" "},null,null,null,null,null,null,null,null,0,null,null,null,null,null,null,null,null,null,null,null,"-",null,{"$f":"IF(SUMPRODUCT((A$14:A387=A387)*(B$14:B387=B387)*(C$14:C387=C387))>1,0,1)","v":0},"NO","NO",{"$f":"IFERROR(VLOOKUP(F387,Tipo!$C$12:$C$27,1,FALSE),\"NO\")","v":"NO"},"NO","NO"]
[null,null,null,null,null,null,null,null,null,{"$f":"IF(ISERROR(VLOOKUP(I388,Eje_Pilar!$C$2:$E$47,2,FALSE)),\" \",VLOOKUP(I388,Eje_Pilar!$C$2:$E$47,2,FALSE))","v":" "},{"$f":"IF(ISERROR(VLOOKUP(I388,Eje_Pilar!$C$2:$E$47,3,FALSE)),\" \",VLOOKUP(I388,Eje_Pilar!$C$2:$E$47,3,FALSE))","v":" "},null,null,null,null,null,null,null,null,0,null,null,null,null,null,null,null,null,null,null,null,"-",null,{"$f":"IF(SUMPRODUCT((A$14:A388=A388)*(B$14:B388=B388)*(C$14:C388=C388))>1,0,1)","v":0},"NO","NO",{"$f":"IFERROR(VLOOKUP(F388,Tipo!$C$12:$C$27,1,FALSE),\"NO\")","v":"NO"},"NO","NO"]
[null,null,null,null,null,null,null,null,null,{"$f":"IF(ISERROR(VLOOKUP(I389,Eje_Pilar!$C$2:$E$47,2,FALSE)),\" \",VLOOKUP(I389,Eje_Pilar!$C$2:$E$47,2,FALSE))","v":" "},{"$f":"IF(ISERROR(VLOOKUP(I389,Eje_Pilar!$C$2:$E$47,3,FALSE)),\" \",VLOOKUP(I389,Eje_Pilar!$C$2:$E$47,3,FALSE))","v":" "},null,null,null,null,null,null,null,null,0,null,null,null,null,null,null,null,null,null,null,null,"-",null,{"$f":"IF(SUMPRODUCT((A$14:A389=A389)*(B$14:B389=B389)*(C$14:C389=C389))>1,0,1)","v":0},"NO","NO",{"$f":"IFERROR(VLOOKUP(F389,Tipo!$C$12:$C$27,1,FALSE),\"NO\")","v":"NO"},"NO","NO"]
[null,null,null,null,null,null,null,null,null,{"$f":"IF(ISERROR(VLOOKUP(I390,Eje_Pilar!$C$2:$E$47,2,FALSE)),\" \",VLOOKUP(I390,Eje_Pilar!$C$2:$E$47,2,FALSE))","v":" "},{"$f":"IF(ISERROR(VLOOKUP(I390,Eje_Pilar!$C$2:$E$47,3,FALSE)),\" \",VLOOKUP(I390,Eje_Pilar!$C$2:$E$47,3,FALSE))","v":" "},null,null,null,null,null,null,null,null,0,null,null,null,null,null,null,null,null,null,null,null,"-",null,{"$f":"IF(SUMPRODUCT((A$14:A390=A390)*(B$14:B390=B390)*(C$14:C390=C390))>1,0,1)","v":0},"NO","NO",{"$f":"IFERROR(VLOOKUP(F390,Tipo!$C$12:$C$27,1,FALSE),\"NO\")","v":"NO"},"NO","NO"]
[null,null,null,null,null,null,null,null,null,{"$f":"IF(ISERROR(VLOOKUP(I391,Eje_Pilar!$C$2:$E$47,2,FALSE)),\" \",VLOOKUP(I391,Eje_Pilar!$C$2:$E$47,2,FALSE))","v":" "},{"$f":"IF(ISERROR(VLOOKUP(I391,Eje_Pilar!$C$2:$E$47,3,FALSE)),\" \",VLOOKUP(I391,Eje_Pilar!$C$2:$E$47,3,FALSE))","v":" "},null,null,null,null,null,null,null,null,0,null,null,null,null,null,null,null,null,null,null,null,"-",null,{"$f":"IF(SUMPRODUCT((A$14:A391=A391)*(B$14:B391=B391)*(C$14:C391=C391))>1,0,1)","v":0},"NO","NO",{"$f":"IFERROR(VLOOKUP(F391,Tipo!$C$12:$C$27,1,FALSE),\"NO\")","v":"NO"},"NO","NO"]
[null,null,null,null,null,null,null,null,null,{"$f":"IF(ISERROR(VLOOKUP(I392,Eje_Pilar!$C$2:$E$47,2,FALSE)),\" \",VLOOKUP(I392,Eje_Pilar!$C$2:$E$47,2,FALSE))","v":" "},{"$f":"IF(ISERROR(VLOOKUP(I392,Eje_Pilar!$C$2:$E$47,3,FALSE)),\" \",VLOOKUP(I392,Eje_Pilar!$C$2:$E$47,3,FALSE))","v":" "},null,null,null,null,null,null,null,null,0,null,null,null,null,null,null,null,null,null,null,null,"-",null,{"$f":"IF(SUMPRODUCT((A$14:A392=A392)*(B$14:B392=B392)*(C$14:C392=C392))>1,0,1)","v":0},"NO","NO",{"$f":"IFERROR(VLOOKUP(F392,Tipo!$C$12:$C$27,1,FALSE),\"NO\")","v":"NO"},"NO","NO"]
[null,null,null,null,null,null,null,null,null,{"$f":"IF(ISERROR(VLOOKUP(I393,Eje_Pilar!$C$2:$E$47,2,FALSE)),\" \",VLOOKUP(I393,Eje_Pilar!$C$2:$E$47,2,FALSE))","v":" "},{"$f":"IF(ISERROR(VLOOKUP(I393,Eje_Pilar!$C$2:$E$47,3,FALSE)),\" \",VLOOKUP(I393,Eje_Pilar!$C$2:$E$47,3,FALSE))","v":" "},null,null,null,null,null,null,null,null,0,null,null,null,null,null,null,null,null,null,null,null,"-",null,{"$f":"IF(SUMPRODUCT((A$14:A393=A393)*(B$14:B393=B393)*(C$14:C393=C393))>1,0,1)","v":0},"NO","NO",{"$f":"IFERROR(VLOOKUP(F393,Tipo!$C$12:$C$27,1,FALSE),\"NO\")","v":"NO"},"NO","NO"]
[null,null,null,null,null,null,null,null,null,{"$f":"IF(ISERROR(VLOOKUP(I394,Eje_Pilar!$C$2:$E$47,2,FALSE)),\" \",VLOOKUP(I394,Eje_Pilar!$C$2:$E$47,2,FALSE))","v":" "},{"$f":"IF(ISERROR(VLOOKUP(I394,Eje_Pilar!$C$2:$E$47,3,FALSE)),\" \",VLOOKUP(I394,Eje_Pilar!$C$2:$E$47,3,FALSE))","v":" "},null,null,null,null,null,null,null,null,0,null,null,null,null,null,null,null,null,null,null,null,"-",null,{"$f":"IF(SUMPRODUCT((A$14:A394=A394)*(B$14:B394=B394)*(C$14:C394=C394))>1,0,1)","v":0},"NO","NO",{"$f":"IFERROR(VLOOKUP(F394,Tipo!$C$12:$C$27,1,FALSE),\"NO\")","v":"NO"},"NO","NO"]
[null,null,null,null,null,null,null,null,null,{"$f":"IF(ISERROR(VLOOKUP(I395,Eje_Pilar!$C$2:$E$47,2,FALSE)),\" \",VLOOKUP(I395,Eje_Pilar!$C$2:$E$47,2,FALSE))","v":" "},{"$f":"IF(ISERROR(VLOOKUP(I395,Eje_Pilar!$C$2:$E$47,3,FALSE)),\" \",VLOOKUP(I395,Eje_Pilar!$C$2:$E$47,3,FALSE))","v":" "},null,null,null,null,null,null,null,null,0,null,null,null,null,null,null,null,null,null,null,null,"-",null,{"$f":"IF(SUMPRODUCT((A$14:A395=A395)*(B$14:B395=B395)*(C$14:C395=C395))>1,0,1)","v":0},"NO","NO",{"$f":"IFERROR(VLOOKUP(F395,Tipo!$C$12:$C$27,1,FALSE),\"NO\")","v":"NO"},"NO","NO"]
[null,null,null,null,null,null,null,null,null,{"$f":"IF(ISERROR(VLOOKUP(I396,Eje_Pilar!$C$2:$E$47,2,FALSE)),\" \",VLOOKUP(I396,Eje_Pilar!$C$2:$E$47,2,FALSE))","v":" "},{"$f":"IF(ISERROR(VLOOKUP(I396,Eje_Pilar!$C$2:$E$47,3,FALSE)),\" \",VLOOKUP(I396,Eje_Pilar!$C$2:$E$47,3,FALSE))","v":" "},null,null,null,null,null,null,null,null,0,null,null,null,null,null,null,null,null,null,null,null,"-",null,{"$f":"IF(SUMPRODUCT((A$14:A396=A396)*(B$14:B396=B396)*(C$14:C396=C396))>1,0,1)","v":0},"NO","NO",{"$f":"IFERROR(VLOOKUP(F396,Tipo!$C$12:$C$27,1,FALSE),\"NO\")","v":"NO"},"NO","NO"]
[null,null,null,null,null,null,null,null,null,{"$f":"IF(ISERROR(VLOOKUP(I397,Eje_Pilar!$C$2:$E$47,2,FALSE)),\" \",VLOOKUP(I397,Eje_Pilar!$C$2:$E$47,2,FALSE))","v":" "},{"$f":"IF(ISERROR(VLOOKUP(I397,Eje_Pilar!$C$2:$E$47,3,FALSE)),\" \",VLOOKUP(I397,Eje_Pilar!$C$2:$E$47,3,FALSE))","v":" "},null,null,null,null,null,null,null,null,0,null,null,null,null,null,null,null,null,null,null,null,"-",null,{"$f":"IF(SUMPRODUCT((A$14:A397=A397)*(B$14:B397=B397)*(C$14:C397=C397))>1,0,1)","v":0},"NO","NO",{"$f":"IFERROR(VLOOKUP(F397,Tipo!$C$12:$C$27,1,FALSE),\"NO\")","v":"NO"},"NO","NO"]
[null,null,null,null,null,null,null,null,null,{"$f":"IF(ISERROR(VLOOKUP(I398,Eje_Pilar!$C$2:$E$47,2,FALSE)),\" \",VLOOKUP(I398,Eje_Pilar!$C$2:$E$47,2,FALSE))","v":" "},{"$f":"IF(ISERROR(VLOOKUP(I398,Eje_Pilar!$C$2:$E$47,3,FALSE)),\" \",VLOOKUP(I398,Eje_Pilar!$C$2:$E$47,3,FALSE))","v":" "},null,null,null,null,null,null,null,null,0,null,null,null,null,null,null,null,null,null,null,null,"-",null,{"$f":"IF(SUMPRODUCT((A$14:A398=A398)*(B$14:B398=B398)*(C$14:C398=C398))>1,0,1)","v":0},"NO","NO",{"$f":"IFERROR(VLOOKUP(F398,Tipo!$C$12:$C$27,1,FALSE),\"NO\")","v":"NO"},"NO","NO"]
[null,null,null,null,null,null,null,null,null,{"$f":"IF(ISERROR(VLOOKUP(I399,Eje_Pilar!$C$2:$E$47,2,FALSE)),\" \",VLOOKUP(I399,Eje_Pilar!$C$2:$E$47,2,FALSE))","v":" "},{"$f":"IF(ISERROR(VLOOKUP(I399,Eje_Pilar!$C$2:$E$47,3,FALSE)),\" \",VLOOKUP(I399,Eje_Pilar!$C$2:$E$47,3,FALSE))","v":" "},null,null,null,null,null,null,null,null,0,null,null,null,null,null,null,null,null,null,null,null,"-",null,{"$f":"IF(SUMPRODUCT((A$14:A399=A399)*(B$14:B399=B399)*(C$14:C399=C399))>1,0,1)","v":0},"NO","NO",{"$f":"IFERROR(VLOOKUP(F399,Tipo!$C$12:$C$27,1,FALSE),\"NO\")","v":"NO"},"NO","NO"]
[null,null,null,null,null,null,null,null,null,{"$f":"IF(ISERROR(VLOOKUP(I400,Eje_Pilar!$C$2:$E$47,2,FALSE)),\" \",VLOOKUP(I400,Eje_Pilar!$C$2:$E$47,2,FALSE))","v":" "},{"$f":"IF(ISERROR(VLOOKUP(I400,Eje_Pilar!$C$2:$E$47,3,FALSE)),\" \",VLOOKUP(I400,Eje_Pilar!$C$2:$E$47,3,FALSE))","v":" "},null,null,null,null,null,null,null,null,0,null,null,null,null,null,null,null,null,null,null,null,{"$f":"IF(ISERROR(U400/T400),\"-\",(U400/T400))","v":"-"},null,{"$f":"IF(SUMPRODUCT((A$14:A400=A400)*(B$14:B400=B400)*(C$14:C400=C400))>1,0,1)","v":0},"NO","NO",{"$f":"IFERROR(VLOOKUP(F400,Tipo!$C$12:$C$27,1,FALSE),\"NO\")","v":"NO"},"NO","NO"]
[null,null,null,null,null,null,null,null,null,{"$f":"IF(ISERROR(VLOOKUP(I401,Eje_Pilar!$C$2:$E$47,2,FALSE)),\" \",VLOOKUP(I401,Eje_Pilar!$C$2:$E$47,2,FALSE))","v":" "},{"$f":"IF(ISERROR(VLOOKUP(I401,Eje_Pilar!$C$2:$E$47,3,FALSE)),\" \",VLOOKUP(I401,Eje_Pilar!$C$2:$E$47,3,FALSE))","v":" "},null,null,null,null,null,null,null,null,0,null,null,null,null,null,null,null,null,null,null,null,"-",null,{"$f":"IF(SUMPRODUCT((A$14:A401=A401)*(B$14:B401=B401)*(C$14:C401=C401))>1,0,1)","v":0},"NO","NO",{"$f":"IFERROR(VLOOKUP(F401,Tipo!$C$12:$C$27,1,FALSE),\"NO\")","v":"NO"},"NO","NO"]
[null,null,null,null,null,null,null,null,null,{"$f":"IF(ISERROR(VLOOKUP(I402,Eje_Pilar!$C$2:$E$47,2,FALSE)),\" \",VLOOKUP(I402,Eje_Pilar!$C$2:$E$47,2,FALSE))","v":" "},{"$f":"IF(ISERROR(VLOOKUP(I402,Eje_Pilar!$C$2:$E$47,3,FALSE)),\" \",VLOOKUP(I402,Eje_Pilar!$C$2:$E$47,3,FALSE))","v":" "},null,null,null,null,null,null,null,null,0,null,null,null,null,null,null,null,null,null,null,null,"-",null,{"$f":"IF(SUMPRODUCT((A$14:A402=A402)*(B$14:B402=B402)*(C$14:C402=C402))>1,0,1)","v":0},"NO","NO",{"$f":"IFERROR(VLOOKUP(F402,Tipo!$C$12:$C$27,1,FALSE),\"NO\")","v":"NO"},"NO","NO"]
[null,null,null,null,null,null,null,null,null,{"$f":"IF(ISERROR(VLOOKUP(I403,Eje_Pilar!$C$2:$E$47,2,FALSE)),\" \",VLOOKUP(I403,Eje_Pilar!$C$2:$E$47,2,FALSE))","v":" "},{"$f":"IF(ISERROR(VLOOKUP(I403,Eje_Pilar!$C$2:$E$47,3,FALSE)),\" \",VLOOKUP(I403,Eje_Pilar!$C$2:$E$47,3,FALSE))","v":" "},null,null,null,null,null,null,null,null,0,null,null,null,null,null,null,null,null,null,null,null,"-",null,{"$f":"IF(SUMPRODUCT((A$14:A403=A403)*(B$14:B403=B403)*(C$14:C403=C403))>1,0,1)","v":0},"NO","NO",{"$f":"IFERROR(VLOOKUP(F403,Tipo!$C$12:$C$27,1,FALSE),\"NO\")","v":"NO"},"NO","NO"]
[null,null,null,null,null,null,null,null,null,{"$f":"IF(ISERROR(VLOOKUP(I404,Eje_Pilar!$C$2:$E$47,2,FALSE)),\" \",VLOOKUP(I404,Eje_Pilar!$C$2:$E$47,2,FALSE))","v":" "},{"$f":"IF(ISERROR(VLOOKUP(I404,Eje_Pilar!$C$2:$E$47,3,FALSE)),\" \",VLOOKUP(I404,Eje_Pilar!$C$2:$E$47,3,FALSE))","v":" "},null,null,null,null,null,null,null,null,0,null,null,null,null,null,null,null,null,null,null,null,"-",null,{"$f":"IF(SUMPRODUCT((A$14:A404=A404)*(B$14:B404=B404)*(C$14:C404=C404))>1,0,1)","v":0},"NO","NO",{"$f":"IFERROR(VLOOKUP(F404,Tipo!$C$12:$C$27,1,FALSE),\"NO\")","v":"NO"},"NO","NO"]
[null,null,null,null,null,null,null,null,null,{"$f":"IF(ISERROR(VLOOKUP(I405,Eje_Pilar!$C$2:$E$47,2,FALSE)),\" \",VLOOKUP(I405,Eje_Pilar!$C$2:$E$47,2,FALSE))","v":" "},{"$f":"IF(ISERROR(VLOOKUP(I405,Eje_Pilar!$C$2:$E$47,3,FALSE)),\" \",VLOOKUP(I405,Eje_Pilar!$C$2:$E$47,3,FALSE))","v":" "},null,null,null,null,null,null,null,null,0,null,null,null,null,null,null,null,null,null,null,null,"-",null,{"$f":"IF(SUMPRODUCT((A$14:A405=A405)*(B$14:B405=B405)*(C$14:C405=C405))>1,0,1)","v":0},"NO","NO",{"$f":"IFERROR(VLOOKUP(F405,Tipo!$C$12:$C$27,1,FALSE),\"NO\")","v":"NO"},"NO","NO"]
[null,null,null,null,null,null,null,null,null,{"$f":"IF(ISERROR(VLOOKUP(I406,Eje_Pilar!$C$2:$E$47,2,FALSE)),\" \",VLOOKUP(I406,Eje_Pilar!$C$2:$E$47,2,FALSE))","v":" "},{"$f":"IF(ISERROR(VLOOKUP(I406,Eje_Pilar!$C$2:$E$47,3,FALSE)),\" \",VLOOKUP(I406,Eje_Pilar!$C$2:$E$47,3,FALSE))","v":" "},null,null,null,null,null,null,null,null,0,null,null,null,null,null,null,null,null,null,null,null,"-",null,{"$f":"IF(SUMPRODUCT((A$14:A406=A406)*(B$14:B406=B406)*(C$14:C406=C406))>1,0,1)","v":0},"NO","NO",{"$f":"IFERROR(VLOOKUP(F406,Tipo!$C$12:$C$27,1,FALSE),\"NO\")","v":"NO"},"NO","NO"]
[null,null,null,null,null,null,null,null,null,{"$f":"IF(ISERROR(VLOOKUP(I407,Eje_Pilar!$C$2:$E$47,2,FALSE)),\" \",VLOOKUP(I407,Eje_Pilar!$C$2:$E$47,2,FALSE))","v":" "},{"$f":"IF(ISERROR(VLOOKUP(I407,Eje_Pilar!$C$2:$E$47,3,FALSE)),\" \",VLOOKUP(I407,Eje_Pilar!$C$2:$E$47,3,FALSE))","v":" "},null,null,null,null,null,null,null,null,0,null,null,null,null,null,null,null,null,null,null,null,"-",null,{"$f":"IF(SUMPRODUCT((A$14:A407=A407)*(B$14:B407=B407)*(C$14:C407=C407))>1,0,1)","v":0},"NO","NO",{"$f":"IFERROR(VLOOKUP(F407,Tipo!$C$12:$C$27,1,FALSE),\"NO\")","v":"NO"},"NO","NO"]
[null,null,null,null,null,null,null,null,null,{"$f":"IF(ISERROR(VLOOKUP(I408,Eje_Pilar!$C$2:$E$47,2,FALSE)),\" \",VLOOKUP(I408,Eje_Pilar!$C$2:$E$47,2,FALSE))","v":" "},{"$f":"IF(ISERROR(VLOOKUP(I408,Eje_Pilar!$C$2:$E$47,3,FALSE)),\" \",VLOOKUP(I408,Eje_Pilar!$C$2:$E$47,3,FALSE))","v":" "},null,null,null,null,null,null,null,null,0,null,null,null,null,null,null,null,null,null,null,null,"-",null,{"$f":"IF(SUMPRODUCT((A$14:A408=A408)*(B$14:B408=B408)*(C$14:C408=C408))>1,0,1)","v":0},"NO","NO",{"$f":"IFERROR(VLOOKUP(F408,Tipo!$C$12:$C$27,1,FALSE),\"NO\")","v":"NO"},"NO","NO"]
[null,null,null,null,null,null,null,null,null,{"$f":"IF(ISERROR(VLOOKUP(I409,Eje_Pilar!$C$2:$E$47,2,FALSE)),\" \",VLOOKUP(I409,Eje_Pilar!$C$2:$E$47,2,FALSE))","v":" "},{"$f":"IF(ISERROR(VLOOKUP(I409,Eje_Pilar!$C$2:$E$47,3,FALSE)),\" \",VLOOKUP(I409,Eje_Pilar!$C$2:$E$47,3,FALSE))","v":" "},null,null,null,null,null,null,null,null,0,null,null,null,null,null,null,null,null,null,null,null,"-",null,{"$f":"IF(SUMPRODUCT((A$14:A409=A409)*(B$14:B409=B409)*(C$14:C409=C409))>1,0,1)","v":0},"NO","NO",{"$f":"IFERROR(VLOOKUP(F409,Tipo!$C$12:$C$27,1,FALSE),\"NO\")","v":"NO"},"NO","NO"]
[null,null,null,null,null,null,null,null,null,{"$f":"IF(ISERROR(VLOOKUP(I410,Eje_Pilar!$C$2:$E$47,2,FALSE)),\" \",VLOOKUP(I410,Eje_Pilar!$C$2:$E$47,2,FALSE))","v":" "},{"$f":"IF(ISERROR(VLOOKUP(I410,Eje_Pilar!$C$2:$E$47,3,FALSE)),\" \",VLOOKUP(I410,Eje_Pilar!$C$2:$E$47,3,FALSE))","v":" "},null,null,null,null,null,null,null,null,0,null,null,null,null,null,null,null,null,null,null,null,"-",null,{"$f":"IF(SUMPRODUCT((A$14:A410=A410)*(B$14:B410=B410)*(C$14:C410=C410))>1,0,1)","v":0},"NO","NO",{"$f":"IFERROR(VLOOKUP(F410,Tipo!$C$12:$C$27,1,FALSE),\"NO\")","v":"NO"},"NO","NO"]
[null,null,null,null,null,null,null,null,null,{"$f":"IF(ISERROR(VLOOKUP(I411,Eje_Pilar!$C$2:$E$47,2,FALSE)),\" \",VLOOKUP(I411,Eje_Pilar!$C$2:$E$47,2,FALSE))","v":" "},{"$f":"IF(ISERROR(VLOOKUP(I411,Eje_Pilar!$C$2:$E$47,3,FALSE)),\" \",VLOOKUP(I411,Eje_Pilar!$C$2:$E$47,3,FALSE))","v":" "},null,null,null,null,null,null,null,null,0,null,null,null,null,null,null,null,null,null,null,null,"-",null,{"$f":"IF(SUMPRODUCT((A$14:A411=A411)*(B$14:B411=B411)*(C$14:C411=C411))>1,0,1)","v":0},"NO","NO",{"$f":"IFERROR(VLOOKUP(F411,Tipo!$C$12:$C$27,1,FALSE),\"NO\")","v":"NO"},"NO","NO"]
[null,null,null,null,null,null,null,null,null,{"$f":"IF(ISERROR(VLOOKUP(I412,Eje_Pilar!$C$2:$E$47,2,FALSE)),\" \",VLOOKUP(I412,Eje_Pilar!$C$2:$E$47,2,FALSE))","v":" "},{"$f":"IF(ISERROR(VLOOKUP(I412,Eje_Pilar!$C$2:$E$47,3,FALSE)),\" \",VLOOKUP(I412,Eje_Pilar!$C$2:$E$47,3,FALSE))","v":" "},null,null,null,null,null,null,null,null,0,null,null,null,null,null,null,null,null,null,null,null,"-",null,{"$f":"IF(SUMPRODUCT((A$14:A412=A412)*(B$14:B412=B412)*(C$14:C412=C412))>1,0,1)","v":0},"NO","NO",{"$f":"IFERROR(VLOOKUP(F412,Tipo!$C$12:$C$27,1,FALSE),\"NO\")","v":"NO"},"NO","NO"]
[null,null,null,null,null,null,null,null,null,{"$f":"IF(ISERROR(VLOOKUP(I413,Eje_Pilar!$C$2:$E$47,2,FALSE)),\" \",VLOOKUP(I413,Eje_Pilar!$C$2:$E$47,2,FALSE))","v":" "},{"$f":"IF(ISERROR(VLOOKUP(I413,Eje_Pilar!$C$2:$E$47,3,FALSE)),\" \",VLOOKUP(I413,Eje_Pilar!$C$2:$E$47,3,FALSE))","v":" "},null,null,null,null,null,null,null,null,0,null,null,null,null,null,null,null,null,null,null,null,"-",null,{"$f":"IF(SUMPRODUCT((A$14:A413=A413)*(B$14:B413=B413)*(C$14:C413=C413))>1,0,1)","v":0},"NO","NO",{"$f":"IFERROR(VLOOKUP(F413,Tipo!$C$12:$C$27,1,FALSE),\"NO\")","v":"NO"},"NO","NO"]
[null,null,null,null,null,null,null,null,null,{"$f":"IF(ISERROR(VLOOKUP(I414,Eje_Pilar!$C$2:$E$47,2,FALSE)),\" \",VLOOKUP(I414,Eje_Pilar!$C$2:$E$47,2,FALSE))","v":" "},{"$f":"IF(ISERROR(VLOOKUP(I414,Eje_Pilar!$C$2:$E$47,3,FALSE)),\" \",VLOOKUP(I414,Eje_Pilar!$C$2:$E$47,3,FALSE))","v":" "},null,null,null,null,null,null,null,null,0,null,null,null,null,null,null,null,null,null,null,null,"-",null,{"$f":"IF(SUMPRODUCT((A$14:A414=A414)*(B$14:B414=B414)*(C$14:C414=C414))>1,0,1)","v":0},"NO","NO",{"$f":"IFERROR(VLOOKUP(F414,Tipo!$C$12:$C$27,1,FALSE),\"NO\")","v":"NO"},"NO","NO"]
[null,null,null,null,null,null,null,null,null,{"$f":"IF(ISERROR(VLOOKUP(I415,Eje_Pilar!$C$2:$E$47,2,FALSE)),\" \",VLOOKUP(I415,Eje_Pilar!$C$2:$E$47,2,FALSE))","v":" "},{"$f":"IF(ISERROR(VLOOKUP(I415,Eje_Pilar!$C$2:$E$47,3,FALSE)),\" \",VLOOKUP(I415,Eje_Pilar!$C$2:$E$47,3,FALSE))","v":" "},null,null,null,null,null,null,null,null,0,null,null,null,null,null,null,null,null,null,null,null,"-",null,{"$f":"IF(SUMPRODUCT((A$14:A415=A415)*(B$14:B415=B415)*(C$14:C415=C415))>1,0,1)","v":0},"NO","NO",{"$f":"IFERROR(VLOOKUP(F415,Tipo!$C$12:$C$27,1,FALSE),\"NO\")","v":"NO"},"NO","NO"]
[null,null,null,null,null,null,null,null,null,{"$f":"IF(ISERROR(VLOOKUP(I416,Eje_Pilar!$C$2:$E$47,2,FALSE)),\" \",VLOOKUP(I416,Eje_Pilar!$C$2:$E$47,2,FALSE))","v":" "},{"$f":"IF(ISERROR(VLOOKUP(I416,Eje_Pilar!$C$2:$E$47,3,FALSE)),\" \",VLOOKUP(I416,Eje_Pilar!$C$2:$E$47,3,FALSE))","v":" "},null,null,null,null,null,null,null,null,0,null,null,null,null,null,null,null,null,null,null,null,"-",null,{"$f":"IF(SUMPRODUCT((A$14:A416=A416)*(B$14:B416=B416)*(C$14:C416=C416))>1,0,1)","v":0},"NO","NO",{"$f":"IFERROR(VLOOKUP(F416,Tipo!$C$12:$C$27,1,FALSE),\"NO\")","v":"NO"},"NO","NO"]
[null,null,null,null,null,null,null,null,null,{"$f":"IF(ISERROR(VLOOKUP(I417,Eje_Pilar!$C$2:$E$47,2,FALSE)),\" \",VLOOKUP(I417,Eje_Pilar!$C$2:$E$47,2,FALSE))","v":" "},{"$f":"IF(ISERROR(VLOOKUP(I417,Eje_Pilar!$C$2:$E$47,3,FALSE)),\" \",VLOOKUP(I417,Eje_Pilar!$C$2:$E$47,3,FALSE))","v":" "},null,null,null,null,null,null,null,null,0,null,null,null,null,null,null,null,null,null,null,null,"-",null,{"$f":"IF(SUMPRODUCT((A$14:A417=A417)*(B$14:B417=B417)*(C$14:C417=C417))>1,0,1)","v":0},"NO","NO",{"$f":"IFERROR(VLOOKUP(F417,Tipo!$C$12:$C$27,1,FALSE),\"NO\")","v":"NO"},"NO","NO"]
[null,null,null,null,null,null,null,null,null,{"$f":"IF(ISERROR(VLOOKUP(I418,Eje_Pilar!$C$2:$E$47,2,FALSE)),\" \",VLOOKUP(I418,Eje_Pilar!$C$2:$E$47,2,FALSE))","v":" "},{"$f":"IF(ISERROR(VLOOKUP(I418,Eje_Pilar!$C$2:$E$47,3,FALSE)),\" \",VLOOKUP(I418,Eje_Pilar!$C$2:$E$47,3,FALSE))","v":" "},null,null,null,null,null,null,null,null,0,null,null,null,null,null,null,null,null,null,null,null,"-",null,{"$f":"IF(SUMPRODUCT((A$14:A418=A418)*(B$14:B418=B418)*(C$14:C418=C418))>1,0,1)","v":0},"NO","NO",{"$f":"IFERROR(VLOOKUP(F418,Tipo!$C$12:$C$27,1,FALSE),\"NO\")","v":"NO"},"NO","NO"]
[null,null,null,null,null,null,null,null,null,{"$f":"IF(ISERROR(VLOOKUP(I419,Eje_Pilar!$C$2:$E$47,2,FALSE)),\" \",VLOOKUP(I419,Eje_Pilar!$C$2:$E$47,2,FALSE))","v":" "},{"$f":"IF(ISERROR(VLOOKUP(I419,Eje_Pilar!$C$2:$E$47,3,FALSE)),\" \",VLOOKUP(I419,Eje_Pilar!$C$2:$E$47,3,FALSE))","v":" "},null,null,null,null,null,null,null,null,0,null,null,null,null,null,null,null,null,null,null,null,"-",null,{"$f":"IF(SUMPRODUCT((A$14:A419=A419)*(B$14:B419=B419)*(C$14:C419=C419))>1,0,1)","v":0},"NO","NO",{"$f":"IFERROR(VLOOKUP(F419,Tipo!$C$12:$C$27,1,FALSE),\"NO\")","v":"NO"},"NO","NO"]
[null,null,null,null,null,null,null,null,null,{"$f":"IF(ISERROR(VLOOKUP(I420,Eje_Pilar!$C$2:$E$47,2,FALSE)),\" \",VLOOKUP(I420,Eje_Pilar!$C$2:$E$47,2,FALSE))","v":" "},{"$f":"IF(ISERROR(VLOOKUP(I420,Eje_Pilar!$C$2:$E$47,3,FALSE)),\" \",VLOOKUP(I420,Eje_Pilar!$C$2:$E$47,3,FALSE))","v":" "},null,null,null,null,null,null,null,null,0,null,null,null,null,null,null,null,null,null,null,null,"-",null,{"$f":"IF(SUMPRODUCT((A$14:A420=A420)*(B$14:B420=B420)*(C$14:C420=C420))>1,0,1)","v":0},"NO","NO",{"$f":"IFERROR(VLOOKUP(F420,Tipo!$C$12:$C$27,1,FALSE),\"NO\")","v":"NO"},"NO","NO"]
[null,null,null,null,null,null,null,null,null,{"$f":"IF(ISERROR(VLOOKUP(I421,Eje_Pilar!$C$2:$E$47,2,FALSE)),\" \",VLOOKUP(I421,Eje_Pilar!$C$2:$E$47,2,FALSE))","v":" "},{"$f":"IF(ISERROR(VLOOKUP(I421,Eje_Pilar!$C$2:$E$47,3,FALSE)),\" \",VLOOKUP(I421,Eje_Pilar!$C$2:$E$47,3,FALSE))","v":" "},null,null,null,null,null,null,null,null,0,null,null,null,null,null,null,null,null,null,null,null,"-",null,{"$f":"IF(SUMPRODUCT((A$14:A421=A421)*(B$14:B421=B421)*(C$14:C421=C421))>1,0,1)","v":0},"NO","NO",{"$f":"IFERROR(VLOOKUP(F421,Tipo!$C$12:$C$27,1,FALSE),\"NO\")","v":"NO"},"NO","NO"]
[null,null,null,null,null,null,null,null,null,{"$f":"IF(ISERROR(VLOOKUP(I422,Eje_Pilar!$C$2:$E$47,2,FALSE)),\" \",VLOOKUP(I422,Eje_Pilar!$C$2:$E$47,2,FALSE))","v":" "},{"$f":"IF(ISERROR(VLOOKUP(I422,Eje_Pilar!$C$2:$E$47,3,FALSE)),\" \",VLOOKUP(I422,Eje_Pilar!$C$2:$E$47,3,FALSE))","v":" "},null,null,null,null,null,null,null,null,0,null,null,null,null,null,null,null,null,null,null,null,"-",null,{"$f":"IF(SUMPRODUCT((A$14:A422=A422)*(B$14:B422=B422)*(C$14:C422=C422))>1,0,1)","v":0},"NO","NO",{"$f":"IFERROR(VLOOKUP(F422,Tipo!$C$12:$C$27,1,FALSE),\"NO\")","v":"NO"},"NO","NO"]
[null,null,null,null,null,null,null,null,null,{"$f":"IF(ISERROR(VLOOKUP(I423,Eje_Pilar!$C$2:$E$47,2,FALSE)),\" \",VLOOKUP(I423,Eje_Pilar!$C$2:$E$47,2,FALSE))","v":" "},{"$f":"IF(ISERROR(VLOOKUP(I423,Eje_Pilar!$C$2:$E$47,3,FALSE)),\" \",VLOOKUP(I423,Eje_Pilar!$C$2:$E$47,3,FALSE))","v":" "},null,null,null,null,null,null,null,null,0,null,null,null,null,null,null,null,null,null,null,null,"-",null,{"$f":"IF(SUMPRODUCT((A$14:A423=A423)*(B$14:B423=B423)*(C$14:C423=C423))>1,0,1)","v":0},"NO","NO",{"$f":"IFERROR(VLOOKUP(F423,Tipo!$C$12:$C$27,1,FALSE),\"NO\")","v":"NO"},"NO","NO"]
[null,null,null,null,null,null,null,null,null,{"$f":"IF(ISERROR(VLOOKUP(I424,Eje_Pilar!$C$2:$E$47,2,FALSE)),\" \",VLOOKUP(I424,Eje_Pilar!$C$2:$E$47,2,FALSE))","v":" "},{"$f":"IF(ISERROR(VLOOKUP(I424,Eje_Pilar!$C$2:$E$47,3,FALSE)),\" \",VLOOKUP(I424,Eje_Pilar!$C$2:$E$47,3,FALSE))","v":" "},null,null,null,null,null,null,null,null,0,null,null,null,null,null,null,null,null,null,null,null,"-",null,{"$f":"IF(SUMPRODUCT((A$14:A424=A424)*(B$14:B424=B424)*(C$14:C424=C424))>1,0,1)","v":0},"NO","NO",{"$f":"IFERROR(VLOOKUP(F424,Tipo!$C$12:$C$27,1,FALSE),\"NO\")","v":"NO"},"NO","NO"]
[null,null,null,null,null,null,null,null,null,{"$f":"IF(ISERROR(VLOOKUP(I425,Eje_Pilar!$C$2:$E$47,2,FALSE)),\" \",VLOOKUP(I425,Eje_Pilar!$C$2:$E$47,2,FALSE))","v":" "},{"$f":"IF(ISERROR(VLOOKUP(I425,Eje_Pilar!$C$2:$E$47,3,FALSE)),\" \",VLOOKUP(I425,Eje_Pilar!$C$2:$E$47,3,FALSE))","v":" "},null,null,null,null,null,null,null,null,0,null,null,null,null,null,null,null,null,null,null,null,"-",null,{"$f":"IF(SUMPRODUCT((A$14:A425=A425)*(B$14:B425=B425)*(C$14:C425=C425))>1,0,1)","v":0},"NO","NO",{"$f":"IFERROR(VLOOKUP(F425,Tipo!$C$12:$C$27,1,FALSE),\"NO\")","v":"NO"},"NO","NO"]
[null,null,null,null,null,null,null,null,null,{"$f":"IF(ISERROR(VLOOKUP(I426,Eje_Pilar!$C$2:$E$47,2,FALSE)),\" \",VLOOKUP(I426,Eje_Pilar!$C$2:$E$47,2,FALSE))","v":" "},{"$f":"IF(ISERROR(VLOOKUP(I426,Eje_Pilar!$C$2:$E$47,3,FALSE)),\" \",VLOOKUP(I426,Eje_Pilar!$C$2:$E$47,3,FALSE))","v":" "},null,null,null,null,null,null,null,null,0,null,null,null,null,null,null,null,null,null,null,null,"-",null,{"$f":"IF(SUMPRODUCT((A$14:A426=A426)*(B$14:B426=B426)*(C$14:C426=C426))>1,0,1)","v":0},"NO","NO",{"$f":"IFERROR(VLOOKUP(F426,Tipo!$C$12:$C$27,1,FALSE),\"NO\")","v":"NO"},"NO","NO"]
[null,null,null,null,null,null,null,null,null,{"$f":"IF(ISERROR(VLOOKUP(I427,Eje_Pilar!$C$2:$E$47,2,FALSE)),\" \",VLOOKUP(I427,Eje_Pilar!$C$2:$E$47,2,FALSE))","v":" "},{"$f":"IF(ISERROR(VLOOKUP(I427,Eje_Pilar!$C$2:$E$47,3,FALSE)),\" \",VLOOKUP(I427,Eje_Pilar!$C$2:$E$47,3,FALSE))","v":" "},null,null,null,null,null,null,null,null,0,null,null,null,null,null,null,null,null,null,null,null,"-",null,{"$f":"IF(SUMPRODUCT((A$14:A427=A427)*(B$14:B427=B427)*(C$14:C427=C427))>1,0,1)","v":0},"NO","NO",{"$f":"IFERROR(VLOOKUP(F427,Tipo!$C$12:$C$27,1,FALSE),\"NO\")","v":"NO"},"NO","NO"]
[null,null,null,null,null,null,null,null,null,{"$f":"IF(ISERROR(VLOOKUP(I428,Eje_Pilar!$C$2:$E$47,2,FALSE)),\" \",VLOOKUP(I428,Eje_Pilar!$C$2:$E$47,2,FALSE))","v":" "},{"$f":"IF(ISERROR(VLOOKUP(I428,Eje_Pilar!$C$2:$E$47,3,FALSE)),\" \",VLOOKUP(I428,Eje_Pilar!$C$2:$E$47,3,FALSE))","v":" "},null,null,null,null,null,null,null,null,0,null,null,null,null,null,null,null,null,null,null,null,"-",null,{"$f":"IF(SUMPRODUCT((A$14:A428=A428)*(B$14:B428=B428)*(C$14:C428=C428))>1,0,1)","v":0},"NO","NO",{"$f":"IFERROR(VLOOKUP(F428,Tipo!$C$12:$C$27,1,FALSE),\"NO\")","v":"NO"},"NO","NO"]
[null,null,null,null,null,null,null,null,null,{"$f":"IF(ISERROR(VLOOKUP(I429,Eje_Pilar!$C$2:$E$47,2,FALSE)),\" \",VLOOKUP(I429,Eje_Pilar!$C$2:$E$47,2,FALSE))","v":" "},{"$f":"IF(ISERROR(VLOOKUP(I429,Eje_Pilar!$C$2:$E$47,3,FALSE)),\" \",VLOOKUP(I429,Eje_Pilar!$C$2:$E$47,3,FALSE))","v":" "},null,null,null,null,null,null,null,null,0,null,null,null,null,null,null,null,null,null,null,null,"-",null,{"$f":"IF(SUMPRODUCT((A$14:A429=A429)*(B$14:B429=B429)*(C$14:C429=C429))>1,0,1)","v":0},"NO","NO",{"$f":"IFERROR(VLOOKUP(F429,Tipo!$C$12:$C$27,1,FALSE),\"NO\")","v":"NO"},"NO","NO"]
[null,null,null,null,null,null,null,null,null,{"$f":"IF(ISERROR(VLOOKUP(I430,Eje_Pilar!$C$2:$E$47,2,FALSE)),\" \",VLOOKUP(I430,Eje_Pilar!$C$2:$E$47,2,FALSE))","v":" "},{"$f":"IF(ISERROR(VLOOKUP(I430,Eje_Pilar!$C$2:$E$47,3,FALSE)),\" \",VLOOKUP(I430,Eje_Pilar!$C$2:$E$47,3,FALSE))","v":" "},null,null,null,null,null,null,null,null,0,null,null,null,null,null,null,null,null,null,null,null,"-",null,{"$f":"IF(SUMPRODUCT((A$14:A430=A430)*(B$14:B430=B430)*(C$14:C430=C430))>1,0,1)","v":0},"NO","NO",{"$f":"IFERROR(VLOOKUP(F430,Tipo!$C$12:$C$27,1,FALSE),\"NO\")","v":"NO"},"NO","NO"]
[null,null,null,null,null,null,null,null,null,{"$f":"IF(ISERROR(VLOOKUP(I431,Eje_Pilar!$C$2:$E$47,2,FALSE)),\" \",VLOOKUP(I431,Eje_Pilar!$C$2:$E$47,2,FALSE))","v":" "},{"$f":"IF(ISERROR(VLOOKUP(I431,Eje_Pilar!$C$2:$E$47,3,FALSE)),\" \",VLOOKUP(I431,Eje_Pilar!$C$2:$E$47,3,FALSE))","v":" "},null,null,null,null,null,null,null,null,0,null,null,null,null,null,null,null,null,null,null,null,"-",null,{"$f":"IF(SUMPRODUCT((A$14:A431=A431)*(B$14:B431=B431)*(C$14:C431=C431))>1,0,1)","v":0},"NO","NO",{"$f":"IFERROR(VLOOKUP(F431,Tipo!$C$12:$C$27,1,FALSE),\"NO\")","v":"NO"},"NO","NO"]
[null,null,null,null,null,null,null,null,null,{"$f":"IF(ISERROR(VLOOKUP(I432,Eje_Pilar!$C$2:$E$47,2,FALSE)),\" \",VLOOKUP(I432,Eje_Pilar!$C$2:$E$47,2,FALSE))","v":" "},{"$f":"IF(ISERROR(VLOOKUP(I432,Eje_Pilar!$C$2:$E$47,3,FALSE)),\" \",VLOOKUP(I432,Eje_Pilar!$C$2:$E$47,3,FALSE))","v":" "},null,null,null,null,null,null,null,null,0,null,null,null,null,null,null,null,null,null,null,null,"-",null,{"$f":"IF(SUMPRODUCT((A$14:A432=A432)*(B$14:B432=B432)*(C$14:C432=C432))>1,0,1)","v":0},"NO","NO",{"$f":"IFERROR(VLOOKUP(F432,Tipo!$C$12:$C$27,1,FALSE),\"NO\")","v":"NO"},"NO","NO"]
[null,null,null,null,null,null,null,null,null,{"$f":"IF(ISERROR(VLOOKUP(I433,Eje_Pilar!$C$2:$E$47,2,FALSE)),\" \",VLOOKUP(I433,Eje_Pilar!$C$2:$E$47,2,FALSE))","v":" "},{"$f":"IF(ISERROR(VLOOKUP(I433,Eje_Pilar!$C$2:$E$47,3,FALSE)),\" \",VLOOKUP(I433,Eje_Pilar!$C$2:$E$47,3,FALSE))","v":" "},null,null,null,null,null,null,null,null,0,null,null,null,null,null,null,null,null,null,null,null,"-",null,{"$f":"IF(SUMPRODUCT((A$14:A433=A433)*(B$14:B433=B433)*(C$14:C433=C433))>1,0,1)","v":0},"NO","NO",{"$f":"IFERROR(VLOOKUP(F433,Tipo!$C$12:$C$27,1,FALSE),\"NO\")","v":"NO"},"NO","NO"]
[null,null,null,null,null,null,null,null,null,{"$f":"IF(ISERROR(VLOOKUP(I434,Eje_Pilar!$C$2:$E$47,2,FALSE)),\" \",VLOOKUP(I434,Eje_Pilar!$C$2:$E$47,2,FALSE))","v":" "},{"$f":"IF(ISERROR(VLOOKUP(I434,Eje_Pilar!$C$2:$E$47,3,FALSE)),\" \",VLOOKUP(I434,Eje_Pilar!$C$2:$E$47,3,FALSE))","v":" "},null,null,null,null,null,null,null,null,0,null,null,null,null,null,null,null,null,null,null,null,"-",null,{"$f":"IF(SUMPRODUCT((A$14:A434=A434)*(B$14:B434=B434)*(C$14:C434=C434))>1,0,1)","v":0},"NO","NO",{"$f":"IFERROR(VLOOKUP(F434,Tipo!$C$12:$C$27,1,FALSE),\"NO\")","v":"NO"},"NO","NO"]
[null,null,null,null,null,null,null,null,null,{"$f":"IF(ISERROR(VLOOKUP(I435,Eje_Pilar!$C$2:$E$47,2,FALSE)),\" \",VLOOKUP(I435,Eje_Pilar!$C$2:$E$47,2,FALSE))","v":" "},{"$f":"IF(ISERROR(VLOOKUP(I435,Eje_Pilar!$C$2:$E$47,3,FALSE)),\" \",VLOOKUP(I435,Eje_Pilar!$C$2:$E$47,3,FALSE))","v":" "},null,null,null,null,null,null,null,null,{"$f":"+O435+Q435+S435","v":0},null,null,null,null,null,null,null,null,null,null,null,"-",null,{"$f":"IF(SUMPRODUCT((A$14:A435=A435)*(B$14:B435=B435)*(C$14:C435=C435))>1,0,1)","v":0},{"$f":"IFERROR(VLOOKUP(D435,tipo,1,FALSE),\"NO\")","v":"NO"},{"$f":"IFERROR(VLOOKUP(E435,modal,1,FALSE),\"NO\")","v":"NO"},{"$f":"IFERROR(VLOOKUP(F435,Tipo!$C$12:$C$27,1,FALSE),\"NO\")","v":"NO"},{"$f":"IFERROR(VLOOKUP(H435,afectacion,1,FALSE),\"NO\")","v":"NO"},{"$f":"IFERROR(VLOOKUP(I435,programa,1,FALSE),\"NO\")","v":"NO"}]
[null,null,null,null,null,null,null,null,null,{"$f":"IF(ISERROR(VLOOKUP(I436,Eje_Pilar!$C$2:$E$47,2,FALSE)),\" \",VLOOKUP(I436,Eje_Pilar!$C$2:$E$47,2,FALSE))","v":" "},{"$f":"IF(ISERROR(VLOOKUP(I436,Eje_Pilar!$C$2:$E$47,3,FALSE)),\" \",VLOOKUP(I436,Eje_Pilar!$C$2:$E$47,3,FALSE))","v":" "},null,null,null,null,null,null,null,null,0,null,null,null,null,null,null,null,null,null,null,null,"-",null,{"$f":"IF(SUMPRODUCT((A$14:A436=A436)*(B$14:B436=B436)*(C$14:C436=C436))>1,0,1)","v":0},"NO","NO",{"$f":"IFERROR(VLOOKUP(F436,Tipo!$C$12:$C$27,1,FALSE),\"NO\")","v":"NO"},"NO","NO"]
[null,null,null,null,null,null,null,null,null,{"$f":"IF(ISERROR(VLOOKUP(I437,Eje_Pilar!$C$2:$E$47,2,FALSE)),\" \",VLOOKUP(I437,Eje_Pilar!$C$2:$E$47,2,FALSE))","v":" "},{"$f":"IF(ISERROR(VLOOKUP(I437,Eje_Pilar!$C$2:$E$47,3,FALSE)),\" \",VLOOKUP(I437,Eje_Pilar!$C$2:$E$47,3,FALSE))","v":" "},null,null,null,null,null,null,null,null,0,null,null,null,null,null,null,null,null,null,null,null,"-",null,{"$f":"IF(SUMPRODUCT((A$14:A437=A437)*(B$14:B437=B437)*(C$14:C437=C437))>1,0,1)","v":0},"NO","NO",{"$f":"IFERROR(VLOOKUP(F437,Tipo!$C$12:$C$27,1,FALSE),\"NO\")","v":"NO"},"NO","NO"]
[null,null,null,null,null,null,null,null,null,{"$f":"IF(ISERROR(VLOOKUP(I438,Eje_Pilar!$C$2:$E$47,2,FALSE)),\" \",VLOOKUP(I438,Eje_Pilar!$C$2:$E$47,2,FALSE))","v":" "},{"$f":"IF(ISERROR(VLOOKUP(I438,Eje_Pilar!$C$2:$E$47,3,FALSE)),\" \",VLOOKUP(I438,Eje_Pilar!$C$2:$E$47,3,FALSE))","v":" "},null,null,null,null,null,null,null,null,0,null,null,null,null,null,null,null,null,null,null,null,"-",null,{"$f":"IF(SUMPRODUCT((A$14:A438=A438)*(B$14:B438=B438)*(C$14:C438=C438))>1,0,1)","v":0},"NO","NO",{"$f":"IFERROR(VLOOKUP(F438,Tipo!$C$12:$C$27,1,FALSE),\"NO\")","v":"NO"},"NO","NO"]
[null,null,null,null,null,null,null,null,null,{"$f":"IF(ISERROR(VLOOKUP(I439,Eje_Pilar!$C$2:$E$47,2,FALSE)),\" \",VLOOKUP(I439,Eje_Pilar!$C$2:$E$47,2,FALSE))","v":" "},{"$f":"IF(ISERROR(VLOOKUP(I439,Eje_Pilar!$C$2:$E$47,3,FALSE)),\" \",VLOOKUP(I439,Eje_Pilar!$C$2:$E$47,3,FALSE))","v":" "},null,null,null,null,null,null,null,null,0,null,null,null,null,null,null,null,null,null,null,null,"-",null,{"$f":"IF(SUMPRODUCT((A$14:A439=A439)*(B$14:B439=B439)*(C$14:C439=C439))>1,0,1)","v":0},"NO","NO",{"$f":"IFERROR(VLOOKUP(F439,Tipo!$C$12:$C$27,1,FALSE),\"NO\")","v":"NO"},"NO","NO"]
[null,null,null,null,null,null,null,null,null,{"$f":"IF(ISERROR(VLOOKUP(I440,Eje_Pilar!$C$2:$E$47,2,FALSE)),\" \",VLOOKUP(I440,Eje_Pilar!$C$2:$E$47,2,FALSE))","v":" "},{"$f":"IF(ISERROR(VLOOKUP(I440,Eje_Pilar!$C$2:$E$47,3,FALSE)),\" \",VLOOKUP(I440,Eje_Pilar!$C$2:$E$47,3,FALSE))","v":" "},null,null,null,null,null,null,null,null,0,null,null,null,null,null,null,null,null,null,null,null,"-",null,{"$f":"IF(SUMPRODUCT((A$14:A440=A440)*(B$14:B440=B440)*(C$14:C440=C440))>1,0,1)","v":0},"NO","NO",{"$f":"IFERROR(VLOOKUP(F440,Tipo!$C$12:$C$27,1,FALSE),\"NO\")","v":"NO"},"NO","NO"]
[null,null,null,null,null,null,null,null,null,{"$f":"IF(ISERROR(VLOOKUP(I441,Eje_Pilar!$C$2:$E$47,2,FALSE)),\" \",VLOOKUP(I441,Eje_Pilar!$C$2:$E$47,2,FALSE))","v":" "},{"$f":"IF(ISERROR(VLOOKUP(I441,Eje_Pilar!$C$2:$E$47,3,FALSE)),\" \",VLOOKUP(I441,Eje_Pilar!$C$2:$E$47,3,FALSE))","v":" "},null,null,null,null,null,null,null,null,0,null,null,null,null,null,null,null,null,null,null,null,"-",null,{"$f":"IF(SUMPRODUCT((A$14:A441=A441)*(B$14:B441=B441)*(C$14:C441=C441))>1,0,1)","v":0},"NO","NO",{"$f":"IFERROR(VLOOKUP(F441,Tipo!$C$12:$C$27,1,FALSE),\"NO\")","v":"NO"},"NO","NO"]
[null,null,null,null,null,null,null,null,null,{"$f":"IF(ISERROR(VLOOKUP(I442,Eje_Pilar!$C$2:$E$47,2,FALSE)),\" \",VLOOKUP(I442,Eje_Pilar!$C$2:$E$47,2,FALSE))","v":" "},{"$f":"IF(ISERROR(VLOOKUP(I442,Eje_Pilar!$C$2:$E$47,3,FALSE)),\" \",VLOOKUP(I442,Eje_Pilar!$C$2:$E$47,3,FALSE))","v":" "},null,null,null,null,null,null,null,null,0,null,null,null,null,null,null,null,null,null,null,null,"-",null,{"$f":"IF(SUMPRODUCT((A$14:A442=A442)*(B$14:B442=B442)*(C$14:C442=C442))>1,0,1)","v":0},"NO","NO",{"$f":"IFERROR(VLOOKUP(F442,Tipo!$C$12:$C$27,1,FALSE),\"NO\")","v":"NO"},"NO","NO"]
[null,null,null,null,null,null,null,null,null,{"$f":"IF(ISERROR(VLOOKUP(I443,Eje_Pilar!$C$2:$E$47,2,FALSE)),\" \",VLOOKUP(I443,Eje_Pilar!$C$2:$E$47,2,FALSE))","v":" "},{"$f":"IF(ISERROR(VLOOKUP(I443,Eje_Pilar!$C$2:$E$47,3,FALSE)),\" \",VLOOKUP(I443,Eje_Pilar!$C$2:$E$47,3,FALSE))","v":" "},null,null,null,null,null,null,null,null,0,null,null,null,null,null,null,null,null,null,null,null,"-",null,{"$f":"IF(SUMPRODUCT((A$14:A443=A443)*(B$14:B443=B443)*(C$14:C443=C443))>1,0,1)","v":0},"NO","NO",{"$f":"IFERROR(VLOOKUP(F443,Tipo!$C$12:$C$27,1,FALSE),\"NO\")","v":"NO"},"NO","NO"]
[null,null,null,null,null,null,null,null,null,{"$f":"IF(ISERROR(VLOOKUP(I444,Eje_Pilar!$C$2:$E$47,2,FALSE)),\" \",VLOOKUP(I444,Eje_Pilar!$C$2:$E$47,2,FALSE))","v":" "},{"$f":"IF(ISERROR(VLOOKUP(I444,Eje_Pilar!$C$2:$E$47,3,FALSE)),\" \",VLOOKUP(I444,Eje_Pilar!$C$2:$E$47,3,FALSE))","v":" "},null,null,null,null,null,null,null,null,0,null,null,null,null,null,null,null,null,null,null,null,"-",null,{"$f":"IF(SUMPRODUCT((A$14:A444=A444)*(B$14:B444=B444)*(C$14:C444=C444))>1,0,1)","v":0},"NO","NO",{"$f":"IFERROR(VLOOKUP(F444,Tipo!$C$12:$C$27,1,FALSE),\"NO\")","v":"NO"},"NO","NO"]
[null,null,null,null,null,null,null,null,null,{"$f":"IF(ISERROR(VLOOKUP(I445,Eje_Pilar!$C$2:$E$47,2,FALSE)),\" \",VLOOKUP(I445,Eje_Pilar!$C$2:$E$47,2,FALSE))","v":" "},{"$f":"IF(ISERROR(VLOOKUP(I445,Eje_Pilar!$C$2:$E$47,3,FALSE)),\" \",VLOOKUP(I445,Eje_Pilar!$C$2:$E$47,3,FALSE))","v":" "},null,null,null,null,null,null,null,null,0,null,null,null,null,null,null,null,null,null,null,null,"-",null,{"$f":"IF(SUMPRODUCT((A$14:A445=A445)*(B$14:B445=B445)*(C$14:C445=C445))>1,0,1)","v":0},"NO","NO",{"$f":"IFERROR(VLOOKUP(F445,Tipo!$C$12:$C$27,1,FALSE),\"NO\")","v":"NO"},"NO","NO"]
[null,null,null,null,null,null,null,null,null,{"$f":"IF(ISERROR(VLOOKUP(I446,Eje_Pilar!$C$2:$E$47,2,FALSE)),\" \",VLOOKUP(I446,Eje_Pilar!$C$2:$E$47,2,FALSE))","v":" "},{"$f":"IF(ISERROR(VLOOKUP(I446,Eje_Pilar!$C$2:$E$47,3,FALSE)),\" \",VLOOKUP(I446,Eje_Pilar!$C$2:$E$47,3,FALSE))","v":" "},null,null,null,null,null,null,null,null,0,null,null,null,null,null,null,null,null,null,null,null,"-",null,{"$f":"IF(SUMPRODUCT((A$14:A446=A446)*(B$14:B446=B446)*(C$14:C446=C446))>1,0,1)","v":0},"NO","NO",{"$f":"IFERROR(VLOOKUP(F446,Tipo!$C$12:$C$27,1,FALSE),\"NO\")","v":"NO"},"NO","NO"]
[null,null,null,null,null,null,null,null,null,{"$f":"IF(ISERROR(VLOOKUP(I447,Eje_Pilar!$C$2:$E$47,2,FALSE)),\" \",VLOOKUP(I447,Eje_Pilar!$C$2:$E$47,2,FALSE))","v":" "},{"$f":"IF(ISERROR(VLOOKUP(I447,Eje_Pilar!$C$2:$E$47,3,FALSE)),\" \",VLOOKUP(I447,Eje_Pilar!$C$2:$E$47,3,FALSE))","v":" "},null,null,null,null,null,null,null,null,0,null,null,null,null,null,null,null,null,null,null,null,"-",null,{"$f":"IF(SUMPRODUCT((A$14:A447=A447)*(B$14:B447=B447)*(C$14:C447=C447))>1,0,1)","v":0},"NO","NO",{"$f":"IFERROR(VLOOKUP(F447,Tipo!$C$12:$C$27,1,FALSE),\"NO\")","v":"NO"},"NO","NO"]
[null,null,null,null,null,null,null,null,null,{"$f":"IF(ISERROR(VLOOKUP(I448,Eje_Pilar!$C$2:$E$47,2,FALSE)),\" \",VLOOKUP(I448,Eje_Pilar!$C$2:$E$47,2,FALSE))","v":" "},{"$f":"IF(ISERROR(VLOOKUP(I448,Eje_Pilar!$C$2:$E$47,3,FALSE)),\" \",VLOOKUP(I448,Eje_Pilar!$C$2:$E$47,3,FALSE))","v":" "},null,null,null,null,null,null,null,null,0,null,null,null,null,null,null,null,null,null,null,null,"-",null,{"$f":"IF(SUMPRODUCT((A$14:A448=A448)*(B$14:B448=B448)*(C$14:C448=C448))>1,0,1)","v":0},"NO","NO",{"$f":"IFERROR(VLOOKUP(F448,Tipo!$C$12:$C$27,1,FALSE),\"NO\")","v":"NO"},"NO","NO"]
[null,null,null,null,null,null,null,null,null,{"$f":"IF(ISERROR(VLOOKUP(I449,Eje_Pilar!$C$2:$E$47,2,FALSE)),\" \",VLOOKUP(I449,Eje_Pilar!$C$2:$E$47,2,FALSE))","v":" "},{"$f":"IF(ISERROR(VLOOKUP(I449,Eje_Pilar!$C$2:$E$47,3,FALSE)),\" \",VLOOKUP(I449,Eje_Pilar!$C$2:$E$47,3,FALSE))","v":" "},null,null,null,null,null,null,null,null,0,null,null,null,null,null,null,null,null,null,null,null,"-",null,{"$f":"IF(SUMPRODUCT((A$14:A449=A449)*(B$14:B449=B449)*(C$14:C449=C449))>1,0,1)","v":0},"NO","NO",{"$f":"IFERROR(VLOOKUP(F449,Tipo!$C$12:$C$27,1,FALSE),\"NO\")","v":"NO"},"NO","NO"]
[null,null,null,null,null,null,null,null,null,{"$f":"IF(ISERROR(VLOOKUP(I450,Eje_Pilar!$C$2:$E$47,2,FALSE)),\" \",VLOOKUP(I450,Eje_Pilar!$C$2:$E$47,2,FALSE))","v":" "},{"$f":"IF(ISERROR(VLOOKUP(I450,Eje_Pilar!$C$2:$E$47,3,FALSE)),\" \",VLOOKUP(I450,Eje_Pilar!$C$2:$E$47,3,FALSE))","v":" "},null,null,null,null,null,null,null,null,0,null,null,null,null,null,null,null,null,null,null,null,"-",null,{"$f":"IF(SUMPRODUCT((A$14:A450=A450)*(B$14:B450=B450)*(C$14:C450=C450))>1,0,1)","v":0},"NO","NO",{"$f":"IFERROR(VLOOKUP(F450,Tipo!$C$12:$C$27,1,FALSE),\"NO\")","v":"NO"},"NO","NO"]
[null,null,null,null,null,null,null,null,null,{"$f":"IF(ISERROR(VLOOKUP(I451,Eje_Pilar!$C$2:$E$47,2,FALSE)),\" \",VLOOKUP(I451,Eje_Pilar!$C$2:$E$47,2,FALSE))","v":" "},{"$f":"IF(ISERROR(VLOOKUP(I451,Eje_Pilar!$C$2:$E$47,3,FALSE)),\" \",VLOOKUP(I451,Eje_Pilar!$C$2:$E$47,3,FALSE))","v":" "},null,null,null,null,null,null,null,null,0,null,null,null,null,null,null,null,null,null,null,null,"-",null,{"$f":"IF(SUMPRODUCT((A$14:A451=A451)*(B$14:B451=B451)*(C$14:C451=C451))>1,0,1)","v":0},"NO","NO",{"$f":"IFERROR(VLOOKUP(F451,Tipo!$C$12:$C$27,1,FALSE),\"NO\")","v":"NO"},"NO","NO"]
[null,null,null,null,null,null,null,null,null,{"$f":"IF(ISERROR(VLOOKUP(I452,Eje_Pilar!$C$2:$E$47,2,FALSE)),\" \",VLOOKUP(I452,Eje_Pilar!$C$2:$E$47,2,FALSE))","v":" "},{"$f":"IF(ISERROR(VLOOKUP(I452,Eje_Pilar!$C$2:$E$47,3,FALSE)),\" \",VLOOKUP(I452,Eje_Pilar!$C$2:$E$47,3,FALSE))","v":" "},null,null,null,null,null,null,null,null,0,null,null,null,null,null,null,null,null,null,null,null,"-",null,{"$f":"IF(SUMPRODUCT((A$14:A452=A452)*(B$14:B452=B452)*(C$14:C452=C452))>1,0,1)","v":0},"NO","NO",{"$f":"IFERROR(VLOOKUP(F452,Tipo!$C$12:$C$27,1,FALSE),\"NO\")","v":"NO"},"NO","NO"]
[null,null,null,null,null,null,null,null,null,{"$f":"IF(ISERROR(VLOOKUP(I453,Eje_Pilar!$C$2:$E$47,2,FALSE)),\" \",VLOOKUP(I453,Eje_Pilar!$C$2:$E$47,2,FALSE))","v":" "},{"$f":"IF(ISERROR(VLOOKUP(I453,Eje_Pilar!$C$2:$E$47,3,FALSE)),\" \",VLOOKUP(I453,Eje_Pilar!$C$2:$E$47,3,FALSE))","v":" "},null,null,null,null,null,null,null,null,0,null,null,null,null,null,null,null,null,null,null,null,"-",null,{"$f":"IF(SUMPRODUCT((A$14:A453=A453)*(B$14:B453=B453)*(C$14:C453=C453))>1,0,1)","v":0},"NO","NO",{"$f":"IFERROR(VLOOKUP(F453,Tipo!$C$12:$C$27,1,FALSE),\"NO\")","v":"NO"},"NO","NO"]
[null,null,null,null,null,null,null,null,null,{"$f":"IF(ISERROR(VLOOKUP(I454,Eje_Pilar!$C$2:$E$47,2,FALSE)),\" \",VLOOKUP(I454,Eje_Pilar!$C$2:$E$47,2,FALSE))","v":" "},{"$f":"IF(ISERROR(VLOOKUP(I454,Eje_Pilar!$C$2:$E$47,3,FALSE)),\" \",VLOOKUP(I454,Eje_Pilar!$C$2:$E$47,3,FALSE))","v":" "},null,null,null,null,null,null,null,null,0,null,null,null,null,null,null,null,null,null,null,null,"-",null,{"$f":"IF(SUMPRODUCT((A$14:A454=A454)*(B$14:B454=B454)*(C$14:C454=C454))>1,0,1)","v":0},"NO","NO",{"$f":"IFERROR(VLOOKUP(F454,Tipo!$C$12:$C$27,1,FALSE),\"NO\")","v":"NO"},"NO","NO"]
[null,null,null,null,null,null,null,null,null,{"$f":"IF(ISERROR(VLOOKUP(I455,Eje_Pilar!$C$2:$E$47,2,FALSE)),\" \",VLOOKUP(I455,Eje_Pilar!$C$2:$E$47,2,FALSE))","v":" "},{"$f":"IF(ISERROR(VLOOKUP(I455,Eje_Pilar!$C$2:$E$47,3,FALSE)),\" \",VLOOKUP(I455,Eje_Pilar!$C$2:$E$47,3,FALSE))","v":" "},null,null,null,null,null,null,null,null,0,null,null,null,null,null,null,null,null,null,null,null,"-",null,{"$f":"IF(SUMPRODUCT((A$14:A455=A455)*(B$14:B455=B455)*(C$14:C455=C455))>1,0,1)","v":0},"NO","NO",{"$f":"IFERROR(VLOOKUP(F455,Tipo!$C$12:$C$27,1,FALSE),\"NO\")","v":"NO"},"NO","NO"]
[null,null,null,null,null,null,null,null,null,{"$f":"IF(ISERROR(VLOOKUP(I456,Eje_Pilar!$C$2:$E$47,2,FALSE)),\" \",VLOOKUP(I456,Eje_Pilar!$C$2:$E$47,2,FALSE))","v":" "},{"$f":"IF(ISERROR(VLOOKUP(I456,Eje_Pilar!$C$2:$E$47,3,FALSE)),\" \",VLOOKUP(I456,Eje_Pilar!$C$2:$E$47,3,FALSE))","v":" "},null,null,null,null,null,null,null,null,0,null,null,null,null,null,null,null,null,null,null,null,"-",null,{"$f":"IF(SUMPRODUCT((A$14:A456=A456)*(B$14:B456=B456)*(C$14:C456=C456))>1,0,1)","v":0},"NO","NO",{"$f":"IFERROR(VLOOKUP(F456,Tipo!$C$12:$C$27,1,FALSE),\"NO\")","v":"NO"},"NO","NO"]
[null,null,null,null,null,null,null,null,null,{"$f":"IF(ISERROR(VLOOKUP(I457,Eje_Pilar!$C$2:$E$47,2,FALSE)),\" \",VLOOKUP(I457,Eje_Pilar!$C$2:$E$47,2,FALSE))","v":" "},{"$f":"IF(ISERROR(VLOOKUP(I457,Eje_Pilar!$C$2:$E$47,3,FALSE)),\" \",VLOOKUP(I457,Eje_Pilar!$C$2:$E$47,3,FALSE))","v":" "},null,null,null,null,null,null,null,null,0,null,null,null,null,null,null,null,null,null,null,null,"-",null,{"$f":"IF(SUMPRODUCT((A$14:A457=A457)*(B$14:B457=B457)*(C$14:C457=C457))>1,0,1)","v":0},"NO","NO",{"$f":"IFERROR(VLOOKUP(F457,Tipo!$C$12:$C$27,1,FALSE),\"NO\")","v":"NO"},"NO","NO"]
[null,null,null,null,null,null,null,null,null,{"$f":"IF(ISERROR(VLOOKUP(I458,Eje_Pilar!$C$2:$E$47,2,FALSE)),\" \",VLOOKUP(I458,Eje_Pilar!$C$2:$E$47,2,FALSE))","v":" "},{"$f":"IF(ISERROR(VLOOKUP(I458,Eje_Pilar!$C$2:$E$47,3,FALSE)),\" \",VLOOKUP(I458,Eje_Pilar!$C$2:$E$47,3,FALSE))","v":" "},null,null,null,null,null,null,null,null,0,null,null,null,null,null,null,null,null,null,null,null,"-",null,{"$f":"IF(SUMPRODUCT((A$14:A458=A458)*(B$14:B458=B458)*(C$14:C458=C458))>1,0,1)","v":0},"NO","NO",{"$f":"IFERROR(VLOOKUP(F458,Tipo!$C$12:$C$27,1,FALSE),\"NO\")","v":"NO"},"NO","NO"]
[null,null,null,null,null,null,null,null,null,{"$f":"IF(ISERROR(VLOOKUP(I459,Eje_Pilar!$C$2:$E$47,2,FALSE)),\" \",VLOOKUP(I459,Eje_Pilar!$C$2:$E$47,2,FALSE))","v":" "},{"$f":"IF(ISERROR(VLOOKUP(I459,Eje_Pilar!$C$2:$E$47,3,FALSE)),\" \",VLOOKUP(I459,Eje_Pilar!$C$2:$E$47,3,FALSE))","v":" "},null,null,null,null,null,null,null,null,0,null,null,null,null,null,null,null,null,null,null,null,"-",null,{"$f":"IF(SUMPRODUCT((A$14:A459=A459)*(B$14:B459=B459)*(C$14:C459=C459))>1,0,1)","v":0},"NO","NO",{"$f":"IFERROR(VLOOKUP(F459,Tipo!$C$12:$C$27,1,FALSE),\"NO\")","v":"NO"},"NO","NO"]
[null,null,null,null,null,null,null,null,null,{"$f":"IF(ISERROR(VLOOKUP(I460,Eje_Pilar!$C$2:$E$47,2,FALSE)),\" \",VLOOKUP(I460,Eje_Pilar!$C$2:$E$47,2,FALSE))","v":" "},{"$f":"IF(ISERROR(VLOOKUP(I460,Eje_Pilar!$C$2:$E$47,3,FALSE)),\" \",VLOOKUP(I460,Eje_Pilar!$C$2:$E$47,3,FALSE))","v":" "},null,null,null,null,null,null,null,null,0,null,null,null,null,null,null,null,null,null,null,null,"-",null,{"$f":"IF(SUMPRODUCT((A$14:A460=A460)*(B$14:B460=B460)*(C$14:C460=C460))>1,0,1)","v":0},"NO","NO",{"$f":"IFERROR(VLOOKUP(F460,Tipo!$C$12:$C$27,1,FALSE),\"NO\")","v":"NO"},"NO","NO"]
[null,null,null,null,null,null,null,null,null,{"$f":"IF(ISERROR(VLOOKUP(I461,Eje_Pilar!$C$2:$E$47,2,FALSE)),\" \",VLOOKUP(I461,Eje_Pilar!$C$2:$E$47,2,FALSE))","v":" "},{"$f":"IF(ISERROR(VLOOKUP(I461,Eje_Pilar!$C$2:$E$47,3,FALSE)),\" \",VLOOKUP(I461,Eje_Pilar!$C$2:$E$47,3,FALSE))","v":" "},null,null,null,null,null,null,null,null,0,null,null,null,null,null,null,null,null,null,null,null,"-",null,{"$f":"IF(SUMPRODUCT((A$14:A461=A461)*(B$14:B461=B461)*(C$14:C461=C461))>1,0,1)","v":0},"NO","NO",{"$f":"IFERROR(VLOOKUP(F461,Tipo!$C$12:$C$27,1,FALSE),\"NO\")","v":"NO"},"NO","NO"]
[null,null,null,null,null,null,null,null,null,{"$f":"IF(ISERROR(VLOOKUP(I462,Eje_Pilar!$C$2:$E$47,2,FALSE)),\" \",VLOOKUP(I462,Eje_Pilar!$C$2:$E$47,2,FALSE))","v":" "},{"$f":"IF(ISERROR(VLOOKUP(I462,Eje_Pilar!$C$2:$E$47,3,FALSE)),\" \",VLOOKUP(I462,Eje_Pilar!$C$2:$E$47,3,FALSE))","v":" "},null,null,null,null,null,null,null,null,0,null,null,null,null,null,null,null,null,null,null,null,"-",null,{"$f":"IF(SUMPRODUCT((A$14:A462=A462)*(B$14:B462=B462)*(C$14:C462=C462))>1,0,1)","v":0},"NO","NO",{"$f":"IFERROR(VLOOKUP(F462,Tipo!$C$12:$C$27,1,FALSE),\"NO\")","v":"NO"},"NO","NO"]
[null,null,null,null,null,null,null,null,null,{"$f":"IF(ISERROR(VLOOKUP(I463,Eje_Pilar!$C$2:$E$47,2,FALSE)),\" \",VLOOKUP(I463,Eje_Pilar!$C$2:$E$47,2,FALSE))","v":" "},{"$f":"IF(ISERROR(VLOOKUP(I463,Eje_Pilar!$C$2:$E$47,3,FALSE)),\" \",VLOOKUP(I463,Eje_Pilar!$C$2:$E$47,3,FALSE))","v":" "},null,null,null,null,null,null,null,null,0,null,null,null,null,null,null,null,null,null,null,null,"-",null,{"$f":"IF(SUMPRODUCT((A$14:A463=A463)*(B$14:B463=B463)*(C$14:C463=C463))>1,0,1)","v":0},"NO","NO",{"$f":"IFERROR(VLOOKUP(F463,Tipo!$C$12:$C$27,1,FALSE),\"NO\")","v":"NO"},"NO","NO"]
[null,null,null,null,null,null,null,null,null,{"$f":"IF(ISERROR(VLOOKUP(I464,Eje_Pilar!$C$2:$E$47,2,FALSE)),\" \",VLOOKUP(I464,Eje_Pilar!$C$2:$E$47,2,FALSE))","v":" "},{"$f":"IF(ISERROR(VLOOKUP(I464,Eje_Pilar!$C$2:$E$47,3,FALSE)),\" \",VLOOKUP(I464,Eje_Pilar!$C$2:$E$47,3,FALSE))","v":" "},null,null,null,null,null,null,null,null,0,null,null,null,null,null,null,null,null,null,null,null,{"$f":"IF(ISERROR(U464/T464),\"-\",(U464/T464))","v":"-"},null,{"$f":"IF(SUMPRODUCT((A$14:A464=A464)*(B$14:B464=B464)*(C$14:C464=C464))>1,0,1)","v":0},"NO","NO",{"$f":"IFERROR(VLOOKUP(F464,Tipo!$C$12:$C$27,1,FALSE),\"NO\")","v":"NO"},"NO","NO"]
[null,null,null,null,null,null,null,null,null,{"$f":"IF(ISERROR(VLOOKUP(I465,Eje_Pilar!$C$2:$E$47,2,FALSE)),\" \",VLOOKUP(I465,Eje_Pilar!$C$2:$E$47,2,FALSE))","v":" "},{"$f":"IF(ISERROR(VLOOKUP(I465,Eje_Pilar!$C$2:$E$47,3,FALSE)),\" \",VLOOKUP(I465,Eje_Pilar!$C$2:$E$47,3,FALSE))","v":" "},null,null,null,null,null,null,null,null,0,null,null,null,null,null,null,null,null,null,null,null,"-",null,{"$f":"IF(SUMPRODUCT((A$14:A465=A465)*(B$14:B465=B465)*(C$14:C465=C465))>1,0,1)","v":0},"NO","NO",{"$f":"IFERROR(VLOOKUP(F465,Tipo!$C$12:$C$27,1,FALSE),\"NO\")","v":"NO"},"NO","NO"]
[null,null,null,null,null,null,null,null,null,{"$f":"IF(ISERROR(VLOOKUP(I466,Eje_Pilar!$C$2:$E$47,2,FALSE)),\" \",VLOOKUP(I466,Eje_Pilar!$C$2:$E$47,2,FALSE))","v":" "},{"$f":"IF(ISERROR(VLOOKUP(I466,Eje_Pilar!$C$2:$E$47,3,FALSE)),\" \",VLOOKUP(I466,Eje_Pilar!$C$2:$E$47,3,FALSE))","v":" "},null,null,null,null,null,null,null,null,0,null,null,null,null,null,null,null,null,null,null,null,"-",null,{"$f":"IF(SUMPRODUCT((A$14:A466=A466)*(B$14:B466=B466)*(C$14:C466=C466))>1,0,1)","v":0},"NO","NO",{"$f":"IFERROR(VLOOKUP(F466,Tipo!$C$12:$C$27,1,FALSE),\"NO\")","v":"NO"},"NO","NO"]
[null,null,null,null,null,null,null,null,null,{"$f":"IF(ISERROR(VLOOKUP(I467,Eje_Pilar!$C$2:$E$47,2,FALSE)),\" \",VLOOKUP(I467,Eje_Pilar!$C$2:$E$47,2,FALSE))","v":" "},{"$f":"IF(ISERROR(VLOOKUP(I467,Eje_Pilar!$C$2:$E$47,3,FALSE)),\" \",VLOOKUP(I467,Eje_Pilar!$C$2:$E$47,3,FALSE))","v":" "},null,null,null,null,null,null,null,null,0,null,null,null,null,null,null,null,null,null,null,null,"-",null,{"$f":"IF(SUMPRODUCT((A$14:A467=A467)*(B$14:B467=B467)*(C$14:C467=C467))>1,0,1)","v":0},"NO","NO",{"$f":"IFERROR(VLOOKUP(F467,Tipo!$C$12:$C$27,1,FALSE),\"NO\")","v":"NO"},"NO","NO"]
[null,null,null,null,null,null,null,null,null,{"$f":"IF(ISERROR(VLOOKUP(I468,Eje_Pilar!$C$2:$E$47,2,FALSE)),\" \",VLOOKUP(I468,Eje_Pilar!$C$2:$E$47,2,FALSE))","v":" "},{"$f":"IF(ISERROR(VLOOKUP(I468,Eje_Pilar!$C$2:$E$47,3,FALSE)),\" \",VLOOKUP(I468,Eje_Pilar!$C$2:$E$47,3,FALSE))","v":" "},null,null,null,null,null,null,null,null,0,null,null,null,null,null,null,null,null,null,null,null,"-",null,{"$f":"IF(SUMPRODUCT((A$14:A468=A468)*(B$14:B468=B468)*(C$14:C468=C468))>1,0,1)","v":0},"NO","NO",{"$f":"IFERROR(VLOOKUP(F468,Tipo!$C$12:$C$27,1,FALSE),\"NO\")","v":"NO"},"NO","NO"]
[null,null,null,null,null,null,null,null,null,{"$f":"IF(ISERROR(VLOOKUP(I469,Eje_Pilar!$C$2:$E$47,2,FALSE)),\" \",VLOOKUP(I469,Eje_Pilar!$C$2:$E$47,2,FALSE))","v":" "},{"$f":"IF(ISERROR(VLOOKUP(I469,Eje_Pilar!$C$2:$E$47,3,FALSE)),\" \",VLOOKUP(I469,Eje_Pilar!$C$2:$E$47,3,FALSE))","v":" "},null,null,null,null,null,null,null,null,0,null,null,null,null,null,null,null,null,null,null,null,"-",null,{"$f":"IF(SUMPRODUCT((A$14:A469=A469)*(B$14:B469=B469)*(C$14:C469=C469))>1,0,1)","v":0},"NO","NO",{"$f":"IFERROR(VLOOKUP(F469,Tipo!$C$12:$C$27,1,FALSE),\"NO\")","v":"NO"},"NO","NO"]
[null,null,null,null,null,null,null,null,null,{"$f":"IF(ISERROR(VLOOKUP(I470,Eje_Pilar!$C$2:$E$47,2,FALSE)),\" \",VLOOKUP(I470,Eje_Pilar!$C$2:$E$47,2,FALSE))","v":" "},{"$f":"IF(ISERROR(VLOOKUP(I470,Eje_Pilar!$C$2:$E$47,3,FALSE)),\" \",VLOOKUP(I470,Eje_Pilar!$C$2:$E$47,3,FALSE))","v":" "},null,null,null,null,null,null,null,null,0,null,null,null,null,null,null,null,null,null,null,null,"-",null,{"$f":"IF(SUMPRODUCT((A$14:A470=A470)*(B$14:B470=B470)*(C$14:C470=C470))>1,0,1)","v":0},"NO","NO",{"$f":"IFERROR(VLOOKUP(F470,Tipo!$C$12:$C$27,1,FALSE),\"NO\")","v":"NO"},"NO","NO"]
[null,null,null,null,null,null,null,null,null,{"$f":"IF(ISERROR(VLOOKUP(I471,Eje_Pilar!$C$2:$E$47,2,FALSE)),\" \",VLOOKUP(I471,Eje_Pilar!$C$2:$E$47,2,FALSE))","v":" "},{"$f":"IF(ISERROR(VLOOKUP(I471,Eje_Pilar!$C$2:$E$47,3,FALSE)),\" \",VLOOKUP(I471,Eje_Pilar!$C$2:$E$47,3,FALSE))","v":" "},null,null,null,null,null,null,null,null,0,null,null,null,null,null,null,null,null,null,null,null,"-",null,{"$f":"IF(SUMPRODUCT((A$14:A471=A471)*(B$14:B471=B471)*(C$14:C471=C471))>1,0,1)","v":0},"NO","NO",{"$f":"IFERROR(VLOOKUP(F471,Tipo!$C$12:$C$27,1,FALSE),\"NO\")","v":"NO"},"NO","NO"]
[null,null,null,null,null,null,null,null,null,{"$f":"IF(ISERROR(VLOOKUP(I472,Eje_Pilar!$C$2:$E$47,2,FALSE)),\" \",VLOOKUP(I472,Eje_Pilar!$C$2:$E$47,2,FALSE))","v":" "},{"$f":"IF(ISERROR(VLOOKUP(I472,Eje_Pilar!$C$2:$E$47,3,FALSE)),\" \",VLOOKUP(I472,Eje_Pilar!$C$2:$E$47,3,FALSE))","v":" "},null,null,null,null,null,null,null,null,0,null,null,null,null,null,null,null,null,null,null,null,"-",null,{"$f":"IF(SUMPRODUCT((A$14:A472=A472)*(B$14:B472=B472)*(C$14:C472=C472))>1,0,1)","v":0},"NO","NO",{"$f":"IFERROR(VLOOKUP(F472,Tipo!$C$12:$C$27,1,FALSE),\"NO\")","v":"NO"},"NO","NO"]
[null,null,null,null,null,null,null,null,null,{"$f":"IF(ISERROR(VLOOKUP(I473,Eje_Pilar!$C$2:$E$47,2,FALSE)),\" \",VLOOKUP(I473,Eje_Pilar!$C$2:$E$47,2,FALSE))","v":" "},{"$f":"IF(ISERROR(VLOOKUP(I473,Eje_Pilar!$C$2:$E$47,3,FALSE)),\" \",VLOOKUP(I473,Eje_Pilar!$C$2:$E$47,3,FALSE))","v":" "},null,null,null,null,null,null,null,null,0,null,null,null,null,null,null,null,null,null,null,null,"-",null,{"$f":"IF(SUMPRODUCT((A$14:A473=A473)*(B$14:B473=B473)*(C$14:C473=C473))>1,0,1)","v":0},"NO","NO",{"$f":"IFERROR(VLOOKUP(F473,Tipo!$C$12:$C$27,1,FALSE),\"NO\")","v":"NO"},"NO","NO"]
[null,null,null,null,null,null,null,null,null,{"$f":"IF(ISERROR(VLOOKUP(I474,Eje_Pilar!$C$2:$E$47,2,FALSE)),\" \",VLOOKUP(I474,Eje_Pilar!$C$2:$E$47,2,FALSE))","v":" "},{"$f":"IF(ISERROR(VLOOKUP(I474,Eje_Pilar!$C$2:$E$47,3,FALSE)),\" \",VLOOKUP(I474,Eje_Pilar!$C$2:$E$47,3,FALSE))","v":" "},null,null,null,null,null,null,null,null,0,null,null,null,null,null,null,null,null,null,null,null,"-",null,{"$f":"IF(SUMPRODUCT((A$14:A474=A474)*(B$14:B474=B474)*(C$14:C474=C474))>1,0,1)","v":0},"NO","NO",{"$f":"IFERROR(VLOOKUP(F474,Tipo!$C$12:$C$27,1,FALSE),\"NO\")","v":"NO"},"NO","NO"]
[null,null,null,null,null,null,null,null,null,{"$f":"IF(ISERROR(VLOOKUP(I475,Eje_Pilar!$C$2:$E$47,2,FALSE)),\" \",VLOOKUP(I475,Eje_Pilar!$C$2:$E$47,2,FALSE))","v":" "},{"$f":"IF(ISERROR(VLOOKUP(I475,Eje_Pilar!$C$2:$E$47,3,FALSE)),\" \",VLOOKUP(I475,Eje_Pilar!$C$2:$E$47,3,FALSE))","v":" "},null,null,null,null,null,null,null,null,0,null,null,null,null,null,null,null,null,null,null,null,"-",null,{"$f":"IF(SUMPRODUCT((A$14:A475=A475)*(B$14:B475=B475)*(C$14:C475=C475))>1,0,1)","v":0},"NO","NO",{"$f":"IFERROR(VLOOKUP(F475,Tipo!$C$12:$C$27,1,FALSE),\"NO\")","v":"NO"},"NO","NO"]
[null,null,null,null,null,null,null,null,null,{"$f":"IF(ISERROR(VLOOKUP(I476,Eje_Pilar!$C$2:$E$47,2,FALSE)),\" \",VLOOKUP(I476,Eje_Pilar!$C$2:$E$47,2,FALSE))","v":" "},{"$f":"IF(ISERROR(VLOOKUP(I476,Eje_Pilar!$C$2:$E$47,3,FALSE)),\" \",VLOOKUP(I476,Eje_Pilar!$C$2:$E$47,3,FALSE))","v":" "},null,null,null,null,null,null,null,null,0,null,null,null,null,null,null,null,null,null,null,null,"-",null,{"$f":"IF(SUMPRODUCT((A$14:A476=A476)*(B$14:B476=B476)*(C$14:C476=C476))>1,0,1)","v":0},"NO","NO",{"$f":"IFERROR(VLOOKUP(F476,Tipo!$C$12:$C$27,1,FALSE),\"NO\")","v":"NO"},"NO","NO"]
[null,null,null,null,null,null,null,null,null,{"$f":"IF(ISERROR(VLOOKUP(I477,Eje_Pilar!$C$2:$E$47,2,FALSE)),\" \",VLOOKUP(I477,Eje_Pilar!$C$2:$E$47,2,FALSE))","v":" "},{"$f":"IF(ISERROR(VLOOKUP(I477,Eje_Pilar!$C$2:$E$47,3,FALSE)),\" \",VLOOKUP(I477,Eje_Pilar!$C$2:$E$47,3,FALSE))","v":" "},null,null,null,null,null,null,null,null,0,null,null,null,null,null,null,null,null,null,null,null,"-",null,{"$f":"IF(SUMPRODUCT((A$14:A477=A477)*(B$14:B477=B477)*(C$14:C477=C477))>1,0,1)","v":0},"NO","NO",{"$f":"IFERROR(VLOOKUP(F477,Tipo!$C$12:$C$27,1,FALSE),\"NO\")","v":"NO"},"NO","NO"]
[null,null,null,null,null,null,null,null,null,{"$f":"IF(ISERROR(VLOOKUP(I478,Eje_Pilar!$C$2:$E$47,2,FALSE)),\" \",VLOOKUP(I478,Eje_Pilar!$C$2:$E$47,2,FALSE))","v":" "},{"$f":"IF(ISERROR(VLOOKUP(I478,Eje_Pilar!$C$2:$E$47,3,FALSE)),\" \",VLOOKUP(I478,Eje_Pilar!$C$2:$E$47,3,FALSE))","v":" "},null,null,null,null,null,null,null,null,0,null,null,null,null,null,null,null,null,null,null,null,"-",null,{"$f":"IF(SUMPRODUCT((A$14:A478=A478)*(B$14:B478=B478)*(C$14:C478=C478))>1,0,1)","v":0},"NO","NO",{"$f":"IFERROR(VLOOKUP(F478,Tipo!$C$12:$C$27,1,FALSE),\"NO\")","v":"NO"},"NO","NO"]
[null,null,null,null,null,null,null,null,null,{"$f":"IF(ISERROR(VLOOKUP(I479,Eje_Pilar!$C$2:$E$47,2,FALSE)),\" \",VLOOKUP(I479,Eje_Pilar!$C$2:$E$47,2,FALSE))","v":" "},{"$f":"IF(ISERROR(VLOOKUP(I479,Eje_Pilar!$C$2:$E$47,3,FALSE)),\" \",VLOOKUP(I479,Eje_Pilar!$C$2:$E$47,3,FALSE))","v":" "},null,null,null,null,null,null,null,null,0,null,null,null,null,null,null,null,null,null,null,null,"-",null,{"$f":"IF(SUMPRODUCT((A$14:A479=A479)*(B$14:B479=B479)*(C$14:C479=C479))>1,0,1)","v":0},"NO","NO",{"$f":"IFERROR(VLOOKUP(F479,Tipo!$C$12:$C$27,1,FALSE),\"NO\")","v":"NO"},"NO","NO"]
[null,null,null,null,null,null,null,null,null,{"$f":"IF(ISERROR(VLOOKUP(I480,Eje_Pilar!$C$2:$E$47,2,FALSE)),\" \",VLOOKUP(I480,Eje_Pilar!$C$2:$E$47,2,FALSE))","v":" "},{"$f":"IF(ISERROR(VLOOKUP(I480,Eje_Pilar!$C$2:$E$47,3,FALSE)),\" \",VLOOKUP(I480,Eje_Pilar!$C$2:$E$47,3,FALSE))","v":" "},null,null,null,null,null,null,null,null,0,null,null,null,null,null,null,null,null,null,null,null,"-",null,{"$f":"IF(SUMPRODUCT((A$14:A480=A480)*(B$14:B480=B480)*(C$14:C480=C480))>1,0,1)","v":0},"NO","NO",{"$f":"IFERROR(VLOOKUP(F480,Tipo!$C$12:$C$27,1,FALSE),\"NO\")","v":"NO"},"NO","NO"]
[null,null,null,null,null,null,null,null,null,{"$f":"IF(ISERROR(VLOOKUP(I481,Eje_Pilar!$C$2:$E$47,2,FALSE)),\" \",VLOOKUP(I481,Eje_Pilar!$C$2:$E$47,2,FALSE))","v":" "},{"$f":"IF(ISERROR(VLOOKUP(I481,Eje_Pilar!$C$2:$E$47,3,FALSE)),\" \",VLOOKUP(I481,Eje_Pilar!$C$2:$E$47,3,FALSE))","v":" "},null,null,null,null,null,null,null,null,0,null,null,null,null,null,null,null,null,null,null,null,"-",null,{"$f":"IF(SUMPRODUCT((A$14:A481=A481)*(B$14:B481=B481)*(C$14:C481=C481))>1,0,1)","v":0},"NO","NO",{"$f":"IFERROR(VLOOKUP(F481,Tipo!$C$12:$C$27,1,FALSE),\"NO\")","v":"NO"},"NO","NO"]
[null,null,null,null,null,null,null,null,null,{"$f":"IF(ISERROR(VLOOKUP(I482,Eje_Pilar!$C$2:$E$47,2,FALSE)),\" \",VLOOKUP(I482,Eje_Pilar!$C$2:$E$47,2,FALSE))","v":" "},{"$f":"IF(ISERROR(VLOOKUP(I482,Eje_Pilar!$C$2:$E$47,3,FALSE)),\" \",VLOOKUP(I482,Eje_Pilar!$C$2:$E$47,3,FALSE))","v":" "},null,null,null,null,null,null,null,null,0,null,null,null,null,null,null,null,null,null,null,null,"-",null,{"$f":"IF(SUMPRODUCT((A$14:A482=A482)*(B$14:B482=B482)*(C$14:C482=C482))>1,0,1)","v":0},"NO","NO",{"$f":"IFERROR(VLOOKUP(F482,Tipo!$C$12:$C$27,1,FALSE),\"NO\")","v":"NO"},"NO","NO"]
[null,null,null,null,null,null,null,null,null,{"$f":"IF(ISERROR(VLOOKUP(I483,Eje_Pilar!$C$2:$E$47,2,FALSE)),\" \",VLOOKUP(I483,Eje_Pilar!$C$2:$E$47,2,FALSE))","v":" "},{"$f":"IF(ISERROR(VLOOKUP(I483,Eje_Pilar!$C$2:$E$47,3,FALSE)),\" \",VLOOKUP(I483,Eje_Pilar!$C$2:$E$47,3,FALSE))","v":" "},null,null,null,null,null,null,null,null,0,null,null,null,null,null,null,null,null,null,null,null,"-",null,{"$f":"IF(SUMPRODUCT((A$14:A483=A483)*(B$14:B483=B483)*(C$14:C483=C483))>1,0,1)","v":0},"NO","NO",{"$f":"IFERROR(VLOOKUP(F483,Tipo!$C$12:$C$27,1,FALSE),\"NO\")","v":"NO"},"NO","NO"]
[null,null,null,null,null,null,null,null,null,{"$f":"IF(ISERROR(VLOOKUP(I484,Eje_Pilar!$C$2:$E$47,2,FALSE)),\" \",VLOOKUP(I484,Eje_Pilar!$C$2:$E$47,2,FALSE))","v":" "},{"$f":"IF(ISERROR(VLOOKUP(I484,Eje_Pilar!$C$2:$E$47,3,FALSE)),\" \",VLOOKUP(I484,Eje_Pilar!$C$2:$E$47,3,FALSE))","v":" "},null,null,null,null,null,null,null,null,0,null,null,null,null,null,null,null,null,null,null,null,"-",null,{"$f":"IF(SUMPRODUCT((A$14:A484=A484)*(B$14:B484=B484)*(C$14:C484=C484))>1,0,1)","v":0},"NO","NO",{"$f":"IFERROR(VLOOKUP(F484,Tipo!$C$12:$C$27,1,FALSE),\"NO\")","v":"NO"},"NO","NO"]
[null,null,null,null,null,null,null,null,null,{"$f":"IF(ISERROR(VLOOKUP(I485,Eje_Pilar!$C$2:$E$47,2,FALSE)),\" \",VLOOKUP(I485,Eje_Pilar!$C$2:$E$47,2,FALSE))","v":" "},{"$f":"IF(ISERROR(VLOOKUP(I485,Eje_Pilar!$C$2:$E$47,3,FALSE)),\" \",VLOOKUP(I485,Eje_Pilar!$C$2:$E$47,3,FALSE))","v":" "},null,null,null,null,null,null,null,null,0,null,null,null,null,null,null,null,null,null,null,null,"-",null,{"$f":"IF(SUMPRODUCT((A$14:A485=A485)*(B$14:B485=B485)*(C$14:C485=C485))>1,0,1)","v":0},"NO","NO",{"$f":"IFERROR(VLOOKUP(F485,Tipo!$C$12:$C$27,1,FALSE),\"NO\")","v":"NO"},"NO","NO"]
[null,null,null,null,null,null,null,null,null,{"$f":"IF(ISERROR(VLOOKUP(I486,Eje_Pilar!$C$2:$E$47,2,FALSE)),\" \",VLOOKUP(I486,Eje_Pilar!$C$2:$E$47,2,FALSE))","v":" "},{"$f":"IF(ISERROR(VLOOKUP(I486,Eje_Pilar!$C$2:$E$47,3,FALSE)),\" \",VLOOKUP(I486,Eje_Pilar!$C$2:$E$47,3,FALSE))","v":" "},null,null,null,null,null,null,null,null,0,null,null,null,null,null,null,null,null,null,null,null,"-",null,{"$f":"IF(SUMPRODUCT((A$14:A486=A486)*(B$14:B486=B486)*(C$14:C486=C486))>1,0,1)","v":0},"NO","NO",{"$f":"IFERROR(VLOOKUP(F486,Tipo!$C$12:$C$27,1,FALSE),\"NO\")","v":"NO"},"NO","NO"]
[null,null,null,null,null,null,null,null,null,{"$f":"IF(ISERROR(VLOOKUP(I487,Eje_Pilar!$C$2:$E$47,2,FALSE)),\" \",VLOOKUP(I487,Eje_Pilar!$C$2:$E$47,2,FALSE))","v":" "},{"$f":"IF(ISERROR(VLOOKUP(I487,Eje_Pilar!$C$2:$E$47,3,FALSE)),\" \",VLOOKUP(I487,Eje_Pilar!$C$2:$E$47,3,FALSE))","v":" "},null,null,null,null,null,null,null,null,0,null,null,null,null,null,null,null,null,null,null,null,"-",null,{"$f":"IF(SUMPRODUCT((A$14:A487=A487)*(B$14:B487=B487)*(C$14:C487=C487))>1,0,1)","v":0},"NO","NO",{"$f":"IFERROR(VLOOKUP(F487,Tipo!$C$12:$C$27,1,FALSE),\"NO\")","v":"NO"},"NO","NO"]
[null,null,null,null,null,null,null,null,null,{"$f":"IF(ISERROR(VLOOKUP(I488,Eje_Pilar!$C$2:$E$47,2,FALSE)),\" \",VLOOKUP(I488,Eje_Pilar!$C$2:$E$47,2,FALSE))","v":" "},{"$f":"IF(ISERROR(VLOOKUP(I488,Eje_Pilar!$C$2:$E$47,3,FALSE)),\" \",VLOOKUP(I488,Eje_Pilar!$C$2:$E$47,3,FALSE))","v":" "},null,null,null,null,null,null,null,null,0,null,null,null,null,null,null,null,null,null,null,null,"-",null,{"$f":"IF(SUMPRODUCT((A$14:A488=A488)*(B$14:B488=B488)*(C$14:C488=C488))>1,0,1)","v":0},"NO","NO",{"$f":"IFERROR(VLOOKUP(F488,Tipo!$C$12:$C$27,1,FALSE),\"NO\")","v":"NO"},"NO","NO"]
[null,null,null,null,null,null,null,null,null,{"$f":"IF(ISERROR(VLOOKUP(I489,Eje_Pilar!$C$2:$E$47,2,FALSE)),\" \",VLOOKUP(I489,Eje_Pilar!$C$2:$E$47,2,FALSE))","v":" "},{"$f":"IF(ISERROR(VLOOKUP(I489,Eje_Pilar!$C$2:$E$47,3,FALSE)),\" \",VLOOKUP(I489,Eje_Pilar!$C$2:$E$47,3,FALSE))","v":" "},null,null,null,null,null,null,null,null,0,null,null,null,null,null,null,null,null,null,null,null,"-",null,{"$f":"IF(SUMPRODUCT((A$14:A489=A489)*(B$14:B489=B489)*(C$14:C489=C489))>1,0,1)","v":0},"NO","NO",{"$f":"IFERROR(VLOOKUP(F489,Tipo!$C$12:$C$27,1,FALSE),\"NO\")","v":"NO"},"NO","NO"]
[null,null,null,null,null,null,null,null,null,{"$f":"IF(ISERROR(VLOOKUP(I490,Eje_Pilar!$C$2:$E$47,2,FALSE)),\" \",VLOOKUP(I490,Eje_Pilar!$C$2:$E$47,2,FALSE))","v":" "},{"$f":"IF(ISERROR(VLOOKUP(I490,Eje_Pilar!$C$2:$E$47,3,FALSE)),\" \",VLOOKUP(I490,Eje_Pilar!$C$2:$E$47,3,FALSE))","v":" "},null,null,null,null,null,null,null,null,0,null,null,null,null,null,null,null,null,null,null,null,"-",null,{"$f":"IF(SUMPRODUCT((A$14:A490=A490)*(B$14:B490=B490)*(C$14:C490=C490))>1,0,1)","v":0},"NO","NO",{"$f":"IFERROR(VLOOKUP(F490,Tipo!$C$12:$C$27,1,FALSE),\"NO\")","v":"NO"},"NO","NO"]
[null,null,null,null,null,null,null,null,null,{"$f":"IF(ISERROR(VLOOKUP(I491,Eje_Pilar!$C$2:$E$47,2,FALSE)),\" \",VLOOKUP(I491,Eje_Pilar!$C$2:$E$47,2,FALSE))","v":" "},{"$f":"IF(ISERROR(VLOOKUP(I491,Eje_Pilar!$C$2:$E$47,3,FALSE)),\" \",VLOOKUP(I491,Eje_Pilar!$C$2:$E$47,3,FALSE))","v":" "},null,null,null,null,null,null,null,null,0,null,null,null,null,null,null,null,null,null,null,null,"-",null,{"$f":"IF(SUMPRODUCT((A$14:A491=A491)*(B$14:B491=B491)*(C$14:C491=C491))>1,0,1)","v":0},"NO","NO",{"$f":"IFERROR(VLOOKUP(F491,Tipo!$C$12:$C$27,1,FALSE),\"NO\")","v":"NO"},"NO","NO"]
[null,null,null,null,null,null,null,null,null,{"$f":"IF(ISERROR(VLOOKUP(I492,Eje_Pilar!$C$2:$E$47,2,FALSE)),\" \",VLOOKUP(I492,Eje_Pilar!$C$2:$E$47,2,FALSE))","v":" "},{"$f":"IF(ISERROR(VLOOKUP(I492,Eje_Pilar!$C$2:$E$47,3,FALSE)),\" \",VLOOKUP(I492,Eje_Pilar!$C$2:$E$47,3,FALSE))","v":" "},null,null,null,null,null,null,null,null,0,null,null,null,null,null,null,null,null,null,null,null,"-",null,{"$f":"IF(SUMPRODUCT((A$14:A492=A492)*(B$14:B492=B492)*(C$14:C492=C492))>1,0,1)","v":0},"NO","NO",{"$f":"IFERROR(VLOOKUP(F492,Tipo!$C$12:$C$27,1,FALSE),\"NO\")","v":"NO"},"NO","NO"]
[null,null,null,null,null,null,null,null,null,{"$f":"IF(ISERROR(VLOOKUP(I493,Eje_Pilar!$C$2:$E$47,2,FALSE)),\" \",VLOOKUP(I493,Eje_Pilar!$C$2:$E$47,2,FALSE))","v":" "},{"$f":"IF(ISERROR(VLOOKUP(I493,Eje_Pilar!$C$2:$E$47,3,FALSE)),\" \",VLOOKUP(I493,Eje_Pilar!$C$2:$E$47,3,FALSE))","v":" "},null,null,null,null,null,null,null,null,0,null,null,null,null,null,null,null,null,null,null,null,"-",null,{"$f":"IF(SUMPRODUCT((A$14:A493=A493)*(B$14:B493=B493)*(C$14:C493=C493))>1,0,1)","v":0},"NO","NO",{"$f":"IFERROR(VLOOKUP(F493,Tipo!$C$12:$C$27,1,FALSE),\"NO\")","v":"NO"},"NO","NO"]
[null,null,null,null,null,null,null,null,null,{"$f":"IF(ISERROR(VLOOKUP(I494,Eje_Pilar!$C$2:$E$47,2,FALSE)),\" \",VLOOKUP(I494,Eje_Pilar!$C$2:$E$47,2,FALSE))","v":" "},{"$f":"IF(ISERROR(VLOOKUP(I494,Eje_Pilar!$C$2:$E$47,3,FALSE)),\" \",VLOOKUP(I494,Eje_Pilar!$C$2:$E$47,3,FALSE))","v":" "},null,null,null,null,null,null,null,null,0,null,null,null,null,null,null,null,null,null,null,null,"-",null,{"$f":"IF(SUMPRODUCT((A$14:A494=A494)*(B$14:B494=B494)*(C$14:C494=C494))>1,0,1)","v":0},"NO","NO",{"$f":"IFERROR(VLOOKUP(F494,Tipo!$C$12:$C$27,1,FALSE),\"NO\")","v":"NO"},"NO","NO"]
[null,null,null,null,null,null,null,null,null,{"$f":"IF(ISERROR(VLOOKUP(I495,Eje_Pilar!$C$2:$E$47,2,FALSE)),\" \",VLOOKUP(I495,Eje_Pilar!$C$2:$E$47,2,FALSE))","v":" "},{"$f":"IF(ISERROR(VLOOKUP(I495,Eje_Pilar!$C$2:$E$47,3,FALSE)),\" \",VLOOKUP(I495,Eje_Pilar!$C$2:$E$47,3,FALSE))","v":" "},null,null,null,null,null,null,null,null,0,null,null,null,null,null,null,null,null,null,null,null,"-",null,{"$f":"IF(SUMPRODUCT((A$14:A495=A495)*(B$14:B495=B495)*(C$14:C495=C495))>1,0,1)","v":0},"NO","NO",{"$f":"IFERROR(VLOOKUP(F495,Tipo!$C$12:$C$27,1,FALSE),\"NO\")","v":"NO"},"NO","NO"]
[null,null,null,null,null,null,null,null,null,{"$f":"IF(ISERROR(VLOOKUP(I496,Eje_Pilar!$C$2:$E$47,2,FALSE)),\" \",VLOOKUP(I496,Eje_Pilar!$C$2:$E$47,2,FALSE))","v":" "},{"$f":"IF(ISERROR(VLOOKUP(I496,Eje_Pilar!$C$2:$E$47,3,FALSE)),\" \",VLOOKUP(I496,Eje_Pilar!$C$2:$E$47,3,FALSE))","v":" "},null,null,null,null,null,null,null,null,0,null,null,null,null,null,null,null,null,null,null,null,"-",null,{"$f":"IF(SUMPRODUCT((A$14:A496=A496)*(B$14:B496=B496)*(C$14:C496=C496))>1,0,1)","v":0},"NO","NO",{"$f":"IFERROR(VLOOKUP(F496,Tipo!$C$12:$C$27,1,FALSE),\"NO\")","v":"NO"},"NO","NO"]
[null,null,null,null,null,null,null,null,null,{"$f":"IF(ISERROR(VLOOKUP(I497,Eje_Pilar!$C$2:$E$47,2,FALSE)),\" \",VLOOKUP(I497,Eje_Pilar!$C$2:$E$47,2,FALSE))","v":" "},{"$f":"IF(ISERROR(VLOOKUP(I497,Eje_Pilar!$C$2:$E$47,3,FALSE)),\" \",VLOOKUP(I497,Eje_Pilar!$C$2:$E$47,3,FALSE))","v":" "},null,null,null,null,null,null,null,null,0,null,null,null,null,null,null,null,null,null,null,null,"-",null,{"$f":"IF(SUMPRODUCT((A$14:A497=A497)*(B$14:B497=B497)*(C$14:C497=C497))>1,0,1)","v":0},"NO","NO",{"$f":"IFERROR(VLOOKUP(F497,Tipo!$C$12:$C$27,1,FALSE),\"NO\")","v":"NO"},"NO","NO"]
[null,null,null,null,null,null,null,null,null,{"$f":"IF(ISERROR(VLOOKUP(I498,Eje_Pilar!$C$2:$E$47,2,FALSE)),\" \",VLOOKUP(I498,Eje_Pilar!$C$2:$E$47,2,FALSE))","v":" "},{"$f":"IF(ISERROR(VLOOKUP(I498,Eje_Pilar!$C$2:$E$47,3,FALSE)),\" \",VLOOKUP(I498,Eje_Pilar!$C$2:$E$47,3,FALSE))","v":" "},null,null,null,null,null,null,null,null,0,null,null,null,null,null,null,null,null,null,null,null,"-",null,{"$f":"IF(SUMPRODUCT((A$14:A498=A498)*(B$14:B498=B498)*(C$14:C498=C498))>1,0,1)","v":0},"NO","NO",{"$f":"IFERROR(VLOOKUP(F498,Tipo!$C$12:$C$27,1,FALSE),\"NO\")","v":"NO"},"NO","NO"]
[null,null,null,null,null,null,null,null,null,{"$f":"IF(ISERROR(VLOOKUP(I499,Eje_Pilar!$C$2:$E$47,2,FALSE)),\" \",VLOOKUP(I499,Eje_Pilar!$C$2:$E$47,2,FALSE))","v":" "},{"$f":"IF(ISERROR(VLOOKUP(I499,Eje_Pilar!$C$2:$E$47,3,FALSE)),\" \",VLOOKUP(I499,Eje_Pilar!$C$2:$E$47,3,FALSE))","v":" "},null,null,null,null,null,null,null,null,{"$f":"+O499+Q499+S499","v":0},null,null,null,null,null,null,null,null,null,null,null,"-",null,{"$f":"IF(SUMPRODUCT((A$14:A499=A499)*(B$14:B499=B499)*(C$14:C499=C499))>1,0,1)","v":0},{"$f":"IFERROR(VLOOKUP(D499,tipo,1,FALSE),\"NO\")","v":"NO"},{"$f":"IFERROR(VLOOKUP(E499,modal,1,FALSE),\"NO\")","v":"NO"},{"$f":"IFERROR(VLOOKUP(F499,Tipo!$C$12:$C$27,1,FALSE),\"NO\")","v":"NO"},{"$f":"IFERROR(VLOOKUP(H499,afectacion,1,FALSE),\"NO\")","v":"NO"},{"$f":"IFERROR(VLOOKUP(I499,programa,1,FALSE),\"NO\")","v":"NO"}]
[null,null,null,null,null,null,null,null,null,{"$f":"IF(ISERROR(VLOOKUP(I500,Eje_Pilar!$C$2:$E$47,2,FALSE)),\" \",VLOOKUP(I500,Eje_Pilar!$C$2:$E$47,2,FALSE))","v":" "},{"$f":"IF(ISERROR(VLOOKUP(I500,Eje_Pilar!$C$2:$E$47,3,FALSE)),\" \",VLOOKUP(I500,Eje_Pilar!$C$2:$E$47,3,FALSE))","v":" "},null,null,null,null,null,null,null,null,0,null,null,null,null,null,null,null,null,null,null,null,"-",null,{"$f":"IF(SUMPRODUCT((A$14:A500=A500)*(B$14:B500=B500)*(C$14:C500=C500))>1,0,1)","v":0},"NO","NO",{"$f":"IFERROR(VLOOKUP(F500,Tipo!$C$12:$C$27,1,FALSE),\"NO\")","v":"NO"},"NO","NO"]
[null,null,null,null,null,null,null,null,null,{"$f":"IF(ISERROR(VLOOKUP(I501,Eje_Pilar!$C$2:$E$47,2,FALSE)),\" \",VLOOKUP(I501,Eje_Pilar!$C$2:$E$47,2,FALSE))","v":" "},{"$f":"IF(ISERROR(VLOOKUP(I501,Eje_Pilar!$C$2:$E$47,3,FALSE)),\" \",VLOOKUP(I501,Eje_Pilar!$C$2:$E$47,3,FALSE))","v":" "},null,null,null,null,null,null,null,null,0,null,null,null,null,null,null,null,null,null,null,null,"-",null,{"$f":"IF(SUMPRODUCT((A$14:A501=A501)*(B$14:B501=B501)*(C$14:C501=C501))>1,0,1)","v":0},"NO","NO",{"$f":"IFERROR(VLOOKUP(F501,Tipo!$C$12:$C$27,1,FALSE),\"NO\")","v":"NO"},"NO","NO"]
[null,null,null,null,null,null,null,null,null,{"$f":"IF(ISERROR(VLOOKUP(I502,Eje_Pilar!$C$2:$E$47,2,FALSE)),\" \",VLOOKUP(I502,Eje_Pilar!$C$2:$E$47,2,FALSE))","v":" "},{"$f":"IF(ISERROR(VLOOKUP(I502,Eje_Pilar!$C$2:$E$47,3,FALSE)),\" \",VLOOKUP(I502,Eje_Pilar!$C$2:$E$47,3,FALSE))","v":" "},null,null,null,null,null,null,null,null,0,null,null,null,null,null,null,null,null,null,null,null,"-",null,{"$f":"IF(SUMPRODUCT((A$14:A502=A502)*(B$14:B502=B502)*(C$14:C502=C502))>1,0,1)","v":0},"NO","NO",{"$f":"IFERROR(VLOOKUP(F502,Tipo!$C$12:$C$27,1,FALSE),\"NO\")","v":"NO"},"NO","NO"]
[null,null,null,null,null,null,null,null,null,{"$f":"IF(ISERROR(VLOOKUP(I503,Eje_Pilar!$C$2:$E$47,2,FALSE)),\" \",VLOOKUP(I503,Eje_Pilar!$C$2:$E$47,2,FALSE))","v":" "},{"$f":"IF(ISERROR(VLOOKUP(I503,Eje_Pilar!$C$2:$E$47,3,FALSE)),\" \",VLOOKUP(I503,Eje_Pilar!$C$2:$E$47,3,FALSE))","v":" "},null,null,null,null,null,null,null,null,0,null,null,null,null,null,null,null,null,null,null,null,"-",null,{"$f":"IF(SUMPRODUCT((A$14:A503=A503)*(B$14:B503=B503)*(C$14:C503=C503))>1,0,1)","v":0},"NO","NO",{"$f":"IFERROR(VLOOKUP(F503,Tipo!$C$12:$C$27,1,FALSE),\"NO\")","v":"NO"},"NO","NO"]
[null,null,null,null,null,null,null,null,null,{"$f":"IF(ISERROR(VLOOKUP(I504,Eje_Pilar!$C$2:$E$47,2,FALSE)),\" \",VLOOKUP(I504,Eje_Pilar!$C$2:$E$47,2,FALSE))","v":" "},{"$f":"IF(ISERROR(VLOOKUP(I504,Eje_Pilar!$C$2:$E$47,3,FALSE)),\" \",VLOOKUP(I504,Eje_Pilar!$C$2:$E$47,3,FALSE))","v":" "},null,null,null,null,null,null,null,null,0,null,null,null,null,null,null,null,null,null,null,null,"-",null,{"$f":"IF(SUMPRODUCT((A$14:A504=A504)*(B$14:B504=B504)*(C$14:C504=C504))>1,0,1)","v":0},"NO","NO",{"$f":"IFERROR(VLOOKUP(F504,Tipo!$C$12:$C$27,1,FALSE),\"NO\")","v":"NO"},"NO","NO"]
[null,null,null,null,null,null,null,null,null,{"$f":"IF(ISERROR(VLOOKUP(I505,Eje_Pilar!$C$2:$E$47,2,FALSE)),\" \",VLOOKUP(I505,Eje_Pilar!$C$2:$E$47,2,FALSE))","v":" "},{"$f":"IF(ISERROR(VLOOKUP(I505,Eje_Pilar!$C$2:$E$47,3,FALSE)),\" \",VLOOKUP(I505,Eje_Pilar!$C$2:$E$47,3,FALSE))","v":" "},null,null,null,null,null,null,null,null,0,null,null,null,null,null,null,null,null,null,null,null,"-",null,{"$f":"IF(SUMPRODUCT((A$14:A505=A505)*(B$14:B505=B505)*(C$14:C505=C505))>1,0,1)","v":0},"NO","NO",{"$f":"IFERROR(VLOOKUP(F505,Tipo!$C$12:$C$27,1,FALSE),\"NO\")","v":"NO"},"NO","NO"]
[null,null,null,null,null,null,null,null,null,{"$f":"IF(ISERROR(VLOOKUP(I506,Eje_Pilar!$C$2:$E$47,2,FALSE)),\" \",VLOOKUP(I506,Eje_Pilar!$C$2:$E$47,2,FALSE))","v":" "},{"$f":"IF(ISERROR(VLOOKUP(I506,Eje_Pilar!$C$2:$E$47,3,FALSE)),\" \",VLOOKUP(I506,Eje_Pilar!$C$2:$E$47,3,FALSE))","v":" "},null,null,null,null,null,null,null,null,0,null,null,null,null,null,null,null,null,null,null,null,"-",null,{"$f":"IF(SUMPRODUCT((A$14:A506=A506)*(B$14:B506=B506)*(C$14:C506=C506))>1,0,1)","v":0},"NO","NO",{"$f":"IFERROR(VLOOKUP(F506,Tipo!$C$12:$C$27,1,FALSE),\"NO\")","v":"NO"},"NO","NO"]
[null,null,null,null,null,null,null,null,null,{"$f":"IF(ISERROR(VLOOKUP(I507,Eje_Pilar!$C$2:$E$47,2,FALSE)),\" \",VLOOKUP(I507,Eje_Pilar!$C$2:$E$47,2,FALSE))","v":" "},{"$f":"IF(ISERROR(VLOOKUP(I507,Eje_Pilar!$C$2:$E$47,3,FALSE)),\" \",VLOOKUP(I507,Eje_Pilar!$C$2:$E$47,3,FALSE))","v":" "},null,null,null,null,null,null,null,null,0,null,null,null,null,null,null,null,null,null,null,null,"-",null,{"$f":"IF(SUMPRODUCT((A$14:A507=A507)*(B$14:B507=B507)*(C$14:C507=C507))>1,0,1)","v":0},"NO","NO",{"$f":"IFERROR(VLOOKUP(F507,Tipo!$C$12:$C$27,1,FALSE),\"NO\")","v":"NO"},"NO","NO"]
[null,null,null,null,null,null,null,null,null,{"$f":"IF(ISERROR(VLOOKUP(I508,Eje_Pilar!$C$2:$E$47,2,FALSE)),\" \",VLOOKUP(I508,Eje_Pilar!$C$2:$E$47,2,FALSE))","v":" "},{"$f":"IF(ISERROR(VLOOKUP(I508,Eje_Pilar!$C$2:$E$47,3,FALSE)),\" \",VLOOKUP(I508,Eje_Pilar!$C$2:$E$47,3,FALSE))","v":" "},null,null,null,null,null,null,null,null,0,null,null,null,null,null,null,null,null,null,null,null,"-",null,{"$f":"IF(SUMPRODUCT((A$14:A508=A508)*(B$14:B508=B508)*(C$14:C508=C508))>1,0,1)","v":0},"NO","NO",{"$f":"IFERROR(VLOOKUP(F508,Tipo!$C$12:$C$27,1,FALSE),\"NO\")","v":"NO"},"NO","NO"]
[null,null,null,null,null,null,null,null,null,{"$f":"IF(ISERROR(VLOOKUP(I509,Eje_Pilar!$C$2:$E$47,2,FALSE)),\" \",VLOOKUP(I509,Eje_Pilar!$C$2:$E$47,2,FALSE))","v":" "},{"$f":"IF(ISERROR(VLOOKUP(I509,Eje_Pilar!$C$2:$E$47,3,FALSE)),\" \",VLOOKUP(I509,Eje_Pilar!$C$2:$E$47,3,FALSE))","v":" "},null,null,null,null,null,null,null,null,0,null,null,null,null,null,null,null,null,null,null,null,"-",null,{"$f":"IF(SUMPRODUCT((A$14:A509=A509)*(B$14:B509=B509)*(C$14:C509=C509))>1,0,1)","v":0},"NO","NO",{"$f":"IFERROR(VLOOKUP(F509,Tipo!$C$12:$C$27,1,FALSE),\"NO\")","v":"NO"},"NO","NO"]
[null,null,null,null,null,null,null,null,null,{"$f":"IF(ISERROR(VLOOKUP(I510,Eje_Pilar!$C$2:$E$47,2,FALSE)),\" \",VLOOKUP(I510,Eje_Pilar!$C$2:$E$47,2,FALSE))","v":" "},{"$f":"IF(ISERROR(VLOOKUP(I510,Eje_Pilar!$C$2:$E$47,3,FALSE)),\" \",VLOOKUP(I510,Eje_Pilar!$C$2:$E$47,3,FALSE))","v":" "},null,null,null,null,null,null,null,null,0,null,null,null,null,null,null,null,null,null,null,null,"-",null,{"$f":"IF(SUMPRODUCT((A$14:A510=A510)*(B$14:B510=B510)*(C$14:C510=C510))>1,0,1)","v":0},"NO","NO",{"$f":"IFERROR(VLOOKUP(F510,Tipo!$C$12:$C$27,1,FALSE),\"NO\")","v":"NO"},"NO","NO"]
[null,null,null,null,null,null,null,null,null,{"$f":"IF(ISERROR(VLOOKUP(I511,Eje_Pilar!$C$2:$E$47,2,FALSE)),\" \",VLOOKUP(I511,Eje_Pilar!$C$2:$E$47,2,FALSE))","v":" "},{"$f":"IF(ISERROR(VLOOKUP(I511,Eje_Pilar!$C$2:$E$47,3,FALSE)),\" \",VLOOKUP(I511,Eje_Pilar!$C$2:$E$47,3,FALSE))","v":" "},null,null,null,null,null,null,null,null,0,null,null,null,null,null,null,null,null,null,null,null,"-",null,{"$f":"IF(SUMPRODUCT((A$14:A511=A511)*(B$14:B511=B511)*(C$14:C511=C511))>1,0,1)","v":0},"NO","NO",{"$f":"IFERROR(VLOOKUP(F511,Tipo!$C$12:$C$27,1,FALSE),\"NO\")","v":"NO"},"NO","NO"]
[null,null,null,null,null,null,null,null,null,{"$f":"IF(ISERROR(VLOOKUP(I512,Eje_Pilar!$C$2:$E$47,2,FALSE)),\" \",VLOOKUP(I512,Eje_Pilar!$C$2:$E$47,2,FALSE))","v":" "},{"$f":"IF(ISERROR(VLOOKUP(I512,Eje_Pilar!$C$2:$E$47,3,FALSE)),\" \",VLOOKUP(I512,Eje_Pilar!$C$2:$E$47,3,FALSE))","v":" "},null,null,null,null,null,null,null,null,0,null,null,null,null,null,null,null,null,null,null,null,"-",null,{"$f":"IF(SUMPRODUCT((A$14:A512=A512)*(B$14:B512=B512)*(C$14:C512=C512))>1,0,1)","v":0},"NO","NO",{"$f":"IFERROR(VLOOKUP(F512,Tipo!$C$12:$C$27,1,FALSE),\"NO\")","v":"NO"},"NO","NO"]
[null,null,null,null,null,null,null,null,null,{"$f":"IF(ISERROR(VLOOKUP(I513,Eje_Pilar!$C$2:$E$47,2,FALSE)),\" \",VLOOKUP(I513,Eje_Pilar!$C$2:$E$47,2,FALSE))","v":" "},{"$f":"IF(ISERROR(VLOOKUP(I513,Eje_Pilar!$C$2:$E$47,3,FALSE)),\" \",VLOOKUP(I513,Eje_Pilar!$C$2:$E$47,3,FALSE))","v":" "},null,null,null,null,null,null,null,null,0,null,null,null,null,null,null,null,null,null,null,null,"-",null,{"$f":"IF(SUMPRODUCT((A$14:A513=A513)*(B$14:B513=B513)*(C$14:C513=C513))>1,0,1)","v":0},"NO","NO",{"$f":"IFERROR(VLOOKUP(F513,Tipo!$C$12:$C$27,1,FALSE),\"NO\")","v":"NO"},"NO","NO"]
[null,null,null,null,null,null,null,null,null,{"$f":"IF(ISERROR(VLOOKUP(I514,Eje_Pilar!$C$2:$E$47,2,FALSE)),\" \",VLOOKUP(I514,Eje_Pilar!$C$2:$E$47,2,FALSE))","v":" "},{"$f":"IF(ISERROR(VLOOKUP(I514,Eje_Pilar!$C$2:$E$47,3,FALSE)),\" \",VLOOKUP(I514,Eje_Pilar!$C$2:$E$47,3,FALSE))","v":" "},null,null,null,null,null,null,null,null,0,null,null,null,null,null,null,null,null,null,null,null,"-",null,{"$f":"IF(SUMPRODUCT((A$14:A514=A514)*(B$14:B514=B514)*(C$14:C514=C514))>1,0,1)","v":0},"NO","NO",{"$f":"IFERROR(VLOOKUP(F514,Tipo!$C$12:$C$27,1,FALSE),\"NO\")","v":"NO"},"NO","NO"]
[null,null,null,null,null,null,null,null,null,{"$f":"IF(ISERROR(VLOOKUP(I515,Eje_Pilar!$C$2:$E$47,2,FALSE)),\" \",VLOOKUP(I515,Eje_Pilar!$C$2:$E$47,2,FALSE))","v":" "},{"$f":"IF(ISERROR(VLOOKUP(I515,Eje_Pilar!$C$2:$E$47,3,FALSE)),\" \",VLOOKUP(I515,Eje_Pilar!$C$2:$E$47,3,FALSE))","v":" "},null,null,null,null,null,null,null,null,0,null,null,null,null,null,null,null,null,null,null,null,"-",null,{"$f":"IF(SUMPRODUCT((A$14:A515=A515)*(B$14:B515=B515)*(C$14:C515=C515))>1,0,1)","v":0},"NO","NO",{"$f":"IFERROR(VLOOKUP(F515,Tipo!$C$12:$C$27,1,FALSE),\"NO\")","v":"NO"},"NO","NO"]
[null,null,null,null,null,null,null,null,null,{"$f":"IF(ISERROR(VLOOKUP(I516,Eje_Pilar!$C$2:$E$47,2,FALSE)),\" \",VLOOKUP(I516,Eje_Pilar!$C$2:$E$47,2,FALSE))","v":" "},{"$f":"IF(ISERROR(VLOOKUP(I516,Eje_Pilar!$C$2:$E$47,3,FALSE)),\" \",VLOOKUP(I516,Eje_Pilar!$C$2:$E$47,3,FALSE))","v":" "},null,null,null,null,null,null,null,null,0,null,null,null,null,null,null,null,null,null,null,null,"-",null,{"$f":"IF(SUMPRODUCT((A$14:A516=A516)*(B$14:B516=B516)*(C$14:C516=C516))>1,0,1)","v":0},"NO","NO",{"$f":"IFERROR(VLOOKUP(F516,Tipo!$C$12:$C$27,1,FALSE),\"NO\")","v":"NO"},"NO","NO"]
[null,null,null,null,null,null,null,null,null,{"$f":"IF(ISERROR(VLOOKUP(I517,Eje_Pilar!$C$2:$E$47,2,FALSE)),\" \",VLOOKUP(I517,Eje_Pilar!$C$2:$E$47,2,FALSE))","v":" "},{"$f":"IF(ISERROR(VLOOKUP(I517,Eje_Pilar!$C$2:$E$47,3,FALSE)),\" \",VLOOKUP(I517,Eje_Pilar!$C$2:$E$47,3,FALSE))","v":" "},null,null,null,null,null,null,null,null,0,null,null,null,null,null,null,null,null,null,null,null,"-",null,{"$f":"IF(SUMPRODUCT((A$14:A517=A517)*(B$14:B517=B517)*(C$14:C517=C517))>1,0,1)","v":0},"NO","NO",{"$f":"IFERROR(VLOOKUP(F517,Tipo!$C$12:$C$27,1,FALSE),\"NO\")","v":"NO"},"NO","NO"]
[null,null,null,null,null,null,null,null,null,{"$f":"IF(ISERROR(VLOOKUP(I518,Eje_Pilar!$C$2:$E$47,2,FALSE)),\" \",VLOOKUP(I518,Eje_Pilar!$C$2:$E$47,2,FALSE))","v":" "},{"$f":"IF(ISERROR(VLOOKUP(I518,Eje_Pilar!$C$2:$E$47,3,FALSE)),\" \",VLOOKUP(I518,Eje_Pilar!$C$2:$E$47,3,FALSE))","v":" "},null,null,null,null,null,null,null,null,0,null,null,null,null,null,null,null,null,null,null,null,"-",null,{"$f":"IF(SUMPRODUCT((A$14:A518=A518)*(B$14:B518=B518)*(C$14:C518=C518))>1,0,1)","v":0},"NO","NO",{"$f":"IFERROR(VLOOKUP(F518,Tipo!$C$12:$C$27,1,FALSE),\"NO\")","v":"NO"},"NO","NO"]
[null,null,null,null,null,null,null,null,null,{"$f":"IF(ISERROR(VLOOKUP(I519,Eje_Pilar!$C$2:$E$47,2,FALSE)),\" \",VLOOKUP(I519,Eje_Pilar!$C$2:$E$47,2,FALSE))","v":" "},{"$f":"IF(ISERROR(VLOOKUP(I519,Eje_Pilar!$C$2:$E$47,3,FALSE)),\" \",VLOOKUP(I519,Eje_Pilar!$C$2:$E$47,3,FALSE))","v":" "},null,null,null,null,null,null,null,null,0,null,null,null,null,null,null,null,null,null,null,null,"-",null,{"$f":"IF(SUMPRODUCT((A$14:A519=A519)*(B$14:B519=B519)*(C$14:C519=C519))>1,0,1)","v":0},"NO","NO",{"$f":"IFERROR(VLOOKUP(F519,Tipo!$C$12:$C$27,1,FALSE),\"NO\")","v":"NO"},"NO","NO"]
[null,null,null,null,null,null,null,null,null,{"$f":"IF(ISERROR(VLOOKUP(I520,Eje_Pilar!$C$2:$E$47,2,FALSE)),\" \",VLOOKUP(I520,Eje_Pilar!$C$2:$E$47,2,FALSE))","v":" "},{"$f":"IF(ISERROR(VLOOKUP(I520,Eje_Pilar!$C$2:$E$47,3,FALSE)),\" \",VLOOKUP(I520,Eje_Pilar!$C$2:$E$47,3,FALSE))","v":" "},null,null,null,null,null,null,null,null,0,null,null,null,null,null,null,null,null,null,null,null,"-",null,{"$f":"IF(SUMPRODUCT((A$14:A520=A520)*(B$14:B520=B520)*(C$14:C520=C520))>1,0,1)","v":0},"NO","NO",{"$f":"IFERROR(VLOOKUP(F520,Tipo!$C$12:$C$27,1,FALSE),\"NO\")","v":"NO"},"NO","NO"]
[null,null,null,null,null,null,null,null,null,{"$f":"IF(ISERROR(VLOOKUP(I521,Eje_Pilar!$C$2:$E$47,2,FALSE)),\" \",VLOOKUP(I521,Eje_Pilar!$C$2:$E$47,2,FALSE))","v":" "},{"$f":"IF(ISERROR(VLOOKUP(I521,Eje_Pilar!$C$2:$E$47,3,FALSE)),\" \",VLOOKUP(I521,Eje_Pilar!$C$2:$E$47,3,FALSE))","v":" "},null,null,null,null,null,null,null,null,0,null,null,null,null,null,null,null,null,null,null,null,"-",null,{"$f":"IF(SUMPRODUCT((A$14:A521=A521)*(B$14:B521=B521)*(C$14:C521=C521))>1,0,1)","v":0},"NO","NO",{"$f":"IFERROR(VLOOKUP(F521,Tipo!$C$12:$C$27,1,FALSE),\"NO\")","v":"NO"},"NO","NO"]
[null,null,null,null,null,null,null,null,null,{"$f":"IF(ISERROR(VLOOKUP(I522,Eje_Pilar!$C$2:$E$47,2,FALSE)),\" \",VLOOKUP(I522,Eje_Pilar!$C$2:$E$47,2,FALSE))","v":" "},{"$f":"IF(ISERROR(VLOOKUP(I522,Eje_Pilar!$C$2:$E$47,3,FALSE)),\" \",VLOOKUP(I522,Eje_Pilar!$C$2:$E$47,3,FALSE))","v":" "},null,null,null,null,null,null,null,null,0,null,null,null,null,null,null,null,null,null,null,null,"-",null,{"$f":"IF(SUMPRODUCT((A$14:A522=A522)*(B$14:B522=B522)*(C$14:C522=C522))>1,0,1)","v":0},"NO","NO",{"$f":"IFERROR(VLOOKUP(F522,Tipo!$C$12:$C$27,1,FALSE),\"NO\")","v":"NO"},"NO","NO"]
[null,null,null,null,null,null,null,null,null,{"$f":"IF(ISERROR(VLOOKUP(I523,Eje_Pilar!$C$2:$E$47,2,FALSE)),\" \",VLOOKUP(I523,Eje_Pilar!$C$2:$E$47,2,FALSE))","v":" "},{"$f":"IF(ISERROR(VLOOKUP(I523,Eje_Pilar!$C$2:$E$47,3,FALSE)),\" \",VLOOKUP(I523,Eje_Pilar!$C$2:$E$47,3,FALSE))","v":" "},null,null,null,null,null,null,null,null,0,null,null,null,null,null,null,null,null,null,null,null,"-",null,{"$f":"IF(SUMPRODUCT((A$14:A523=A523)*(B$14:B523=B523)*(C$14:C523=C523))>1,0,1)","v":0},"NO","NO",{"$f":"IFERROR(VLOOKUP(F523,Tipo!$C$12:$C$27,1,FALSE),\"NO\")","v":"NO"},"NO","NO"]
[null,null,null,null,null,null,null,null,null,{"$f":"IF(ISERROR(VLOOKUP(I524,Eje_Pilar!$C$2:$E$47,2,FALSE)),\" \",VLOOKUP(I524,Eje_Pilar!$C$2:$E$47,2,FALSE))","v":" "},{"$f":"IF(ISERROR(VLOOKUP(I524,Eje_Pilar!$C$2:$E$47,3,FALSE)),\" \",VLOOKUP(I524,Eje_Pilar!$C$2:$E$47,3,FALSE))","v":" "},null,null,null,null,null,null,null,null,0,null,null,null,null,null,null,null,null,null,null,null,"-",null,{"$f":"IF(SUMPRODUCT((A$14:A524=A524)*(B$14:B524=B524)*(C$14:C524=C524))>1,0,1)","v":0},"NO","NO",{"$f":"IFERROR(VLOOKUP(F524,Tipo!$C$12:$C$27,1,FALSE),\"NO\")","v":"NO"},"NO","NO"]
[null,null,null,null,null,null,null,null,null,{"$f":"IF(ISERROR(VLOOKUP(I525,Eje_Pilar!$C$2:$E$47,2,FALSE)),\" \",VLOOKUP(I525,Eje_Pilar!$C$2:$E$47,2,FALSE))","v":" "},{"$f":"IF(ISERROR(VLOOKUP(I525,Eje_Pilar!$C$2:$E$47,3,FALSE)),\" \",VLOOKUP(I525,Eje_Pilar!$C$2:$E$47,3,FALSE))","v":" "},null,null,null,null,null,null,null,null,0,null,null,null,null,null,null,null,null,null,null,null,"-",null,{"$f":"IF(SUMPRODUCT((A$14:A525=A525)*(B$14:B525=B525)*(C$14:C525=C525))>1,0,1)","v":0},"NO","NO",{"$f":"IFERROR(VLOOKUP(F525,Tipo!$C$12:$C$27,1,FALSE),\"NO\")","v":"NO"},"NO","NO"]
[null,null,null,null,null,null,null,null,null,{"$f":"IF(ISERROR(VLOOKUP(I526,Eje_Pilar!$C$2:$E$47,2,FALSE)),\" \",VLOOKUP(I526,Eje_Pilar!$C$2:$E$47,2,FALSE))","v":" "},{"$f":"IF(ISERROR(VLOOKUP(I526,Eje_Pilar!$C$2:$E$47,3,FALSE)),\" \",VLOOKUP(I526,Eje_Pilar!$C$2:$E$47,3,FALSE))","v":" "},null,null,null,null,null,null,null,null,0,null,null,null,null,null,null,null,null,null,null,null,"-",null,{"$f":"IF(SUMPRODUCT((A$14:A526=A526)*(B$14:B526=B526)*(C$14:C526=C526))>1,0,1)","v":0},"NO","NO",{"$f":"IFERROR(VLOOKUP(F526,Tipo!$C$12:$C$27,1,FALSE),\"NO\")","v":"NO"},"NO","NO"]
[null,null,null,null,null,null,null,null,null,{"$f":"IF(ISERROR(VLOOKUP(I527,Eje_Pilar!$C$2:$E$47,2,FALSE)),\" \",VLOOKUP(I527,Eje_Pilar!$C$2:$E$47,2,FALSE))","v":" "},{"$f":"IF(ISERROR(VLOOKUP(I527,Eje_Pilar!$C$2:$E$47,3,FALSE)),\" \",VLOOKUP(I527,Eje_Pilar!$C$2:$E$47,3,FALSE))","v":" "},null,null,null,null,null,null,null,null,0,null,null,null,null,null,null,null,null,null,null,null,"-",null,{"$f":"IF(SUMPRODUCT((A$14:A527=A527)*(B$14:B527=B527)*(C$14:C527=C527))>1,0,1)","v":0},"NO","NO",{"$f":"IFERROR(VLOOKUP(F527,Tipo!$C$12:$C$27,1,FALSE),\"NO\")","v":"NO"},"NO","NO"]
[null,null,null,null,null,null,null,null,null,{"$f":"IF(ISERROR(VLOOKUP(I528,Eje_Pilar!$C$2:$E$47,2,FALSE)),\" \",VLOOKUP(I528,Eje_Pilar!$C$2:$E$47,2,FALSE))","v":" "},{"$f":"IF(ISERROR(VLOOKUP(I528,Eje_Pilar!$C$2:$E$47,3,FALSE)),\" \",VLOOKUP(I528,Eje_Pilar!$C$2:$E$47,3,FALSE))","v":" "},null,null,null,null,null,null,null,null,0,null,null,null,null,null,null,null,null,null,null,null,{"$f":"IF(ISERROR(U528/T528),\"-\",(U528/T528))","v":"-"},null,{"$f":"IF(SUMPRODUCT((A$14:A528=A528)*(B$14:B528=B528)*(C$14:C528=C528))>1,0,1)","v":0},"NO","NO",{"$f":"IFERROR(VLOOKUP(F528,Tipo!$C$12:$C$27,1,FALSE),\"NO\")","v":"NO"},"NO","NO"]
[null,null,null,null,null,null,null,null,null,{"$f":"IF(ISERROR(VLOOKUP(I529,Eje_Pilar!$C$2:$E$47,2,FALSE)),\" \",VLOOKUP(I529,Eje_Pilar!$C$2:$E$47,2,FALSE))","v":" "},{"$f":"IF(ISERROR(VLOOKUP(I529,Eje_Pilar!$C$2:$E$47,3,FALSE)),\" \",VLOOKUP(I529,Eje_Pilar!$C$2:$E$47,3,FALSE))","v":" "},null,null,null,null,null,null,null,null,0,null,null,null,null,null,null,null,null,null,null,null,"-",null,{"$f":"IF(SUMPRODUCT((A$14:A529=A529)*(B$14:B529=B529)*(C$14:C529=C529))>1,0,1)","v":0},"NO","NO",{"$f":"IFERROR(VLOOKUP(F529,Tipo!$C$12:$C$27,1,FALSE),\"NO\")","v":"NO"},"NO","NO"]
[null,null,null,null,null,null,null,null,null,{"$f":"IF(ISERROR(VLOOKUP(I530,Eje_Pilar!$C$2:$E$47,2,FALSE)),\" \",VLOOKUP(I530,Eje_Pilar!$C$2:$E$47,2,FALSE))","v":" "},{"$f":"IF(ISERROR(VLOOKUP(I530,Eje_Pilar!$C$2:$E$47,3,FALSE)),\" \",VLOOKUP(I530,Eje_Pilar!$C$2:$E$47,3,FALSE))","v":" "},null,null,null,null,null,null,null,null,0,null,null,null,null,null,null,null,null,null,null,null,"-",null,{"$f":"IF(SUMPRODUCT((A$14:A530=A530)*(B$14:B530=B530)*(C$14:C530=C530))>1,0,1)","v":0},"NO","NO",{"$f":"IFERROR(VLOOKUP(F530,Tipo!$C$12:$C$27,1,FALSE),\"NO\")","v":"NO"},"NO","NO"]
[null,null,null,null,null,null,null,null,null,{"$f":"IF(ISERROR(VLOOKUP(I531,Eje_Pilar!$C$2:$E$47,2,FALSE)),\" \",VLOOKUP(I531,Eje_Pilar!$C$2:$E$47,2,FALSE))","v":" "},{"$f":"IF(ISERROR(VLOOKUP(I531,Eje_Pilar!$C$2:$E$47,3,FALSE)),\" \",VLOOKUP(I531,Eje_Pilar!$C$2:$E$47,3,FALSE))","v":" "},null,null,null,null,null,null,null,null,0,null,null,null,null,null,null,null,null,null,null,null,"-",null,{"$f":"IF(SUMPRODUCT((A$14:A531=A531)*(B$14:B531=B531)*(C$14:C531=C531))>1,0,1)","v":0},"NO","NO",{"$f":"IFERROR(VLOOKUP(F531,Tipo!$C$12:$C$27,1,FALSE),\"NO\")","v":"NO"},"NO","NO"]
[null,null,null,null,null,null,null,null,null,{"$f":"IF(ISERROR(VLOOKUP(I532,Eje_Pilar!$C$2:$E$47,2,FALSE)),\" \",VLOOKUP(I532,Eje_Pilar!$C$2:$E$47,2,FALSE))","v":" "},{"$f":"IF(ISERROR(VLOOKUP(I532,Eje_Pilar!$C$2:$E$47,3,FALSE)),\" \",VLOOKUP(I532,Eje_Pilar!$C$2:$E$47,3,FALSE))","v":" "},null,null,null,null,null,null,null,null,0,null,null,null,null,null,null,null,null,null,null,null,"-",null,{"$f":"IF(SUMPRODUCT((A$14:A532=A532)*(B$14:B532=B532)*(C$14:C532=C532))>1,0,1)","v":0},"NO","NO",{"$f":"IFERROR(VLOOKUP(F532,Tipo!$C$12:$C$27,1,FALSE),\"NO\")","v":"NO"},"NO","NO"]
[null,null,null,null,null,null,null,null,null,{"$f":"IF(ISERROR(VLOOKUP(I533,Eje_Pilar!$C$2:$E$47,2,FALSE)),\" \",VLOOKUP(I533,Eje_Pilar!$C$2:$E$47,2,FALSE))","v":" "},{"$f":"IF(ISERROR(VLOOKUP(I533,Eje_Pilar!$C$2:$E$47,3,FALSE)),\" \",VLOOKUP(I533,Eje_Pilar!$C$2:$E$47,3,FALSE))","v":" "},null,null,null,null,null,null,null,null,0,null,null,null,null,null,null,null,null,null,null,null,"-",null,{"$f":"IF(SUMPRODUCT((A$14:A533=A533)*(B$14:B533=B533)*(C$14:C533=C533))>1,0,1)","v":0},"NO","NO",{"$f":"IFERROR(VLOOKUP(F533,Tipo!$C$12:$C$27,1,FALSE),\"NO\")","v":"NO"},"NO","NO"]
[null,null,null,null,null,null,null,null,null,{"$f":"IF(ISERROR(VLOOKUP(I534,Eje_Pilar!$C$2:$E$47,2,FALSE)),\" \",VLOOKUP(I534,Eje_Pilar!$C$2:$E$47,2,FALSE))","v":" "},{"$f":"IF(ISERROR(VLOOKUP(I534,Eje_Pilar!$C$2:$E$47,3,FALSE)),\" \",VLOOKUP(I534,Eje_Pilar!$C$2:$E$47,3,FALSE))","v":" "},null,null,null,null,null,null,null,null,0,null,null,null,null,null,null,null,null,null,null,null,"-",null,{"$f":"IF(SUMPRODUCT((A$14:A534=A534)*(B$14:B534=B534)*(C$14:C534=C534))>1,0,1)","v":0},"NO","NO",{"$f":"IFERROR(VLOOKUP(F534,Tipo!$C$12:$C$27,1,FALSE),\"NO\")","v":"NO"},"NO","NO"]
[null,null,null,null,null,null,null,null,null,{"$f":"IF(ISERROR(VLOOKUP(I535,Eje_Pilar!$C$2:$E$47,2,FALSE)),\" \",VLOOKUP(I535,Eje_Pilar!$C$2:$E$47,2,FALSE))","v":" "},{"$f":"IF(ISERROR(VLOOKUP(I535,Eje_Pilar!$C$2:$E$47,3,FALSE)),\" \",VLOOKUP(I535,Eje_Pilar!$C$2:$E$47,3,FALSE))","v":" "},null,null,null,null,null,null,null,null,0,null,null,null,null,null,null,null,null,null,null,null,"-",null,{"$f":"IF(SUMPRODUCT((A$14:A535=A535)*(B$14:B535=B535)*(C$14:C535=C535))>1,0,1)","v":0},"NO","NO",{"$f":"IFERROR(VLOOKUP(F535,Tipo!$C$12:$C$27,1,FALSE),\"NO\")","v":"NO"},"NO","NO"]
[null,null,null,null,null,null,null,null,null,{"$f":"IF(ISERROR(VLOOKUP(I536,Eje_Pilar!$C$2:$E$47,2,FALSE)),\" \",VLOOKUP(I536,Eje_Pilar!$C$2:$E$47,2,FALSE))","v":" "},{"$f":"IF(ISERROR(VLOOKUP(I536,Eje_Pilar!$C$2:$E$47,3,FALSE)),\" \",VLOOKUP(I536,Eje_Pilar!$C$2:$E$47,3,FALSE))","v":" "},null,null,null,null,null,null,null,null,0,null,null,null,null,null,null,null,null,null,null,null,"-",null,{"$f":"IF(SUMPRODUCT((A$14:A536=A536)*(B$14:B536=B536)*(C$14:C536=C536))>1,0,1)","v":0},"NO","NO",{"$f":"IFERROR(VLOOKUP(F536,Tipo!$C$12:$C$27,1,FALSE),\"NO\")","v":"NO"},"NO","NO"]
[null,null,null,null,null,null,null,null,null,{"$f":"IF(ISERROR(VLOOKUP(I537,Eje_Pilar!$C$2:$E$47,2,FALSE)),\" \",VLOOKUP(I537,Eje_Pilar!$C$2:$E$47,2,FALSE))","v":" "},{"$f":"IF(ISERROR(VLOOKUP(I537,Eje_Pilar!$C$2:$E$47,3,FALSE)),\" \",VLOOKUP(I537,Eje_Pilar!$C$2:$E$47,3,FALSE))","v":" "},null,null,null,null,null,null,null,null,0,null,null,null,null,null,null,null,null,null,null,null,"-",null,{"$f":"IF(SUMPRODUCT((A$14:A537=A537)*(B$14:B537=B537)*(C$14:C537=C537))>1,0,1)","v":0},"NO","NO",{"$f":"IFERROR(VLOOKUP(F537,Tipo!$C$12:$C$27,1,FALSE),\"NO\")","v":"NO"},"NO","NO"]
[null,null,null,null,null,null,null,null,null,{"$f":"IF(ISERROR(VLOOKUP(I538,Eje_Pilar!$C$2:$E$47,2,FALSE)),\" \",VLOOKUP(I538,Eje_Pilar!$C$2:$E$47,2,FALSE))","v":" "},{"$f":"IF(ISERROR(VLOOKUP(I538,Eje_Pilar!$C$2:$E$47,3,FALSE)),\" \",VLOOKUP(I538,Eje_Pilar!$C$2:$E$47,3,FALSE))","v":" "},null,null,null,null,null,null,null,null,0,null,null,null,null,null,null,null,null,null,null,null,"-",null,{"$f":"IF(SUMPRODUCT((A$14:A538=A538)*(B$14:B538=B538)*(C$14:C538=C538))>1,0,1)","v":0},"NO","NO",{"$f":"IFERROR(VLOOKUP(F538,Tipo!$C$12:$C$27,1,FALSE),\"NO\")","v":"NO"},"NO","NO"]
[null,null,null,null,null,null,null,null,null,{"$f":"IF(ISERROR(VLOOKUP(I539,Eje_Pilar!$C$2:$E$47,2,FALSE)),\" \",VLOOKUP(I539,Eje_Pilar!$C$2:$E$47,2,FALSE))","v":" "},{"$f":"IF(ISERROR(VLOOKUP(I539,Eje_Pilar!$C$2:$E$47,3,FALSE)),\" \",VLOOKUP(I539,Eje_Pilar!$C$2:$E$47,3,FALSE))","v":" "},null,null,null,null,null,null,null,null,0,null,null,null,null,null,null,null,null,null,null,null,"-",null,{"$f":"IF(SUMPRODUCT((A$14:A539=A539)*(B$14:B539=B539)*(C$14:C539=C539))>1,0,1)","v":0},"NO","NO",{"$f":"IFERROR(VLOOKUP(F539,Tipo!$C$12:$C$27,1,FALSE),\"NO\")","v":"NO"},"NO","NO"]
[null,null,null,null,null,null,null,null,null,{"$f":"IF(ISERROR(VLOOKUP(I540,Eje_Pilar!$C$2:$E$47,2,FALSE)),\" \",VLOOKUP(I540,Eje_Pilar!$C$2:$E$47,2,FALSE))","v":" "},{"$f":"IF(ISERROR(VLOOKUP(I540,Eje_Pilar!$C$2:$E$47,3,FALSE)),\" \",VLOOKUP(I540,Eje_Pilar!$C$2:$E$47,3,FALSE))","v":" "},null,null,null,null,null,null,null,null,0,null,null,null,null,null,null,null,null,null,null,null,"-",null,{"$f":"IF(SUMPRODUCT((A$14:A540=A540)*(B$14:B540=B540)*(C$14:C540=C540))>1,0,1)","v":0},"NO","NO",{"$f":"IFERROR(VLOOKUP(F540,Tipo!$C$12:$C$27,1,FALSE),\"NO\")","v":"NO"},"NO","NO"]
[null,null,null,null,null,null,null,null,null,{"$f":"IF(ISERROR(VLOOKUP(I541,Eje_Pilar!$C$2:$E$47,2,FALSE)),\" \",VLOOKUP(I541,Eje_Pilar!$C$2:$E$47,2,FALSE))","v":" "},{"$f":"IF(ISERROR(VLOOKUP(I541,Eje_Pilar!$C$2:$E$47,3,FALSE)),\" \",VLOOKUP(I541,Eje_Pilar!$C$2:$E$47,3,FALSE))","v":" "},null,null,null,null,null,null,null,null,0,null,null,null,null,null,null,null,null,null,null,null,"-",null,{"$f":"IF(SUMPRODUCT((A$14:A541=A541)*(B$14:B541=B541)*(C$14:C541=C541))>1,0,1)","v":0},"NO","NO",{"$f":"IFERROR(VLOOKUP(F541,Tipo!$C$12:$C$27,1,FALSE),\"NO\")","v":"NO"},"NO","NO"]
[null,null,null,null,null,null,null,null,null,{"$f":"IF(ISERROR(VLOOKUP(I542,Eje_Pilar!$C$2:$E$47,2,FALSE)),\" \",VLOOKUP(I542,Eje_Pilar!$C$2:$E$47,2,FALSE))","v":" "},{"$f":"IF(ISERROR(VLOOKUP(I542,Eje_Pilar!$C$2:$E$47,3,FALSE)),\" \",VLOOKUP(I542,Eje_Pilar!$C$2:$E$47,3,FALSE))","v":" "},null,null,null,null,null,null,null,null,0,null,null,null,null,null,null,null,null,null,null,null,"-",null,{"$f":"IF(SUMPRODUCT((A$14:A542=A542)*(B$14:B542=B542)*(C$14:C542=C542))>1,0,1)","v":0},"NO","NO",{"$f":"IFERROR(VLOOKUP(F542,Tipo!$C$12:$C$27,1,FALSE),\"NO\")","v":"NO"},"NO","NO"]
[null,null,null,null,null,null,null,null,null,{"$f":"IF(ISERROR(VLOOKUP(I543,Eje_Pilar!$C$2:$E$47,2,FALSE)),\" \",VLOOKUP(I543,Eje_Pilar!$C$2:$E$47,2,FALSE))","v":" "},{"$f":"IF(ISERROR(VLOOKUP(I543,Eje_Pilar!$C$2:$E$47,3,FALSE)),\" \",VLOOKUP(I543,Eje_Pilar!$C$2:$E$47,3,FALSE))","v":" "},null,null,null,null,null,null,null,null,0,null,null,null,null,null,null,null,null,null,null,null,"-",null,{"$f":"IF(SUMPRODUCT((A$14:A543=A543)*(B$14:B543=B543)*(C$14:C543=C543))>1,0,1)","v":0},"NO","NO",{"$f":"IFERROR(VLOOKUP(F543,Tipo!$C$12:$C$27,1,FALSE),\"NO\")","v":"NO"},"NO","NO"]
[null,null,null,null,null,null,null,null,null,{"$f":"IF(ISERROR(VLOOKUP(I544,Eje_Pilar!$C$2:$E$47,2,FALSE)),\" \",VLOOKUP(I544,Eje_Pilar!$C$2:$E$47,2,FALSE))","v":" "},{"$f":"IF(ISERROR(VLOOKUP(I544,Eje_Pilar!$C$2:$E$47,3,FALSE)),\" \",VLOOKUP(I544,Eje_Pilar!$C$2:$E$47,3,FALSE))","v":" "},null,null,null,null,null,null,null,null,0,null,null,null,null,null,null,null,null,null,null,null,"-",null,{"$f":"IF(SUMPRODUCT((A$14:A544=A544)*(B$14:B544=B544)*(C$14:C544=C544))>1,0,1)","v":0},"NO","NO",{"$f":"IFERROR(VLOOKUP(F544,Tipo!$C$12:$C$27,1,FALSE),\"NO\")","v":"NO"},"NO","NO"]
[null,null,null,null,null,null,null,null,null,{"$f":"IF(ISERROR(VLOOKUP(I545,Eje_Pilar!$C$2:$E$47,2,FALSE)),\" \",VLOOKUP(I545,Eje_Pilar!$C$2:$E$47,2,FALSE))","v":" "},{"$f":"IF(ISERROR(VLOOKUP(I545,Eje_Pilar!$C$2:$E$47,3,FALSE)),\" \",VLOOKUP(I545,Eje_Pilar!$C$2:$E$47,3,FALSE))","v":" "},null,null,null,null,null,null,null,null,0,null,null,null,null,null,null,null,null,null,null,null,"-",null,{"$f":"IF(SUMPRODUCT((A$14:A545=A545)*(B$14:B545=B545)*(C$14:C545=C545))>1,0,1)","v":0},"NO","NO",{"$f":"IFERROR(VLOOKUP(F545,Tipo!$C$12:$C$27,1,FALSE),\"NO\")","v":"NO"},"NO","NO"]
[null,null,null,null,null,null,null,null,null,{"$f":"IF(ISERROR(VLOOKUP(I546,Eje_Pilar!$C$2:$E$47,2,FALSE)),\" \",VLOOKUP(I546,Eje_Pilar!$C$2:$E$47,2,FALSE))","v":" "},{"$f":"IF(ISERROR(VLOOKUP(I546,Eje_Pilar!$C$2:$E$47,3,FALSE)),\" \",VLOOKUP(I546,Eje_Pilar!$C$2:$E$47,3,FALSE))","v":" "},null,null,null,null,null,null,null,null,0,null,null,null,null,null,null,null,null,null,null,null,"-",null,{"$f":"IF(SUMPRODUCT((A$14:A546=A546)*(B$14:B546=B546)*(C$14:C546=C546))>1,0,1)","v":0},"NO","NO",{"$f":"IFERROR(VLOOKUP(F546,Tipo!$C$12:$C$27,1,FALSE),\"NO\")","v":"NO"},"NO","NO"]
[null,null,null,null,null,null,null,null,null,{"$f":"IF(ISERROR(VLOOKUP(I547,Eje_Pilar!$C$2:$E$47,2,FALSE)),\" \",VLOOKUP(I547,Eje_Pilar!$C$2:$E$47,2,FALSE))","v":" "},{"$f":"IF(ISERROR(VLOOKUP(I547,Eje_Pilar!$C$2:$E$47,3,FALSE)),\" \",VLOOKUP(I547,Eje_Pilar!$C$2:$E$47,3,FALSE))","v":" "},null,null,null,null,null,null,null,null,0,null,null,null,null,null,null,null,null,null,null,null,"-",null,{"$f":"IF(SUMPRODUCT((A$14:A547=A547)*(B$14:B547=B547)*(C$14:C547=C547))>1,0,1)","v":0},"NO","NO",{"$f":"IFERROR(VLOOKUP(F547,Tipo!$C$12:$C$27,1,FALSE),\"NO\")","v":"NO"},"NO","NO"]
[null,null,null,null,null,null,null,null,null,{"$f":"IF(ISERROR(VLOOKUP(I548,Eje_Pilar!$C$2:$E$47,2,FALSE)),\" \",VLOOKUP(I548,Eje_Pilar!$C$2:$E$47,2,FALSE))","v":" "},{"$f":"IF(ISERROR(VLOOKUP(I548,Eje_Pilar!$C$2:$E$47,3,FALSE)),\" \",VLOOKUP(I548,Eje_Pilar!$C$2:$E$47,3,FALSE))","v":" "},null,null,null,null,null,null,null,null,0,null,null,null,null,null,null,null,null,null,null,null,"-",null,{"$f":"IF(SUMPRODUCT((A$14:A548=A548)*(B$14:B548=B548)*(C$14:C548=C548))>1,0,1)","v":0},"NO","NO",{"$f":"IFERROR(VLOOKUP(F548,Tipo!$C$12:$C$27,1,FALSE),\"NO\")","v":"NO"},"NO","NO"]
[null,null,null,null,null,null,null,null,null,{"$f":"IF(ISERROR(VLOOKUP(I549,Eje_Pilar!$C$2:$E$47,2,FALSE)),\" \",VLOOKUP(I549,Eje_Pilar!$C$2:$E$47,2,FALSE))","v":" "},{"$f":"IF(ISERROR(VLOOKUP(I549,Eje_Pilar!$C$2:$E$47,3,FALSE)),\" \",VLOOKUP(I549,Eje_Pilar!$C$2:$E$47,3,FALSE))","v":" "},null,null,null,null,null,null,null,null,0,null,null,null,null,null,null,null,null,null,null,null,"-",null,{"$f":"IF(SUMPRODUCT((A$14:A549=A549)*(B$14:B549=B549)*(C$14:C549=C549))>1,0,1)","v":0},"NO","NO",{"$f":"IFERROR(VLOOKUP(F549,Tipo!$C$12:$C$27,1,FALSE),\"NO\")","v":"NO"},"NO","NO"]
[null,null,null,null,null,null,null,null,null,{"$f":"IF(ISERROR(VLOOKUP(I550,Eje_Pilar!$C$2:$E$47,2,FALSE)),\" \",VLOOKUP(I550,Eje_Pilar!$C$2:$E$47,2,FALSE))","v":" "},{"$f":"IF(ISERROR(VLOOKUP(I550,Eje_Pilar!$C$2:$E$47,3,FALSE)),\" \",VLOOKUP(I550,Eje_Pilar!$C$2:$E$47,3,FALSE))","v":" "},null,null,null,null,null,null,null,null,0,null,null,null,null,null,null,null,null,null,null,null,"-",null,{"$f":"IF(SUMPRODUCT((A$14:A550=A550)*(B$14:B550=B550)*(C$14:C550=C550))>1,0,1)","v":0},"NO","NO",{"$f":"IFERROR(VLOOKUP(F550,Tipo!$C$12:$C$27,1,FALSE),\"NO\")","v":"NO"},"NO","NO"]
[null,null,null,null,null,null,null,null,null,{"$f":"IF(ISERROR(VLOOKUP(I551,Eje_Pilar!$C$2:$E$47,2,FALSE)),\" \",VLOOKUP(I551,Eje_Pilar!$C$2:$E$47,2,FALSE))","v":" "},{"$f":"IF(ISERROR(VLOOKUP(I551,Eje_Pilar!$C$2:$E$47,3,FALSE)),\" \",VLOOKUP(I551,Eje_Pilar!$C$2:$E$47,3,FALSE))","v":" "},null,null,null,null,null,null,null,null,0,null,null,null,null,null,null,null,null,null,null,null,"-",null,{"$f":"IF(SUMPRODUCT((A$14:A551=A551)*(B$14:B551=B551)*(C$14:C551=C551))>1,0,1)","v":0},"NO","NO",{"$f":"IFERROR(VLOOKUP(F551,Tipo!$C$12:$C$27,1,FALSE),\"NO\")","v":"NO"},"NO","NO"]
[null,null,null,null,null,null,null,null,null,{"$f":"IF(ISERROR(VLOOKUP(I552,Eje_Pilar!$C$2:$E$47,2,FALSE)),\" \",VLOOKUP(I552,Eje_Pilar!$C$2:$E$47,2,FALSE))","v":" "},{"$f":"IF(ISERROR(VLOOKUP(I552,Eje_Pilar!$C$2:$E$47,3,FALSE)),\" \",VLOOKUP(I552,Eje_Pilar!$C$2:$E$47,3,FALSE))","v":" "},null,null,null,null,null,null,null,null,0,null,null,null,null,null,null,null,null,null,null,null,"-",null,{"$f":"IF(SUMPRODUCT((A$14:A552=A552)*(B$14:B552=B552)*(C$14:C552=C552))>1,0,1)","v":0},"NO","NO",{"$f":"IFERROR(VLOOKUP(F552,Tipo!$C$12:$C$27,1,FALSE),\"NO\")","v":"NO"},"NO","NO"]
[null,null,null,null,null,null,null,null,null,{"$f":"IF(ISERROR(VLOOKUP(I553,Eje_Pilar!$C$2:$E$47,2,FALSE)),\" \",VLOOKUP(I553,Eje_Pilar!$C$2:$E$47,2,FALSE))","v":" "},{"$f":"IF(ISERROR(VLOOKUP(I553,Eje_Pilar!$C$2:$E$47,3,FALSE)),\" \",VLOOKUP(I553,Eje_Pilar!$C$2:$E$47,3,FALSE))","v":" "},null,null,null,null,null,null,null,null,0,null,null,null,null,null,null,null,null,null,null,null,"-",null,{"$f":"IF(SUMPRODUCT((A$14:A553=A553)*(B$14:B553=B553)*(C$14:C553=C553))>1,0,1)","v":0},"NO","NO",{"$f":"IFERROR(VLOOKUP(F553,Tipo!$C$12:$C$27,1,FALSE),\"NO\")","v":"NO"},"NO","NO"]
[null,null,null,null,null,null,null,null,null,{"$f":"IF(ISERROR(VLOOKUP(I554,Eje_Pilar!$C$2:$E$47,2,FALSE)),\" \",VLOOKUP(I554,Eje_Pilar!$C$2:$E$47,2,FALSE))","v":" "},{"$f":"IF(ISERROR(VLOOKUP(I554,Eje_Pilar!$C$2:$E$47,3,FALSE)),\" \",VLOOKUP(I554,Eje_Pilar!$C$2:$E$47,3,FALSE))","v":" "},null,null,null,null,null,null,null,null,0,null,null,null,null,null,null,null,null,null,null,null,"-",null,{"$f":"IF(SUMPRODUCT((A$14:A554=A554)*(B$14:B554=B554)*(C$14:C554=C554))>1,0,1)","v":0},"NO","NO",{"$f":"IFERROR(VLOOKUP(F554,Tipo!$C$12:$C$27,1,FALSE),\"NO\")","v":"NO"},"NO","NO"]
[null,null,null,null,null,null,null,null,null,{"$f":"IF(ISERROR(VLOOKUP(I555,Eje_Pilar!$C$2:$E$47,2,FALSE)),\" \",VLOOKUP(I555,Eje_Pilar!$C$2:$E$47,2,FALSE))","v":" "},{"$f":"IF(ISERROR(VLOOKUP(I555,Eje_Pilar!$C$2:$E$47,3,FALSE)),\" \",VLOOKUP(I555,Eje_Pilar!$C$2:$E$47,3,FALSE))","v":" "},null,null,null,null,null,null,null,null,0,null,null,null,null,null,null,null,null,null,null,null,"-",null,{"$f":"IF(SUMPRODUCT((A$14:A555=A555)*(B$14:B555=B555)*(C$14:C555=C555))>1,0,1)","v":0},"NO","NO",{"$f":"IFERROR(VLOOKUP(F555,Tipo!$C$12:$C$27,1,FALSE),\"NO\")","v":"NO"},"NO","NO"]
[null,null,null,null,null,null,null,null,null,{"$f":"IF(ISERROR(VLOOKUP(I556,Eje_Pilar!$C$2:$E$47,2,FALSE)),\" \",VLOOKUP(I556,Eje_Pilar!$C$2:$E$47,2,FALSE))","v":" "},{"$f":"IF(ISERROR(VLOOKUP(I556,Eje_Pilar!$C$2:$E$47,3,FALSE)),\" \",VLOOKUP(I556,Eje_Pilar!$C$2:$E$47,3,FALSE))","v":" "},null,null,null,null,null,null,null,null,0,null,null,null,null,null,null,null,null,null,null,null,"-",null,{"$f":"IF(SUMPRODUCT((A$14:A556=A556)*(B$14:B556=B556)*(C$14:C556=C556))>1,0,1)","v":0},"NO","NO",{"$f":"IFERROR(VLOOKUP(F556,Tipo!$C$12:$C$27,1,FALSE),\"NO\")","v":"NO"},"NO","NO"]
[null,null,null,null,null,null,null,null,null,{"$f":"IF(ISERROR(VLOOKUP(I557,Eje_Pilar!$C$2:$E$47,2,FALSE)),\" \",VLOOKUP(I557,Eje_Pilar!$C$2:$E$47,2,FALSE))","v":" "},{"$f":"IF(ISERROR(VLOOKUP(I557,Eje_Pilar!$C$2:$E$47,3,FALSE)),\" \",VLOOKUP(I557,Eje_Pilar!$C$2:$E$47,3,FALSE))","v":" "},null,null,null,null,null,null,null,null,0,null,null,null,null,null,null,null,null,null,null,null,"-",null,{"$f":"IF(SUMPRODUCT((A$14:A557=A557)*(B$14:B557=B557)*(C$14:C557=C557))>1,0,1)","v":0},"NO","NO",{"$f":"IFERROR(VLOOKUP(F557,Tipo!$C$12:$C$27,1,FALSE),\"NO\")","v":"NO"},"NO","NO"]
[null,null,null,null,null,null,null,null,null,{"$f":"IF(ISERROR(VLOOKUP(I558,Eje_Pilar!$C$2:$E$47,2,FALSE)),\" \",VLOOKUP(I558,Eje_Pilar!$C$2:$E$47,2,FALSE))","v":" "},{"$f":"IF(ISERROR(VLOOKUP(I558,Eje_Pilar!$C$2:$E$47,3,FALSE)),\" \",VLOOKUP(I558,Eje_Pilar!$C$2:$E$47,3,FALSE))","v":" "},null,null,null,null,null,null,null,null,0,null,null,null,null,null,null,null,null,null,null,null,"-",null,{"$f":"IF(SUMPRODUCT((A$14:A558=A558)*(B$14:B558=B558)*(C$14:C558=C558))>1,0,1)","v":0},"NO","NO",{"$f":"IFERROR(VLOOKUP(F558,Tipo!$C$12:$C$27,1,FALSE),\"NO\")","v":"NO"},"NO","NO"]
[null,null,null,null,null,null,null,null,null,{"$f":"IF(ISERROR(VLOOKUP(I559,Eje_Pilar!$C$2:$E$47,2,FALSE)),\" \",VLOOKUP(I559,Eje_Pilar!$C$2:$E$47,2,FALSE))","v":" "},{"$f":"IF(ISERROR(VLOOKUP(I559,Eje_Pilar!$C$2:$E$47,3,FALSE)),\" \",VLOOKUP(I559,Eje_Pilar!$C$2:$E$47,3,FALSE))","v":" "},null,null,null,null,null,null,null,null,0,null,null,null,null,null,null,null,null,null,null,null,"-",null,{"$f":"IF(SUMPRODUCT((A$14:A559=A559)*(B$14:B559=B559)*(C$14:C559=C559))>1,0,1)","v":0},"NO","NO",{"$f":"IFERROR(VLOOKUP(F559,Tipo!$C$12:$C$27,1,FALSE),\"NO\")","v":"NO"},"NO","NO"]
[null,null,null,null,null,null,null,null,null,{"$f":"IF(ISERROR(VLOOKUP(I560,Eje_Pilar!$C$2:$E$47,2,FALSE)),\" \",VLOOKUP(I560,Eje_Pilar!$C$2:$E$47,2,FALSE))","v":" "},{"$f":"IF(ISERROR(VLOOKUP(I560,Eje_Pilar!$C$2:$E$47,3,FALSE)),\" \",VLOOKUP(I560,Eje_Pilar!$C$2:$E$47,3,FALSE))","v":" "},null,null,null,null,null,null,null,null,0,null,null,null,null,null,null,null,null,null,null,null,"-",null,{"$f":"IF(SUMPRODUCT((A$14:A560=A560)*(B$14:B560=B560)*(C$14:C560=C560))>1,0,1)","v":0},"NO","NO",{"$f":"IFERROR(VLOOKUP(F560,Tipo!$C$12:$C$27,1,FALSE),\"NO\")","v":"NO"},"NO","NO"]
[null,null,null,null,null,null,null,null,null,{"$f":"IF(ISERROR(VLOOKUP(I561,Eje_Pilar!$C$2:$E$47,2,FALSE)),\" \",VLOOKUP(I561,Eje_Pilar!$C$2:$E$47,2,FALSE))","v":" "},{"$f":"IF(ISERROR(VLOOKUP(I561,Eje_Pilar!$C$2:$E$47,3,FALSE)),\" \",VLOOKUP(I561,Eje_Pilar!$C$2:$E$47,3,FALSE))","v":" "},null,null,null,null,null,null,null,null,0,null,null,null,null,null,null,null,null,null,null,null,"-",null,{"$f":"IF(SUMPRODUCT((A$14:A561=A561)*(B$14:B561=B561)*(C$14:C561=C561))>1,0,1)","v":0},"NO","NO",{"$f":"IFERROR(VLOOKUP(F561,Tipo!$C$12:$C$27,1,FALSE),\"NO\")","v":"NO"},"NO","NO"]
[null,null,null,null,null,null,null,null,null,{"$f":"IF(ISERROR(VLOOKUP(I562,Eje_Pilar!$C$2:$E$47,2,FALSE)),\" \",VLOOKUP(I562,Eje_Pilar!$C$2:$E$47,2,FALSE))","v":" "},{"$f":"IF(ISERROR(VLOOKUP(I562,Eje_Pilar!$C$2:$E$47,3,FALSE)),\" \",VLOOKUP(I562,Eje_Pilar!$C$2:$E$47,3,FALSE))","v":" "},null,null,null,null,null,null,null,null,0,null,null,null,null,null,null,null,null,null,null,null,"-",null,{"$f":"IF(SUMPRODUCT((A$14:A562=A562)*(B$14:B562=B562)*(C$14:C562=C562))>1,0,1)","v":0},"NO","NO",{"$f":"IFERROR(VLOOKUP(F562,Tipo!$C$12:$C$27,1,FALSE),\"NO\")","v":"NO"},"NO","NO"]
[null,null,null,null,null,null,null,null,null,{"$f":"IF(ISERROR(VLOOKUP(I563,Eje_Pilar!$C$2:$E$47,2,FALSE)),\" \",VLOOKUP(I563,Eje_Pilar!$C$2:$E$47,2,FALSE))","v":" "},{"$f":"IF(ISERROR(VLOOKUP(I563,Eje_Pilar!$C$2:$E$47,3,FALSE)),\" \",VLOOKUP(I563,Eje_Pilar!$C$2:$E$47,3,FALSE))","v":" "},null,null,null,null,null,null,null,null,{"$f":"+O563+Q563+S563","v":0},null,null,null,null,null,null,null,null,null,null,null,"-",null,{"$f":"IF(SUMPRODUCT((A$14:A563=A563)*(B$14:B563=B563)*(C$14:C563=C563))>1,0,1)","v":0},{"$f":"IFERROR(VLOOKUP(D563,tipo,1,FALSE),\"NO\")","v":"NO"},{"$f":"IFERROR(VLOOKUP(E563,modal,1,FALSE),\"NO\")","v":"NO"},{"$f":"IFERROR(VLOOKUP(F563,Tipo!$C$12:$C$27,1,FALSE),\"NO\")","v":"NO"},{"$f":"IFERROR(VLOOKUP(H563,afectacion,1,FALSE),\"NO\")","v":"NO"},{"$f":"IFERROR(VLOOKUP(I563,programa,1,FALSE),\"NO\")","v":"NO"}]
[null,null,null,null,null,null,null,null,null,{"$f":"IF(ISERROR(VLOOKUP(I564,Eje_Pilar!$C$2:$E$47,2,FALSE)),\" \",VLOOKUP(I564,Eje_Pilar!$C$2:$E$47,2,FALSE))","v":" "},{"$f":"IF(ISERROR(VLOOKUP(I564,Eje_Pilar!$C$2:$E$47,3,FALSE)),\" \",VLOOKUP(I564,Eje_Pilar!$C$2:$E$47,3,FALSE))","v":" "},null,null,null,null,null,null,null,null,0,null,null,null,null,null,null,null,null,null,null,null,"-",null,{"$f":"IF(SUMPRODUCT((A$14:A564=A564)*(B$14:B564=B564)*(C$14:C564=C564))>1,0,1)","v":0},"NO","NO",{"$f":"IFERROR(VLOOKUP(F564,Tipo!$C$12:$C$27,1,FALSE),\"NO\")","v":"NO"},"NO","NO"]
[null,null,null,null,null,null,null,null,null,{"$f":"IF(ISERROR(VLOOKUP(I565,Eje_Pilar!$C$2:$E$47,2,FALSE)),\" \",VLOOKUP(I565,Eje_Pilar!$C$2:$E$47,2,FALSE))","v":" "},{"$f":"IF(ISERROR(VLOOKUP(I565,Eje_Pilar!$C$2:$E$47,3,FALSE)),\" \",VLOOKUP(I565,Eje_Pilar!$C$2:$E$47,3,FALSE))","v":" "},null,null,null,null,null,null,null,null,0,null,null,null,null,null,null,null,null,null,null,null,"-",null,{"$f":"IF(SUMPRODUCT((A$14:A565=A565)*(B$14:B565=B565)*(C$14:C565=C565))>1,0,1)","v":0},"NO","NO",{"$f":"IFERROR(VLOOKUP(F565,Tipo!$C$12:$C$27,1,FALSE),\"NO\")","v":"NO"},"NO","NO"]
[null,null,null,null,null,null,null,null,null,{"$f":"IF(ISERROR(VLOOKUP(I566,Eje_Pilar!$C$2:$E$47,2,FALSE)),\" \",VLOOKUP(I566,Eje_Pilar!$C$2:$E$47,2,FALSE))","v":" "},{"$f":"IF(ISERROR(VLOOKUP(I566,Eje_Pilar!$C$2:$E$47,3,FALSE)),\" \",VLOOKUP(I566,Eje_Pilar!$C$2:$E$47,3,FALSE))","v":" "},null,null,null,null,null,null,null,null,0,null,null,null,null,null,null,null,null,null,null,null,"-",null,{"$f":"IF(SUMPRODUCT((A$14:A566=A566)*(B$14:B566=B566)*(C$14:C566=C566))>1,0,1)","v":0},"NO","NO",{"$f":"IFERROR(VLOOKUP(F566,Tipo!$C$12:$C$27,1,FALSE),\"NO\")","v":"NO"},"NO","NO"]
[null,null,null,null,null,null,null,null,null,{"$f":"IF(ISERROR(VLOOKUP(I567,Eje_Pilar!$C$2:$E$47,2,FALSE)),\" \",VLOOKUP(I567,Eje_Pilar!$C$2:$E$47,2,FALSE))","v":" "},{"$f":"IF(ISERROR(VLOOKUP(I567,Eje_Pilar!$C$2:$E$47,3,FALSE)),\" \",VLOOKUP(I567,Eje_Pilar!$C$2:$E$47,3,FALSE))","v":" "},null,null,null,null,null,null,null,null,0,null,null,null,null,null,null,null,null,null,null,null,"-",null,{"$f":"IF(SUMPRODUCT((A$14:A567=A567)*(B$14:B567=B567)*(C$14:C567=C567))>1,0,1)","v":0},"NO","NO",{"$f":"IFERROR(VLOOKUP(F567,Tipo!$C$12:$C$27,1,FALSE),\"NO\")","v":"NO"},"NO","NO"]
[null,null,null,null,null,null,null,null,null,{"$f":"IF(ISERROR(VLOOKUP(I568,Eje_Pilar!$C$2:$E$47,2,FALSE)),\" \",VLOOKUP(I568,Eje_Pilar!$C$2:$E$47,2,FALSE))","v":" "},{"$f":"IF(ISERROR(VLOOKUP(I568,Eje_Pilar!$C$2:$E$47,3,FALSE)),\" \",VLOOKUP(I568,Eje_Pilar!$C$2:$E$47,3,FALSE))","v":" "},null,null,null,null,null,null,null,null,0,null,null,null,null,null,null,null,null,null,null,null,"-",null,{"$f":"IF(SUMPRODUCT((A$14:A568=A568)*(B$14:B568=B568)*(C$14:C568=C568))>1,0,1)","v":0},"NO","NO",{"$f":"IFERROR(VLOOKUP(F568,Tipo!$C$12:$C$27,1,FALSE),\"NO\")","v":"NO"},"NO","NO"]
[null,null,null,null,null,null,null,null,null,{"$f":"IF(ISERROR(VLOOKUP(I569,Eje_Pilar!$C$2:$E$47,2,FALSE)),\" \",VLOOKUP(I569,Eje_Pilar!$C$2:$E$47,2,FALSE))","v":" "},{"$f":"IF(ISERROR(VLOOKUP(I569,Eje_Pilar!$C$2:$E$47,3,FALSE)),\" \",VLOOKUP(I569,Eje_Pilar!$C$2:$E$47,3,FALSE))","v":" "},null,null,null,null,null,null,null,null,0,null,null,null,null,null,null,null,null,null,null,null,"-",null,{"$f":"IF(SUMPRODUCT((A$14:A569=A569)*(B$14:B569=B569)*(C$14:C569=C569))>1,0,1)","v":0},"NO","NO",{"$f":"IFERROR(VLOOKUP(F569,Tipo!$C$12:$C$27,1,FALSE),\"NO\")","v":"NO"},"NO","NO"]
[null,null,null,null,null,null,null,null,null,{"$f":"IF(ISERROR(VLOOKUP(I570,Eje_Pilar!$C$2:$E$47,2,FALSE)),\" \",VLOOKUP(I570,Eje_Pilar!$C$2:$E$47,2,FALSE))","v":" "},{"$f":"IF(ISERROR(VLOOKUP(I570,Eje_Pilar!$C$2:$E$47,3,FALSE)),\" \",VLOOKUP(I570,Eje_Pilar!$C$2:$E$47,3,FALSE))","v":" "},null,null,null,null,null,null,null,null,0,null,null,null,null,null,null,null,null,null,null,null,"-",null,{"$f":"IF(SUMPRODUCT((A$14:A570=A570)*(B$14:B570=B570)*(C$14:C570=C570))>1,0,1)","v":0},"NO","NO",{"$f":"IFERROR(VLOOKUP(F570,Tipo!$C$12:$C$27,1,FALSE),\"NO\")","v":"NO"},"NO","NO"]
[null,null,null,null,null,null,null,null,null,{"$f":"IF(ISERROR(VLOOKUP(I571,Eje_Pilar!$C$2:$E$47,2,FALSE)),\" \",VLOOKUP(I571,Eje_Pilar!$C$2:$E$47,2,FALSE))","v":" "},{"$f":"IF(ISERROR(VLOOKUP(I571,Eje_Pilar!$C$2:$E$47,3,FALSE)),\" \",VLOOKUP(I571,Eje_Pilar!$C$2:$E$47,3,FALSE))","v":" "},null,null,null,null,null,null,null,null,0,null,null,null,null,null,null,null,null,null,null,null,"-",null,{"$f":"IF(SUMPRODUCT((A$14:A571=A571)*(B$14:B571=B571)*(C$14:C571=C571))>1,0,1)","v":0},"NO","NO",{"$f":"IFERROR(VLOOKUP(F571,Tipo!$C$12:$C$27,1,FALSE),\"NO\")","v":"NO"},"NO","NO"]
[null,null,null,null,null,null,null,null,null,{"$f":"IF(ISERROR(VLOOKUP(I572,Eje_Pilar!$C$2:$E$47,2,FALSE)),\" \",VLOOKUP(I572,Eje_Pilar!$C$2:$E$47,2,FALSE))","v":" "},{"$f":"IF(ISERROR(VLOOKUP(I572,Eje_Pilar!$C$2:$E$47,3,FALSE)),\" \",VLOOKUP(I572,Eje_Pilar!$C$2:$E$47,3,FALSE))","v":" "},null,null,null,null,null,null,null,null,0,null,null,null,null,null,null,null,null,null,null,null,"-",null,{"$f":"IF(SUMPRODUCT((A$14:A572=A572)*(B$14:B572=B572)*(C$14:C572=C572))>1,0,1)","v":0},"NO","NO",{"$f":"IFERROR(VLOOKUP(F572,Tipo!$C$12:$C$27,1,FALSE),\"NO\")","v":"NO"},"NO","NO"]
[null,null,null,null,null,null,null,null,null,{"$f":"IF(ISERROR(VLOOKUP(I573,Eje_Pilar!$C$2:$E$47,2,FALSE)),\" \",VLOOKUP(I573,Eje_Pilar!$C$2:$E$47,2,FALSE))","v":" "},{"$f":"IF(ISERROR(VLOOKUP(I573,Eje_Pilar!$C$2:$E$47,3,FALSE)),\" \",VLOOKUP(I573,Eje_Pilar!$C$2:$E$47,3,FALSE))","v":" "},null,null,null,null,null,null,null,null,0,null,null,null,null,null,null,null,null,null,null,null,"-",null,{"$f":"IF(SUMPRODUCT((A$14:A573=A573)*(B$14:B573=B573)*(C$14:C573=C573))>1,0,1)","v":0},"NO","NO",{"$f":"IFERROR(VLOOKUP(F573,Tipo!$C$12:$C$27,1,FALSE),\"NO\")","v":"NO"},"NO","NO"]
[null,null,null,null,null,null,null,null,null,{"$f":"IF(ISERROR(VLOOKUP(I574,Eje_Pilar!$C$2:$E$47,2,FALSE)),\" \",VLOOKUP(I574,Eje_Pilar!$C$2:$E$47,2,FALSE))","v":" "},{"$f":"IF(ISERROR(VLOOKUP(I574,Eje_Pilar!$C$2:$E$47,3,FALSE)),\" \",VLOOKUP(I574,Eje_Pilar!$C$2:$E$47,3,FALSE))","v":" "},null,null,null,null,null,null,null,null,0,null,null,null,null,null,null,null,null,null,null,null,"-",null,{"$f":"IF(SUMPRODUCT((A$14:A574=A574)*(B$14:B574=B574)*(C$14:C574=C574))>1,0,1)","v":0},"NO","NO",{"$f":"IFERROR(VLOOKUP(F574,Tipo!$C$12:$C$27,1,FALSE),\"NO\")","v":"NO"},"NO","NO"]
[null,null,null,null,null,null,null,null,null,{"$f":"IF(ISERROR(VLOOKUP(I575,Eje_Pilar!$C$2:$E$47,2,FALSE)),\" \",VLOOKUP(I575,Eje_Pilar!$C$2:$E$47,2,FALSE))","v":" "},{"$f":"IF(ISERROR(VLOOKUP(I575,Eje_Pilar!$C$2:$E$47,3,FALSE)),\" \",VLOOKUP(I575,Eje_Pilar!$C$2:$E$47,3,FALSE))","v":" "},null,null,null,null,null,null,null,null,0,null,null,null,null,null,null,null,null,null,null,null,"-",null,{"$f":"IF(SUMPRODUCT((A$14:A575=A575)*(B$14:B575=B575)*(C$14:C575=C575))>1,0,1)","v":0},"NO","NO",{"$f":"IFERROR(VLOOKUP(F575,Tipo!$C$12:$C$27,1,FALSE),\"NO\")","v":"NO"},"NO","NO"]
[null,null,null,null,null,null,null,null,null,{"$f":"IF(ISERROR(VLOOKUP(I576,Eje_Pilar!$C$2:$E$47,2,FALSE)),\" \",VLOOKUP(I576,Eje_Pilar!$C$2:$E$47,2,FALSE))","v":" "},{"$f":"IF(ISERROR(VLOOKUP(I576,Eje_Pilar!$C$2:$E$47,3,FALSE)),\" \",VLOOKUP(I576,Eje_Pilar!$C$2:$E$47,3,FALSE))","v":" "},null,null,null,null,null,null,null,null,0,null,null,null,null,null,null,null,null,null,null,null,"-",null,{"$f":"IF(SUMPRODUCT((A$14:A576=A576)*(B$14:B576=B576)*(C$14:C576=C576))>1,0,1)","v":0},"NO","NO",{"$f":"IFERROR(VLOOKUP(F576,Tipo!$C$12:$C$27,1,FALSE),\"NO\")","v":"NO"},"NO","NO"]
[null,null,null,null,null,null,null,null,null,{"$f":"IF(ISERROR(VLOOKUP(I577,Eje_Pilar!$C$2:$E$47,2,FALSE)),\" \",VLOOKUP(I577,Eje_Pilar!$C$2:$E$47,2,FALSE))","v":" "},{"$f":"IF(ISERROR(VLOOKUP(I577,Eje_Pilar!$C$2:$E$47,3,FALSE)),\" \",VLOOKUP(I577,Eje_Pilar!$C$2:$E$47,3,FALSE))","v":" "},null,null,null,null,null,null,null,null,0,null,null,null,null,null,null,null,null,null,null,null,"-",null,{"$f":"IF(SUMPRODUCT((A$14:A577=A577)*(B$14:B577=B577)*(C$14:C577=C577))>1,0,1)","v":0},"NO","NO",{"$f":"IFERROR(VLOOKUP(F577,Tipo!$C$12:$C$27,1,FALSE),\"NO\")","v":"NO"},"NO","NO"]
[null,null,null,null,null,null,null,null,null,{"$f":"IF(ISERROR(VLOOKUP(I578,Eje_Pilar!$C$2:$E$47,2,FALSE)),\" \",VLOOKUP(I578,Eje_Pilar!$C$2:$E$47,2,FALSE))","v":" "},{"$f":"IF(ISERROR(VLOOKUP(I578,Eje_Pilar!$C$2:$E$47,3,FALSE)),\" \",VLOOKUP(I578,Eje_Pilar!$C$2:$E$47,3,FALSE))","v":" "},null,null,null,null,null,null,null,null,0,null,null,null,null,null,null,null,null,null,null,null,"-",null,{"$f":"IF(SUMPRODUCT((A$14:A578=A578)*(B$14:B578=B578)*(C$14:C578=C578))>1,0,1)","v":0},"NO","NO",{"$f":"IFERROR(VLOOKUP(F578,Tipo!$C$12:$C$27,1,FALSE),\"NO\")","v":"NO"},"NO","NO"]
[null,null,null,null,null,null,null,null,null,{"$f":"IF(ISERROR(VLOOKUP(I579,Eje_Pilar!$C$2:$E$47,2,FALSE)),\" \",VLOOKUP(I579,Eje_Pilar!$C$2:$E$47,2,FALSE))","v":" "},{"$f":"IF(ISERROR(VLOOKUP(I579,Eje_Pilar!$C$2:$E$47,3,FALSE)),\" \",VLOOKUP(I579,Eje_Pilar!$C$2:$E$47,3,FALSE))","v":" "},null,null,null,null,null,null,null,null,0,null,null,null,null,null,null,null,null,null,null,null,"-",null,{"$f":"IF(SUMPRODUCT((A$14:A579=A579)*(B$14:B579=B579)*(C$14:C579=C579))>1,0,1)","v":0},"NO","NO",{"$f":"IFERROR(VLOOKUP(F579,Tipo!$C$12:$C$27,1,FALSE),\"NO\")","v":"NO"},"NO","NO"]
[null,null,null,null,null,null,null,null,null,{"$f":"IF(ISERROR(VLOOKUP(I580,Eje_Pilar!$C$2:$E$47,2,FALSE)),\" \",VLOOKUP(I580,Eje_Pilar!$C$2:$E$47,2,FALSE))","v":" "},{"$f":"IF(ISERROR(VLOOKUP(I580,Eje_Pilar!$C$2:$E$47,3,FALSE)),\" \",VLOOKUP(I580,Eje_Pilar!$C$2:$E$47,3,FALSE))","v":" "},null,null,null,null,null,null,null,null,0,null,null,null,null,null,null,null,null,null,null,null,"-",null,{"$f":"IF(SUMPRODUCT((A$14:A580=A580)*(B$14:B580=B580)*(C$14:C580=C580))>1,0,1)","v":0},"NO","NO",{"$f":"IFERROR(VLOOKUP(F580,Tipo!$C$12:$C$27,1,FALSE),\"NO\")","v":"NO"},"NO","NO"]
["TOTALES",null,null,null,null,null,null,null,null,null,null,null,null,null,{"$f":"SUM(O14:O580)","v":19044432144.620102},43,-391377178,220,4478893636.333334,23131948602.95343,9508380575]

{"sheet":"Instructivo","index":1,"n_rows":298,"n_cols":13,"rows_kept":298,"cut":false,"hidden":false,"merged":[[1,1,1,3],[2,1,2,3],[4,1,4,3],[5,1,5,3],[6,1,6,3],[8,1,8,3],[9,1,9,3],[10,1,10,3],[3,1,3,3],[23,1,23,3],[12,1,12,3],[7,1,7,3],[63,1,63,3],[24,1,25,1],[24,2,25,2],[28,1,29,1],[28,2,29,2],[30,1,50,1],[32,2,33,2],[51,1,53,1],[51,2,53,2],[56,1,58,1],[57,2,58,2],[60,1,61,1],[87,1,87,3],[64,1,66,1],[64,2,66,2],[67,1,68,1],[67,2,68,2],[70,1,71,1],[70,2,71,2],[73,1,76,1],[73,2,76,2],[79,1,79,3],[80,1,81,1],[80,2,81,2]]}
[]
[null,"OBSERVACIONES INICIALES"]
[null,"Recomendamos leer cuidadosamente y poner en práctica las instrucciones que se explican en este instructivo. De la calidad de la información que se registre, depende en gran medida la calidad del informe de rendición de cuentas de la Gestión Contractual que presenta el Alcalde Mayor, consolidado por la Veeduría Distrital."]
[null,"La base en Excel a diligenciar es inmodificable, debe utilizar versión Excel 2010 o posteriores, la versión 2007 no habilita los macros.  La base no permite que se incluyan columnas con otro tipo de información que la Veeduría Distrital no está solicitando o que se cambie el formato de celda establecido. Tenga en cuenta que muchas celdas están bloqueadas y/o solo permiten el registro de una información determinada."]
[null,"La información que se registre en la base, debe coincidir con los reportes realizados en PREDIS y en el SECOP"]
[null,"Diligencie la totalidad de celdas."]
[null,"Para insertar una o varias filas, haga click  en el opción Insertar Filas y digite el número de filas a insertar. Si usted no sigue este procedimiento las filas que copie no tomaran el formato de las filas anteriores."]
[null,"Si requiere inserte una o varias filas realícelo despues de la fila A15 y antes de la fila de Totales para que tomen el formato de las filas anteriores."]
[null,"En primer lugar diligencie toda la información correspondiente a los contratos suscritos con cargo a la vigencia 2019."]
[null,"Una vez incluidos todos los contratos de la vigencia 2019, a continuación diligencie el formato completo con la información correspondiente a las adiciones efectuadas con cargo a la vigencia 2019 de contratos suscritos en vigencias anteriores. La información general del contrato como: modalidad de selección, tipología contractual, objeto, entre otros, debe corresponder a la información del contrato adicionado o modificado. Respecto al valor solo se diligencia el valor en la columna adiciòn, es decir la columna de valor inicial debe quedar en blanco. No olvide registrar el nùmero de adiciones realizadas, en la columna correspondiente."]
[null,"En caso de haber realizado apropiaciones presupuestales en la vigencia a través de resoluciones, caja menor, honorarios ediles, servicios públicos, debe relacionar dicha información en una sola fila al final de la base, indicando de que se trata la apropiación y número de proyecto si hay lugar a ello. En el tipo de contrato se registra Otros gastos."]
[]
[null,"ENCABEZADO DEL FORMATO"]
[null,1,"Entidad","Indique el nombre completo de la Entidad."]
[null,2,"Sector","Relacione el sector al cual pertenece la Entidad."]
[null,3,"Presupuesto Disponible Inversión Directa","Indique el valor total del presupuesto disponible de inversión directa, de acuerdo con el PREDIS, a 31 de diciembre de 2019."]
[null,4,"Presupuesto Comprometido de Inversión Directa ","Escriba el valor total del presupuesto comprometido de inversión directa, de acuerdo con el PREDIS a 31 de diciembre de 2019."]
[null,5,"Presupuesto Disponible Funcionamiento","Indique el valor total del presupuesto de funcionamiento disponible, de acuerdo con el PREDIS a 31 de diciembre de 2019."]
[null,6,"Presupuesto Comprometido funcionamiento ","Escriba el monto del presupuesto de funcionamiento, comprometido mediante contratos, de acuerdo con el PREDIS a 31 de diciembre de 2019."]
[null,7,"Presupuesto Disponible Operación","Coloque el monto del presupuesto de operación disponible, de acuerdo con el PREDIS, a 31 de diciembre de 2019. Los gastos de operación corresponden solamente a aquellas entidades de régimen de contratación  privado."]
[null,8,"Presupuesto Comprometido operación mediante contratos","Escriba el monto del presupuesto de operación comprometido mediante contratos a 31 de diciembre de 2019."]
[null,9,"Nombre de quien diligencia el formato:","Indique el nombre completo, cargo, número de teléfono con extensión y correo electrónico del profesional que diligencia el formato y que posteriormente realizará los ajustes y aclaraciones a que haya lugar por solicitud de la Veeduría Distrital."]
[]
[null,"1- INFORMACIÓN GENERAL"]
[null,1,"Número de Contrato","En estricto orden consecutivo registre el número del contrato, sin incluir los contratos que fueron anulados."]
[null,null,null,"Una vez terminado el registro de los contratos con cargo a la vigencia 2019, en las siguientes filas registre la información correspondiente a las adiciones efectuadas con cargo a la vigencia 2019 de contratos suscritos en vigencias anteriores, especificando el año de suscripción en la columna dos."]
[null,2,"Año","Registre el año de celebración del contrato."]
[null,3,"Número de proceso en el SECOP","Relacione el número de proceso con el cual se encuentra publicado el contrato en el SECOP. Ejemplo IDU-CMA-DTDP-240-2019"]
[null,4,"Tipo de Contrato","En esta columna seleccione de la lista el tipo de contrato que corresponde al contrato suscrito. El formato no permite incluir tipo de contratos diferentes a los señaladas en la lista desplegable.  "]
[null,null,null,"Para las adiciones a contratos de años anteriores se debe diligenciar el tipo del contrato adicionado o modificado."]
[null,4,"Obra ","Son contratos de obra los que celebren las entidades estatales para la construcción, mantenimiento, instalación y, en general, para la realización de cualquier otro trabajo material sobre bienes inmuebles, cualquiera que sea la modalidad de ejecución y pago. Numeral 1 del Artículo 32 de la Ley 80 de 1993. "]
[null,null,"Consultoría","Aquellos que celebran las entidades estatales, referidos a los estudios necesarios para la ejecución de proyectos de inversión, de diagnósticos, prefactibilidad o factibilidad para programas o proyectos específicos, así como a las asesorías técnicas de coordinación, control y supervisión. Numeral 2 del Artículo 32 de la Ley 80 de 1993. "]
[null,null,"Interventoría","Son también  contratos de consultoría los que tienen por objeto la Interventoría, asesoría, gerencia de obras o de proyectos, dirección, programación y la ejecución de diseños, planos, anteproyectos y proyectos. Numeral 2 del Artículo 32 de la Ley 80 de 1993."]
[null,null,null,"El contrato de Interventoría tiene por objeto la  supervisión, seguimiento y vigilancia a la ejecución material de un contrato principal."]
[null,null,"Contrato de Prestación de servicios","Son contratos de prestación de servicios los que celebren las entidades estatales para desarrollar actividades relacionadas con la administración o funcionamiento de la entidad. Numeral 3 del Artículo 32 de la Ley 80 de 1993."]
[null,null,"Contrato de Prestación de servicios profesionales y de apoyo a la gestión","Corresponden a aquellos de naturaleza intelectual diferentes a los de consultoría que se derivan del cumplimiento de las funciones de la entidad estatal; así como los relacionados con actividades operativas, logísticas, o asistenciales. Art. 2.2.1.2.1.4.9, Decreto 1082 de 2015"]
[null,null,"Compraventa de bienes muebles","Son aquellos contratos donde se transfiere el dominio de un bien mueble (aquellos susceptibles de ser trasladadas de un lugar a otro sin alterar ni su forma ni su esencia, tal es el caso del mobiliario y equipo de oficina, maquinaria, automóviles, etc.), cuya ejecución se agota de manera instantánea. Artículo 660, Código Civil."]
[null,null,"Compraventa de bienes inmuebles","Son aquellos contratos donde se transfiere el dominio de un bien inmueble (todos aquellos bienes considerados bienes raíces, por tener de común la circunstancia de estar íntimamente ligados al suelo, unidos de modo inseparable, física o jurídicamente, al terreno). Artículo 656, Código Civil."]
[null,null,"Arrendamiento de bienes muebles","Es un contrato que tiene por objeto, conceder el uso y goce de un bien mueble a cambio de un precio determinado.  Artículo 1974 Código Civil."]
[null,null,"Arrendamiento de bienes inmuebles","Es un contrato que tiene por objeto, conceder el uso y goce de un bien inmueble a cambio de un precio determinado.  Artículo 2.2.1.2.1.4.11 Decreto 1082 de 2015"]
[null,null,"Seguros","El seguro es un contrato, en virtud del cual una persona jurídica llamada asegurador, asume, a cambio de una prima, un riesgo que le es trasladado por una persona natural o jurídica llamado tomador y en el cual éste tiene un interés asegurable, con el fin de indemnizarlo, en el evento de que ocurra la realización del riesgo amparado. de conformidad con el Título V, del Libro Cuarto del Código de Comercio "]
[null,null,"Suministro","El suministro es el contrato por el cual una parte se obliga, a cambio de una contraprestación, a cumplir en favor de otra, en forma independiente, prestaciones periódicas o continuadas de cosas o servicios. Artículo 968, Código de Comercio"]
[null,null,"Empréstitos","Son contratos de empréstito los que tienen por objeto proveer a la entidad estatal contratante de recursos en moneda nacional o extranjera con plazo para su pago. Artículo 7,  Decreto 2681 de 1996. "]
[null,null,"Fiducia mercantil o encargo fiduciario","Son contratos que tienen por objeto la administración o el manejo de los recursos vinculados a los contratos que tales entidades celebren. Numeral 5 de Articulo 32 de la Ley 80 de 1993."]
[null,null,"Concesión","Este contrato tiene por objeto otorgar a una persona llamada CONCESIONARIO  la prestación, operación, explotación, organización o gestión, total o parcial, de un servicio público, o la construcción, explotación o conservación total o parcial, de una obra o bien destinados al servicio o uso público, así como todas aquellas actividades necesarias para la adecuada prestación o funcionamiento de la obra o servicio por cuenta y riesgo del CONCESIONARIO, y bajo la vigilancia y control de la entidad concedente, a cambio de una remuneración que puede consistir en derechos, tarifas, tasas, valorización, o en la participación que se le otorgue en la explotación del bien, obra o servicio, o en una suma periódica, única o porcentual, y en general, en cualquier otra modalidad de contraprestación que las partes acuerden. Numeral 4 del Artículo 32 de la Ley 80 de 1993 "]
[null,null,"Convenios de cooperación","Son aquellos mediante los cuales se formaliza la asistencia, ayuda, auxilio, soporte o colaboración entre entidades de una misma nación, de distintos países o por parte de organizaciones internacionales de naturaleza pública o privada a favor de entidades públicas. Artículo 20 de la ley 1150"]
[null,null,"Convenios/Contratos interadministrativos","El convenio interadministrativo es el negocio jurídico en el cual están presentes dos entidades públicas en desarrollo de relaciones interadministrativas cuyo objeto es coordinar, cooperar, colaborar o distribuir competencias en la realización de funciones administrativas de interés común a los sujetos negóciales. Artículo 95 de la ley 489 de 1998."]
[null,null,"Convenios de Apoyo y/o Convenios de Asociación","Los contratos que en desarrollo de lo dispuesto en el segundo inciso del artículo 355 de la Constitución Política celebren la Nación, los Departamentos, Distritos y Municipios con entidades privadas sin ánimo de lucro y de reconocida idoneidad, con el propósito de impulsar programas y actividades de interés público.  Reglamentado mediante Decreto 92 de 2017"]
[null,null,"Asociaciones Público Privadas","Los contratos con personas naturales o jurídicas que se celebran en desarrollo de lo dispuesto en el Decreto 1508 de 2012."]
[null,null,"Otros","Los demás tipos de contratos que no se encuentren definidos en las anteriores tipologías."]
[null,null,"Otros gastos","Incluye los gastos no contractuales, estos se registran al final de la base, no cuentan con nùmero de contrato, tipo, proceso o modalidad.  Estos gastos en los que no media un acuerdo de voluntades, en caso de ser del rubro de inversiòn, se deben discriminar por programa y proyecto. En el caso de ser del rubro de funcionamiento no requieren ser discriminados."]
[null,5,"Modalidad de Selección","Al ubicarse en la celda, se despliega una lista de modalidades de selección, de las cuales debe seleccionar la indicada. El formato no permite incluir modalidades diferentes a las señaladas en la lista desplegable.  "]
[null,null,null,"Para las adiciones a contratos de años anteriores se debe diligenciar la modalidad de selección del contrato adicionado o modificado"]
[null,null,null,"La modalidad regimen especial se refiere a todos los contratos realizados en cumplimiento del Decreto 092 de 2017, convenios de asociaciòn con ESAL. Regimen Privado es para todas aquellas entidades, que no se rigen por el Estatuto General de Contrataciòn, para el caso, en estas entidades todos sus contratos deben ser identificados con esta modalidad."]
[null,6,"Procedimiento o causal","Esta columna solo se habilita y debe ser diligenciada, para las modalidades de selección abreviada y contratación directa. Al ubicarse en la celda, se despliega una lista de procedimientos o causales, de las cuales debe seleccionar la indicada. El formato no permite incluir procedimientos o causales diferentes a las señaladas en la lista desplegable.  "]
[null,7,"Objeto","Registre el objeto del contrato."]
[null,8,"Afectación ","Registre la afectación según la clasificación de cuentas del presupuesto de gastos. Funcionamiento, Inversión y Operación, esta última aplica únicamente para entidades de régimen privado. La celda solamente permite registrar estas tres opciones."]
[null,null,"Número Programa","Si en la columna anterior “Afectación”,  indicó funcionamiento u operación deje en blanco el número de programa, es decir esta columna solamente aplica para gastos de Inversión."]
[null,null,null,"Identifíquelo de acuerdo con el código presupuestal del plan de desarrollo Bogotá Mejor Para Todos. Si un mismo contrato afecta más de un código presupuestal discrimine el contrato por cada código que afecte en filas separadas. Si se registra el número del programa (de 1 a 45), automáticamente en la columna j y k se despliega el nombre del programa y el eje o pilar según corresponda."]
[null,9,"Número Proyecto","Indique el código presupuestal con el que se identifica el proyecto. Si un mismo contrato afecta más de un proyecto, discriminar el contrato por cada proyecto que afecte en filas separadas."]
[null,10,"Número de Identificación del contratista","Indicar el número de identificación del contratista persona natural o jurídica con quien se suscribió el contrato, con digito de verificación (DV), el formato de celda no permite guiones, puntos o comas, solo números. "]
[null,null,"Nombre del Contratista","Indicar el nombre del contratista, persona natural o jurídica."]
[]
[null,"2- INFORMACIÓN FINANCIERA"]
[null,11,"Valor Inicial ","Registre el valor inicial del contrato con cargo a la vigencia 2019, el formato de celda no permite guiones, puntos, comas o texto escrito. Esta columna solo debe contener información numérica."]
[null,null,null,"En el caso de adiciones a contratos de años anteriores,  no diligencie esta columna, solamente la columna 15 \"Adiciones\" "]
[null,null,null,"Excluya las reservas de apropiación y cuentas por pagar."]
[null,12,"Número de reducciones ","Diligencie esta columna solo en el caso de reducciones, reintegros, liberaciones, saldos a favor o cualquier factor que disminuya el valor de los contratos con cargo a la vigencia."]
[null,null,null,"Registre en esta celda la cantidad de reducciones que se realizaron al contrato."]
[null,13,"Valor total reducciones (En valor negativo)","Registre el valor total de las reducciones que se realizaron al contrato, el formato de celda no permite guiones, puntos, comas o texto escrito. Esta columna solo debe contener información numérica."]
[null,14,"Número de adiciones ","Diligencie esta columna solo en el caso de adiciones al valor inicial que aumenten el valor del contrato con cargo a la vigencia."]
[null,null,null,"Registre en esta celda el número de adiciones que se realizaron al contrato."]
[null,15,"Valor total de adiciones","Registre el valor total de las adiciones que se realizaron al contrato,  el formato de celda no permite guiones, puntos, comas o texto escrito. Esta columna solo debe contener información numérica."]
[null,16,"Valor Final","Esta columna se encuentra formulada y bloqueada, sí el valor final no coincide, es porque están mal diligenciadas las columnas valor inicial, valor de reducciones y/o valor de adiciones. En tal caso se debe verificar dicha información."]
[null,null,null,"La sumatoria de la columna 16 (valor final) para los contratos de Inversión Directa, según el programa del Plan de Desarrollo, deberá coincidir con el rubro registrado en el encabezado 4, Presupuesto comprometido de inversión según PREDIS, este valor debe coincidir a la vez con los informes de ejecución presupuestal del PREDIS.  "]
[null,null,null,"Si los valores no coinciden debe especificarse al final del formato en qué está representada la diferencia Otros gastos(discriminando los conceptos por Programa y Proyecto de inversión), con sus respectivos valores."]
[null,null,null,"Las bases donde dichos valores no coincidan serán devueltas por la Veeduría Distrital a cada entidad para los respectivos ajustes."]
[null,17,"Giros"," "]
[]
[null,"3- PLAZOS"]
[null,18,"Fecha de Suscripción","Relacionar la fecha en que se suscribió el contrato original. La celda solo admite el formato Día/Mes/Año así  17/02/2019."]
[]
[null,19,"Fecha de inicio","Indicar la fecha de inicio del contrato. Para las adiciones a contratos de años anteriores se debe diligenciar la fecha de inicio de la adición en la vigencia 2019. La celda solo admite el formato Día/Mes/Año así  13/03/2019."]
[null,20,"Fecha de terminación","Indicar la fecha efectiva de terminación del contrato. La celda solo admite el formato Día/Mes/Año así  15/02/2019."]
[null,21,"Plazo en días","Esta columna contiene el plazo inicial del contrato con el número total de días a ejecutar (sólo número de días, no mes, no texto)."]
[null,22,"Prórroga en días","En caso de presentarse este evento, indicar en días, el tiempo por el cual se prorrogó el contrato a partir de la fecha inicial de terminación (sólo número de días, no mes, no texto)."]
[]
[null,"4- ESTADO A 31 DE DICIEMBRE DE 2019"]
[null,23,"Estado","Marque con una X en la respectiva columna si el contrato se encuentra Anulado, Por Iniciar, En Ejecución, Terminado o Liquidado."]
[null,24,"% Avance y/o cumplimiento","Indica el porcentaje de avance o de cumplimiento del mismo en términos presupuestales, es decir lo efectivamente pagado al contratista. Si no se ha iniciado la ejecución, él % de avance es 0%. La celda se encuentra formulada y protegida. Es la relación entre el valor de los giros y el valor final del contrato. Si el porcentaje de avance no coincide, se debe revisar los valores que se registraron en estas columnas.  Este porcentaje no debe ser superior al 100%"]
[]
[]
[]
[]
[]
[]
[]
[]
[]
[]
[]
[]
[]
[]
[]
[]
[]
[]
[]
[]
[]
[]
[]
[]
[]
[]
[]
[]
[]
[]
[]
[]
[]
[]
[]
[]
[]
[]
[]
[]
[]
[]
[]
[]
[]
[]
[]
[]
[]
[]
[]
[]
[]
[]
[]
[]
[]
[]
[]
[]
[]
[]
[]
[]
[]
[]
[]
[]
[]
[]
[]
[]
[]
[]
[]
[]
[]
[]
[]
[]
[]
[]
[]
[]
[]
[]
[]
[]
[]
[]
[]
[]
[]
[]
[]
[]
[]
[]
[]
[]
[]
[]
[]
[]
[]
[]
[]
[]
[]
[]
[]
[]
[]
[]
[]
[]
[]
[]
[]
[]
[]
[]
[]
[]
[]
[]
[]
[]
[]
[]
[]
[]
[]
[]
[]
[]
[]
[]
[]
[]
[]
[]
[]
[]
[]
[]
[]
[]
[]
[]
[]
[]
[]
[]
[]
[]
[]
[]
[]
[]
[]
[]
[]
[]
[]
[]
[]
[]
[]
[]
[]
[]
[]
[]
[]
[]
[]
[]
[]
[]
[]
[]
[]
[]
[]
[]
[]
[]
[]
[]
[]
[]
[]
[]
[]
[]
[]
[]
[null,null,null,null,null,null,null,null,null,null,null,null,860066942]
[]
[]
[]
[]
[]
[]
[]
[]
[null,null,null,null,null,null,null,null,null,null,null,null,9]

{"sheet":"Tipo","index":2,"n_rows":31,"n_cols":4,"rows_kept":31,"cut":false,"hidden":true,"merged":[]}
[null,"Tipo","Modalidad de Selección","afectacion"]
[1,"Obra pública","Concurso de méritos","Funcionamiento"]
[2,"Consultoría","Contratación directa","Inversión"]
[3,"Interventoría","Contratación mínima cuantia","Operación"]
[4,"Contratos de prestación de servicios","Selección abreviada"]
[5,"Contratos de prestación de servicios profesionales y de apoyo a la gestión","Licitación pública"]
[6,"Compraventa de bienes muebles","Régimen privado"]
[7,"Compraventa de bienes inmuebles","Régimen especial"]
[8,"Arrendamiento de bienes muebles"]
[9,"Arrendamiento de bienes inmuebles"]
[10,"Seguros","Selección abreviada"]
[11,"Suministro","Subasta inversa "]
[12,"Empréstitos","Bolsas de productos"]
[13,"Fiducia mercantil o encargo fiduciario","Acuerdo marco de precios "]
[14,"Concesión ","Selección abreviada por menor cuantía "]
[15,"Convenios de cooperacion"]
[16,"Contratos interadministrativos","contratacion directa"]
[17,"Convenios de apoyo y/o convenios de asociación ","Urgencia manifiesta"]
[18,"Asociaciones público privadas","Contratación de empréstitos"]
[19,"Otros","Contratos interadministrativos"]
[20,"Otros gastos","Contratación de bienes y servicios en el sector Defensa y en el Departamento Administrativo de Seguridad, DAS"]
[null,null,"Contratos para el desarrollo de actividades científicas y tecnológicas"]
[null,null,"Contratos de encargo fiduciario que celebren las entidades territoriales cuando inician el Acuerdo de Reestructuración de Pasivos"]
[null,null,"Cuando no exista pluralidad de oferentes en el mercado"]
[null,null,"Prestación de servicios profesionales y de apoyo a la gestión, o para la ejecución de trabajos artísticos que sólo puedan encomendarse a determinadas personas naturales;"]
[null,null,"El arrendamiento o adquisición de inmuebles"]
[null,null,"Contratación de bienes y servicios de la Dirección Nacional de Inteligencia (DNI)"]
[]
[]
[null,null,"Decreto 92 de 2017"]
[null,null,"No aplica"]

{"sheet":"Eje_Pilar","index":3,"n_rows":47,"n_cols":5,"rows_kept":47,"cut":false,"hidden":false,"merged":[]}
[]
[null,null,"Código","Programa - Bogotá Mejor para Todos","Pilar /Eje"]
[null,null,1,"Prevención y atención de la maternidad y la paternidad tempranas","Pilar 1 Igualdad de Calidad de Vida"]
[null,null,2,"Desarrollo integral desde la gestación hasta la adolescencia","Pilar 1 Igualdad de Calidad de Vida"]
[null,null,3,"Igualdad y autonomía para una Bogotá incluyente","Pilar 1 Igualdad de Calidad de Vida"]
[null,null,4,"Familias protegidas y adaptadas al cambio climático","Pilar 1 Igualdad de Calidad de Vida"]
[null,null,5,"Desarrollo integral para la felicidad y el ejercicio de la ciudadanía","Pilar 1 Igualdad de Calidad de Vida"]
[null,null,6,"Calidad educativa para todos","Pilar 1 Igualdad de Calidad de Vida"]
[null,null,7,"Inclusión educativa para la equidad","Pilar 1 Igualdad de Calidad de Vida"]
[null,null,8,"Acceso con calidad a la educación superior","Pilar 1 Igualdad de Calidad de Vida"]
[null,null,9,"Atención integral y eficiente en salud","Pilar 1 Igualdad de Calidad de Vida"]
[null,null,10,"Modernización de la infraestructura física y tecnológica en salud","Pilar 1 Igualdad de Calidad de Vida"]
[null,null,11,"Mejores oportunidades para el desarrollo a través de la cultura, la recreación y el deporte","Pilar 1 Igualdad de Calidad de Vida"]
[null,null,12,"Mujeres protagonistas, activas y empoderadas en el cierre de brechas de género","Pilar 1 Igualdad de Calidad de Vida"]
[null,null,13,"Infraestructura para el desarrollo del hábitat","Pilar 2 Democracía Urbana"]
[null,null,14,"Intervenciones integrales del hábitat","Pilar 2 Democracía Urbana"]
[null,null,15,"Recuperación, incorporación, vida urbana y control de la ilegalidad","Pilar 2 Democracía Urbana"]
[null,null,16,"Integración social para una ciudad de oportunidades","Pilar 2 Democracía Urbana"]
[null,null,17,"Espacio público, derecho de todos","Pilar 2 Democracía Urbana"]
[null,null,18,"Mejor movilidad para todos","Pilar 2 Democracía Urbana"]
[null,null,19,"Seguridad y convivencia para todos","Pilar 3 Construcción de Comunidad y Cultura Ciudadana"]
[null,null,20,"Fortalecimiento del Sistema de Protección Integral a Mujeres Víctimas de Violencia - SOFIA","Pilar 3 Construcción de Comunidad y Cultura Ciudadana"]
[null,null,21,"Justicia para todos: consolidación del Sistema Distrital de Justicia","Pilar 3 Construcción de Comunidad y Cultura Ciudadana"]
[null,null,22,"Bogotá vive los derechos humanos","Pilar 3 Construcción de Comunidad y Cultura Ciudadana"]
[null,null,23,"Bogotá mejor para las víctimas, la paz y la reconciliación","Pilar 3 Construcción de Comunidad y Cultura Ciudadana"]
[null,null,24,"Equipo por la educación para el reencuentro, la reconciliación y la paz","Pilar 3 Construcción de Comunidad y Cultura Ciudadana"]
[null,null,25,"Cambio cultural y construcción del tejido social para la vida","Pilar 3 Construcción de Comunidad y Cultura Ciudadana"]
[null,null,26,"Información relevante e integral para la planeación territorial","Eje Transversal 1 Nuevo Ordenamiento Territorial"]
[null,null,27,"Proyectos urbanos integrales con visión de ciudad","Eje Transversal 1 Nuevo Ordenamiento Territorial"]
[null,null,28,"Suelo para reducir el déficit habitacional de suelo urbanizable, vivienda y soportes urbanos","Eje Transversal 1 Nuevo Ordenamiento Territorial"]
[null,null,29,"Articulación regional y planeación integral del transporte","Eje Transversal 1 Nuevo Ordenamiento Territorial"]
[null,null,30,"Financiación para el Desarrollo Territorial","Eje Transversal 1 Nuevo Ordenamiento Territorial"]
[null,null,31,"Fundamentar el desarrollo económico en la generación y uso del conocimiento para mejorar la competitividad de la Ciudad Región","Eje Transversal 2 Desarrollo Económico basado en el conocimiento"]
[null,null,32,"Generar alternativas de ingreso y empleo de mejor calidad","Eje Transversal 2 Desarrollo Económico basado en el conocimiento"]
[null,null,33,"Elevar la eficiencia de los mercados de la ciudad","Eje Transversal 2 Desarrollo Económico basado en el conocimiento"]
[null,null,34,"Mejorar y fortalecer el recaudo tributario de la ciudad e impulsar el uso de mecanismos de vinculación de capital privado","Eje Transversal 2 Desarrollo Económico basado en el conocimiento"]
[null,null,35,"Bogotá, ciudad inteligente","Eje Transversal 2 Desarrollo Económico basado en el conocimiento"]
[null,null,36,"Bogotá, una ciudad digital","Eje Transversal 2 Desarrollo Económico basado en el conocimiento"]
[null,null,37,"Consolidar el turismo como factor de desarrollo, confianza y felicidad para Bogotá Región","Eje Transversal 2 Desarrollo Económico basado en el conocimiento"]
[null,null,38,"Recuperación y manejo de la Estructura Ecológica Principal","Eje Transversal 3 Sostenibilidad Ambiental basada en la eficiencia energética"]
[null,null,39,"Ambiente sano para la equidad y disfrute del ciudadano","Eje Transversal 3 Sostenibilidad Ambiental basada en la eficiencia energética"]
[null,null,40,"Gestión de la huella ambiental urbana","Eje Transversal 3 Sostenibilidad Ambiental basada en la eficiencia energética"]
[null,null,41,"Desarrollo rural sostenible","Eje Transversal 3 Sostenibilidad Ambiental basada en la eficiencia energética"]
[null,null,42,"Transparencia, gestión pública y servicio a la ciudadanía","Eje Transversal 4 Gobierno Legitimo, Fortalecimiento Local y Eficiencia"]
[null,null,43,"Modernización institucional","Eje Transversal 4 Gobierno Legitimo, Fortalecimiento Local y Eficiencia"]
[null,null,44,"Gobierno y ciudadanía digital","Eje Transversal 4 Gobierno Legitimo, Fortalecimiento Local y Eficiencia"]
[null,null,45,"Gobernanza e influencia local, regional e internacional","Eje Transversal 4 Gobierno Legitimo, Fortalecimiento Local y Eficiencia"]