{"text_format":"1","workbook":"xlsx","n_sheets":2,"sheets":["Contratos 2019","Tipo"],"not_rendered":{"charts":0,"images":1,"macros":1,"external_links":0,"defined_names":10,"comments":1,"pivot_tables":0},"unopened":[],"bounds":{"document_bytes":16777216,"sheet_cells":100000,"rows_first":2000,"rows_last":500,"rows_between":2000,"halvings":0,"cell_chars":16384,"cell_head_chars":4096},"cells_cut":0,"cells_raw":0,"read":"whole","date_system":"1900"}

{"sheet":"Contratos 2019","index":0,"n_rows":581,"n_cols":39,"rows_kept":581,"cut":false,"hidden":false,"merged":[[7,0,7,13],[8,0,8,2],[8,4,8,6],[8,8,9,13],[9,0,9,2],[9,4,9,6],[7,20,7,21],[7,22,7,31],[8,20,8,21],[8,22,8,31],[9,20,9,21],[9,22,9,31],[5,22,5,31],[6,20,6,21],[6,22,6,31],[1,0,1,31],[2,0,2,31],[4,0,4,2],[4,8,4,9],[4,12,4,13],[4,20,4,31],[5,0,5,2],[5,8,5,9],[6,0,6,2],[6,8,6,9],[5,20,5,21],[10,0,10,13],[10,14,10,20],[10,21,10,25],[10,26,10,30],[11,7,11,10],[11,12,11,13],[11,26,11,30]]}
[]
["VEEDURIA DISTRITAL - RENDICION DE CUENTAS DE LA GESTION CONTRACTUAL EN EL DISTRITO CAPITAL (Acuerdo 380 de 2009)"]
["INFORMACION GENERAL DE CONTRATACION ENTIDADES DISTRITALES  -  ENERO 1 A 31 DICIEMBRE DE 2019"]
[]
["1. Entidad:",null,null,"LOCALIDAD ANTONIO NARIÑO",null,null,"2. Sector","GOBIERNO"]
["3. Presupuesto Disponible Inversión Directa PREDIS",null,null,16156958224,null,null,"5. Presupuesto Disponible Funcionamiento PREDIS",1967861333,null,null,null,null,null,null,null,null,null,null,null,null,"9. Nombre de quien diligencia el formato"]
["4. Presupuesto Comprometido de Inversión Directa según PREDIS ",null,null,16000608854,null,null,"6. Presupuesto Comprometido Funcionamiento según PREDIS",1841574515,null,null,null,null,null,null,null,null,null,null,null,null,"Cargo",null,"APOYO A LA GESTIÓN OFICINA DE CONTRATACIÓN"]
[null,null,null,null,null,null,null,null,null,null,null,null,null,null,null,null,null,null,null,null,"Dependencia",null,"CONTRATACIÓN-GESTIÓN CORPORATIVA LOCAL"]
["7. Presupuesto Disponible Operación (Regimen Privado)",null,null,null,null,null,null,null,null,null,null,null,null,null,null,null,null,null,null,null,"Teléfono",null,"3118631508-4432490 Ext.225"]
["8. Presupuesto Comprometido Operación mediante contratos",null,null,null,null,null,null,null,null,null,null,null,null,null,null,null,null,null,null,null,"Correo Electrónico",null,"jacqueline.leal@gobiernobogota.gov.co"]
["1- INFORMACION GENERAL",null,null,null,null,null,null,null,null,null,null,null,null,null,"2- INFORMACION FINANCIERA",null,null,null,null,null,null,"3 - PLAZOS ",null,null,null,null,"4 - ESTADO ",null,null,null,null,"5. %  Avance y/o cumplimiento"]
[1,2,3,4,5,6,7,8,null,null,null,9,10,null,11,12,13,14,15,16,17,18,19,20,21,22,23,null,null,null,null,24]
["Número Contrato","Año","Número de proceso contractual","Tipo de contrato ","Modalidad de Selección","Procedimiento o causal","Objeto","Afectación","Número Programa","Equivalencia número de programa","Eje / Pilar","Número Proyecto","Número  de Identificación del contratista\n(NIT con digito de verificación)","Nombre del contratista","Valor Inicial del contrato","Número de reducciones","Valor total reducciones (En valor negativo)","Número de adiciones","Valor total de adiciones ","Valor Final ","Giros\n(Valor en pesos)","Fecha de suscripción (DD/MM/AAAA)","Fecha de inicio (DD/MM/AAAA)","Fecha de terminación (DD/MM/AAAA)","Plazo en días","Prorroga en días","Anulado","Celebrado o por iniciar","En Ejecución","Terminado","Liquidado","% Avance y/o Cumplimiento",null,"Total Contratos","Validación Tipo","Validación Modalidad","Validación procedimiento","Validación afectación","Validación programa"]
[1,2019,"CPS-01-2019","Contratos de prestación de servicios profesionales y de apoyo a la gestión","Contratación directa","Prestación de servicios profesionales y de apoyo a la gestión, o para la ejecución de trabajos artísticos que sólo puedan encomendarse a determinadas personas naturales;","Prestación de servicios Técnico administrativo de apoyo al Despacho del Alcalde Local de Antonio Nariño en el manejo de los distintos asuntos y trámites asociados con la gestión administrativa local","Inversión",45,{"$f":"IF(ISERROR(VLOOKUP(I14,#REF!,2,FALSE)),\" \",VLOOKUP(I14,#REF!,2,FALSE))","v":" "},{"$f":"IF(ISERROR(VLOOKUP(I14,#REF!,3,FALSE)),\" \",VLOOKUP(I14,#REF!,3,FALSE))","v":" "},"3-3-1-15-07-45-1441-000",1126908588,"Angelica Maria Hernandez Doria",38445000,null,null,1,5126000,{"$f":"+O14+Q14+S14","v":43571000},40076000,"2019-01-17","2019-01-17","2020-01-31",374,44,null,null,"X",null,null,{"$f":"IF(ISERROR(U14/T14),\"-\",(U14/T14))","v":0.9197860962566845},{"$f":"T14","v":43571000},{"$f":"IF(SUMPRODUCT((A$14:A14=A14)*(B$14:B14=B14)*(C$14:C14=C14))>1,0,1)","v":1},{"$f":"IFERROR(VLOOKUP(D14,tipo,1,FALSE),\"NO\")","v":"Contratos de prestación de servicios profesionales y de apoyo a la gestión"},{"$f":"IFERROR(VLOOKUP(E14,modal,1,FALSE),\"NO\")","v":"Contratación directa"},{"$f":"IFERROR(VLOOKUP(F14,Tipo!$C$12:$C$27,1,FALSE),\"NO\")","v":"Prestación de servicios profesionales y de apoyo a la gestión, o para la ejecución de trabajos artísticos que sólo puedan encomendarse a determinadas personas naturales;"},{"$f":"IFERROR(VLOOKUP(H14,afectacion,1,FALSE),\"NO\")","v":"Inversión"},{"$f":"IFERROR(VLOOKUP(I14,programa,1,FALSE),\"NO\")","v":"NO"}]
[2,2019,"CPS-002-2019","Contratos de prestación de servicios profesionales y de apoyo a la gestión","Contratación directa","Prestación de servicios profesionales y de apoyo a la gestión, o para la ejecución de trabajos artísticos que sólo puedan encomendarse a determinadas personas naturales;","Prestación de servicios de apoyo en el manejo de sistemas de información en los temas relacionados con la contratación que realiza el área de gestión de desarrollo local de Antonio Nariño.","Inversión",45,{"$f":"IF(ISERROR(VLOOKUP(I15,#REF!,2,FALSE)),\" \",VLOOKUP(I15,#REF!,2,FALSE))","v":" "},{"$f":"IF(ISERROR(VLOOKUP(I15,#REF!,3,FALSE)),\" \",VLOOKUP(I15,#REF!,3,FALSE))","v":" "},"3-3-1-15-07-45-1441-000",57443219,"Jacqueline Leal Rangel",26048880,null,null,1,6596700,32645580,24785904,"2019-01-17","2019-01-17","2019-12-30",344,14,null,null,null,"X",null,{"$f":"IF(ISERROR(U15/T15),\"-\",(U15/T15))","v":0.75924226189272792},{"$f":"T15","v":32645580},{"$f":"IF(SUMPRODUCT((A$14:A15=A15)*(B$14:B15=B15)*(C$14:C15=C15))>1,0,1)","v":1},"Contratos de prestación de servicios profesionales y de apoyo a la gestión","Contratación directa",{"$f":"IFERROR(VLOOKUP(F15,Tipo!$C$12:$C$27,1,FALSE),\"NO\")","v":"Prestación de servicios profesionales y de apoyo a la gestión, o para la ejecución de trabajos artísticos que sólo puedan encomendarse a determinadas personas naturales;"},"Inversión","NO"]
[3,2019,"FDLAN-CD-003-2019","Contratos de prestación de servicios profesionales y de apoyo a la gestión","Contratación directa","Prestación de servicios profesionales y de apoyo a la gestión, o para la ejecución de trabajos artísticos que sólo puedan encomendarse a determinadas personas naturales;","PRESTACIÓN DE SERVICIOS PROFESIONALES PARA COORDINAR, LIDERAR Y ASESORAR LOS PLANES Y ESTRATEGIAS DE COMUNICACIÓN INTERNA Y EXTERNA PARA LA DIVULGACIÓN DE LOS PROGRAMAS, PROYECTOS Y ACTIVIDADES DE LA ALCALDÍA LOCAL","Inversión",45,{"$f":"IF(ISERROR(VLOOKUP(I16,#REF!,2,FALSE)),\" \",VLOOKUP(I16,#REF!,2,FALSE))","v":" "},{"$f":"IF(ISERROR(VLOOKUP(I16,#REF!,3,FALSE)),\" \",VLOOKUP(I16,#REF!,3,FALSE))","v":" "},"3-3-1-15-07-45-1441-000",52428475,"Diana Olaya Torres",59970000,null,null,1,7996000,67966000,61969000,"2019-01-21","2019-01-21","2019-12-30",340,40,null,null,null,"X",null,{"$f":"IF(ISERROR(U16/T16),\"-\",(U16/T16))","v":0.91176470588235292},67966000,{"$f":"IF(SUMPRODUCT((A$14:A16=A16)*(B$14:B16=B16)*(C$14:C16=C16))>1,0,1)","v":1},"Contratos de prestación de servicios profesionales y de apoyo a la gestión","Contratación directa",{"$f":"IFERROR(VLOOKUP(F16,Tipo!$C$12:$C$27,1,FALSE),\"NO\")","v":"Prestación de servicios profesionales y de apoyo a la gestión, o para la ejecución de trabajos artísticos que sólo puedan encomendarse a determinadas personas naturales;"},"Inversión","NO"]
[4,2019,"FDLAN-CD-004-2019","Contratos de prestación de servicios profesionales y de apoyo a la gestión","Contratación directa","Prestación de servicios profesionales y de apoyo a la gestión, o para la ejecución de trabajos artísticos que sólo puedan encomendarse a determinadas personas naturales;","Prestación de servicios profesionales al despacho de la Alcaldía Local Antonio Nariño para fortalecer el proceso de atención a los requerimientos de los entes de control y las diferentes oficinas del Gobierno Distrital","Inversión",45,{"$f":"IF(ISERROR(VLOOKUP(I17,#REF!,2,FALSE)),\" \",VLOOKUP(I17,#REF!,2,FALSE))","v":" "},{"$f":"IF(ISERROR(VLOOKUP(I17,#REF!,3,FALSE)),\" \",VLOOKUP(I17,#REF!,3,FALSE))","v":" "},"3-3-1-15-07-45-1441-000",1026270893,"Jorge Eduardo Salgado Ardila",{"$f":"86784000","v":86784000},null,null,null,null,86784000,79104000,"2019-01-21","2019-01-22","2019-12-31",339,null,null,null,null,"X",null,0.91150442477876104,86784000,{"$f":"IF(SUMPRODUCT((A$14:A17=A17)*(B$14:B17=B17)*(C$14:C17=C17))>1,0,1)","v":1},"Contratos de prestación de servicios profesionales y de apoyo a la gestión","Contratación directa",{"$f":"IFERROR(VLOOKUP(F17,Tipo!$C$12:$C$27,1,FALSE),\"NO\")","v":"Prestación de servicios profesionales y de apoyo a la gestión, o para la ejecución de trabajos artísticos que sólo puedan encomendarse a determinadas personas naturales;"},"Inversión","NO"]
[5,2019,"FDLAN-CD-008-2019","Contratos de prestación de servicios profesionales y de apoyo a la gestión","Contratación directa","Prestación de servicios profesionales y de apoyo a la gestión, o para la ejecución de trabajos artísticos que sólo puedan encomendarse a determinadas personas naturales;","Prestar sus servicios profesionales para apoyar los procesos de aplicación, implementación y socialización de los estándares internacionales de contabilidad e información financiera al interior del Fondo de Desarrollo local","Inversión",45,{"$f":"IF(ISERROR(VLOOKUP(I18,#REF!,2,FALSE)),\" \",VLOOKUP(I18,#REF!,2,FALSE))","v":" "},{"$f":"IF(ISERROR(VLOOKUP(I18,#REF!,3,FALSE)),\" \",VLOOKUP(I18,#REF!,3,FALSE))","v":" "},"3-3-1-15-07-45-1441-000",1075216502,"Luis Wilson Morales Montero",15609330,null,null,null,null,15609330,{"$f":"10879230+4730100","v":15609330},"2019-01-22","2019-01-22","2019-04-30",330,null,null,null,null,"X",null,1,15609330,{"$f":"IF(SUMPRODUCT((A$14:A18=A18)*(B$14:B18=B18)*(C$14:C18=C18))>1,0,1)","v":1},"Contratos de prestación de servicios profesionales y de apoyo a la gestión","Contratación directa",{"$f":"IFERROR(VLOOKUP(F18,Tipo!$C$12:$C$27,1,FALSE),\"NO\")","v":"Prestación de servicios profesionales y de apoyo a la gestión, o para la ejecución de trabajos artísticos que sólo puedan encomendarse a determinadas personas naturales;"},"Inversión","NO"]
[6,2019,"FDLAN-CD-006-2019","Contratos de prestación de servicios profesionales y de apoyo a la gestión","Contratación directa","Prestación de servicios profesionales y de apoyo a la gestión, o para la ejecución de trabajos artísticos que sólo puedan encomendarse a determinadas personas naturales;","Prestar sus servicios en el manejo, validación y actualización de la información de los aplicativos SIPSE, SEGPLAN, tablero de control de seguimientos de los proyectos de inversión del FDLAN y apoyo a las actividades inherentes al Sistema Integrado de Gestión SIG y Subsistema de Calidad","Inversión",45,{"$f":"IF(ISERROR(VLOOKUP(I19,#REF!,2,FALSE)),\" \",VLOOKUP(I19,#REF!,2,FALSE))","v":" "},{"$f":"IF(ISERROR(VLOOKUP(I19,#REF!,3,FALSE)),\" \",VLOOKUP(I19,#REF!,3,FALSE))","v":" "},"3-3-1-15-07-45-1441-000",1026565159,"Karen Herrera",53607800,null,null,null,null,{"$f":"+O19+Q19+S19","v":53607800},48877700,"2019-01-22","2019-01-22","2019-12-31",340,null,null,null,null,"X",null,0.91176470588235292,53607800,{"$f":"IF(SUMPRODUCT((A$14:A19=A19)*(B$14:B19=B19)*(C$14:C19=C19))>1,0,1)","v":1},{"$f":"IFERROR(VLOOKUP(D19,tipo,1,FALSE),\"NO\")","v":"Contratos de prestación de servicios profesionales y de apoyo a la gestión"},{"$f":"IFERROR(VLOOKUP(E19,modal,1,FALSE),\"NO\")","v":"Contratación directa"},{"$f":"IFERROR(VLOOKUP(F19,Tipo!$C$12:$C$27,1,FALSE),\"NO\")","v":"Prestación de servicios profesionales y de apoyo a la gestión, o para la ejecución de trabajos artísticos que sólo puedan encomendarse a determinadas personas naturales;"},{"$f":"IFERROR(VLOOKUP(H19,afectacion,1,FALSE),\"NO\")","v":"Inversión"},{"$f":"IFERROR(VLOOKUP(I19,programa,1,FALSE),\"NO\")","v":"NO"}]
[7,2019,"FDLAN-CD-007-2019","Contratos de prestación de servicios profesionales y de apoyo a la gestión","Contratación directa","Prestación de servicios profesionales y de apoyo a la gestión, o para la ejecución de trabajos artísticos que sólo puedan encomendarse a determinadas personas naturales;","Apoyar técnicamente a los responsables e integrantes de los procesos en la implementación de herramientas de gestión, siguiendo los lineamientos metodológicos establecidos por la Oficina Asesora de Planeación de la Secretaría Distrital de Gobierno","Inversión",45,{"$f":"IF(ISERROR(VLOOKUP(I20,#REF!,2,FALSE)),\" \",VLOOKUP(I20,#REF!,2,FALSE))","v":" "},{"$f":"IF(ISERROR(VLOOKUP(I20,#REF!,3,FALSE)),\" \",VLOOKUP(I20,#REF!,3,FALSE))","v":" "},"3-3-1-15-07-45-1441-000",1032446399,"Sara Sofia Lancheros Ramirez",64725270,null,null,null,null,64725270,58997370,"2019-01-22","2019-01-23","2019-12-31",339,null,null,null,null,"X",null,0.91150442477876104,64725270,{"$f":"IF(SUMPRODUCT((A$14:A20=A20)*(B$14:B20=B20)*(C$14:C20=C20))>1,0,1)","v":1}]
{"$rows_left_out":562}
{"sheet":"Tipo","index":1,"n_rows":31,"n_cols":4,"rows_kept":31,"cut":false,"hidden":true,"merged":[]}
[null,"Tipo","Modalidad de Selección","afectacion"]
[1,"Obra pública","Concurso de méritos","Funcionamiento"]
[2,"Consultoría","Contratación directa","Inversión"]
[3,"Interventoría","Contratación mínima cuantia","Operación"]
[4,"Contratos de prestación de servicios","Selección abreviada"]
[5,"Contratos de prestación de servicios profesionales y de apoyo a la gestión","Licitación pública"]
[6,"Compraventa de bienes muebles","Régimen privado"]
[7,"Compraventa de bienes inmuebles","Régimen especial"]
[8,"Arrendamiento de bienes muebles"]
[9,"Arrendamiento de bienes inmuebles"]
[10,"Seguros","Selección abreviada"]
[11,"Suministro","Subasta inversa "]
[12,"Empréstitos","Bolsas de productos"]
[13,"Fiducia mercantil o encargo fiduciario","Acuerdo marco de precios "]
[14,"Concesión ","Selección abreviada por menor cuantía "]
[15,"Convenios de cooperacion"]
[16,"Contratos interadministrativos","contratacion directa"]
[17,"Convenios de apoyo y/o convenios de asociación ","Urgencia manifiesta"]
[18,"Asociaciones público privadas","Contratación de empréstitos"]
[19,"Otros","Contratos interadministrativos"]
{"$rows_left_out":11}